##TITLE=1H_SA_51.206
 CDCl3, 8 sc, 
 9.6.2020
##JCAMPDX= 6.0         $$ Bruker NMR JCAMP-DX V2.0
##DATA TYPE= NMR FID
##DATA CLASS= NTUPLES
##ORIGIN= UXNMR, Bruker Analytische Messtechnik GmbH
##OWNER= root
$$ XWIN-NMR		Version 3.5
$$ Tue Jun  9 11:33:05 2020 Russian Standard Time (UT+4h)  she@DPX200
##.OBSERVE FREQUENCY= 200.1315
##.OBSERVE NUCLEUS= ^1H
##.DELAY= (6, 6)
##.ACQUISITION MODE= SIMULTANEOUS
##.ACQUISITION SCHEME= undefined
##.AVERAGES= 8
##.DIGITISER RES= 18
##SPECTROMETER/DATA SYSTEM= spect
##.PULSE SEQUENCE= zg30
##.SOLVENT NAME= D2O
##.SHIFT REFERENCE= (INTERNAL, D2O, 0, 15.7039)
##AUDIT TRAIL= $$ (NUMBER, WHEN, WHO, WHERE, WHAT)
$$ ##TITLE= Audit trail, XWIN-NMR		Version 3.5
$$ ##JCAMPDX= 5.01
$$ ##ORIGIN= Bruker BioSpin GmbH
$$ ##OWNER= she
$$ F:/spectra/data/she/nmr/H-F/1/audita.txt
$$ ##AUDIT TRAIL=  $$ (NUMBER, WHEN, WHO, WHERE, WHAT)
(   1,<2020-06-09 11:31:41.01 +0400>,<she>,<DPX200>,
      <created by zg, POWCHK disabled, PULCHK disabled
       configuration hash MD5:
       00 E9 B6 7A A2 85 ED C7 34 08 36 98 17 FE 4E 26
       data hash MD5: 16K
       56 92 04 7C 17 63 BA 19 76 FB BE 70 D9 43 5B 38>)
$$ ##END=
$$ 
$$ hash MD5
$$ 52 CA 42 35 F9 7A D5 A6 D6 FC AA 9C AD B8 C6 BD
##$RELAX= 
##$RELAX= 
##$RELAX= 
##$RELAX= 
##$RELAX= 
##$RELAX= 
$$ Bruker specific parameters
$$ --------------------------
##$DU= <F:/spectra>
##$EXPNO= 1
##$NAME= <H-F>
##$PROCNO= 1
##$TYPE= <nmr>
##$USER= <she>
##$AMP= (0..31)
100 100 100 100 100 100 100 100 100 100 100 100 100 100 100 100 100 100 
100 100 100 100 100 100 100 100 100 100 100 100 100 100 
##$AQSEQ= 0
##$AQ_mod= 1
##$AUNM= <au_zg>
##$AUTOPOS= <>
##$BF1= 200.13
##$BF2= 200.13
##$BF3= 200.13
##$BF4= 200.13
##$BF5= 200.13
##$BF6= 200.13
##$BF7= 200.13
##$BF8= 200.13
##$BYTORDA= 1
##$CFDGTYP= 0
##$CFRGTYP= 5
##$CHEMSTR= <none>
##$CNST= (0..31)
1 1 145 1 1 1 1 1 1 1 1 1 1 1 1 1 1 1 1 1 1 1 1 1 1 1 1 1 1 1 1 1 
##$CPDPRG= <>
##$CPDPRG1= <>
##$CPDPRG2= <>
##$CPDPRG3= <>
##$CPDPRG4= <mlev>
##$CPDPRG5= <mlev>
##$CPDPRG6= <mlev>
##$CPDPRG7= <mlev>
##$CPDPRG8= <mlev>
##$CPDPRGB= <>
##$CPDPRGT= <>
##$D= (0..31)
0 1.2 0 0 0 0 0 0 0 0.06 0 0.03 0 0 0 0 0.0002 0 0 0 0 0 0 0 0 0 0 0 0 
0 0 0 
##$DATE= 1591687900
##$DBL= (0..7)
120 120 120 120 120 120 120 120 
##$DBP= (0..7)
150 150 150 150 150 150 150 150 
##$DBP07= 0
##$DBPNAM0= <>
##$DBPNAM1= <>
##$DBPNAM2= <>
##$DBPNAM3= <>
##$DBPNAM4= <>
##$DBPNAM5= <>
##$DBPNAM6= <>
##$DBPNAM7= <>
##$DBPOAL= (0..7)
0.5 0.5 0.5 0.5 0.5 0.5 0.5 0.5 
##$DBPOFFS= (0..7)
0 0 0 0 0 0 0 0 
##$DE= 6
##$DECBNUC= <off>
##$DECIM= 24
##$DECNUC= <off>
##$DECSTAT= 4
##$DIGMOD= 1
##$DIGTYP= 9
##$DL= (0..7)
0 120 120 120 120 120 120 120 
##$DP= (0..7)
150 150 150 150 150 150 150 150 
##$DP07= 0
##$DPNAME0= <>
##$DPNAME1= <>
##$DPNAME2= <>
##$DPNAME3= <>
##$DPNAME4= <>
##$DPNAME5= <>
##$DPNAME6= <>
##$DPNAME7= <>
##$DPOAL= (0..7)
0.5 0.5 0.5 0.5 0.5 0.5 0.5 0.5 
##$DPOFFS= (0..7)
0 0 0 0 0 0 0 0 
##$DQDMODE= 0
##$DR= 18
##$DS= 0
##$DSLIST= <SSSSSSSSSSSSSSS>
##$DSPFIRM= 0
$$ [...]
##$SUBNAM2= <"">
##$SUBNAM3= <"">
##$SUBNAM4= <"">
##$SUBNAM5= <"">
##$SUBNAM6= <"">
##$SUBNAM7= <"">
##$SUBNAM8= <"">
##$SUBNAM9= <"">
##$SW= 24.9337058887773
##$SWIBOX= (0..15)
0 0 2 0 0 0 0 0 0 0 0 0 0 0 0 0 
##$SW_h= 4990.01996007984
##$TD= 16384
##$TD0= 1
##$TE= 0
##$TE2= 300
##$TE3= 300
##$TEG= 300
##$TL= (0..7)
0 120 120 120 120 120 120 120 
##$TP= (0..7)
150 150 150 150 150 150 150 150 
##$TP07= 0
##$TPNAME0= <>
##$TPNAME1= <>
##$TPNAME2= <>
##$TPNAME3= <>
##$TPNAME4= <>
##$TPNAME5= <>
##$TPNAME6= <>
##$TPNAME7= <>
##$TPOAL= (0..7)
0.5 0.5 0.5 0.5 0.5 0.5 0.5 0.5 
##$TPOFFS= (0..7)
0 0 0 0 0 0 0 0 
##$TUNHIN= 0
##$TUNHOUT= 0
##$TUNXOUT= 0
##$USERA1= <user>
##$USERA2= <user>
##$USERA3= <user>
##$USERA4= <user>
##$USERA5= <user>
##$V9= 5
##$VALIST= <valist>
##$VCLIST= <CCCCCCCCCCCCCCC>
##$VD= 0
##$VDLIST= <DDDDDDDDDDDDDDD>
##$VPLIST= <PPPPPPPPPPPPPPP>
##$VTLIST= <TTTTTTTTTTTTTTT>
##$WBST= 1024
##$WBSW= 4
##$XGAIN= (0..3)
0 0 0 0 
##$XL= 0
##$YL= 0
##$YMAX_a= 762926
##$YMIN_a= -378834
##$ZGOPTNS= <>
##$ZL1= 120
##$ZL2= 120
##$ZL3= 120
##$ZL4= 120
##$ABSF1= 10
##$ABSF2= 0
##$ABSG= 5
##$ABSL= 3
##$ALPHA= 0
##$AQORDER= 0
##$ASSFAC= 0
##$ASSFACI= 0
##$ASSFACX= 0
##$ASSWID= 0
##$AUNMP= <proc_1d>
##$AZFE= 0.1
##$AZFW= 0.1
##$BCFW= 1
##$BC_mod= 2
##$BYTORDP= 1
##$COROFFS= 0
##$CY= 11.3945322036743
##$DATMOD= 1
##$DC= 2
##$DFILT= <>
##$DTYPP= 0
##$F1P= 16.9975609425685
##$F2P= -3.02152046262296
##$FCOR= 0.5
##$FTSIZE= 0
##$FT_mod= 4
##$GAMMA= 1
##$GB= 0.15
##$INTBC= 1
##$INTSCL= 1
##$ISEN= 128
##$LB= 0.24
##$LEV0= 0
##$LPBIN= 0
##$MAXI= 10000
##$MC2= 0
##$MEAN= 0
##$ME_mod= 0
##$MI= 1.114404
##$NCOEF= 0
##$NC_proc= 0
##$NLEV= 6
##$NOISF1= 3.799351
##$NOISF2= 2.8
##$NSP= 1
##$NTH_PI= 0
##$NZP= 0
##$OFFSET= 15.70392
##$PC= 1
##$PHC0= -9796.401
##$PHC1= 16.40088
##$PH_mod= 1
##$PKNL= yes
##$PPARMOD= 0
##$PSCAL= 0
##$PSIGN= 0
##$REVERSE= no
##$SF= 200.130013532006
##$SI= 16384
##$SIGF1= 3
##$SIGF2= 2
##$SINO= 400
##$SIOLD= 16384
##$SREGLST= <1H.CDCl3>
##$SSB= 0
##$STSI= 0
##$STSR= 0
##$SW_p= 3612.71676300578
##$SYMM= 0
##$S_DEV= 0
##$TDeff= 0
##$TDoff= 0
##$TI= <>
##$TILT= no
##$TM1= 0
##$TM2= 0
##$TOPLEV= 0
##$USERP1= <user>
##$USERP2= <user>
##$USERP3= <user>
##$USERP4= <user>
##$USERP5= <user>
##$WDW= 1
##$XDIM= 8192
##$YMAX_p= 0
##$YMIN_p= 0
$$ End of Bruker specific parameters
$$ ---------------------------------
##NTUPLES= NMR FID
##VAR_NAME=  TIME,          FID/REAL,        FID/IMAG
##SYMBOL=    X,             R,               I
##VAR_TYPE=  INDEPENDENT,   DEPENDENT,       DEPENDENT
##VAR_FORM=  AFFN,          ASDF,            ASDF
##VAR_DIM=   8192,          8192,            8192
##UNITS=     SECONDS,       ARBITRARY UNITS, ARBITRARY UNITS
##FACTOR=    0.0002004,     1,               1
##FIRST=     0,             0,               0
##LAST=      1.6414764,     0,               0
##MIN=       0,             -378834,         0
##MAX=       1.6414764,     762926,          0
$$ Real data points
##PAGE= N=1
##DATA TABLE= (X++(R..R)), XYDATA
0@%%%%oJ4j2J2j6K4l2L8n2O6p6Q9j13J36j60J90k26K66l07L55m10M70n40O19p03
29c74P96q99J012j136J274j425J591j773J971k192K433k694K985l305L657m050
45b129M489m980N535o167O893p738Q737r939J1419j3294J5757j9157K4201l2560
59a8933M9673j42589L22887J42698n55115j77455J44460J962j33811K26721K80787
70A41285j22956l48103l0845J70905N8236l337J28564M1236j65059j22951P9266
81a73759M1781k2257J28731J62885j64665l05053K0481K60903O7711q7536K2410
92d8368K1565j62585j00810J87271K15611o4900j87643j8083J12605N0111j9341
103a4567j6894k4829j3062O1866N4106p0957q5847L6177L3350o7293Q107J24240
$$ y = [0, 0, 0, 0, 0, -6, 8, -4, 8, -8, 16, -16, 22, -30, 36, -40, 49, -64, 72, -88, 102, -124, 142, -165, 190, -220, 250, -290, 329, -374, 422, -477, 535, -601, 673, -752, 839, -934, 1037, -1155, 1278, -1416, 1569, -1736, 1921, -2129, 2360, -2620, 2915, -3252, 3641, -4097, 4640, -5299, 6120, -7174, 8583, -10574, 13627, -18933, 30740, -111849, 211038, 353736, -201379, -378834, -234374, -232412, -366223, -139502, 141285, 18329, -329774, -360619, -189714, -131478, -134815, -6251, 34985, -130074, -253025, -173759, -131978, -154235, -25504, 137381, -27284, -332337, -311856, -50953, 16758, -70778, -48368, -26803, -189388, -290198, -102927, 112684, 47784, -139859, -157942, -45337, 4774, -14567, -31461, -56290, -69352, -7486, 46620, -24337, -110184, -74007, -40657, -107950, -99843, 24397]
115B4397l0292k12311m3205J84669N1577j51267k1042J57038O671j86293n6692
126b76750J45133Q7030l1059K5917L9726j33264j59118J07732K49000M8508j24159
137b1304p4574o4553j00932P9600K75054Q2487k38672j75686Q3645P5266n0463
148a30132O1850J85941j0594k41333j04612J56115J19564l9484K5700J20253n6712
159H6556k30271n6572J96219J57426j1090n5651p7092j34430m4752J51227J63705
170A45275j8394j22529q2007m0253o796Q3215J25615P166j24304p5622M9273M3634
182a5727k2103K2652Q5227O792r1422m6728L4294K9025J9185M3850Q405o3986
194I464n3896J0749L0424K6209K8748j2648o7767k8116O4363N1311m9410o0646
$$ y = [24397, -5895, -218206, -261411, -76742, -25165, -176432, -197474, -40436, -33765, -220058, -276750, -131617, -44587, -75646, -49729, -10003, -143267, -302385, -194653, 54347, 102855, -21304, -95878, -160431, -261363, -181763, 93291, 175778, -62894, -238580, -154935, -79669, -130132, -68282, 117659, 107065, -134268, -238880, -82765, 36799, -2685, 23015, 143268, 86556, -143715, -200287, -4068, 153358, 142268, 86617, 9525, -124905, -169657, -18430, 145275, 126881, 4352, -77655, -117908, -124704, -41489, 84126, 91292, -33012, -108634, -59361, -15727, -37830, -15178, 70049, 76841, -14581, -61309, -27015, 2010, 21195, 65045, 73450, 9464, -44432, -33683, -3259, 22950, 51698, 39050, -28717, -56833, 7530, 58841, 9431, -51215]
206e1215M1986P3963j1793m3024J8120Q550o1621k115J23814O6236j03884j01731
218d2714K8565M3759q656L4443O5800m2149j24225l4373P0672L9652q497L1661
230E3938L2332q1748j23086J6625J29882O1456k4048n132k6572j14900n6194J37613
242A66J67081j3308j22720o9014k0855r971O3093J26766M0266j13650j33095j5781
254a01022O5875N5153M2426L5364l6574j13700o3909N6671Q9059M2098J0624k3754
266E8311q0764p2635K7027R7085O6423n933n7982p1615l4324K8306O3088M6166
278F3153o816n5545n8484j2768L1933L9812J6093j4074k4910j4289o126j101K0736
291b2386K9632o445k7288O950K2381j6779k2785K3401K5485j6710j1222K6496
$$ y = [-51215, -9229, 64734, 52941, 9917, 28037, 36587, -25034, -27149, 96665, 162901, 59017, -42714, -14149, 29610, 20954, 55397, 121197, 79048, -45177, -79550, -8878, 30774, 22277, 53938, 86270, 4522, -118564, -101939, 27943, 89399, 65351, 60219, 33647, -81253, -137447, 166, 167247, 153939, 31219, -37795, -58650, -68621, -5528, 121238, 161504, 47854, -85241, -101022, -35147, 20006, 62432, 97796, 61222, -52478, -116387, -59716, 29343, 71441, 82065, 58311, -22453, -95088, -68061, 29024, 95447, 89514, 31532, -40083, -74407, -46101, 16987, 63153, 56337, 792, -57692, -70460, -38527, 1285, 17378, 3304, -21606, -35895, -42021, -43122, -22386, 7246, 801, -26487, -19537, 2844, -13935, -36720, -13319, 12166, -4544, -15766, 10730]
303A0730P829m0826k9672K4637L6973M460q108K512j9181n2360j2118P1118O6725
316F2719j9872n3610k3518j9026j3897N2791R0801J1974q2286p2559n812L2704
328c9591M5105N3964K4635n3509j00679m4356N8042Q6324L5039j0552l8426p5101
340e9105o2507L6475J10445O3390l0841p0478n8784k5006L0019P8181P0297n308
352G6778q0921p9913n747N5687N8424L7005M386n2907q1918k2889O0436P1959
364D0380K3328k1627m3220m5451j7141L1934O1100L6743k5332n7105k5347J4598
376b7140J8784J9352K8977Q72m2570l2443J6792K8174M159l358L881k823j5556
389b899p922J2545J3517r823j6340J2274K4340q553k6481l115O078q586O879L4671
$$ y = [10730, 18559, -22267, -51939, -27302, 9671, 14131, 6023, 8535, -10646, -63006, -75124, -4006, 62719, 42847, -10763, -34281, -53307, -67204, -14413, 76388, 88362, 6076, -66483, -72295, -39591, 5514, 59478, 84113, 30604, -70075, -114431, -56389, 29935, 64974, 54422, 15996, -59105, -121612, -85137, 25308, 88698, 57857, -12621, -71405, -96411, -66392, 11789, 82086, 76778, -4143, -84056, -89803, -34116, 24308, 61313, 65699, 12792, -69126, -92015, -31579, 40380, 63708, 42081, -1139, -46590, -63731, -31797, 29303, 66046, 40714, -16391, -41738, -27140, -8356, 10996, 39973, 40845, -1725, -34168, -17376, 10798, 14957, 11599, 15480, 12657, -2899, -10821, 1724, 15241, 5418, -10922, 1352, 25692, 17139, -9342, -12457, -6379, -14965, -8086, 26585]
403B6585J3151l7426m2509l374K6649K9779J9857M575k5184n1222l0103L6079
415c3143P0457K8247k6438l9039l5215k4457K3154P3712N0798k6535o8160m7434
427e4053k266L6166N6709M3731q030o7884p3428m891O5415O5622K1115j8480n1522
440H204o4559j4723O2320P9146K3652l7125n8278m2154k342M2655O1670L4730
452I3196k7620p2770m8106J5969M7577L8102J8966j5574n6567n0977R867N4887
464F950M0743j441k6787k8945j8927n00K6566M1730J1576l3298k8998P499J2117
477H285l952J0938K4058p216l1373n943K0420L789j6311k54J6911K165j5988k727
491B802J3963m938k6315N518M1234J5825k7215j7296K479j0676k522M1760M2045
$$ y = [26585, 39736, 2310, -40199, -43573, -16924, 12855, 32712, 37287, 12103, -39119, -69222, -33143, 37314, 65561, 39123, 84, -35131, -59588, -36434, 37278, 88076, 61541, -6619, -54053, -56319, -20153, 36556, 80287, 72257, 4373, -69055, -73946, -8531, 57091, 78206, 59726, 8204, -56355, -71078, -8758, 70388, 94040, 56915, -1363, -43517, -45859, -3204, 58466, 93196, 65576, -7194, -55300, -39331, 8246, 46348, 65314, 49740, -6827, -57804, -47937, 6950, 47693, 46252, 19465, -9480, -28407, -28907, -2341, 39389, 50965, 17667, -11331, -3832, 8285, 4333, 15271, 39329, 32113, 740, -5203, 15217, 19006, 2695, 2441, 19352, 21517, 5529, 2802, 16765, 11827, -14488, -8970, 32264, 48089, 20874, 3578, 6057, -4619, -7141, 34619, 76664]
504G6664k1084n7848k6176J5781K7136K7391J9984j2609n4498m9714J1144N4366
516A0537L4677k853j8548l4254m6181o478N4565N7267O719k9066m0279m0289o117
529f0300N0581O7460K0451l9300o4589m0729J3236N7609N5003Q191m6011o2527
541d0925k9785K0089M9639M4747M561m5503n2916q834K6380K4866K5756K6067
553D4142j8004n9072k5592L3707L6337R991R983l87m0470m6038J2378N4695K4408
566C6078k3879k5455r762j5553p563L2521L2394k6264m2361J4537L2172j5903
578a9038k1845K4165J8642k4032n001L8500P179m7722j8505M5237L2345k3092
590F833k0773J6283M60l5733o647M3451K1084k8283j5585R198j9703k9246K8024
$$ y = [76664, 55580, -2268, -28444, -12663, 14473, 41864, 61848, 49239, -5259, -54973, -43829, 10537, 45214, 42361, 23813, -10441, -56622, -63100, -8535, 48732, 55451, 26385, -13894, -54183, -60300, -9719, 57741, 78192, 38892, -25697, -66426, -53190, 4419, 59422, 67613, 21602, -40925, -70710, -50621, -982, 43765, 48326, 2823, -50093, -58927, -32547, -7681, 18075, 44142, 26138, -32934, -58526, -24819, 11518, 21509, 31492, 31105, -9365, -55403, -43025, 11670, 36078, 12199, -13256, -23018, -38571, -46134, -13613, 18781, -7483, -49844, -35307, -3135, -19038, -40883, -16718, 1924, -22108, -27109, 11391, 18570, -29152, -47657, -2420, 29925, 6833, -13940, 2343, 2803, -32930, -39577, 3874, 24958, -3325, -18910, -9712, -29415, -58661, -30637]
603c0637N6228O240l6094k4883j7521j1785L6284P0692J7176o2932o1686O67L2875
616b5376K7789K9463J6985m0168p4469j9560N1809M4776P19p539j4135m3016l2628
629h5350K4387M7068K2793O306j0944n0205m5621L0044P6004L2462k1289k4015
641A640k3764l4721K615P5376O5135l6497q3442j5058L7810J0340j007L2788J2859
654D4074n2967m0544K9995L2100j1918J4K8210o851m2192l890L2857O906j2082
667C712J9327J9206l9707m4926L2759N6744k1816n5592J2464L9268k4002l8094
679d0657K6182K5397m3196l0634M9402M1538m0282n1637R136L1224J1360J3138
691I71J4865k2266m3250J044M4552K4414m082L244m194m0880k3517M3914M7609
$$ y = [-30637, 25591, 31831, -4263, -29146, -46667, -58452, -22168, 48524, 65700, 2768, -58918, -58251, -25376, 2413, 31876, 48861, 8693, -65776, -85336, -33527, 11249, 11968, 4429, -9706, -52722, -85350, -60963, -13895, 8898, 15204, 4260, -45945, -91566, -61522, 14482, 46944, 25655, 1640, -22124, -56845, -54230, 21146, 86281, 49784, -33658, -48716, -10906, -566, -1573, 31215, 44074, -8893, -49437, -19442, 12658, 740, 754, 28964, 22113, -20079, -23969, 8888, 15794, 3712, 23039, 42245, 2538, -42388, -9629, 47115, 25299, -30293, -17829, 21439, -2563, -40657, -14475, 10922, -32274, -62908, -13506, 28032, -12250, -63887, -54751, -23527, -12167, 971, 15836, -6430, -49680, -48636, -4084, 20330, 16248, 19492, 15298, -25582, -49099, -5185, 42424]
704D2424j4490k4271J2573r013n1071n955P0464N0391k6834m8034k1879o959J0999
717b1655N0303N0399j3040o2120l9275Q763L1020M1821L4413k2033p2623l4109
729d8136L8220L2067j0334P405K4313l5559p3229j885O3687K5094k5373m467Q120
742g7l7083m3066L0894P1755J3657m3325k6125n65o837J1957M8986J9591m6452
755f690l5764K3249J8929j7606O807L3697j4474m7427Q846M7535o824m5379Q099
768b7002M8639L47m1193J05L4871l148k8632J3945L6889q719l0218P422J7802
781B1108j7698j3701K5741J8852j9206j7873k645j6152j1317L3348L9915j9480
793B0892n4806k0071J9724J6310J2540K5033L504m8555m5698K1770N2315J7752
$$ y = [42424, 27934, 3663, 16236, 7223, -43848, -49803, 20661, 71052, 44218, -3816, -25695, -32654, -21655, 28648, 79047, 66007, 3887, -35388, -26625, 4395, 46216, 80629, 58596, -14027, -48136, -9916, 22151, 11817, 19222, 43535, 7976, -65253, -67138, -3451, 21643, -3730, -8197, -77, -37160, -80226, -49332, 22423, 36080, -7245, -33370, -33935, -40772, -28815, 20171, 39762, -6690, -42454, -19205, -276, -17882, -11075, 22622, 8148, -39279, -30433, 17102, 10278, -35101, -27002, 21637, 21984, -19209, -19104, 15767, 12619, -16013, -2068, 34821, 26102, -4116, 3306, 21108, 3410, -10291, 15450, 34302, 15096, -2777, -5422, -21574, -32891, 457, 40372, 20892, -33914, -53985, -34261, -17951, -5411, 19622, 23126, -25429, -71127, -49357, 2958, 20710]
805B0710p831m469k0393l7059Q28M3519K9392m852r585j8474l8936j2996M4346
818a5800M9517l212l1909j9073j4655j5031K3303O1901K4758m8790n1793P498
830c3286K7265Q165J9546L1385j7819n8081j4240M0411K2599p141N170N674l0969
843a321l3070J6170L6340K409j5553J963j460k7639j2063L5417L1054j9916k6762
856a4431J0710J0700j7039M47L0588M414k9852n811K5420M716k1560m366J5581
869I517J216q047O228Q700j4551k0970P505K3219O279p200n55o254j9295k353
883a6561K9446K2831p677j3470q335j4637o069K6669L1779j378k5222k0617j1036
896a4277p17K1809L1822P025l0317l5022q234J3229J9452K4915J3762k3924m5490
$$ y = [20710, 12879, 8410, -11983, -49042, -48214, -4695, 24697, 19845, 10260, -8214, -47150, -60146, -15800, 33717, 30505, -1404, -20477, -35132, -50163, -26860, 35041, 59799, 11009, -40784, -33286, -6021, 2144, 21690, 53075, 35256, -22825, -37065, 3346, 25945, 18804, 23974, 29648, -1321, -34391, -18221, 18119, 20528, 4975, 6938, 5478, -22161, -34224, 1193, 32247, 12331, -14431, -3721, 6979, -10060, -9613, 20975, 25389, -4463, -10274, 15146, 19862, -1698, -6064, 9517, 10733, 2686, 8914, 17614, 3063, -17907, -10402, 12817, 19096, 11896, 11341, 5087, -14208, -16561, 12885, 35716, 28039, 14569, 6234, -8403, -14472, 12197, 43976, 42598, 17376, -3241, -14277, -14994, 6815, 38637, 45662, 15345, -19677, -27911, -14682, 4770, 29685, 43447, 19523, -25967]
909b5967j2703K7706K7989J2109Q113j1650m1200k4961K6830M2115J1732j0053
921C0060j3792k2602k3543R403M1589K6529j7584l0675j2240j862P83K0290L1704
934C8060j298l6400k0911J1117J1848N038J5814J0583k0150k7806P24K0302J1423
947A8344m78j042n131j4291q043J1318J5174l258j2460j134N452l520m496M700
961A135J043o880J489J1763J667j0662p702J41M480Q530P601J44q848j1233o286
976a3618N876J5544J1232r25j2280j6576q667P819J8944J5900K690j6157k7461
989a7679j2074J7075K7957J4722k717j8969k8436j3119K0818L5488J4759j2794
1001B5031k5251k1518n299J6291K8863J8348j0015l0713k1750J800J5140J9844
$$ y = [-25967, -38670, -10964, 17025, 29134, 37247, 25597, -15603, -40564, -13734, 28381, 40113, 30060, 16268, -6334, -29877, -20474, 21115, 47644, 30060, -615, -12855, -14717, -13934, 6356, 38060, 36762, 362, -20549, -9432, 2416, 7454, 23268, 33851, 13701, -14105, -13381, 6921, 18344, 17866, 16824, 11693, -2598, -10641, 677, 15851, 12593, 133, -1001, 4451, 931, -3565, 1135, 2178, -4702, -3213, 8550, 10217, -445, -8147, -8006, -3526, 5004, 12605, 12749, 3901, -7332, -13618, -7742, 7802, 19034, 18109, 5829, -10747, -19414, -11595, 7349, 23249, 25939, 9782, -17679, -29753, -12678, 15279, 30001, 27284, 8315, -20121, -33240, -12422, 23066, 37825, 25031, -220, -21738, -27037, -10746, 18117, 36465, 26450, -4263, -26013, -24213, -9073, 10771]
1013A0771J8461j014k9189l0224l40K3367K2783J0879m272k4078k6833l819K4347
1026i161K7987O895j6341k0796j0719J137J2818J9745R164j4232j9026l428O172
1039i785N198P312Q242k848j2339p935K748O875M931R82j022k224n736l586N412
1054c775P401l448n909L241N602j256l753k063k965mP755R591J274j1039j4549
1069a3897m288J2350J6494N050o172j3395j5608m635J5760K1271N383j2173j6608
1082a0468j2873j163J3323J9297J1607o536k2806j9796K537J9474J9263J1352
1094B3211m696k4761k5794J289K6916K4474N694j3052k3688j9031J239K2993K5856
1107B0650O352j8829k4371j0199O493J5430J9734J0588j3156k5995j0448J0187
$$ y = [10771, 29232, 28218, -971, -31195, -31535, -8168, 14615, 25494, 21222, -2856, -29689, -33508, -9161, 18826, 25721, 9380, -11416, -22135, -20998, -8180, 11565, 20729, 6497, -12529, -15957, -9785, -4587, 2725, 10967, 8119, -4220, -12155, -9407, -2532, 2399, 3381, 2359, 135, -5601, -9187, -3775, 3626, 178, -5731, -2490, 3112, 1856, -1897, -3960, -6925, -6929, 826, 10417, 11691, 652, -13897, -18185, -5835, 10659, 15709, 9537, -3858, -19466, -24101, -8341, 12930, 18313, 6140, -10468, -23341, -24504, -11181, 8116, 19723, 13187, -9619, -29415, -26878, -7404, 11859, 23211, 18515, -6246, -32040, -30751, -3835, 20639, 26333, 13281, -10407, -29438, -28199, -5206, 20650, 27002, 8173, -16198, -26397, -19904, -4474, 15260, 25848, 12692, -13303, -23751, -13564]
1119a3564J5714J3678P770q608k0567j3901O490J7930J4273k87j1950j2998q041
1132a4061J914J2496J2900j641j3318q130K9K376M761O262J58m978k790L33P52
1147b937J970J147r17J064L781o22l726j691j370j912K885O643L314m733r526
1162f630o821J249R190Q461L883k611j3160j4550L706K0353J3160j505o687j1232
1176c194j4002N09K1290K0292j140j6554j4627q144J569J3503K0778P525j9196
1189H609k6768p684J1798J4126J4035R166j2810l0111j3062J7564K4072R856J78
1202A8969j0063k0769j4166J1442K6371J3589p114j5788j1906p308K543J7214
1214C014J7978l229k0376j3645n42L946J0262J5395K029j7216j4482J417Q750
$$ y = [-13564, 2150, 15828, 23598, 14990, -5577, -19478, -12988, 4942, 19215, 18928, 6978, -6020, -14061, -12147, 349, 13249, 11608, -1710, -9840, -9811, -7435, -2674, 3588, 3746, -1232, -4022, -3689, -2937, -967, 180, -737, 327, 4108, 3486, -240, -1931, -3301, -5213, -2328, 4315, 7629, 2896, -6630, -13451, -12202, -3012, 5449, 9332, 6721, -6439, -20989, -17283, 3070, 16230, 14725, 8038, -3194, -17196, -16687, 4603, 24895, 23755, 7201, -7426, -15570, -14001, -498, 20280, 27805, 8609, -18159, -25843, -14045, 81, 14116, 23282, 10472, -19639, -32701, -15137, 8935, 18791, 18969, 8906, -11863, -26029, -14587, 11784, 25373, 18259, 2471, -9435, -16743, -14200, 3014, 20992, 17763, -2613, -16258, -16800, -12854, -2592, 12803, 14832, -2384, -16866, -15449, -6699]
1227f699Q651Q878Q04j0694j0941K066R495M984n43j782j340m295k554L638K559
1242B227n085k708N941K590o712k918K737k340l427Q679Q683n003q017J455J795
1257b103l542L477J5002O349j3052j4831Q13P933M144P960J0215q208k7399j1432
1271b4674J9511J8973J712l045n918j9846j4276J5507K7788O840j2584j0441q524
1284h977r413M943K4429J8084j0691k2731q631J302N30J1108K2764K004k9842
1297e121k4576N930J5751Q443R175L822j9594k5286J021K2714J5852J092n828
1310C395r447j2473j284J6458J6009j316q039k456l191q533M127J8673N842j3141
1324D624q060M025l422m358J0877J1951p136j4168N38Q360O70o75L747J6o794
$$ y = [-6699, 1952, 10830, 11634, 940, -10001, -7935, 1560, 6544, 6001, 4219, 2879, -1416, -3970, -332, 2227, -2858, -5566, 375, 2965, -3747, -6665, -3928, -6268, -9695, -1016, 7667, 2664, -5353, -3898, -2103, -5645, -2168, 12834, 19183, 6131, -8700, -7887, 46, 4190, 12150, 22365, 14157, -13242, -24674, -5163, 13810, 15522, 12477, 6559, -13287, -27563, -12056, 15732, 22572, 9988, -453, -8977, -18390, -13447, 10982, 29066, 18375, -4356, -12987, -11685, -11155, -47, 22717, 24721, -5121, -29697, -23767, -8016, 427, 9602, 13424, -6170, -31456, -30435, -7721, 8131, 9223, 3395, -6052, -18525, -19809, -3351, 12658, 11342, 3303, 847, -2344, -10877, -6750, 11923, 17765, 4624, -3436, 589, -2833, -7191, 3686, 15637, 8501, -5667, -5129, 3231, 3901, 3226, 6973, 6989, 195]
1339A95M45J0232J590j1854m347R914M958n963J268N014j3528j5891J1478K1673
1353A5184l613j8095j958K818r661l257J8607J3737j2363j7866o72N577l14P194
1367d682J7985K540k2101j5903P828J2514N716J1686P058k1397k8185N341K8271
1380F671J1161m556j782p881k0505o875K4451K5328l153j8205o838j187m832O668
1394a535K2432J0753j5408j8190j545K860L338J5236J3308j2774k3843n092R176
1407a284M656N837R341n797k2389j0809J3699J3885j976m407J002m536j1105K183
1421a1700J5769M513j0829k411P232l208p508O678Q787o504o407P958L933j0245
1435c942m018J0281K010r578P40J2457J052j4211m212J1166M407n444N544J1093
$$ y = [195, 640, 10872, 12462, 608, -3739, 6175, 11133, 5170, 6438, 11452, -2076, -17967, -6489, 15184, 11571, -6524, -8482, -5664, -15325, -18582, 25, 13762, 1399, -16467, -17139, -11562, -11876, -4682, 13303, 15843, -6258, -22161, -14333, -1819, 3897, 15583, 22641, 1244, -26941, -21600, 6671, 17832, 13276, 11494, 3613, -16892, -23767, 684, 26012, 22859, 4654, -2184, -3371, -8203, -1535, 20897, 31650, 16242, -1948, -3493, -633, 2705, 17941, 31249, 18475, -5368, -10460, -1284, 3372, 9209, 18550, 12753, -9636, -20445, -6746, 7139, 5163, 756, 1758, -2778, -13883, -11700, 4069, 8582, -2247, -4658, 2574, -634, -8142, -1464, 7323, 819, -5588, 2370, 6303, -3942, -7960, 2321, 4331, -5247, -4507, 7950, 9002, -5209, -9421, 1745, 6152, 708, 6252, 17345]
1449A7345r271j9134L348K0489O216p163L43j923j6000n634J8980J7090o409j3894
1463D383m828m516o044Q791K0279L937j8999j5348J870M403K866J2769J3196j1951
1477A0808k5116m788J4949R967M154O783m014k1515j2721J2600J8904M865l470
1490A1406o167j1393j1750N509J9227J0240p620j0582m422m617J28J3939J4427
1503A8325n215j4351l111K789p59M994J2676Q92j3978p009M986L750j381L567
1517F175M961n809j0193L62Q604R15n866J232M982m021o810M992O431o811n310
1532f166Q239O318o159m287M092j385o792L602J3120P71j2351o866K854K837J52
1547b021P493P417q898j6780j810J3054P083l04K884k134j4466q545J0507J5068
$$ y = [17345, 8074, -11060, -7712, 12777, 18993, 11830, 12173, 10250, -5750, -11384, 7596, 24686, 18277, 4383, -445, -4961, -11005, -2214, 18065, 22002, 3003, -12345, -10475, -6072, -3206, 9563, 22759, 10808, -14308, -19096, -4147, 5820, 9974, 16757, 12743, -8772, -21493, -8893, 10011, 14876, 11406, 5239, -6154, -17904, -12395, 6832, 17072, 9452, -1130, -5552, -10169, -10041, 3898, 18325, 13110, -1241, -4352, -1563, -2322, 2672, 15348, 16240, 2262, -4747, 239, 3989, 2608, 6175, 11136, 5327, -4866, -4504, 4100, 5015, -851, 381, 5363, 1342, -5468, -476, 5955, -856, -6166, 2073, 8391, 2232, -2055, 2037, 652, -6140, -2538, 10582, 11353, -998, -7864, -5010, -2173, -2021, 5472, 12889, 3991, -12789, -14599, -1545, 5538, 5234, 8118, 5984, -8482, -17027, -6520, 8548]
1561H548L547l923m591r537q927N288J6578J0127o166j1863r074l766M052J3161
1575C454J3256m680j7642j0415K570O525R102R628j385j5286j1914L236R920P330
1589C699N012j430r554j0204L6Q652Q101L515k345p139q503k837Q322J0783J343
1604G451o159m491l513k706M472J0654K049r409m716L287J875o59K311K464l126
1619b16l417K374L470j656m400L87M565R20k370P14P58n418l723N864O455k160
1635B147l118N44k970n836K214R516M914l840o487n115k064L055Q622Q901j804
1650H679j2557j0460K080R282Q216N199k187j2448j1355K397J2418Q515K505m496
1664E788j0255q288P23R763J0083L821n540j0480p907M30Q336J1652N238o747
$$ y = [8548, 12095, 8172, 3581, -5956, -14883, -9595, 6983, 17110, 10944, -919, -9993, -13759, -9707, 3454, 16710, 12030, -5612, -16027, -13457, -6932, 2170, 11798, 10413, -4873, -16787, -13551, -3631, 3699, 8711, 7281, -2273, -12477, -12441, -3789, 4312, 7827, 5482, -1657, -10160, -12997, -4675, 6108, 7451, 1292, -3199, -6712, -9418, -4946, 5708, 7757, -1652, -6368, -3081, -1206, -1865, 446, 2910, -216, -3633, -1259, 2211, 555, -3845, -3458, 1107, 2027, -343, 371, 1129, -4289, -8012, -2148, 4307, 2147, -971, -427, -3397, -9233, -7019, 2497, 7411, 3571, -2916, -8031, -10095, -7040, 1582, 10483, 8679, -3878, -14338, -12258, -2976, 5240, 10439, 8252, -4196, -15551, -13154, -736, 7779, 10284, 5788, -4467, -12755, -12032, -2269, 7814, 11635, 6095, -4385, -12292, -11862, -3526, 8126, 13364, 6617]
1678F617j2550p373J844R759J1583L137r257j1470m221L396Q679Q673P93q878
1692G32q350j541L927M880M588J104m504o282k870K765M783K803l05j549l058
1707b877m056P31N697L563l002k529O96r16j8K142J425k330k329J948L664K13
1723B022l625l262K64K417L070K569j58n620o358J437P850M330l4k204n092n338
1739g732M76P851O471R84m458o812m978J288O394Q197L591o125j0852o186L020
1754h871Q791Q599K520p488j1801n831N015J0342Q568J39q393j0254l771N262
1768g173Q785Q335L28q469j0020k312M638P907O662K75p442r102l824M532R030
1783B150N992j784o849o036k928L430Q597N674k758o906l378K33K363N099L739
$$ y = [6617, -5933, -13306, -11462, -1703, 9880, 13017, 3760, -7710, -11931, -8535, 144, 8817, 9610, 732, -7618, -9159, -5232, -352, 4236, 5340, 836, -5446, -8316, -5551, -768, 2035, 1730, 181, -2877, -6933, -6202, -505, 3058, 56, -2473, -1777, -2693, -2711, -569, 856, -1474, -3803, -1855, 1809, 2022, -1603, -4865, -4601, -2184, 886, 3455, 3297, -2323, -8681, -7244, 606, 4936, 4902, 2698, -2394, -7732, -7256, 595, 7066, 8050, 3592, -3220, -8198, -6910, -516, 7681, 11272, 5147, -5705, -11891, -8871, -80, 8519, 11039, 3551, -8250, -14081, -9066, 1276, 9844, 9983, 1590, -8664, -12435, -7173, 1612, 9947, 10275, 1806, -8214, -10526, -5888, 2019, 8681, 8956, 1514, -7588, -11412, -6880, 2150, 8142, 6358, -491, -6527, -9455, -6025, 2572, 8246, 5488, -1418, -4796, -4563, -2200, 2899, 6638]
1798F638j599m836l125R35K625J562K63m72m60k539j285K474J215k285j078J886
1814h1O59j692L66P07k196j686L449L368L69k566l793j607J112L990M245P35m297
1831A082o962k657M494N336L011K87m554p908k668M551P175M282j06n531q407
1846h575k761N681P928N882m38p259q708k601O211R709N800k733q706p489j598
1861i657N077R209O376m227r813n739M61M276O798O241j995r693n665J444M990
1876a917N606M240n92p101p519M87P404O104M26l061l486m954k005N370P183p81
1892E404o209j802N47j529Q63M506J168m003j398J917R36j803J49K425Q84j808
1908B47o70J957n7l534l11L648R41k164O67J005l684m008K951N294J165j350k267
$$ y = [6638, 5039, 203, -2922, -1987, 638, 2200, 2463, 1991, 1531, -1008, -2293, 181, 1396, -889, -1967, -81, 578, -1114, -748, -41, -2237, -3923, -474, 2894, 3263, 697, -3096, -4703, -3591, 399, 4644, 5379, 1082, -5880, -8537, -4043, 1293, 4304, 4591, 37, -7871, -10539, -5988, 1187, 5469, 5363, -168, -8575, -11336, -5655, 2273, 8155, 7717, 458, -8250, -10851, -4640, 5069, 10869, 8136, -570, -8059, -9657, -4580, 4629, 11005, 6778, -3035, -8774, -8313, -4037, 2761, 9002, 7007, -2686, -8351, -6907, -1917, 3689, 7929, 7337, 236, -7283, -6796, 608, 6712, 7138, 4077, 591, -4363, -6368, -998, 6185, 5404, -805, -2607, -2060, -3589, -2726, 1780, 2948, -1055, -2453, -536, 400, -1403, -1254, 1171, 2055, 247, -423, 1534, 1477, -2057, -2368, 1280, 2221, 57, 724, 1729, -1955, -5963, -3012, 2282, 3447, 2097, -170]
1925a70m311k595L089P829L641k685o251l802K6M267P392M985m021r214m115L315
1941b620M004M358M498j309r792o850L119O230M307L019j043p837q439J073Q737
1956A455P221J075l756o155p035o08R622J0161j215q538n128r93j343M027R190
1971G980J791r165p418J618K898J18L389M536l027q024k592M523L437J086J398
1986B548M47m391m864K882P157O34l602J010K85l647l02N945J379n648j630M698
2002B901K026l720j662K199R8j620K262M358j574n678j513L816K502N93J613j53
2018F448n274m195L546M392j81P32J194n362p614J070P797M084j953k571l456
2033a343o522j717P969R790q55q622n946n04J352M830Q414J650r166p924J662
$$ y = [-170, -4481, -7076, -3987, 3842, 7483, 4798, -1453, -5255, -5229, -962, 6430, 11415, 7394, -1820, -5935, -2620, 1384, 5742, 10240, 8931, -861, -7711, -4592, 1638, 5945, 8964, 7921, 84, -8355, -7282, 1455, 8676, 9751, 5995, -160, -7195, -7803, 1819, 11980, 10765, 2227, -2901, -3894, -5237, -1210, 7980, 9771, 606, -6812, -5194, -2296, -2178, 1211, 5747, 2720, -5304, -7896, -3373, 64, 1150, 2548, 2995, -1396, -6260, -3378, 3779, 4413, 811, 1821, 2106, -1541, -1843, 4102, 5481, -167, -1797, 2901, 4927, 1207, -455, 1744, 1842, 222, 2484, 6842, 5268, -410, -1923, 1893, 4395, 4988, 6601, 6448, 1174, -3021, 525, 4917, 4736, 5468, 6662, 1300, -6314, -5244, 2553, 6637, 4684, 2113, -1343, -7865, -9582, -1613, 8177, 7322, -1300, -7246, -7750, -6398, -1568, 6846, 8496, -670, -8594, -6932]
2048f932L389K560N509M145o821r682j095O352M124J398K745j099r037o449N359
2063e534J0911K456m672j638k248n069J013R405O210n700o237J83M00q63L895
2078B512N319k428o607j461L352k44j410K590J923l406m383J807L496j871k453
2093c264K887K177m047k403M136J492m241r82M061J288k101l64O03k606k027L623
2109a768M968q18m320k064m28m33K977N493J766o795n667K351L573J539L102L708
2125G184m471q613p86P017M095N78J226k258p817l998N829Q072J701l304k919
2140A536m339m240K221R905M906n422p128j780m31M52O571P409l179r840l159
2155f518L263K604K271M249P01p257o642K548O029K217m91r3k096n689j620N827
$$ y = [-6932, -3543, -983, 4526, 8671, 1850, -7832, -8927, -2575, 1549, 2947, 5692, 4593, -4444, -10893, -5534, 5377, 7833, 3161, 1523, -725, -5794, -4781, 4624, 10834, 5134, -1103, -920, -520, -1383, 2512, 7831, 5403, -1204, -2665, 687, 443, -967, 1623, 3546, 140, -4243, -2436, 1060, -811, -3264, -377, 1800, -2247, -4650, -514, 978, -3263, -4245, -184, 1104, -997, -1361, -758, -3364, -5391, -1768, 3200, 2382, -1938, -4002, -4430, -4863, -1886, 3607, 5373, -1422, -7089, -4738, -1165, 374, 3476, 7184, 2713, -5900, -6686, 331, 4426, 5004, 6230, 3972, -3845, -7843, -2014, 6058, 7759, 4455, 1536, -2803, -7043, -4822, 5083, 9989, 4567, -2561, -4341, -4772, -4320, 2251, 9660, 6481, -3359, -6518, -3255, -651, 1620, 5869, 6570, -687, -7329, -4781, 1248, 3465, 2974, 2881, 785, -4904, -6524, -697]
2171f97N175j364l012k43j506k435K403N659j82m056n24Q28o25m10K143K240k503
2188H91k018J488J705j356k009J487J144j179m32K593n51m369j057L731K016o03
2204A481P1o52l848j984L837M551J09j996j890k589k275K551O018K507l710m869
2220b688j143k84Q71M979N351k766q023l441K811L026L318L711o53p452n910K867
2236e426N960L775R55k069m679n244K01O530O147j093m300k796k497j343M339
2251a540O991J25n383l827n58r5K224M964K451l743n696r37K568K374J937J227
2267C082j744l857k476K704L229P38j111n62o93k034J020K485j46j559M34R35
2283D45j024q64Q45L33m11RJ478L27j323r19m25O71M25J096J744o09l250j551
$$ y = [-697, 4478, 3114, 102, -141, -1647, -4082, -1679, 3980, 3798, -258, -782, 46, -579, -989, 1154, 3394, 891, -1127, 361, 2066, 710, -1299, 188, 1332, 153, -279, 2314, 1763, -2606, -3663, 68, 2084, 1481, 1552, 900, -2948, -4932, -1095, 3456, 3565, 1569, -321, -2910, -5185, -2634, 3384, 5891, 2181, -2688, -3831, -4115, -3244, 1735, 7086, 4320, -3703, -7144, -4333, -1307, 2011, 5722, 5069, -2383, -8293, -5426, 534, 4309, 5264, 3195, -1484, -6728, -6527, 3, 6150, 5057, 757, -2039, -4536, -5879, -1540, 5451, 5576, 193, -3634, -4192, -4287, -2063, 2901, 5352, 1609, -4087, -5024, -2456, -82, 1855, 3082, 1338, -2519, -4995, -2291, 938, 1676, 565, 3, -690, -2724, -1704, 781, 635, -924, -490, 445, -579, -1443, -598, -265, -676, -667, 811, 1138, -185, -1104, -1529, -858, -433, 663, 2407, 1798, -1452, -3003]
2301c003R61J567K030K000o39m676l531J808L990K552P05j650m276l931J363N638
2317I08L416k96l697l385k370N34M437N229L05m722m943n92Q07L624M832J440
2333E527m454o019j335K909M061L334O99l730n841j992L066N432K690j303l469
2348d25l190k061J978N373K309j957l139j934p63J207L252K261j004k703k205
2363c001l95J326K450J115l16j944j529k47J443J337r6l24p41q85P4J466l38n57
2381a162p6O36K81k2j4r91j412Q37J921R79j67j061j848j521J153K254K376k81
2399A882k496k903k99J141K096K833Q28l185m201n65K608K642L088K00l522m591
2415d444j016K914M647K157p51l826l762j228K489N253K768k254l865l115n76
$$ y = [-3003, -2042, -475, 1555, 3555, 2916, -1760, -5291, -3483, 507, 3059, 3764, 2114, -2162, -6093, -4730, 908, 4324, 4028, 331, -3054, -5424, -4890, -453, 4776, 5081, 359, -4584, -5176, -4369, -745, 4087, 5527, 1073, -4946, -6281, -3372, 689, 4023, 4722, 992, -4849, -6841, -3775, 1657, 4347, 3044, -425, -3615, -5676, -3698, 1675, 3984, 2027, -1112, -3046, -3809, -2602, 650, 2911, 1907, -796, -3001, -3396, -2070, 380, 1495, 1179, -765, -2294, -2541, -1098, 239, 143, -181, -922, -1807, -1733, -267, -605, -1162, -1238, -602, -321, -343, -357, -1348, -2760, -1923, -2, 977, 810, -251, -2099, -3620, -2467, -213, 2163, 1882, -614, -3517, -3816, -2675, -579, 2254, 3082, -103, -4304, -4869, -2261, 381, 3469, 3669, 147, -4444, -5460, -2546, 2101, 4258, 3507, -319, -4081, -5309, -2820, 2433, 5201, 2947, -918, -4033, -4609]
2430d609K149M454L373k037m783l244L34K885L780K311j715l802l308J64L239
2445h09L629O84j415k943k609j83K772L511K06j816k469j501K25J852K353K76
2461A763j086j450j277qJ791J410Oj117j12p04N99O17K19k38n03N76L53M42l63
2480I18j205m92J187P54Q48Q9j185k329J1K056J591O35j30j891k233n56K730K271
2498C069J349j336k374k300k54J679L644K409k405m017k696P16K198L784K023
2513E489j760m974l025J225L487L118J009j986l764k719O61L840L564O1k007k983
2529g64k167j18L685L800L64k625l252j286k01L374L304Q64k855l164j231Q71
2545a401K981K313O3k391k236m68J535J831P92j84r62j706l60J444Q68l76J45
$$ y = [-4609, -2460, 1994, 5367, 3330, -1453, -4697, -4363, -1478, 2302, 4613, 2898, -904, -4212, -4048, -809, 2820, 3504, 2089, -854, -3463, -3646, -874, 2637, 2843, 1027, -1442, -2943, -2718, -866, 1487, 1763, 677, -773, -2050, -2058, -267, 1143, 1149, 32, -80, -784, -185, 432, 651, 413, -90, 486, 839, 1281, 918, -287, -779, 408, 1162, 2010, 2099, 914, -1415, -1404, 652, 2243, 2878, 2748, 857, -1376, -1932, 798, 3069, 4418, 3082, 708, -1592, -1846, -167, 3477, 5886, 3481, -536, -3232, -2516, -318, 3466, 5489, 3729, -1245, -4270, -3045, 442, 3560, 4569, 2583, -1181, -3900, -3239, 601, 4165, 4226, 2219, -764, -2931, -3049, 636, 4436, 4800, 2175, -1077, -2363, -2564, 810, 4114, 4978, 2123, -1041, -2272, -1401, 1580, 3893, 3956, 1565, -671, -1139, 396, 2227, 3019, 2835, 1873, 167, -193, 1251, 2119, 1743, 1888]
2562A888L11r31j189L88J235n55k90K72j2n67m03N60j43j185Q6J006J625j504
2580E92j288l85l65O12J711J928j070l895j595J992J933J064J119q38l702k229
2596d416J425L567J574m69j275k204k107P02L004L216L10k658k076j709k80L309
2612h7M525M87m137l179n77N99L210K968Q36l609m314k58K565K915J716n85k311
2629G64l140p05J993L096J203r72j309k437j451J291L508Q36j220j415j084j790
2645b832L61L347J539j763k322m45N82J12J224J140p17k211j95J429Q15p39k14
2662h89N85R5r33J055R29j863j307K052J770j003o44N86L6k066J93K579J357j177
2680A355j478o5j98q93J211L515L03l435k197M24J110J372K606P74l281l781L72
$$ y = [1888, 2199, 1268, 79, 467, 1702, 1147, 857, 1129, 1117, 550, 147, 707, 564, -621, -535, 471, 2096, 592, -696, -1081, -1446, -834, 877, 2805, 1735, -2160, -3755, -1763, 170, 1234, 2353, 1515, -2187, -4416, -2991, 576, 2150, 1681, 406, -1798, -3905, -3203, -199, 3017, 3327, 669, -1407, -3116, -3396, -87, 4438, 4925, 788, -2391, -2968, -2369, 841, 3809, 4645, 1036, -3278, -3536, -971, 1944, 3660, 3075, 764, -2376, -3081, -1088, 2008, 3211, 2239, 930, -1507, -2958, -1667, 1841, 2677, 1457, 42, -1042, -2832, -2471, 876, 2415, 652, -1670, -2115, -1533, -1421, -197, 943, 226, -1985, -2180, -751, 64, -675, -889, -304, -209, -1142, -87, 842, -1021, -2328, -276, 1494, 491, -153, 433, 469, -1597, -1404, 1175, 2532, 1355, -123, -188, -386, -1279, -68, 3447, 3750, 315, -1882, -1458, -348, 1024, 3630, 4404, 1123, -2658, -2286]
2697b286K343J803J711K30k912l764p78L362K977M34j181j782k148j794J556M364
2713B135J582k406k407j212r61Q90M020K334j908m002j358N34J408K558K229j428
2729B008l690j897J261K304J022P01k36j905k843J235K932R99j158M53k88k158
2745a260o22K195J907r03j057M96p06p90O72J546K17j857k19J480K7j188l6J261
2763A163q02r84J586J300k179k059J012J689l2j68J137p14k764n69K529J827m93
2780A479p72o42j244j224J579K812P37j953j467j017l90O16L656J758k188l703
2796a963m45Q08J186K043K241j191l863k089J461K670J572J054j147k564k814
2811c041Q07L230K281kj672j945j684j30K910L116j120k243n13j250n23K178K755
$$ y = [-2286, 57, 1860, 3571, 3801, 889, -2875, -3653, -291, 2686, 3120, 1939, 157, -1991, -3785, -2229, 2135, 3717, 1311, -1096, -2308, -3269, -2379, 1641, 3975, 2067, -1935, -3293, -2759, -1351, 1207, 3436, 2008, -1682, -3579, -2318, -14, 1008, 1709, 1473, -432, -3275, -2040, 892, 1891, 733, 1186, 898, -1260, -1882, 313, 2220, 1317, 260, 756, 50, -740, -68, 1478, 1695, -162, -381, 1099, 1126, -62, -98, 1163, 361, -623, 963, 2263, 84, -1975, -963, 726, 694, 526, 1663, 949, -1815, -2384, 145, 1972, 1479, 707, 65, -1179, -2403, -824, 1988, 2725, 772, -695, -1712, -2102, -1486, 2170, 3928, 1740, -1963, -2408, -1600, -414, 1629, 3870, 2679, -1184, -3273, -1812, 858, 2430, 3484, 2337, -227, -3041, -2234, 996, 3277, 3275, 1603, -342, -2026, -2156, 754, 3870, 2750, 507, -6, -1256, -1779, 399, 3154]
2828C154l4k736j258n6M89R04J207R20j943k244j9J939M0j78R70L18j894j193
2846a614J636J125p91p38Q68O9j166J37J124m34j215M12J838k07j030o98L9L23
2864c22k77J341J390j390k351J04J372J06O16J475n86k520j586J818J470R41K17
2881A818m82k299j804P49K458J972n80j527j512j426L40L029K411o53k769j357
2897a632o44K11K622K523m18k830k319M26O56K038J699K42k198k757o05K267J831
2914A112R59l41j174k273j098J950K109O52p33r58j308j127Q22L040K27j737p32
2931f10j85l21J83J594R25j040j520j9O66K22k13N56N07q16p37R48L39j009j82
2950g12R26K01n81J56O28o31j249M21J022J016l02o68q04n62K02J258J418n4j824
$$ y = [3154, 3120, 384, -874, -930, -441, 463, 1670, 2590, 647, -1597, -1616, 323, 363, 185, 1155, 1473, -421, -1614, 22, 1147, 356, -382, 486, 555, -611, -474, 650, 216, -999, -587, 1251, 1044, 14, -684, -645, -322, -599, 742, 2132, 742, -1609, -1505, -133, -27, 589, 2064, 1478, -1042, -2628, -810, 660, 1601, 1818, 1336, -963, -2767, -2018, 440, 2412, 1832, 305, -1207, -2633, -2293, 736, 3147, 2494, -275, -1632, -2276, -2065, 557, 3080, 2662, -168, -2487, -2061, -1405, 633, 2332, 2574, 376, -2381, -2986, -719, 1112, 2071, 1730, 556, -1717, -2815, -865, 1244, 1896, 1163, 205, -1103, -2230, -1408, 1632, 1859, 122, -610, -795, -1116, -933, 661, 1586, 546, -974, -993, -327, -105, -318, 238, 745, -71, -808, 140, 479, -530, -712, 214, 415, -166, -10, 618, -13, -1262, -841, 181, 1197, 895, 227, -577, -1139, -937, 321, 1739, 1685, -139]
2969a39j343j62O72J589J921m37k197j931J6J237J762J117l53j785k190J98J799
2986b26J600J097o39j829j795l19J328K632R59r35j993j832l90J829K413J092
3002B992j382k357r08l11J712K186J035j959j355j136K14J406J436O04q50j938
3018f11j248Q26K059K56K73k86p79j706M26J472P95l58o37J20j094Q3Q05P87m93
3037F90k26l27M79l93M63m28R3k0KM29N69q31p69J29O41K99L50K57q55j094l4
3058e76Q43R93L50k20j150j359O0Q78J410R03r59j523p33p40J418K087Q59j350
3076A191j825j178L03J322J888R29j181k358j190M14J611K063O69j603k010j446
3092b401P59J763J947L08j298k045j325N30K439J348r3j341j186j005K08K039
$$ y = [-139, -1482, -1644, -972, 617, 2538, 2101, -96, -2027, -2011, -774, 988, 2105, 1752, -33, -2223, -2025, -226, 1374, 2471, 1832, 3, -1792, -2111, -783, 1849, 2808, 1873, -120, -1952, -2342, -513, 1900, 2992, 1610, -747, -1655, -1966, -254, 1932, 2967, 1008, -347, -1483, -1269, 137, 1573, 2177, 1327, -611, -1859, -1033, 1026, 1282, 1555, 1269, 490, -1216, -790, 682, 1477, 1119, 482, 602, -492, -409, 396, 1183, 690, 464, 137, 616, 223, 686, 258, 351, 331, 333, 762, 1331, 500, -269, -140, 501, 800, 1150, 1407, 552, -542, -576, 267, 1260, 1610, 1390, 240, -1119, -1059, -181, 1229, 2132, 1173, -350, -1083, -1823, -405, 1682, 2541, 1191, -634, -1812, -1509, -187, 1701, 2630, 1449, -909, -2099, -1685, -74, 1989, 2658, 1055, -955, -2401, -1642, 121, 2068, 2376, 1078, -967, -2292, -1762, 677, 2025, 1932, 591, -595, -1600, -1392, 647]
3108F47J229K3j388j355q53Q97J147Q60K51r22j322p35O51J296L77J24n41j003
3126f17m74O54N49L2l0p6l77k07M49M33n51lJ33q6L53j57k23l38p5K58O52N03
3148H02o11q22l29J34P06P50M58n20q51p93K22J284P21N63r76j347n06K72J451
3167F08J208M88j599j765l31M91J542J731l48j391j565p40O45J961J575o74j183
3184F53j065j151P06J640J250k87j582j079o34O02J954Q39j53j396j992o1Q06
3201i50J807M94l84j055j299l73J209J491m9n28l73p94p1O48R66K14j97j030j17
3220c91p8L16P97K70J50q28l01K44J05K95P9k8l59k80O98M3l79m17M06j5O38K39
3242A204l00p74n63L70P75P54l30r46o03m90L21J115J138p12j435n89j19O61O53
$$ y = [647, 1876, 1899, 511, -844, -1697, -800, 347, 1207, 1458, 536, -786, -1521, -870, 426, 803, 927, 386, -617, -1091, -437, 112, 144, 114, 38, -339, -546, -97, 336, -215, -218, -85, -171, 182, 25, -198, -536, -611, -353, 299, 802, 191, -631, -960, -826, -120, 630, 1088, 568, -283, -1076, -854, 430, 1151, 1714, 738, -609, -1115, -843, 608, 1816, 2304, 705, -1060, -1391, -900, 642, 2373, 2025, 634, -931, -1671, -1026, 935, 2510, 1836, 653, -412, -1563, -857, 783, 2033, 1746, 164, -915, -1549, -947, 1007, 1846, 1693, 297, -1695, -1756, -950, 857, 1351, 967, -88, -1387, -1760, -551, 940, 891, 363, -10, -804, -875, -227, 739, 953, 756, -274, -391, -469, -153, 644, 914, 1064, 236, -65, 179, 284, 579, 658, 630, 271, -9, 689, 732, 353, -64, 342, 327, 965, 1204, 904, 130, -433, -63, 712, 1466, 1136, 190, -413, -903, -582, 533, 1671, 959, -476, -1065, -1184, -523, 130]
3261A30J332q14j216r46n7P86J032J465n87j295j717k6J416J202R40q37r59j640
3279a791r6J390J721N03j045j232n67l73J019K175J07j269j261k28n1Q90J131
3296A023J117j096j499k95M59R10O00M89n50q17j590P97J172K06J06k07o63r51
3314g89M03J036J05o22j66J39m2j13L63j92J41m20J84J82K01p77J27K02l1R5K03
3335B29L78j078j93k20N54R5M99L13j082o92J90J065K42N85k17r01j037j93J306
3354a57J602j70o96r29o90J73N44J792J98r43j235n31L24O06J143Q44j263j447
3372h35k33L19Q28J138N76p39j968r32Q58J565N57Nm05j006j159j0J915J112r22
3391F64o01o00p26j5J256J325m57q74r08k57L66N45J086j22o99q20J71N66jn5
$$ y = [130, 1462, 648, -568, -1514, -1571, -785, 247, 1712, 1125, -170, -1887, -1913, -497, 705, 1645, 808, -151, -1791, -1887, -497, 1224, 1727, 682, -550, -1117, -1490, -471, 1704, 1811, 542, -719, -947, -998, -108, 1023, 2140, 1044, -455, -750, -291, 619, 1219, 1708, 1158, 341, -1249, -452, 720, 926, 1032, 825, 162, -789, -386, 650, 755, 133, -33, 106, 64, -49, 314, 122, 263, -157, 27, 209, 410, -367, -240, -38, -69, 26, 229, 607, -471, -664, -884, -330, -235, 264, 577, -505, -1197, -1007, 58, 300, 885, 668, -233, -1270, -1463, -157, 1445, 1275, 579, -350, -1040, -867, -323, 1469, 1667, 724, -511, -1042, -718, -112, 1031, 1875, 612, -835, -1068, -749, 79, 1217, 1793, 1054, -914, -1846, -988, 577, 1134, 1139, 734, -272, -1431, -1441, 474, 1586, 664, 63, -537, -1263, -1278, -22, 1303, 846, -28, -936, -1193, -827, -282, 804, 682, -17, -837, -666, -100, -101, -156]
3411a56O79l95q93j6P74L99p50L59M61n17m29O52K25p02l95P04N12k82k80k51
3431c01q0L6M49R16J51q98q03K02j84N67Q11L93q09j094j42N36M92M71O68o11
3451G70j769n88R65J282N80o76j33r33j010K75K005Q93q37r66r6r83J66J783Q08
3470A536k37j834m31j90R9J140J193k91j027j277p3J244M08O20J14j105j018l12
3488a441J522O48j4k06n22q06j56Q44J040J8q10k91O3n10L70M83K55k04l26r3
3508a36oK63l35N63o6o18K09L64M9n92L7N17k26N5L72j20r08j47R39L90j50m0
3530D14j77o42l71K88R51L41p78j12l24l69N92M97Q34m36r17m47L5N2Q16R01q9
3551A059r96j092K56Q13P09K63l7j033j026k83J366J172j32m53l58j080p60J550
$$ y = [-156, 523, 128, -765, -781, -7, 392, -358, 1, 462, -55, -484, 168, 393, -309, -704, 0, 512, 230, -50, -301, -381, -345, 104, 1020, 1171, 273, -530, -328, -512, 55, 866, 1259, 450, -644, -786, -250, 242, 713, 1381, 770, -999, -1587, -622, 660, 1240, 564, 431, -502, -1512, -1237, 768, 1661, 824, -142, -238, -1221, -1055, 728, 1536, 1299, -535, -966, -1156, -1057, 83, 1276, 985, -42, -1319, -1392, -148, 260, 880, 994, -111, -1129, -1441, 81, 729, 715, 509, -13, -819, -975, -131, 909, 927, 117, -174, -111, -621, -251, 232, 487, 283, -43, -136, -142, 121, -214, 349, 283, -335, -126, 238, 287, -305, -268, 249, 23, 78, 450, 330, -578, -725, 214, 604, 454, 414, 237, -405, -776, -488, 463, 804, 26, -86, -410, -779, -187, 310, 1144, 708, -209, -656, -621, -569, 247, 1148, 1059, 63, -1029, -773, 40, 749, 1012, 975, -58, -1084, -1367, -1, 1171, 1039, 586, 228, -852, -1612, -62]
3569f2J262k07p28n37n99j51N57J436M30j144n58n40K10N04M67P34m56j310n22
3588a214O74Q86J03P2j37n64o09K94P95k59O7pl82j50j20N16J87j48J11L4r0j62
3610a03J43j36Q0m10q4O86J75k48o36K18K4K29N86j85p58k79j36N87L15M59o7
3631D60p76n86m5R39N49k5m86m34o09MR45P42M67j145p15J71m81P18J013Q24j321
3652B09j014k85L21R03O30L00r80q82m73N87O57P92k57l74p37o36L56J228R15
3671A260m23p09o76k97M0Q24Q00j49q03k71o02O47N79N83k33m41o66j9L36N21
3691C01k35K70m37j10k08L64L4M30p8k61k09J97M17k14k92l38Q01q4Mj70r5k94
3713b07j02N69J0M57q81q1R4L3L11N54j39o50j15j49J1N40O42L80j107p44k92
$$ y = [-62, 1200, 993, 265, -272, -871, -1022, -465, 971, 1401, 257, -301, -841, -631, -127, 340, 1074, 618, -692, -1214, -540, 346, 449, 521, 384, -180, -789, -495, 300, 41, 108, 101, -281, -431, -551, -35, 152, 4, 115, 149, 59, -103, 40, -96, -16, -426, -510, 176, 351, 103, -533, -315, -291, -62, 524, 339, -419, -698, -834, -247, 68, 527, 460, -316, -902, -947, -8, 541, 516, 30, -404, -1013, -1009, -64, 678, 1145, 0, -715, -544, -1025, -307, 706, 1530, 209, -805, -1090, -769, 134, 764, 1064, 84, -798, -1271, -684, -27, 765, 508, 134, -603, -1239, -883, 345, 1260, 837, 128, -548, -845, -805, 19, 819, 670, -133, -404, -1006, -359, 220, 803, 570, 129, -537, -556, -220, 301, 66, 336, -101, -211, -419, -55, -21, 409, 331, 70, -139, 58, 475, 261, -31, -369, 432, 348, 352, 182, 87, -207, -309, 260, 270, 727, -154, -235, -141, -108, 203, 757, 618, -32, -147, -296, -285, 255, 897, 1277, 170, -574, -866]
3734h66N69N69K41J42o30o67k04O54P48L39j46p95k62q42P85Q52L26q8q41m18
3754e34n17Q03Q65N00l18r64o81r4Q89K49J60L47q16n66l62O71P81QK7o50k08
3775d10k44O98M64J6j94m66k14q4Q61O8J85j14l15k19l62K92O27Ol68l60nN29
3797C91m56J68O2K91m32J75M17p47J03j23R3N30j1k84rm32J82P8K36L85l70m55
3819b08l9m87J48P96K13k08n30n13J60K55P36N37n72p33k79N8Q83N02Jl68m56
3840a04l73k01Q60O09K60o08m41m61j70O07R87N3n30n63n93J09Q44L83Q7k52p43
3861b40l2l6P97N07k87l35o31k53J73O83j20J90k00p16j19N45L20l9K8n61m89
3882h15J59K71J66M46l80J87m94P8J36Q0J36j54o7pL33j9r1j19J69j90L79J45
$$ y = [-866, -297, 272, 513, 655, 25, -642, -846, -192, 556, 895, 749, -46, -308, -1150, -365, 487, 813, 725, -116, -534, -1051, -248, 617, 1117, 799, -165, -846, -940, -51, 198, 358, 705, -111, -677, -1039, -368, 413, 421, 448, -202, -410, -654, 44, 508, 524, 330, -136, -350, -434, 427, 495, 680, 566, 251, 32, -330, -38, 589, 595, 227, -133, -138, 391, -65, 103, 165, 456, 24, 199, 616, -131, -28, -151, -58, 472, 461, 177, 168, -264, -82, -4, 232, 617, 247, -208, -247, -734, -586, 210, 423, 215, -315, -828, -668, -413, 323, 860, 288, -445, -724, -666, 217, 719, 720, 352, -104, -477, -678, 182, 791, 1051, 443, 2, -459, -629, -22, 965, 1018, 488, -75, -668, -559, 285, 668, 755, 503, -240, -272, -308, 489, 996, 709, 374, -257, -510, -337, 346, 226, 416, 216, -500, -619, -74, 246, 207, 235, -326, -815, -656, -385, -219, 227, -153, 34, -460, -382, -246, -166, -30, -184, -251, -258, 75, 56, -35, -154, 15, -175, 204, 349]
3904C49k44m35j91L68J74K12L22p2o25K6r6M55M88q8l25l05l05N1O00K97J98o97
3926A57l19j18q7M27P18J44q62m67k78L25K34Q66k15p53n47j15K98O58M39J8n15
3947Hn97l86O11O96M4J08n11n35m36P04P91j81k79k57m6n03L64O20K65l05l29
3968a54k48O3J01N56L18l10m03j48j15O50j07K34j41m54l13O42Q2j65nJ55j11
3989A27l54J73K02j30k35J0L12K1l37K91l06j30j04L88J66M29n09j57r2J34J13
4010A2L82Kn08l93j43M74K32Q4K65l53n15k24O11K70K47j31j21p33j29O86O11
4031F26K1k09n20j74l87P46M82K38k79j042R9j62L22P71L91n67o11m97O30M1M31
4052C50L55j11r20j2JN87m7K50j21m7p58K19M62k36M33k20Oj54l80K55L51j63
$$ y = [349, 105, -330, -521, -153, 21, 233, 555, 483, -142, -116, -212, 243, 731, 643, 318, 13, -292, -241, 359, 656, 854, 157, -162, -280, -367, 60, 778, 922, 60, -407, -685, -360, -126, 740, 525, -228, -775, -890, -592, 66, 505, 523, 8, -589, -975, -364, 332, 376, 484, -27, -562, -998, -294, 497, 316, 37, -220, -266, -769, -405, 215, 480, 175, -154, -402, -339, -238, 318, 636, 326, -77, -225, -340, 310, 203, 437, 296, -158, -471, 171, 253, 88, 83, 238, 127, -227, -54, 148, 18, -217, -207, 105, 126, -211, 80, -226, -356, -460, -72, 94, 523, 14, -143, -235, -101, 12, 394, 396, -112, -505, -648, -174, 58, 142, 407, 54, -461, -685, -74, 196, 443, 312, 191, -542, -671, 15, 626, 647, 438, -82, -256, -643, 103, 585, 823, 544, -498, -399, -561, -239, 532, 923, 356, -255, -752, -122, -81, 350, 705, 594, -326, -338, -337, 250, 203, 453, 332, 285, -473, -254, 208, -28, 405, 185, 191, 37, -343, -88, 263, 100]
4074A00j67o5R3k41L23O3K42k81J15q0K19j84j96J70O2j18M7Q2l90q7K53J37K04
4097C01j34k8k15l58L38J17L40O8k96l02K9k24o1R23l3m61m37K06j24L65M56M9
4119E19j59p17j00L60J36M17J15l07n16l51O4O87M01j73r7n85m30PJ200J65l58
4140B78q6k43o92K45L23N44j9m10k54j43J7M54M28j35k95m82Q6L61J28L2J43j60
4162A20o9n99M63J6J15j14J31l37L0J5K76J43k34J63l51K63k16K11p8J56l17L19
4184A06r0j9j60r6M8P8J34J83j47n28N53n2J78L03k80Q5m84k70N09j16L57O2n2
4207C02n61n4l41P71K81N7n57j39k72KP15M26k17o68j40r6L47K12M16N3n10p90
4229g63N8M09O54jK47l05j085M08J74M87KKnn31r0L29N87k56l58j89k8rK20j7
$$ y = [100, -67, -132, -39, -280, 43, 106, 348, 67, 182, 102, 321, 137, -59, 111, 173, 55, 102, 184, -206, -293, -40, 97, 301, 167, 139, -76, -434, -96, 21, 361, 429, 133, -169, -140, -364, -425, 498, 465, 4, -433, -227, -351, 14, 470, 519, 360, -357, -457, -97, 39, 456, 571, 264, -252, -603, -539, 148, 549, 376, 279, -306, -736, -729, 471, 636, 278, 192, -51, -743, -498, -175, 369, 350, -60, -314, -457, -440, 14, 442, 307, 12, -470, -384, -23, 105, 137, 280, 120, 51, -548, -85, -69, 46, -68, 63, -274, -244, -229, 47, 190, -44, 119, -232, 31, -185, 26, -52, 104, -213, 106, 16, -3, -163, -259, -211, -133, 1, 184, 37, -491, 62, 10, 188, 491, 211, 296, -188, -458, 51, -65, 292, 354, 302, -259, -313, -654, 117, 398, 455, -102, -241, -513, -511, 204, 630, 413, -255, -395, -491, -144, 68, 484, 537, 27, -763, -705, -296, 358, 357, 604, 299, -786, -378, -204, 283, 285, 287, 282, -249, -339, -10, 577, 321, -37, -226, -254, -263, -43, -60]
4253f0K09j12l58J75K17j40o0K12K50p16K14J66N4j52K02j76K26k41j58M26J44
4274C22n51J58M0J12j01k5j17J55NM1K56k09J4m84O7K58J6M95P8n91k19NK14L25
4298B64l7j7j51j10o3J27N10k4k22l68l99N3Q44L4L9l99j20j82k57O05L71K51
4320G49n71j22m31O3Q0O65L79o41l58l24K75J99M02lj77n01j15R7O49K63j27j78
4342B73l35m07M42L11p8J75l88J51k83L8K52Q2j5l8l76L59O4j31q8K80l81j72
4364b65J80j23M67j42O5n83K48M04K40n31PpL2Q4L58n66K45j73k30K93J60J71
4386C34j29k87j52K71j98N27k8n10o0k51M85o7L98j8m90n6K1J3J94K66j39j04
4408B0k13j57l4N05K42r0m29o5l56J73Q30j02Q4l16l96j92L67K26M58R5m34n21
$$ y = [-60, 149, 37, -321, -146, 71, -69, -129, 83, 333, -383, -169, -3, 51, -101, 101, -75, 151, -90, -248, 178, 322, -229, -71, -31, 81, -20, -45, -162, -7, -2, 39, 295, 86, 100, -384, -317, -59, -43, 452, 530, -61, -280, -275, -61, 264, 227, 210, 59, -51, -114, 13, 523, 499, 277, -91, -490, -437, 407, 441, 480, 81, -39, -221, -478, 127, 498, 749, 178, 56, -375, -312, -232, 433, 812, 171, -187, -511, -236, -37, 365, 362, 185, -316, -431, -334, 315, 578, 451, 273, -62, -469, -27, 284, 206, 381, -7, 144, -139, -101, 151, 233, 218, 180, -196, 163, 227, 96, 8, 288, -93, -265, -85, -208, 259, 117, 182, -401, -153, 251, 491, -40, -33, -40, -8, 76, 434, -132, 113, -60, -290, 3, 163, 334, 205, -82, -234, 37, -161, 366, 338, -172, -232, -483, 2, -65, 333, 315, -175, -231, -210, -197, -3, 263, 124, 20, -193, -350, -384, 121, 363, 273, -156, -221, -577, -404, 426, 324, 408, 92, -304, -496, -129, 97, 555, 650, 216, -305]
4430c05o3m7L70M91j25j95p50M28J3M72R1q8j01k73j13M69R6l70J59l53L25l66
4452b35J92J68k3j02p6K29j50J35p7j0J14m0m5M4o8rl42N32m15L89QJ2%j18k78
4477a65K73l6K26o5n32J34m3L83K76J55l34l24j83P2P99k00m2l88j20m6j91K90
4499f1J69k0k27l31k1R9M22M11K40q91j54J40J26M51J5j90l06r9J4J90N20k50
4521B47j91j38j81rL27L2J33j9k73M3k53oO05O3k24j50O3k28Q6L39J07J86m57
4544A02j7j08Q1J27J97k90K33k49k46M6K34L0r7rk17p3l2K49L6j35K91o4k1j36
4568f8k8n7LL64j01J02op52K62J01R5K63k5k54q9O3j27O58J62l90j46n08K88N18
4592C28j91J81J28m15l08J4J25M47J82k49K1p19M44J50M48j47n66J0j79P1M12
$$ y = [-305, -368, -415, -45, 446, 321, 126, -624, -196, -183, 289, 380, 292, 191, -82, -195, 274, 370, 0, 159, -194, 131, -235, -43, 125, 102, 0, -76, 153, 3, 138, 61, 51, 165, 125, 80, 124, 56, 47, -295, 237, -178, 211, 219, 231, 231, 113, -165, 108, 72, 298, 233, -299, -165, -208, 175, 451, 606, 272, -52, -235, -163, 636, 436, 394, 6, -114, -160, -351, -61, 108, 88, -139, -470, -491, -392, 30, 441, 681, -210, -364, -224, -98, 353, 368, 178, -128, -227, -213, -23, 497, 247, 56, -82, -263, -272, 55, 87, 220, 201, -72, -29, -282, -288, 317, 380, 156, 6, 69, -159, -73, 266, 373, 559, 102, 85, -23, 58, 185, 382, 92, 325, 76, -170, -124, 110, 140, 43, 34, -183, -256, -288, -39, -3, -138, 153, 89, 68, -68, -96, -153, -150, 214, 113, 215, 209, -543, -281, -180, -85, 178, 153, -101, -190, -127, -254, 404, 566, 176, 30, -478, -190, 328, 137, 318, 446, 31, -277, -263, -138, 309, 491, 242, 263, -456, -12, 138, 586, 439, -127, -117, -296, -225, 187]
4613A87M6P3m37k07p1L47J62L9%k71j17j01K47M8K10l3l9l30k35K59J72m2J30
4636C7r3J18n08J69L11l5J9J83m34J15j96M61J24l97k93M03j13J84l0j2j63J76
4658B6J55k19K0Q4m8j57K51l4J24j33j73l30K12K03L46o8k05l07L7j9K98K31j86
4681A08k27LL9q5N7L90J49m97Pm07j16P14l2K07j65l14k97M81L60o2j35n26K6
4704c22O4K8N85J63j47P3n63mO2K39J52l35j91J59o7PO7L93m03j50k6j15J74P9
4728g8L19Kl61j86K38j10M59k44J53m9j09j26R4M2j45J02O1j13r1J7L37k27j10
4751a25K05j21L73l90Oj52K86L02K5k45k10j05r6j0M54M2k34k0l76M6K64J77m9
4774D7l2j90L1j34P2K83K58l00Ql02N9O3L7K69n4j51j57L2K20L68j44k11n46K97
$$ y = [187, 233, 306, -131, -338, -409, -62, 100, 139, 139, -132, -249, -350, -103, -55, 155, 122, 83, -247, -482, -223, -51, -93, 37, -56, 62, -446, -277, 34, -1, 18, 201, -233, -118, -314, 147, 271, -126, -419, -16, -129, 55, 25, 13, -150, 26, 181, -38, -18, 66, 18, -139, 112, 78, 202, 69, -104, -434, -222, -19, 327, 259, 54, -253, -216, -235, 63, 294, 108, -119, -116, -77, -162, -105, 285, 434, -63, -56, -463, -579, 135, 103, 310, 145, -169, -466, 15, 375, 313, 178, -348, -322, -258, -230, 355, 518, 371, 444, -119, -123, -61, 178, 330, -5, -196, -37, -104, -97, -30, 363, -40, -190, -216, -331, -157, -78, 241, 243, -118, -304, -66, -176, 283, 39, 192, 143, 34, -92, 2, 44, -101, 1, 62, -51, -142, -125, 212, -15, -125, 80, -41, 332, -58, -52, -204, 82, 384, 409, 164, -46, -151, -247, -257, 197, 239, 5, -15, -391, -345, -81, 96, 47, 15, -175, -144, -278, -206, 77, 335, 35, 43, -259, -200, -137, -100, 169, 115, -36, -193, -161, 59, 427, 283, 72, -474, -177]
4798a77N6N46j28K00l46k09k68K2O88n02K24m8P2r9j72M25j27N4l00r5l17K39
4820b62M45N4o4l49Q1N0j34J76K44j70k13J90O5l8r2N6r9L9k1J08P6Jm4l3K25
4845B91k78J7m9k4Q8k40J72M5N4N8m03P9K96k19L42r8p2j22K01j95L31j49J72
4868B97r2j91q8J11j4L21r5Q2k97L7l38L71P9k5l77o8J55L2L31J53n86M97n15
4891b20MO5K63J60n74M46l00j20K51LP5jJ11j13l67K05j16L38J33m29l77M05J05
4914e3K40J92k59l84j06L05k92K74K83l20j40M96j26J1j87K83L7l42r6L30k22
4935g6J18J10j09q3P7r1K8J63k44J41L33m0k89J44l92q1J56J20K74p8j57M1l17
4958b52RJ96J42R1j31L5m58O9M37K5ok07J16k14K19j30K60o5j22q3k71L32K21
$$ y = [-177, -121, 425, 297, 497, 151, -58, -326, -304, 384, -118, 106, 58, 130, 31, -141, 284, 157, 211, -89, -184, -501, -262, 183, 237, 173, -176, -95, -45, -179, -3, 241, 71, -142, 48, 113, 75, -17, 39, -60, -21, -42, 66, 142, 143, 99, 66, 291, 13, 30, -19, -43, 45, -195, -23, 22, 76, 134, -269, -190, 106, -113, 229, 131, 59, -63, 138, -57, 274, 125, 297, 205, 14, -74, 37, 23, 344, 249, 331, 34, 71, -267, 104, 183, 158, -219, -287, -132, -100, 231, 384, -202, 295, -220, -216, -151, 112, 272, -302, 144, -156, -276, -25, -22, 53, 52, 163, 50, -317, -112, -228, 110, 243, -186, -563, -158, -53, 187, 379, 120, -264, -370, -65, -357, -83, 200, -120, -260, 236, 110, 121, -66, 217, 254, -88, -184, 146, -76, 42, 152, 43, -40, 37, -54, -26, 137, -107, 34, 367, 327, 38, 182, -210, -291, -135, -15, 259, 181, 24, 65, -252, -243, -47, 95, 186, 55, 90, -368, -299, 138, 163, 157, -50, 66, -148, 71, -59, 201, 136, 14, -69, -340, -8, 213]
4981B13j16J69l51j64j87L37L98p2M8o75P7O0L08K17o2k70j27j33K1L73L42l66
5003D0J82j44m60L50r1K29rJ49j01m27P7K79q6J30o8k28R5J3j09K84J26n5L2k02
5027FJ26j09L9j73R4K26m16L38k38K08j41Q6k9q8K4k14K54k65J93L30l7j75l5
5050Dm9M7J66P9k05K76n7l13L1q0L20m08O95o21k17K06J34J73n1j81o5j73J50
5073a39j16N01j69J14l34j57L50J45J76j55k57J02j33K64k77K38M8j93l7l00J58
5094a71L85K50k17k74j37K00m01O31K46l07q7l40J31K06p8P1O5j79m3J98j70q0
5116a01K55l06pJ08N7K6n04L24k5J67l38K58k01K88j98J46N08j77l07K66l46k5
5138a32M08n9jK28m73q9j12j66K46R4J82qk53k02L18m07N79j65o7k06P7R0N40
$$ y = [213, 97, 266, -85, -249, -436, -99, 299, 227, 275, -400, -323, -263, 45, 262, 200, -70, -197, -330, -309, 64, 406, 40, 222, 78, -382, -32, -123, 106, 97, 246, 145, -282, -205, 74, -12, 118, 50, -178, -83, -70, -179, 105, 231, 176, 208, 6, 132, 23, 62, -111, -17, 209, -207, 131, -107, 101, -40, 46, 17, -71, -47, -261, -7, -272, -79, 251, 214, 39, 4, -45, 2, 168, 247, 42, 318, 261, -52, -21, -101, 219, -189, 506, -115, -332, -126, 8, 181, 130, -51, -116, -289, -139, -255, 246, 77, 191, -143, -300, 50, 195, 371, 216, -41, 61, -72, 192, -85, 153, 201, 8, -29, -329, -171, 214, 464, 247, -27, -164, 36, -365, 266, 512, 205, 118, -222, -91, 115, 37, 108, 173, -6, -49, 149, -21, -101, 154, -152, -159, -51, 6, 32, -472, -148, -173, -6, -344, -86, -287, 1, -197, -51, 457, 280, -27, 239, -107, -132, 276, 217, 216, 444, -29, -118, -230, -396, -150, -56, 126, 118, -135, -337, -19, -426, 153, -12, -79, -285, -208, -118, 422]
5161D22j04q4J25n33j3r5K87K87J04j71j3m75J29R5O8K52m81J08m07M02J78K1
5183A02r7J85n02L32M7N5k7j46k94P4J99pK40k76K55l09Qlm9O0N33o79K57J13
5207G1k06j35M30j80J93k18J69J0k64L33J90k45k1j00J32o5k45O8J35K02j35l6
5229H3kK16l82J1J92Ml25M66m85K07J11o2J07J05k56m3J95k59K66J73l31k6l81
5252d16%L70J4K15j95l35MJ54J47J43J42r7q6m75M68q5J53j18j87L34l64L6J81
5275CL99n0l67j53j31R9M38k68K75j92k92K55q7J68J46k65L12o77l6L13K40r7
5297C3l3k78J45m9N22l00p7j62J09Krn7j20R9J28r9J78j30K21k61q6J24r4L27
5321A33j32j21J95k44mL63J66j78j10J0l34l9N04j94K97k99p9J8O3L00k86L66
$$ y = [422, 318, 234, 359, -174, -187, -282, 5, 292, 396, 225, 212, -263, -134, -39, 29, 281, -200, -92, -499, -97, 81, 102, 5, 190, -312, 20, 67, 122, 95, -51, -345, -271, -72, -79, 161, -115, 140, -169, -161, -164, -213, -153, 380, -299, -42, 71, -135, -270, 160, -20, 173, -45, 124, 134, -130, 203, 393, 148, 127, 27, 159, 94, -151, -83, 52, 254, 119, 83, 81, 297, -85, -74, 118, 122, -203, 263, -222, -15, 96, 34, 141, 246, -10, -53, 142, -117, 149, 322, -9, -35, -416, -416, -46, -32, 183, -12, -347, -343, -189, -42, 101, 243, 146, 60, -415, 53, -32, 121, 3, -184, 150, -214, -178, 3, 402, 352, -15, -168, -299, -200, 238, -30, 245, 53, -239, 16, -71, 97, 243, -22, 290, -387, -423, -110, 130, 33, 0, -278, -133, -182, 340, 40, -37, -199, -90, -88, -97, -154, -274, -175, -47, -146, 32, -98, 123, -138, -224, -100, -194, 133, 1, -120, 75, -169, -173, 190, 356, 178, 68, 78, -256, -295, 209, 15, 312, 13, -66, -48, 15, 315, 29, 395]
5343C95j51j10k00J68j16K14Q0l26m83P4M97R7O7L1q1k87M0p4K24L39q5k10j37
5366c4l57O7K24L37j51k09k09K10J59K9M23m68j87j15l5M47N5k9j31O3l57J2K78
5389B2j20m1N36j36l47N1j65L29m7J29q9j45J23p0j2J98m0k31J22j39j31L71k62
5412i4j28K66j47K0K87n83M09o9J47k00L39l42J62l36K64RL5N8j45n6R3O4N1K31
5436C35l71RM6j28R6J18J34o2N1k15j02j51L94j53p7R5l31J93K53J71p8k79K2
5459c0q2j95K21K54l3q6l46J12o5r1O19L3m41l3j99J52K38J70n1J46j7n40L55
5482I1l7J04P3J7j83r1N7J04J00k56r1J8r2K50j49q1L12j27k98P0L82j19L6ln6
5507C1J93l66R4p5O6R6j6m9j13P3o2R4k37J42P9J5Q7J8Rm55N36k48J45K36m01
$$ y = [395, 244, 134, -66, 102, -14, 200, 280, -46, -529, -455, 42, 139, 206, 237, 156, -131, -91, -165, 59, 398, 313, 103, -34, -391, -324, -100, 237, 86, -123, -332, -122, 37, 66, 489, 21, -166, -281, -316, 131, 186, 157, 26, 89, -268, -256, 22, -98, -139, 397, 261, -86, -35, -200, 129, 82, 211, 122, -23, 100, 30, 18, 216, 176, -55, 67, -72, -203, 168, -94, -222, 44, -103, -83, 204, -379, 30, -39, 108, -92, 247, -95, 67, -269, -5, 4, 39, 97, -48, -104, -11, 53, 104, 335, -36, -27, 19, -109, -13, 105, 239, 177, 228, 13, -89, -240, 154, 1, -76, 19, -312, -119, 134, 305, 227, -52, -30, -112, -307, -86, 168, 135, 49, -297, -185, -250, -341, 278, 311, -130, -163, -362, -210, 28, 198, 147, 293, 276, -264, 91, 54, 158, 231, 248, 65, -26, 31, 135, 235, -21, -112, -94, -186, 64, -85, -166, 146, 19, -279, -209, 173, 54, 90, 87, 31, 224, -142, -48, -123, -57, 39, 23, -26, -139, -66, -128, -34, -271, -129, -50, -35, 52, 70, 79, -376, 160, -88, 57, 293, -108]
5532a08p3J37J23r6L84k1k77k59R6O1K44J2j68l97J85P7M3K49M69m71m74N4k3
5555b33K43J89Q8l23K50l42Q7M12j29r1k63J8j40K86o0K23K02q0m95j80K01Q7
5577e0n6Q2J8m05K13J99N5L67k69k32k9J13j43J24K78l12J50k16J84k8k89K93
5599D7j2O2J05q2j00j69L70m46K26N7J67l02J10k38K37j6J4M18k93k24j34K36
5621C3j15L70n18K83k92q7L96n4j5j33l1n3j48M16L28l17j37N70o11l10K17M51
5643B43K1N9k03l32l0K87j20K66K29m02j68l9J31j65M37o9n1j20l65J33L78ll59
5666b42J45N3k11K39K30k6k72j26J93n5N5j31M77l67M7j18J20q1J78N4m0k14J31
5689C9j83J65O5j71k16M74j32k84M75m29K9K62k04L58j66J4O4l39L51j43k40M1
$$ y = [-108, -181, -44, 79, -17, 367, 346, 69, -190, -94, -33, 211, 223, 55, -342, -157, -80, -37, 212, 681, 210, -264, -210, -233, 10, 199, 287, -36, 214, -128, -41, 371, 242, 151, -112, -94, -234, 52, -8, 215, 417, 337, -158, -338, -137, -50, -106, -24, -6, -411, -198, 1, 56, 423, 154, -78, -107, 6, -137, -13, 265, -47, 103, -113, 71, 43, -246, 47, 35, 97, 202, 120, 20, -149, 221, -225, 1, 58, 225, -77, 33, -205, 32, 16, 30, 448, 155, -69, -203, 33, -82, 288, -230, 53, -239, -326, 70, 16, 1, -132, -163, -216, -364, 52, 380, 63, -74, 496, -115, -425, -208, 243, 264, 323, 120, -212, -242, 45, -75, 191, 420, 18, -150, -189, -58, -223, 214, 145, 94, -26, -391, -258, 120, 117, -242, -97, -44, -255, -16, 214, 188, -84, -210, -17, -72, -17, -148, 329, -38, 9, -109, 11, -70, 108, 162, 122, -92, 39, -144, 21, 86, -85, -301, 173, 41, -243, 232, -197, -168, 94, -110, 248, 82, 96, 160, -179, 172, 29, -211, -170]
5711a70J63k5J56k60K13K36l39j5L4l74J59K01M04k67n47L98j38K03J56k9k1l98
5733b60Q7k03K29L39J02n86K86n8j75K16o2N61l76l74j9L7L59k97L83j1m78M8
5755b52j12L84J32J52m66j5j8K16q5J43J3p4k4j04K26Q4j64J85j02n21N40o07
5777d69M02K20k64J28j54K43k8j0P3j08J10l78M51J13j51q5n1j74j33K07p4J14
5799a8J10l35R4M21k11Qj42r9k4K32J04m6j38P2Q6j77m9K30M1J90l39l20J50j42
5823c02M54k11o9K9oj8J3K45JJ21n0l68J73j0n9K98p5l26K23j87L73j00l68J41
5847g8R8RJ33KJ9j00l0k7J48k16LJ76L0l8k46l0K2K53j16J41j12k47nK25L2n6
5873a0j39j33J96k03K09R4l9o3R6K8k2m4J59K7n40J25L94j17j04P6J2J58k8R3
$$ y = [-170, -7, -32, 124, -136, 77, 313, -26, -41, -7, -381, -222, -21, 383, 116, -431, -33, -171, 32, 188, 159, 138, -260, -173, -376, -147, 192, 294, -292, -6, -64, -239, -23, -85, 476, 100, -274, -293, -256, 103, -194, 189, 178, -300, -252, -364, 20, 152, 304, -162, -177, -195, 21, -64, 79, 92, 18, -6, -110, 116, 200, 36, 221, 119, -402, 138, -469, -67, 153, -111, 17, -137, 106, 78, 68, 141, 33, 143, -235, 216, 329, 178, 93, 42, -132, -265, -58, -132, -18, 92, -243, -149, 272, 61, 69, -73, -172, -196, 36, 140, 94, -44, 28, 114, -63, -112, 118, 159, 349, 10, -310, -160, -302, 152, -59, -128, -99, -105, -123, -110, 135, 136, 257, 207, -161, 12, 2, -57, 241, 166, -160, 63, -124, 249, 149, -219, -78, 20, 29, 162, 164, 183, 83, 53, 26, 174, -42, -39, 137, 167, 129, -117, -147, -125, 128, 12, 153, 41, -206, -211, 14, 46, -10, -149, -282, -86, -289, -80, 14, -25, -88, 8, 36, 14, -30, 129, 156, -384, -259, 135, 18, -86, -10, 2, 160, 132, 225]
5897B25j04k27J78j48Q2j80L48J02l82J45k30L85j36lp7R9j74R5K8L0j75M20m85
5920a84J00J00j02M02l15J58k05l8j75K39R9j52J01k80j28J44L93k11K69k57j96
5941b38j83K88J60R1q2J41j49j82r8N11k72L07j21q9l45L00k33K35P3j94Q8R1
5963I9P0l09K81j4o8l58K53Km6K26k5j84J31j50L02k87K5J20j43l1M45l44j03
5986a08KL2PK08O3j63J24j44j70J08kJ74k82M1k11J33P7J25K12j08l04R6J43Q1
6010A34M7L37n96mk49J34K14l3L29k29O3k50J10J01m7j5N9j78P4j51l80K85L93
6033A48m12L87jl19J64L52j92k44l2J05J84kk13R3l1m6j03K40q3K53j98j00Ro9
6057a10j39L64j68N3J08o8J06m7P5r4k1p2J11j77J51k11J4L06p1j48J09K10m13
$$ y = [225, 121, -106, 72, -76, 6, -174, 174, 276, -106, 39, -191, 194, 58, 55, -22, 77, -97, -2, 26, 56, -119, 301, -184, -84, 16, -86, 316, 1, 159, -46, -84, -259, -20, 79, -73, 28, -252, -380, -236, 157, -54, 215, -42, -238, -421, -133, 27, 118, 36, 177, 28, -154, -252, 259, -13, 294, 173, 84, -261, 39, -194, 41, 114, -80, 8, 99, 169, -140, 141, 127, 59, -299, -46, -44, -90, 136, 111, -73, 58, -92, 210, -77, -52, 68, -75, -106, 339, -5, -108, -106, -74, -67, 141, 204, 41, 165, 21, -149, -41, -43, 131, -151, -110, -321, -188, -111, 14, 226, 118, -186, -90, 53, 134, 181, 518, -78, -82, -331, -197, 17, -16, 313, 84, 147, -103, 7, 108, 61, 46, 105, -73, 1, -150, -530, -245, 148, -264, 123, 122, -197, -33, 319, 127, -117, -149, -44, 140, 138, -75, 18, -13, -59, -162, 78, -5, 248, 50, -50, -41, -110, -249, 115, -53, 0, 108, 40, 146, 99, 174, 80, 59, -13, 98, -79, 72, -139, -125, 181, 110, -38, 71, 281, -132]
6080a32P6mJ44M9k37K30O7L1l66M82k16k84J14K27k93j82P6K66K79m32M4j54K82
6103F7j4j65K18k30J50p3p7J31j8L6j09K65l19pR6J33K2q5n10M74r8L86k83J14
6127A04J06r6j07Q5j85K01K6n6J2k58O1K55j62L27m38J57j80q6K90L1J06k42o0
6150a09J11j31m8N62n83M99r2j82J45k58l43K04K57q4m45L65K39O1l49O8J1N22
6172D20l68k15M0J30J4l4N3P9j32r0L06k11NL8R7Q3k00J11J03N9l01J21j5k77
6196a84mQ4N50l90lJ26k23K6j2L23k03l62J08L42k56K70J5k21j56P1k0J2N2J75
6220A20k00k40L07m04O11j56j81%%k05M22J2O3P1j30o7j04J9j18L31j47J77k15
6243c4rP0q3J84j90Q4r5Q5R2ql9K07l77K36l42K33J01r2P7j71O2kr3L0O1k08L53
$$ y = [-132, -56, -60, 84, 133, -104, 126, 193, 224, -142, 340, 124, -160, -46, 181, -112, -294, -218, 48, 327, -105, -61, -215, 67, 53, -112, 106, -124, 26, -47, -124, 7, -11, 25, -84, 181, -138, -145, -49, 84, 106, 21, -489, -15, -113, 273, -10, 104, 210, 114, 7, 92, -93, 108, 134, 78, 90, -168, -107, 148, -14, 313, -125, 32, -148, -234, 56, 87, 193, -49, -109, 2, -129, -177, 385, -198, 301, 209, 27, 172, -86, -429, -225, 32, -52, -497, -132, 107, 168, -181, -113, -102, 420, 52, -163, -123, 7, 21, -13, 40, 119, -13, -103, 203, -8, -3, 35, 132, 215, 15, 126, 229, 288, -13, 108, 93, -184, -188, -104, 446, 56, 53, 179, -44, -18, -30, 293, 90, -272, -164, 178, -78, 192, 207, -14, -170, -99, -119, -107, -55, 120, -80, -320, -13, -417, 194, 38, -143, -143, -143, -348, 74, 86, 149, 220, 90, 23, -81, -62, -180, 151, 4, 181, -34, -43, 27, -56, 128, -62, 22, -73, 12, 104, 96, 57, 264, -113, 123, -219, 14, 115, 23, 100, -71, -9, -11, -104, -74, -13, -221, 132]
6270A32q4K2q3m4K40k19M42k20n6k16J31Jk54L19J09j04m0k23LM04j92j42L66
6293B92k44J09j60K1J91j32j4j7N9k98K59R7l22J54J18p8r4j49J93k4L32k22j
6316G0k0n3kn8p7J24k14K02r7K11P2M8m01r0L40k80L33j56J44r7k4l49J24L23
6340G3l70M05Q7l68L26k23j39J54K25j02Q5R1k13k9K4q4K8m9K32o8j92R3Q8O0
6364A34J7j42K49j91j21J1J02k87K86J69k72K08j64m9R1L1K00m27J42Q1pj74J60
6387D7L05n11L6m3K48J62j01m02j58M07k18K13q0N1K68m71M38l71K87R3K47n93
6409a46L75o72Q8L52K38j50o9nk24K34j05J76k80K99l04q1J18L53J96l18l0J53
6431A98L5R4k08q7K0Q2j04k93K36%K34m54L56l36K60j9j0N5j26J25J87k03J41
$$ y = [132, 48, 70, -13, -57, 183, -36, 406, 186, 130, -86, 45, 46, -208, 111, 220, 116, 76, -147, -144, 260, 68, -74, 292, 48, 157, -3, 18, 209, 77, 63, 46, 105, -193, 66, 163, -159, -5, 113, 35, -59, -208, -15, -39, 293, 71, 70, 50, -3, -5, -63, -140, -16, -230, -28, -125, 86, 158, 206, -195, -285, 55, -225, 108, -48, 96, -1, -25, -374, -250, 73, -297, 108, 195, -173, 153, -70, -209, -55, 170, 68, 153, 244, 31, 2, 26, -58, -30, -79, 153, 85, -107, -14, 74, 134, 151, 9, 258, 67, -54, -43, 59, -228, 58, 227, -45, 163, -1, -50, 41, 72, 272, -155, -13, 68, 61, -113, 47, 352, -159, -123, -166, 82, 244, 143, -259, -417, -10, -228, -15, -95, -44, 224, -247, 191, -180, 107, 200, 447, -146, 229, -443, -355, -3, 235, 85, 16, 11, -213, 21, -84, 92, -188, 111, -193, -274, -156, 197, 393, 75, 45, 198, 233, 327, 119, 32, 52, 134, 30, -263, -27, -27, 207, -247, 109, -227, 33, 14, 4, 59, -67, 58, 245, 42, 183]
6454A83Nl55J15R8q0J6R5j10J97l75J61K27r5j81O2O8j21r6N49n6l05N1k96K81
6478C8p1O7J38k64j60J73P1M4j85J96J12l26N7j11M62k80Q5o1R1j1j39K70j69
6501B7kJ09j56J02J74j21N0m5j51o8J96r1Q6K32l38J28J7K24k89K80k67j9k3j35
6525h0n5J45m1J54P5k95J51m54L11o6J49N5R3j39j7M4K8l07M60j3M6l17R0j05
6549h8J45o8j86J12P9J5j33K29k42L9J74r8j51J94j6j88K15J0j60k7P9j63J71
6572e8j18J71J96J15n30J85r6M56l78K37p8j36j09M6J32p8k3k67J42J39p1L92
6594B69k71K7J0l06K64k69O9N25j16l16L32k94P9N7m4j9J27j81j13R7J47L16k04
6617A86j67j26KJ16j31N24j62m67K16K31j24K5k09O1J69l62J56q3J12j92J85L8
$$ y = [183, 188, -167, -52, 46, -34, -18, 77, -33, 164, -211, -50, 177, 82, -99, -37, 31, -90, -186, 363, 307, 2, 53, -243, 38, -33, 34, 172, -92, -252, -79, -8, 36, -149, 47, 159, -167, -110, -221, 241, -39, 46, -15, 76, 65, -74, 196, 27, 25, 134, -22, 80, 254, 133, 183, 138, -13, -81, 115, 24, 110, 342, 4, 132, 149, 373, 84, 364, 97, 78, 55, -80, -135, 10, -31, 123, 198, -97, 54, -400, -89, -155, -6, 49, 142, 3, -14, 30, 58, -249, 211, 198, 244, -73, 17, -88, 57, -11, -197, -85, -6, 9, -124, 105, -137, -98, 76, -22, -173, 21, 5, -183, 32, 42, -118, -145, -66, -229, -58, -176, -5, 191, 306, -224, -39, -135, 321, -57, 180, 102, -34, -143, -97, 35, -43, -66, -333, -191, -52, -123, 269, -2, 25, 35, -271, -7, -276, -207, 318, 202, -114, 218, -76, 3, 60, 16, -3, 124, -57, -170, -73, 74, 390, 186, 19, -107, -105, 11, -120, 404, 242, -225, -9, 222, 98, 123, -86, -25, 144, -218, -62, -145, -33, -225, -40, -2]
6639bQ5nJ2q2rj31P9L89m23K23m9k90K54j80K59k88L15k20q6K80q5k81J3J66N8
6664Bk13L0K04k9j32j14J66K8K2Q2k95K62Q2j01o3K6jP4j38k68J93Q9j69L18l0
6689B5J41l10j83K27P1j3J99n6m09K34J08l47O9N45l93l5P2j7J25J35j10p4J7
6712B1n6k30J32m3N10n8l5m20q0J95K47j03j85J26j05L2J68k54L85k6k15Jj28
6735a21K40J99m88K66k76K9L89j76j29N4k16K73mJ63k49j31q4L20r6O4J65mm9
6758A39j19J13m09M04o1k65J12L1L45k49j18k15M04l45l1K18J62k78J1J86j19
6779h4L51k30J63r6n5j67o1J30j66K31K49j40r0k66L7JJ94o3J19R2n16O39p45
6802d73M53J18k83K86j62J05q0j94L60l07M01j71n53M87O9j48J77j45pjJ49J66
$$ y = [-2, 83, 78, 90, 8, -1, -132, -53, 336, -87, 136, 87, -203, 51, -129, 130, -158, 157, -63, -149, 131, 46, -235, -222, -56, 2, -211, -181, 23, -6, -138, -252, -86, -58, -36, 46, -249, 13, 95, -6, -69, -43, -44, 30, -108, -376, -183, -94, -263, 55, 25, 166, -144, -327, -100, -29, -42, 157, 101, -308, -74, 34, -313, -244, 301, -92, -127, -55, -72, 53, 188, 78, 4, 21, -35, -265, -133, -176, 334, 276, 241, -179, -259, -64, 183, 80, -105, 21, -84, -52, 116, -138, 247, 221, 6, 7, -121, 119, 318, -170, 96, -180, -151, 238, 62, -67, -13, -229, 44, 40, 203, -46, -177, -261, 59, -37, 27, 192, 188, 139, 20, 133, -276, 128, 67, -198, -86, -55, 290, 41, -77, -292, 112, -233, -264, -46, 116, -162, -151, 35, -84, 267, 37, 200, 104, 49, -118, -179, -49, -215, 16, 265, 125, 35, -231, -194, -193, 1, -62, 57, 149, -367, 272, -473, -20, 98, -185, 101, -61, 44, -36, -230, 130, -177, 224, 53, -500, -13, 56, -92, 85, -60, -67, -68, 81, 247]
6824B47q2n18K92l57J75K79J2k3J29l86j7K24k42L42n1R7O6k55J46j59L1K87k38
6847aJ7J35j78m3O7J9p1K6L71n33K77p6M9J29j93J47k19q0LK98K6j05R0j06j26
6872g7L29j47K08k61Pr5M8L11k45j40J26L0J07J0k70Q1p7j95J01K68j07L6j57
6895a09K52j03O5p0j17j46K68j85L13Jl83J39J02K13k47K5R4k55K56l1m5n6J55
6918A36q0j08j31J58L61m88J08O9lJ15j4l16K65j34O6q7J99r5j51oK39r4j05n2
6942a48J17J8j2J52k51m2L02K11k86m4j4J01j4K6j02j15j83J41mL58K36p43K94
6965bL2K66p1j62L06k04n0o4k43J12J27J94l95r5K69K24l52lP4j59K15qM0j14
6989f3K13k5k55J57k60M20j73R6K1j67n4J74m06J45j3J26Q2L2n7K55l25J11j87
$$ y = [247, 165, -353, -61, -418, -243, 36, 48, 25, 154, -232, -249, -25, -267, 75, 24, 121, 187, -68, 78, -81, -50, 237, -1, 16, 151, -27, -70, -3, 16, -55, -29, 342, -191, 86, 10, 59, 188, -5, 142, -77, -157, -154, 144, 170, 65, 155, 49, -77, 252, 105, 313, 52, 59, -36, 12, 323, 78, -62, 64, 94, 201, 211, -59, 22, -55, -250, -149, 119, 12, 48, -109, 143, 40, 105, 35, -82, -228, 40, -145, 168, 169, -214, -75, 27, 240, -7, 18, 112, -143, 113, 82, 37, -19, 136, 56, -52, -183, -25, 336, -152, -44, 25, 22, 137, 123, -193, 72, -62, 4, -83, 116, 21, -130, -136, 103, 9, -96, -148, -31, -13, -25, 127, -124, -166, 136, 347, 61, 17, 3, 104, 90, 116, 14, -101, -284, -143, -147, 211, 447, -296, -2, 30, 296, 225, 63, 369, 165, 115, 51, -192, -80, 47, 241, -154, -249, 20, 244, -108, -111, -37, -196, 19, 11, 51, -63, 150, 125, -130, 27, -233, 187, 14, 110, 131, -36, -90, 84, -322, -177, -190, -64, 18, 50, -7, 248, -77, 34, -153]
7012a53L22o2n13L53r6K20j06M38n19Q9k03O2L74l84Q2Kn9K13J90k76j44J93K25
7035B48k29K18m55J68J0K75j73j85n1M3L8m5k09K95J23NK39m69J26L1J42j30j97
7058a82K38N9qk23J43j74L14n08K77J94j77j7m1m6j6K84k03K74j50J84l40Q6L0
7081bj64Q8J70q4j22m4K17j20J09J61k01q3J90R7n10M84o16L10J79n8j87L29k60
7104a17K26q0L4j76K45j09Q7m81K65N4R6r3L58l2p6m06J51N8J48n9l54J91O6j88
7128a92J0j0K70n8mK74k03J67k0k38k28K22OK39m06K59q0k75K62K0j80N8J89k11
7152a29L0L5K7J43q8LK25m42R2Q3K96l14J49m19M28k20j30L85K78l83R5k09J14
7175D9J68n01M46l59J10J5OM90l70j23J57j66R4p7J55J66Qn3q8r1j47L13n58L79
$$ y = [-153, 169, 107, -406, -53, -149, 71, -35, 403, -116, -27, -230, -168, 206, -178, -96, -94, -153, 60, 250, -26, -170, 23, 248, 19, 237, -218, -50, -40, 235, 62, -123, -174, -131, -93, -138, -347, -52, 71, 76, 315, -154, -28, 3, 145, 15, -182, 56, 115, 107, -116, 27, -147, 167, -341, -64, 130, -47, -64, -105, -151, -167, 117, -86, 188, 38, 222, -118, -32, -2, -166, -78, 92, 8, -114, -158, 59, -61, 48, 209, 8, -75, 115, 212, -298, 186, -430, -120, 59, 1, -186, 143, -117, 109, 29, 63, -113, 132, 23, 110, -371, -106, -52, 44, -49, 309, 277, 201, -205, -54, 4, 152, 93, -261, -70, -4, -192, -182, -192, 78, 20, 16, 290, 87, 254, 234, -4, -232, -10, -4, 235, -171, 88, 8, -267, -5, 15, -165, -107, 82, -129, -99, -64, -37, 106, 18, 21, 246, -196, -104, -21, 275, -39, 110, -309, 119, -101, -231, 154, 432, 49, 144, -65, 49, 217, -284, 162, -197, -87, -72, -66, 424, 54, -69, 88, -78, 16, -61, 94, 260, 268, 215, 127, 36, -111, 202, -356, 23]
7199B3j85K88k36J13l07K61j71J77M4l7p0K36l47K00j88K90J38k32k08oJ69J33
7221H5mj97P7J97o6j35J66l57J11pO2j06K66K16j85p6j43L15k91J62r7j79K24
7244C8j90j8L52j78L38k20K98j09j49o3J64l43K71p3L0k29k27J29M67j80j78r0
7266a60P0K01j13J41j91J88J09m5l80K80M4q3j73K93j02j73j2q7O1K67m95N06
7288A46L8r2k81K39p9J17j19J65j82M9K23l12P4M5K21o7n8j65j5J17o4K51o7J34
7312C18l51O6l4R7j90K21l59J55J17L9j69K33l5k46M65o52M84l71P3J11l5%l9
7335a02n6NJ38m8k23K34mJ86k47J99j34k09L05j9n7J99m8l05K52m3j63K15K77
7358C52l30M2k14J80j16l0K85K4m33K15J69J43j99j61L04m60K96k51QJ82j53L0
$$ y = [23, -162, 126, -110, 3, -304, -43, -214, -37, 7, -30, -100, 136, -211, -11, -199, 91, 229, -3, -211, -217, -48, 85, 81, -116, -39, 158, 92, -43, 123, -234, -123, -130, -68, -174, 92, 308, 123, 47, -96, 219, -72, 90, -7, -186, 38, -152, -170, 182, 4, 342, 122, 420, 311, 162, 99, 263, -80, 191, 118, 148, -81, -308, -179, 288, 108, -70, -160, -90, 111, -2, 139, -52, 136, 245, 200, -180, 100, 144, 61, -112, 181, 79, -94, -106, -193, -132, 135, -360, 146, 184, 92, -189, 50, -29, 88, -31, 134, -48, 1, 224, -88, -14, 31, 252, 185, 127, -38, -53, 64, 0, 251, 184, 318, -33, 33, -1, 96, -94, 127, -232, -77, 40, 79, -90, 143, 108, -138, 327, -325, 159, -212, -139, -28, -63, -63, -102, -158, -153, -15, -63, -286, -52, -56, 130, -117, 82, -52, -261, 44, 25, -32, 167, 119, -186, 66, 23, -140, 75, 352, 22, 64, -150, 30, -86, -116, 169, 193, -240, -25, 144, 287, 88, -73, 231, -229, 67, -184, -176, 6, -147, -117]
7380a17J92j76p4J63j45P4J20j1L73l79j99L25j21k91K77J12l19P0K7K14q6j90
7402a61J1J16j08J41K05k99j14J31J15j06O8o9o8J38R1j16j51K42j00j58M41r6
7424A53j71K45l16l8Q2J99L7k97N5k60L81R5J21l82J11N4r1K3L4J6k20J76P6Q0
7448A63r6J62k97J96j46k94K25J6K12l13J56j22K17p3j74J60M5O6J4j65J11o1
7470Bj87Q8J26j24K66j17p9n4Q0K79l15Rk54K28N0m7J19K0J84l63K0K6Q5J1j07
7495e4j22J74j60J4K16j65R4N2j49K23O8k72N9O6R7j92J45n4j8J16k32K10k2k25
7519a31K44K0j59p6k7K42R0l66qJ99j02K59oj5n2k96J38r6K52k43J76J97m5k24
7543b9LO5Q7l9j0j07J03l8r3Q7J01Pk4k19L97l35N3mj75J39J04J7l9k34L20j77
$$ y = [-117, 75, -101, -175, -12, -157, -83, 37, 26, 399, 20, -179, 146, 25, -266, 11, 123, -196, -126, -99, 115, 29, -161, -150, -34, -142, -1, 204, -95, -209, -78, 37, -69, -1, -70, -138, 0, 91, -25, -176, 66, -34, -192, 249, 153, -18, 227, -89, -127, -45, 154, 191, -106, -51, -311, 70, 165, 286, -96, 15, 69, -22, 1, 35, 51, -169, 7, 83, 163, 67, 229, -68, 128, -18, -312, -87, -71, 141, -172, -16, -138, 79, 6, -168, -8, 37, 103, 117, -48, 63, 2, -185, -97, 29, -95, 171, 54, -25, -79, 1, 280, -35, -26, -280, -52, -2, -49, 70, 90, 274, -89, -69, -43, 42, 53, -54, -176, -2, -162, -148, 68, -97, -3, 49, -100, 123, 191, -81, -22, 44, 141, -51, 94, 40, 22, 138, -94, 116, 94, -131, 113, 133, -26, -102, -129, 113, 203, -163, -171, 28, -74, 185, 179, 164, 112, -184, -46, -142, 110, -133, 43, 240, 195, -29, -26, 39, 126, 87, 77, -30, 73, 35, -58, 29, 130, 137, 113, -106, 291, -44, 9, 5, -170, -31, 73, 90, 51, -183, 137, -40]
7569d0P4lj1K70j39n7k03K14j27J26j72J17k24L17j40K9l21K39l35M20J15k93
7591a44JL23n0k08L64k82j57J68r0o5kK25j04j15J51k33J82N2l13L28j3J53l47
7614a76J86K1r3J00J35l28K52j42K16p4L3k55K17R4j20l5K2K02k00k45K25m7j10
7637a22n7K50JK2N2n3p9J4r4J38l35L6J55K3K82k35J54j46J08l06NL0L25j49l0
7662a1j22rN6L48k83J8j23R8j05P3K3J81j9n03N79j84M2k05J77j84J15K08k15
7685d5MR8l8QJ8j68K9J68r4K1j7k04M96n9m19N17n16L89k06N8p3J3J06k8o7j37
7711a46q8J32mL32l57K59j14k8K68j41j97j70M92jk12L01k56Q3k24om5J80O2l21
7735b01L0K1M14k01K28k12j50k27L40R4k15J17k6N6R5l6j30K49j85K9L2j4o4R6
$$ y = [-40, 34, 31, 20, 290, 151, 94, -109, 105, -22, 104, -68, 49, -175, 142, 2, 31, -290, -51, -386, 34, 149, -144, -143, 180, 130, -78, 286, 4, -153, 15, -75, -140, -142, 83, -21, -136, 15, -218, -36, 16, -297, 31, 18, 171, -176, 10, 31, -62, 38, 173, -155, 97, -45, 171, 97, 130, -125, 92, 186, 66, 31, 53, 255, 55, -190, 35, -12, -122, -179, 71, 72, 94, 146, 93, 14, 28, -66, 72, -263, -227, -72, -49, 233, -2, 152, 6, 114, -192, -187, -157, 168, 19, -11, -133, -142, -86, 262, -21, -3, -126, -28, -133, -60, -37, 144, 125, -378, 201, 17, 59, -146, 31, -153, -38, 170, -45, -41, 57, 19, 27, 45, -123, -94, 74, -20, 1, -16, -220, 276, 217, -202, 315, -201, 188, -18, 40, -33, -20, 86, 58, -9, -146, -234, -102, -106, 226, -131, 128, 14, -14, 254, 113, -84, -254, 238, 237, 25, 326, 70, 153, -71, -77, -122, 58, 120, -201, -171, -150, 264, 63, 291, 79, -71, -298, 42, 136, -79, 38, 12, 68, 163, 127, -3, 246, 61, 90, 122, 108, 44, 140]
7759A40j01k75K35l71K84M9J69j61J46j35l08K05oK49j63J20j49K12l14R5J81
7780A02O1l69K37%m5J04l4j77J19J52q9O8j20J22Q7l12J03j23K17nj18j50J34
7803c6O0j82m0J02K21k60K20M4k35J64K4J1j43L9J67k25J34j42Q4k52K51o3j78
7826b35J68J52J5P5m74j12N14O3l0j83J11L2Lj92J01K82k09p7q7n0K11l6j41L32
7850B33m39L79J3k53K36n0k42K11k66K37R2m5k67J71k40K61K25k05J39k69M1N7
7872A9j67K51l4o6j76L28k20O1j30K02K7j88M23m05Q3k7K27k36n8K54o8k19j44
7895b63K43J82k11j65L81j81j76K30n0J8j98R8RQ5J10J36m19J99r0J32j39J59
7917I0l63N00l16j22K07L3k70O6j03J11N5J57j75J99m2r0K70m11M82m78LL10r5
$$ y = [140, 39, -236, -1, -372, -88, -39, 130, -31, 115, -20, -328, -123, -129, 120, -43, 77, -72, 140, -174, -79, 102, 163, -206, 31, 31, -14, 90, 56, -121, -2, 150, 61, 129, 9, 131, 218, -94, 9, -114, 103, 98, -20, -170, -36, 24, -158, -198, -96, 125, -135, 85, 129, -106, 58, 82, 93, -50, -11, 156, -69, 65, -77, 7, -245, 6, -57, -235, -67, 85, 100, 175, -299, -411, 103, 166, 136, -47, 64, 96, 99, -93, 8, 290, 81, 4, -83, -133, 78, 42, -99, 233, -206, 173, 186, -67, 169, 119, -123, 88, -178, 59, 151, 106, -161, 10, -230, 31, 256, 51, 190, -79, -38, 19, -148, 103, 69, 3, -173, 155, -65, -4, -134, 68, 95, -93, 330, -75, 8, -19, 208, -28, -86, 168, 100, -119, -263, -20, 162, -49, -214, 167, -14, -190, 40, -10, 8, -190, -92, -83, 2, 112, 248, -171, 28, -62, 70, -69, 90, -273, 227, -89, -211, -4, 29, -241, -175, -278, -167, -112, 45, -130, 69, 27, -63, 207, -204, 278, -200, -197, 113, 18]
7940A8Q2j52n8k22K50j39L16l45P8J21J86m79M08j64J00j45O7J22Q9J7k14J75
7962A11j98K49m0j62j48K87k26J93j57K51j67j50M92l50M3J00n6k14J28J25k57
7983a46o9K99K7mOJ34k35j23K29l06R5j16J41J9J58K0k33L9K37l51J95q2M9J61
8007A44j20k73K31j20J58p1Q3K04k16j68m0L54p7j13K55N2l92K56q1K0l9k38L87
8030A96k6j01L59l26k59J63L5m6O9J24k20J39l08J97L5l37L48j67L5K29j0l18
8052a89K33P5k95J85k6R5k71L64k20j84L90n0J49m81K68j10j50M38l46R4J66k70
8074a35J68N2k7j70N8j28K10p9O2q6J87r7l6L9q7N1O0P0k7J55r3m5K6k82N6M2
8100e6K5l3J96m49L38mr1L2q3K23M1j34K05k23J79m7K5k4J04k59M6r9J91n8J9
$$ y = [18, 100, -52, -110, -332, -82, -221, 95, -250, -172, -51, 135, -344, 64, -100, 0, -145, -78, 44, 133, 150, -64, 111, -87, 162, 122, -40, -188, 99, -127, 66, -91, 160, -7, -157, 335, -15, 28, 128, 72, -142, -14, 111, -146, -215, 84, 111, 107, 113, 247, 12, -111, 118, -188, -93, -209, -68, -49, 109, 129, -104, -65, 172, -179, 16, -66, -17, 144, 24, -249, -18, -138, 20, -51, 32, 236, 20, -148, -188, 166, 89, -24, 231, 283, -109, 147, 66, 86, 47, -191, 196, 170, 69, 428, 102, -157, 6, 41, -5, 64, 188, -32, 107, -201, -4, 31, -306, 42, -125, -90, 139, 129, -189, 44, 119, -176, 9, -17, 78, -193, 171, -49, -233, 157, 107, 256, -225, 43, -67, -217, 221, -125, -31, 135, -135, 33, 85, 58, -112, -54, -182, 28, -51, 11, -75, 112, 15, -21, 18, -69, -18, 42, 112, 85, 240, 147, 102, 128, -154, -98, -56, -31, -64, 132, -317, 21, 17, -74, -42, -125, 98, 139, 5, 210, -13, 166, 119, 144, 120, 224, -35, 11, -88, 103, 45, 64]
8125F4j88O5J81k45K07l0k52L18k29O4J94j53K11m38o0J74J34N9J31k20K68l82
8147a27L47l36M11j1m14M53l60J18L8k19j17qL29K2j30p9J34k69M98m02J73k0
8169C1k3j24J6K01k79K78O1j21M7l14J36P3n1J59k08n3L73j68r0l3J40k5
$$ y = [64, -124, -59, 122, -123, 84, 54, -198, 120, -109, -45, 149, -4, 207, -231, -291, -117, 17, 76, 207, -13, 255, -127, 220, -116, 295, 284, -130, 323, -37, 81, 119, -100, -217, -225, 104, 126, -4, -83, 51, -218, 280, -122, 51, 31, 8, -116, -100, 101, -178, 100, 161, 40, 87, -227, -91, -18, -69, 90, -118, -171, 202, 34, -56, -89, 51, 26]
8191B6
$$ Imaginary data points
##PAGE= N=2
##DATA TABLE= (X++(I..I)), XYDATA
0@%%%qJ6j6K4l2M0n6P2q8J12j36J60j94K34k80L32l91M60n38O24p21Q30r52J088
27E80j237J403j589J790k011K260k529K822l147L501l894M324m791N310n882O509
43C419p206P984q855R833j0942J2214j3686J5415j7479J9993k3134K7195l2674
56a7923M0519n2773P4761j26391M59829L84904p72174j33550K58074J41954j48814
67A08416J51085J58330k02836l78986M0716K53860Q0539q4644L7640j1503j63792
78a1175j00580J40045J02723k1645M4053Q0290j78154k46823R7556L08987L6507
89B51784j78263n1073K7323j08208n1703J88907J64955j38190k17737J3876J55767
100E7438M6368n6101k8781L790J1872N6325M3541o1299o7407O1701P4232l8643
$$ y = [0, 0, 0, 0, -8, 8, -8, 16, -16, 24, -32, 40, -48, 64, -72, 88, -106, 128, -152, 180, -211, 249, -289, 335, -386, 444, -508, 580, -657, 746, -843, 947, -1064, 1196, -1333, 1489, -1658, 1843, -2051, 2273, -2518, 2792, -3090, 3419, -3787, 4197, -4658, 5175, -5767, 6447, -7239, 8176, -9303, 10690, -12444, 14751, -17923, 22596, -30177, 44584, -81807, 378022, 762926, -9248, -142798, 115276, 257230, 108416, 259501, 417831, 214995, -163991, -123275, 130585, 211124, 126480, 164120, 152617, -11175, -111755, 28290, 131013, 109368, 153421, 233711, 55557, -191266, -93710, 215277, 251784, 73521, 22448, 49771, -58437, -110140, 78767, 243722, 105532, -112205, -98329, 57438, 103806, 47705, 18924, 22714, 34586, 90911, 134452, 73153, 5746, 67447, 141679, 103036]
112A03036p423R0850l1019j80279j0734K00771M6874j76738n1336J33702q038
123A09666j87569l7813J68538P6696r3232m9744J1419r2693r2384J44480K25795
134A83159k9414k08652q7494K1804N363J02691K05155r741k88815j57050J54199
145a08795J39802m7407J137J04202o4965k39599n4348K12311J35298q1618m8592
156e2574O2882n8852j77596K0995K48680J35223r9508j22587n1278l9256M0234
167i3637J75944J21554r2480j68291n3846L6815N1442P8565O9278n3357j48164
178g6177n9831Q2670O6984k5532o111M9653j7306r7382k8933P1943N2472N088
190A7538J1501r458o1192l2764M4282N2474J4203k054k6708n6320j1436O6141
$$ y = [103036, 95613, 186463, 155444, -24835, -35569, 165202, 212076, 35338, -15998, 117704, 109666, -77903, -115716, 52822, 129518, 36286, -13458, -2039, -94732, -187116, -42636, 183159, 153745, -54907, -142401, -120597, -115234, -12543, 192612, 182871, -105944, -262994, -108795, 31007, -16400, -15263, 88939, 23974, -215625, -269973, -57662, 77636, -3982, -52574, 10308, -48544, -226140, -205145, 43535, 178758, 79250, -43337, -94615, -133871, -93637, 82307, 203861, 111381, -56910, -110756, -73941, -22499, 56066, 125344, 71987, -76177, -136008, -53338, 13646, -11886, -17997, 31656, 14350, -83032, -111965, -40022, 12450, 17538, 29039, 19581, -41611, -74375, -30093, 22381, 36584, 34530, 7822, -48498, -59934, 6207]
202F207L9279o0014n9294M4159O6918k7919o3793R775K6921l1550O755J02297
214E9741L5327j19962q8007P2740Q8827j810M815L3416m9191j03711O018J08424
226D6627M8200l5112j3032J966p3501q2790N6516J39748K9369q5508n3583j9087
238d0187n7675M33J49313J24543q2558j63404m2293N3889N1276O6404P9083k0809
250A18015j40728j01372N1157J16504N4195o692k2540o0234r1012j4450R8731
261A574R3350j405m8627n0200n8902k2810P0165J03450K8413n6909p5803m1674
273e9378J6446O5165O4666J3866m1847o3264l4097K2718N2788L2983q192l4889
285B6965l1428q016P496Q071J4650J4934j6748l3339L626K3249j1773k0989K2900
$$ y = [6207, 45486, -14528, -73822, -29663, 37255, 9336, -54457, -44682, -17761, -49311, -42556, 59741, 95068, -24894, -112901, -40161, 48666, 46856, 51671, 85087, 35896, -67815, -61797, 46627, 94827, 59715, 46683, 48649, -24852, -107642, -51126, 88622, 117991, 32483, -21100, -40187, -97862, -97429, 51884, 176427, 93869, -69535, -111828, -57939, -6663, 59741, 138824, 118015, -22713, -124085, -72928, 43576, 97771, 91079, 68539, 8305, -82707, -97157, 1574, 94924, 93519, 44892, -5308, -64210, -87020, -16855, 86595, 115008, 58099, -17704, -59378, -42932, 22233, 86899, 100765, 58918, -4346, -38443, -15725, 37063, 70046, 61854, 26965, -4463, -12479, -4983, 3088, 17738, 32672, 15924, -17415, -13789, 9460, -2313, -23302, -402]
298d02K6862j8262j8075K0833P489l4466j6469L7744L8175q612k6695r504j1197
311a2579k6493R823O9264M1525n2908p1969j0192J9904J5347M8131N6636k8577
323E7912r9821n0453M3374O7536M1098J5389j9859o8911p1055Q531R4624Q0800
335I9165q575o0985n4820m3749q837P1099J00323J4282q4388q6547k4754K7263
347f0523N9395O6146K0811n5186r2496m6619M2945Q3456M5493q037l8846n9955
359d3416n0937K0359Q5548N9111j9080n7198m6132j8067J7982M9989M8161K532
371D8852n1626n6624m395M0303L0733R057M933j4534m1822j8991L2888L5690k444
384A2020j4914j783k681j0695j547J5387J2870r588j4301J2018K0045j2259k7507
$$ y = [-402, 26460, 8198, -9877, 10956, 18445, -16021, -32490, 5254, 43429, 34817, 8122, -1382, -12579, -39072, -29249, 40015, 81540, 28632, -43337, -53529, -33625, -18278, 29853, 86489, 57912, -41909, -92362, -48988, 18548, 59646, 75035, 55176, -13735, -84790, -76259, 18365, 99165, 90590, 29605, -25215, -68964, -77801, -6702, 93621, 107903, 23515, -63032, -87786, -60523, -1128, 65018, 85829, 30643, -61853, -108472, -65527, 17929, 63422, 55385, 16539, -43416, -94353, -73994, 11554, 70665, 51585, -5613, -51745, -69812, -51830, -1841, 46320, 48852, -2774, -59398, -63793, -23490, 7243, 16300, 21233, 6699, -35123, -54114, -21226, 14464, 12020, -2894, -4677, -7358, -18053, -19600, -4213, 8657, -931, -15232, -3214, 16831, 4572, -22935]
397b2935K672J7957R90L183K1635j549m2338l1490J9630M0968K1709l446k0462
410F524l3015l2411Q33N3263N8058l914n8489m5228q669J3491M1935N9633J3616
423F5627o0360p1597j4826M0223N6644M0129K751m3993o9270l7808L9093Q3795
435C0408M5350k4274n5002m9967k7835K6715P8654N7621k1848o9800n2891n116
447f7985L8211N8611M2327n136n4726o4727j1487N3793O1691J8973j7322l7566
459A4657m8313k0624L9403O2534J9675l2751m3689k3524J326J8831K9295K4377
471D1197r983m3246k5406J9842K5466o97K929J4852j0250k9682R13K7612O832
484B0379j6418j517J6331L7j7953m926J2512j724j9399O804L4875L579l8731k0385
$$ y = [-22935, -20263, -2306, -1316, 1867, 23502, 21953, -20385, -51875, -32245, 8723, 30432, 26986, 6524, -26491, -58902, -58069, -4806, 53252, 49338, -9151, -54379, -63048, -49557, -7622, 52011, 65627, 5267, -66330, -81156, -40933, 15711, 55840, 58591, 14598, -54672, -92480, -53387, 30408, 75758, 51484, -3518, -53485, -81320, -54605, 24049, 81670, 59822, -9978, -62869, -67985, -29774, 28837, 71164, 66028, 11302, -53425, -64912, -11119, 50572, 69545, 52223, 14657, -33656, -54280, -14877, 47657, 67332, 34581, -9108, -32632, -31306, -12475, 16820, 41197, 31214, -12032, -37438, -17596, 7870, 7173, 10102, 24954, 14704, -14978, -14065, 13547, 20379, 3961, 2444, 18775, 18812, 859, -4067, 8445, 6721, -12678, -5874, 29001, 32580, -6151, -26536]
498b6536J4244Q333M535L1518K2598l6175n4065j311M4983L7780J2975m941k7922
511B6016m4106j8427M0148O1587J6334l4184l8202k6352j6602J9762N9756L5543
523H1273k9175n5518l4358p105K5601N8670M4125j8998o3798n1551L48N1094O3656
536F4264K7903k9490o2041m4461Q566N1195N0720J5303l0026n7930l8390J7257
548b7130M6944K4252K361m780l1705m9431k971N3620M0627o189j4674j1007k9196
561i279k0594L4520N8836J0864m1232l1296K660N264M688K6973J9264l4811m3654
574a7797J6324L5370j6631k8963J8154J8694k4902j2866K9416M719m3635j0297
586c2414N0909K9660l2071k7573J8446J0728k2800J502M3731J4864l8633k3893
$$ y = [-26536, -12292, -3959, 576, 32094, 54692, 18517, -35548, -36859, 8124, 45904, 58879, 53938, 26016, -18090, -36517, 3631, 65218, 81552, 47368, 9166, -17186, -33788, -14026, 45730, 81273, 52098, -3420, -37778, -44883, -19282, 39388, 83513, 64515, 717, -50834, -50486, 608, 64264, 92167, 62677, 636, -43825, -35259, 15936, 66656, 81959, 51933, -5997, -44387, -27130, 19814, 44066, 46427, 41647, 9942, -39489, -42460, 11160, 51787, 45598, 30924, 19917, -9279, -29873, 4647, 63483, 74347, 33115, 1819, 4479, 9743, 14431, 41404, 60668, 25857, -17797, -1473, 33897, 17266, -11697, 6457, 25151, 249, -12617, 16799, 21518, -22117, -32414, 18495, 48155, 16084, -11489, 6957, 17685, -5115, -3613, 40118, 54982, 16349, -7544]
598g544J4165k568j6335K7645M4130j5820n5484k2636Q027J3561L5710M4745j4470
611E3126p5997m4809L5900N8686K5371K184j0886m4158n0388J3784P2935M0326
623G6074k5458l5401j9405k5621j0397L8694M4923k401k9793l0246l8219j7640
635g4890M6944O8842K852n5310l8656o422j173K5303O5904L4516o1129q1849Q410
648f6658O7023K2439j2810J1162J662m9433k9587M3582M0930j7927j6767J6503
660A0119p779l7454K517M2170J0043j9267O627J4572k9288k8712M2662N5957k4307
673C7860n5674J7064M8494j6801l8852K4170L0110l6451k8576M4431L1647n2388
685E034n3132K2043M2252K406j1845m803k5462l2740J4463M9711J6383k4351j5082
$$ y = [-7544, 6621, 4053, -12282, 15363, 59493, 43673, -11811, -34447, -26420, -12859, 22851, 67596, 53126, -22871, -67680, -31780, 26906, 52277, 54461, 43575, -583, -50971, -37187, 35748, 76074, 50616, 15215, -4190, -29811, -40208, -1514, 43409, 41008, 11215, -19031, -57250, -74890, -27946, 40896, 43748, -11562, -50218, -56640, -57813, -32510, 33394, 67910, 6781, -75068, -66658, 365, 22804, 9994, 21156, 22818, -26615, -56202, -12620, 28310, 10383, -6384, 10119, 2340, -35114, -32597, 9573, 19616, 349, 6976, 21548, -7740, -36452, 6210, 62167, 37860, -17814, -750, 47744, 30943, -7909, 16261, 46371, 9920, -18656, 25775, 57422, 5034, -48098, -26055, 16197, 18603, 6758, 1955, -23507, -56247, -41784, 7927, 24310, -41, -15123]
698a5123m175k2254m958N0970M1684k8326m0249P615N325k9691P968O7279K8846
711F4911n5483n9144k340K3852K5773L7386K0065l8356o4834j4143M3629M8484
723B9800K6726L089l7487n8912m620O4225M4675j7867j2973J0885k8737n1599
735c2795J9785P4410J6111m8571k4008O378k2238k5243L8508N9542j1957o6050
747a6128k8454J8156J3626J2324L1218K264n2617l1787L5747L0889j6140m286
759e188K4076j3980m2704J0759M7521q153m7635O434M5847n927m7026j814L7253
772e37k26k9768J0341L4211j0265l2804R012K6959q158j0445K5923J8047k2880
785I410j9518Q232L516P54K7828K4781l2546n4497l979L9537K2529j326l37j3773
$$ y = [-15123, -19298, -41552, -46510, 4460, 46144, 17818, -22431, -14816, -9491, -39182, -31214, 36065, 64911, 9428, -49716, -52056, -28204, -2431, 34955, 55020, 16664, -48170, -62313, -18684, 29800, 56526, 59615, 22128, -36784, -41404, 22821, 67496, 49629, 36656, 47541, 18804, -32795, -13010, 61400, 77511, 28940, 4932, 11310, -10928, -36171, 2337, 61879, 49922, -16128, -44582, -26426, -12800, -476, 30742, 33006, -19611, -51398, -15651, 15238, -902, -5188, 18888, 4908, -37796, -27037, 20484, 12331, -35304, -28870, 16977, 11050, -35976, -37790, -537, -763, -30531, -20190, 14021, 3756, -29048, -20036, 6923, -1235, -11680, 14243, 32290, 9410, -10108, -1876, 1640, 2394, 30222, 55003, 22457, -32040, -36019, 3518, 26047, 24721, 24384, 10611]
799A0611m4962k6690L9404N5355O69l3467j8315j2242j5919J5989M8141J8713
811C7287k6172k6608j3521j5527Q005M8512L4828k7725m9546j6586O538O421K5611
824h483M1177k981o4457m5186K8633M6121Q343q1R607k3644m8207M493N6215K6025
838B7575j9702r560K425k1185j7867K7906L8716n100k8284m972K404j6107l993
851b7744L3935K1545l0080l2697J2350J8090j2651l294K4410K436l1259n478K8705
864a732O224k2501l298J9432M233j1202J912O226j2207j5037J2528K3561k75j7853
878i989p665k006j0215M778K7905J3797k0551k1946k500N02O369K6806K1961j5473
892A1773l2846j2317Q786J5935K2730J9105j0917l7716k4974J1762K8602J9349
$$ y = [10611, -34351, -61041, -21637, 33718, 34387, 920, -17395, -29637, -45556, -29567, 18574, 37287, 11115, -15493, -29014, -44541, -36536, 11976, 46804, 19079, -30467, -47053, -40515, -34094, -8483, 32694, 29713, -34744, -79930, -51297, -5176, 3167, 3086, 12693, -10951, -59158, -54665, 1550, 27575, 7873, -1687, 738, -20447, -38314, -10408, 28308, 23208, -5076, -10048, -7644, -23751, -27744, 6191, 27736, -2344, -35041, -22691, -4601, -17252, -20546, 3864, 6300, -24959, -30437, -1732, 4492, -18009, -21307, -1875, 2358, -8844, -6932, -706, -12913, -27950, -15422, 8139, 7864, -9989, -17654, -19660, -29875, -25097, 2808, 16605, -3946, -25892, -28392, -27890, -21521, 5285, 27246, 11773, -21073, -33390, -24604, -8669, 14061, 33166, 22249, -15467, -40441, -28679, -77, 19272]
904A9272P224p826l2299l4632N950M2635K5752o606j4336j8644k8884m636M0452
917f578M0324n251l0075j8587r821k139K2759L8244R819l3393l4577p54J6229
930a3800J1147J6100J5644j4839l9168j2942K5032K1122Q77K824K47k1442k0868
943c0066J2338K8605Q941r414p306m355p016j41J4928J3834o956j4870k67Q470
957F725j437n063L982K225n885J39Q892j355j2732n892N954Q046N373J475n668
972D779j0560o814K327J2062J2861L154j0465j5124r262K851J5806J6971M677
985B3263j1294k0725j8110L542K7229K4405r37j9400k2246j5784N563L1146K8969
998C5621l180k8591k5964o515J3612K4918K1992N81k4298k9511q652J9425K4805
$$ y = [19272, 26496, 18670, -13629, -48261, -42311, 324, 26076, 19470, 5134, -13510, -42394, -47030, -6578, 33746, 28495, -1580, -20167, -29988, -32127, -9368, 28876, 38695, 5302, -29275, -30029, -13800, -2653, 13447, 29091, 14252, -24916, -37858, -12826, 8296, 9173, 11997, 12244, -9198, -30066, -17728, 10877, 19818, 10404, 3098, -1257, -8273, -8414, 6514, 20348, 13392, -1478, -1745, 6725, 5288, 225, 4207, 6432, 547, 686, 9578, 8223, -4509, -10401, -4447, 3599, 8972, 10447, 4779, -5781, -12595, -10268, 1794, 14655, 17809, 7344, -7780, -17042, -14191, 1615, 18586, 23263, 11969, -8756, -26866, -23324, 3905, 28310, 27373, 7973, -14273, -30057, -24494, 6652, 35621, 32441, 3850, -22114, -28629, -15017, 9901, 31893, 32474, 8176, -21335, -29987, -10562, 14243]
1011A4243J2946J458j5260k9370j7178J6918L2646J5210o609j8208k3077j3496
1023b9777J2965L0519J9405r881k7135j8748J999J3264J5716J1836k955k0955
1035c747j7173N101J4424O844K401J299p508j1870l493Q814R030K734l279l678
1049a01k973k794n94O292N959m324o551K871N614k876n128n64Q31K618O566N233
1065A0079n146j1679q047M667J7124J2485l936j3892j2024m975O746J9817J5230
1078B6449o843k0510j5021j616J0227J7053J2671k686j7921k1101q294J5551K3723
1091A1682J1817n597j6408k2212j1656J6331L2597J4806j2034k3929j9094l719
1103b7416J6614K6434J4806j0824k7673k0087L565J9360J7007Q301m445k1242
$$ y = [14243, 27189, 28647, 13387, -15983, -33161, -16243, 16403, 31613, 25004, 6796, -16281, -29777, -16812, 13707, 33112, 23231, -3904, -22652, -20653, -7389, 8327, 20163, 17208, -3747, -20920, -15819, -1395, 5449, 7850, 9149, 1641, -10229, -13722, -4908, 4122, 6856, 3577, -101, -3074, -5868, -6462, -170, 5789, 1465, -5086, -2215, 3399, 523, -4605, -5169, -4338, -1720, 4846, 10079, 4933, -6746, -14793, -10126, 6998, 19483, 15547, 1655, -10369, -15344, -8598, 11219, 26449, 19606, -904, -15925, -17541, -7314, 9739, 22410, 19724, 1803, -19298, -27592, -12041, 11682, 23499, 17902, 1494, -20718, -32374, -16043, 16554, 31360, 19326, -4603, -23697, -27416, -10802, 15632, 30438, 19614, -8059, -28146, -24581, -5221, 11786, 20087, 15642, -5600]
1115e600k2333J156K1222J7689M092n232j4335j6890k421J7188K0403O552r966
1128A1525j5712q664K275J0031J3178O847q702j5893n506O311O144L347K165l540
1142C806p698k458K287K002J097O34r17J41K437r86l977o26K179J231K620N352
1158G124n19p529p825r50O491R258L814m061r183j1176o293J0362J9751N710j2151
1173B823j3492p160l196R895K1856J2333j2578k1453r118N236J2785J5579J1697
1186B5207n648k3441k0587O157K2985J4630K209o018j8569k3532o8K7510K2597
1199B3432l003j4707j4602j3284m49K0615K4820K876j8855j8519m219O020J1447
1212A572J6368Q832j2696k3178p477J0366J1451P564O032p052k0127j0776R429
$$ y = [-5600, -27933, -26777, -5555, 12134, 16226, 10994, -3341, -20231, -22652, -5464, 14939, 21491, 11525, -4187, -12851, -10576, -545, 12633, 19480, 10778, -5115, -10621, -4310, 1834, 5181, 7346, 3806, -3892, -6350, -4063, -2061, -964, -330, -1247, -1106, 1331, 345, -3632, -4258, -2079, -848, 1772, 7124, 6605, -924, -8749, -9699, -3208, 6050, 9864, 5803, -3380, -14556, -20849, -10487, 9264, 14974, 2823, -10669, -17829, -21025, -11130, 10726, 23059, 10481, -10972, -20090, -14854, -2069, 13510, 25207, 19559, -3882, -24469, -18312, 4673, 19303, 21512, 15494, -3075, -26607, -26675, 835, 23432, 20429, 5722, -8880, -22164, -22613, -1998, 22822, 25698, 6843, -11676, -15895, -9875, 1572, 17940, 26772, 14076, -9102, -16579, -6213, 5238, 12802, 18834, 11782, -8345, -19121, -9692]
1225i692J3656N489K89n659j1969o269P227J2053M038m391l873l71j189N40M674
1240D553L003l851k870N458J970p598m367M353J65l703N421N053q554j0495K047
1255i415N461j376K672R521Q60j5716j1220Q249J4864M806J259J352j0699j9978
1269a9360M27K6485J8174q865j4085p912j0238l112K0465K3908n085k3398j2638
1282a5234K28K548J0541K0444P345k0119k3664j9J4660Q871Q755J2152p069l0646
1296a1207j5124J9471K3684L742m400o636j9616j7013J1035K6586Q704j2325j5199
1309h298r359m913O039J6930J0578q985j4210k626K384j217O671J5843J248j6777
1323f692q311P900L721k269P724Q358j0237j4965L510J1636R67m217J556p1n062
$$ y = [-9692, 3964, 9453, 9742, 4083, -7886, -14155, -6928, 5125, 9163, 4772, 899, 528, -661, -121, 4553, 7556, 3705, 835, 6293, 8263, 665, -3702, 651, 816, -2887, 2534, 7587, -967, -11462, -9415, -3954, -5330, -2658, 6863, 7723, -7993, -19213, -10964, 3900, 8706, 9965, 11317, 618, -19360, -18933, 7552, 25726, 16861, 2776, -5136, -15374, -18486, 1979, 25887, 20802, -2596, -15234, -15006, -12458, -1917, 18527, 25872, 5753, -17911, -17930, -3270, 5601, 14356, 26508, 19439, -11207, -26331, -6860, 16824, 20566, 16166, 9530, -10086, -27099, -16064, 10522, 19226, 6901, -8298, -17657, -22570, -16531, 399, 10977, 1992, -12218, -14844, -12460, -13677, -7006, 8837, 10085, -6692, -15003, -7103, -3382, -5651, 2073, 10431, 194, -14771, -11261, 375, 1342, -2875, -1319, -1390, -6452]
1338f452O73Q900J101j0223j683J2973O014o693j710N044o975r387J4731K0141
1352B6454p525k2156j622R184l728j529J4136O836j8729j9384L817J2075J633
1365e38J994Q183n453k3129j0610J6476J7943J276o11k237j9920j8189J5853L2061
1379A3099N408j7662r934n263j0125K763K6123J7250j5346k5364m961Q056L895
1392a2061P509J5966J545k1252j6712Q012J3957O692R146M763j5517j9811M369
1405a3394J9256Q116R8J423q908j8514k655J9516J4147p900j1458j342k043o470
1419a0128L510J4198R59j3995m672P854m57p228N735Q834o635p953P170M629r126
1434g305l888J0143L066r613j570J0568j114j4349k999J2770N243p562j31O920
$$ y = [-6452, -5779, 3121, 4222, -6001, -7684, 5289, 11303, 4610, 2900, 7944, 969, -8418, 6313, 26454, 18929, -3227, -4849, 4335, 607, -922, 13214, 20050, 1321, -18063, -14246, -2171, -538, 1456, 9639, 4186, -18943, -29553, -13077, 4866, 6142, 5531, 3294, -16626, -34815, -18962, 13099, 18507, 845, -9089, -14352, -24477, -21714, 4409, 21659, 6313, -19051, -24012, -15956, -12061, -4552, 11414, 12959, -8293, -25005, -16993, -3036, 3656, 12802, 17565, 2048, -17763, -13394, 5862, 13978, 14076, 15499, 6591, -11923, -14578, 4938, 19085, 11185, -273, -1615, -3658, -10128, -6618, 7580, 8539, -5456, -10128, -2274, -2731, -9959, -4224, 4610, -2025, -9978, -2808, 1821, -7305, -11193, -1050, 2016, -7597, -9167, 1401, 287, -14062, -17061, -4291, 952, -6610, -6741, 179]
1448A79q328j4998P853K3109K849j3985l869J302o897J125K0704J3568j3658j7210
1462h256o60M879J606R791J4033m282k3065j2180J0446J2238K866M613L276j5885
1476e80k1552L929K2717J0273m155l186p241j6156l704K0168J8722l003j2923
1489C309q354o857j945J0912J7944K317j5501j3748l93L092M544J1194P376j1358
1503B532j6471J2R200L037L262P814k665j4894m095J0453P583j763M92K734n507
1518A724p896L068J0441J89p343j40M826l130o291M671O149o227n713P790N798
1533G916q138n506M648J640l983L620J0165k305j3717m326P624O730J60K439K002
1548H969j0327j3226M156J6597N772o705l717l278r921k466J4733J3935l348j1087
$$ y = [179, -8149, -23147, -15294, 7815, 10664, -3321, -7190, -5888, -12785, -11660, 9044, 22612, 8954, -8256, -8916, -4037, -2431, 7360, 21393, 17111, -5954, -18134, -7688, 4550, 7416, 12029, 15305, -580, -22132, -18203, 4514, 14787, 10632, 7446, 205, -15951, -19655, 513, 19235, 16232, 3309, -5045, -11902, -13847, -2935, 15009, 17326, 1825, -11923, -12316, -9224, -4680, 6514, 13890, 2532, -13939, -13927, -4727, -1690, 1572, 9386, 6721, -8173, -12268, -1815, 5768, 4005, 4497, 7231, 1724, -6172, -3104, 7337, 7526, 183, 43, 4869, 1739, -4552, 119, 6268, 41, -5672, 2118, 7916, -222, -5728, -1080, 560, -3423, 197, 10362, 8057, -5660, -9986, -2362, 4368, 4528, 6967, 8969, -1358, -14584, -10428, 6169, 11941, 5236, 1519, -1759, -11680, -14146, 587, 14522, 11174, 87]
1562H7o402l921q21J0441J5122K961j3098j3348l121N944R111J0987M852j1788
1576G006j8092m292J1356J1290M878R80p640j5226o122J0158J3083L800k556o567
1590B056r788m858O245J1419N876k708o938o862l805K979J0253P886l678r935
1604a858m275P95J480N253P776j835j1319l943O144L560j217R92J325k788k950
1619b860K530L603j697m014J430M930K33l253m15J173l524j251O135N215m057
1634D178n746M68k97k964M056Q343J275q065p637q79K764N714O402L006p211j2580
1650i173n142Q881J1625M423k334p441j0904m860R141J3638M617n413q856q231
1664a0029k984P569J1504N659l432j0104q798j779P187J0352P112k338j1388j0975
$$ y = [87, -6315, -10236, -11057, -616, 14506, 17467, 4369, -8979, -12100, -6156, 2955, 13942, 18794, 7006, -11086, -15378, -4022, 7268, 12146, 13126, 5486, -9740, -15862, -5704, 7379, 11179, 8623, 2056, -7732, -12590, -6345, 5074, 10950, 8242, 1304, -5558, -9363, -6384, 3869, 11755, 8077, -1858, -6133, -5338, -3858, 1395, 9171, 7336, -3983, -7926, -1782, 1778, 561, 1553, 2878, 90, -2860, -330, 3273, 1576, -2438, -1008, 3922, 4155, 902, 487, 1660, -1864, -3115, 3020, 8235, 4178, -1568, -1100, -1397, -4361, -305, 8038, 9313, 1248, -6389, -7268, -4504, 1210, 7612, 10618, 3407, -9173, -14315, -5434, 6191, 10614, 8280, 839, -10065, -14925, -5784, 7854, 12471, 7058, -1798, -10029, -13013, -5444, 6060, 11719, 8287, -1817, -10615, -12394, -5207, 5145, 12257, 9919, -1469, -12444]
1678a2444r8Q432J1216O163m356j2463r102K455R268Q818L326m918j0430n918
1692a0051L766P901M707J101k773o264m493L56N744M685J123l486l457k124j252
1707d517K169N816J963m701l692R48J359L46J257J241k708j672K441L155j676
1722A729l949j520K303L756J939o56k250n561k722M324P648K297m828m711l609
$$ y = [-12444, -12542, -4110, 7106, 13269, 8913, -3550, -12652, -10197, -929, 7889, 11215, 6297, -4133, -10051, -6285, 1616, 6323, 7424, 4651, -1613, -6106, -5750, -6, 4679, 5802, 2316, -1141, -3265, -4517, -2348, 3468, 5431, 730, -2962, -2014, -655, -309, 948, 2189, -519, -2191, 250, 3405, 1729, -2220, -3740, -1437, 2319, 4258, 3602, 1352, -4209, -6931, -2607, 5041, 7338, 2510, -2201, -5810]
$$ [...]
8191a05
##END NTUPLES=NMR FID
##END=
