##TITLE=1H_SA_51.205
 CDCl3, 8 sc, 
 5.6.2020
##JCAMPDX= 6.0         $$ Bruker NMR JCAMP-DX V2.0
##DATA TYPE= NMR FID
##DATA CLASS= NTUPLES
##ORIGIN= UXNMR, Bruker Analytische Messtechnik GmbH
##OWNER= root
$$ XWIN-NMR		Version 3.5
$$ Fri Jun  5 11:53:19 2020 Russian Standard Time (UT+4h)  she@DPX200
##.OBSERVE FREQUENCY= 200.1315
##.OBSERVE NUCLEUS= ^1H
##.DELAY= (6, 6)
##.ACQUISITION MODE= SIMULTANEOUS
##.ACQUISITION SCHEME= undefined
##.AVERAGES= 8
##.DIGITISER RES= 18
##SPECTROMETER/DATA SYSTEM= spect
##.PULSE SEQUENCE= zg30
##.SOLVENT NAME= D2O
##.SHIFT REFERENCE= (INTERNAL, D2O, 0, 15.7039)
##AUDIT TRAIL= $$ (NUMBER, WHEN, WHO, WHERE, WHAT)
$$ ##TITLE= Audit trail, XWIN-NMR		Version 3.5
$$ ##JCAMPDX= 5.01
$$ ##ORIGIN= Bruker BioSpin GmbH
$$ ##OWNER= she
$$ F:/spectra/data/she/nmr/H-F/1/audita.txt
$$ ##AUDIT TRAIL=  $$ (NUMBER, WHEN, WHO, WHERE, WHAT)
(   1,<2020-06-05 11:52:22.81 +0400>,<she>,<DPX200>,
      <created by zg, POWCHK disabled, PULCHK disabled
       configuration hash MD5:
       00 E9 B6 7A A2 85 ED C7 34 08 36 98 17 FE 4E 26
       data hash MD5: 16K
       9D AB EE 3E 44 96 67 71 44 72 32 88 ED 5B EB FE>)
$$ ##END=
$$ 
$$ hash MD5
$$ F1 9B B9 82 93 7A D0 B6 5F AE 4F F6 30 38 4F 33
##$RELAX= 
##$RELAX= 
##$RELAX= 
##$RELAX= 
##$RELAX= 
##$RELAX= 
$$ Bruker specific parameters
$$ --------------------------
##$DU= <F:/spectra>
##$EXPNO= 1
##$NAME= <H-F>
##$PROCNO= 1
##$TYPE= <nmr>
##$USER= <she>
##$AMP= (0..31)
100 100 100 100 100 100 100 100 100 100 100 100 100 100 100 100 100 100 
100 100 100 100 100 100 100 100 100 100 100 100 100 100 
##$AQSEQ= 0
##$AQ_mod= 1
##$AUNM= <au_zg>
##$AUTOPOS= <>
##$BF1= 200.13
##$BF2= 200.13
##$BF3= 200.13
##$BF4= 200.13
##$BF5= 200.13
##$BF6= 200.13
##$BF7= 200.13
##$BF8= 200.13
##$BYTORDA= 1
##$CFDGTYP= 0
##$CFRGTYP= 5
##$CHEMSTR= <none>
##$CNST= (0..31)
1 1 145 1 1 1 1 1 1 1 1 1 1 1 1 1 1 1 1 1 1 1 1 1 1 1 1 1 1 1 1 1 
##$CPDPRG= <>
##$CPDPRG1= <>
##$CPDPRG2= <>
##$CPDPRG3= <>
##$CPDPRG4= <mlev>
##$CPDPRG5= <mlev>
##$CPDPRG6= <mlev>
##$CPDPRG7= <mlev>
##$CPDPRG8= <mlev>
##$CPDPRGB= <>
##$CPDPRGT= <>
##$D= (0..31)
0 1.2 0 0 0 0 0 0 0 0.06 0 0.03 0 0 0 0 0.0002 0 0 0 0 0 0 0 0 0 0 0 0 
0 0 0 
##$DATE= 1591343542
##$DBL= (0..7)
120 120 120 120 120 120 120 120 
##$DBP= (0..7)
150 150 150 150 150 150 150 150 
##$DBP07= 0
##$DBPNAM0= <>
##$DBPNAM1= <>
##$DBPNAM2= <>
##$DBPNAM3= <>
##$DBPNAM4= <>
##$DBPNAM5= <>
##$DBPNAM6= <>
##$DBPNAM7= <>
##$DBPOAL= (0..7)
0.5 0.5 0.5 0.5 0.5 0.5 0.5 0.5 
##$DBPOFFS= (0..7)
0 0 0 0 0 0 0 0 
##$DE= 6
##$DECBNUC= <off>
##$DECIM= 24
##$DECNUC= <off>
##$DECSTAT= 4
##$DIGMOD= 1
##$DIGTYP= 9
##$DL= (0..7)
0 120 120 120 120 120 120 120 
##$DP= (0..7)
150 150 150 150 150 150 150 150 
##$DP07= 0
##$DPNAME0= <>
##$DPNAME1= <>
##$DPNAME2= <>
##$DPNAME3= <>
##$DPNAME4= <>
##$DPNAME5= <>
##$DPNAME6= <>
##$DPNAME7= <>
##$DPOAL= (0..7)
0.5 0.5 0.5 0.5 0.5 0.5 0.5 0.5 
##$DPOFFS= (0..7)
0 0 0 0 0 0 0 0 
##$DQDMODE= 0
##$DR= 18
##$DS= 0
##$DSLIST= <SSSSSSSSSSSSSSS>
##$DSPFIRM= 0
$$ [...]
##$SUBNAM2= <"">
##$SUBNAM3= <"">
##$SUBNAM4= <"">
##$SUBNAM5= <"">
##$SUBNAM6= <"">
##$SUBNAM7= <"">
##$SUBNAM8= <"">
##$SUBNAM9= <"">
##$SW= 24.9337058887773
##$SWIBOX= (0..15)
0 0 2 0 0 0 0 0 0 0 0 0 0 0 0 0 
##$SW_h= 4990.01996007984
##$TD= 16384
##$TD0= 1
##$TE= 0
##$TE2= 300
##$TE3= 300
##$TEG= 300
##$TL= (0..7)
0 120 120 120 120 120 120 120 
##$TP= (0..7)
150 150 150 150 150 150 150 150 
##$TP07= 0
##$TPNAME0= <>
##$TPNAME1= <>
##$TPNAME2= <>
##$TPNAME3= <>
##$TPNAME4= <>
##$TPNAME5= <>
##$TPNAME6= <>
##$TPNAME7= <>
##$TPOAL= (0..7)
0.5 0.5 0.5 0.5 0.5 0.5 0.5 0.5 
##$TPOFFS= (0..7)
0 0 0 0 0 0 0 0 
##$TUNHIN= 0
##$TUNHOUT= 0
##$TUNXOUT= 0
##$USERA1= <user>
##$USERA2= <user>
##$USERA3= <user>
##$USERA4= <user>
##$USERA5= <user>
##$V9= 5
##$VALIST= <valist>
##$VCLIST= <CCCCCCCCCCCCCCC>
##$VD= 0
##$VDLIST= <DDDDDDDDDDDDDDD>
##$VPLIST= <PPPPPPPPPPPPPPP>
##$VTLIST= <TTTTTTTTTTTTTTT>
##$WBST= 1024
##$WBSW= 4
##$XGAIN= (0..3)
0 0 0 0 
##$XL= 0
##$YL= 0
##$YMAX_a= 275397
##$YMIN_a= -106687
##$ZGOPTNS= <>
##$ZL1= 120
##$ZL2= 120
##$ZL3= 120
##$ZL4= 120
##$ABSF1= 10
##$ABSF2= 0
##$ABSG= 5
##$ABSL= 3
##$ALPHA= 0
##$AQORDER= 0
##$ASSFAC= 0
##$ASSFACI= 0
##$ASSFACX= 0
##$ASSWID= 0
##$AUNMP= <proc_1d>
##$AZFE= 0.1
##$AZFW= 0.1
##$BCFW= 1
##$BC_mod= 2
##$BYTORDP= 1
##$COROFFS= 0
##$CY= 11.3945322036743
##$DATMOD= 1
##$DC= 2
##$DFILT= <>
##$DTYPP= 0
##$F1P= 16.9975609425685
##$F2P= -3.02152046262296
##$FCOR= 0.5
##$FTSIZE= 0
##$FT_mod= 4
##$GAMMA= 1
##$GB= 0.15
##$INTBC= 1
##$INTSCL= 1
##$ISEN= 128
##$LB= 0.24
##$LEV0= 0
##$LPBIN= 0
##$MAXI= 10000
##$MC2= 0
##$MEAN= 0
##$ME_mod= 0
##$MI= 1.114404
##$NCOEF= 0
##$NC_proc= 0
##$NLEV= 6
##$NOISF1= 3.799351
##$NOISF2= 2.8
##$NSP= 1
##$NTH_PI= 0
##$NZP= 0
##$OFFSET= 15.70392
##$PC= 1
##$PHC0= -9800.217
##$PHC1= 25.40082
##$PH_mod= 1
##$PKNL= yes
##$PPARMOD= 0
##$PSCAL= 0
##$PSIGN= 0
##$REVERSE= no
##$SF= 200.130013532006
##$SI= 16384
##$SIGF1= 3
##$SIGF2= 2
##$SINO= 400
##$SIOLD= 16384
##$SREGLST= <1H.CDCl3>
##$SSB= 0
##$STSI= 0
##$STSR= 0
##$SW_p= 3612.71676300578
##$SYMM= 0
##$S_DEV= 0
##$TDeff= 0
##$TDoff= 0
##$TI= <>
##$TILT= no
##$TM1= 0
##$TM2= 0
##$TOPLEV= 0
##$USERP1= <user>
##$USERP2= <user>
##$USERP3= <user>
##$USERP4= <user>
##$USERP5= <user>
##$WDW= 1
##$XDIM= 8192
##$YMAX_p= 0
##$YMIN_p= 0
$$ End of Bruker specific parameters
$$ ---------------------------------
##NTUPLES= NMR FID
##VAR_NAME=  TIME,          FID/REAL,        FID/IMAG
##SYMBOL=    X,             R,               I
##VAR_TYPE=  INDEPENDENT,   DEPENDENT,       DEPENDENT
##VAR_FORM=  AFFN,          ASDF,            ASDF
##VAR_DIM=   8192,          8192,            8192
##UNITS=     SECONDS,       ARBITRARY UNITS, ARBITRARY UNITS
##FACTOR=    0.0002004,     1,               1
##FIRST=     0,             0,               0
##LAST=      1.6414764,     0,               0
##MIN=       0,             -106687,         0
##MAX=       1.6414764,     275397,          0
$$ Real data points
##PAGE= N=1
##DATA TABLE= (X++(R..R)), XYDATA
$$ [...]
2630a120j668K042Q49j913P55K371L30k562j358K09K641K055k793k945K147K570
2646A610j905k280J971J660L21j083j654k95J739K290j850k385N25K642J60j313
2662A53k176J729K284R3k800o03K872O7k234j96J704R78m03j332k224J0L408J614
2680B944k228k375J006O08j199j18J784K056m49l671j895K569L219K26j051j896
2696d70j522L02J595P22M32P38Q53m280l128L246M285M41k653k174q47J845Q55
2713B40k03P84J207o22k397q16L39K689K808j668m529r38L335J241j727K09K062
2730B014o56l094o30J319K240J711j063l696l25J933M70l13J64r14J557j81k381
2747a845j164L893K064l824j578J676J391j72j088r69K81J607R74k201j377J424
$$ y = [-1120, -2788, -746, 103, -1810, -1055, 1316, 1646, -916, -2274, -2065, 576, 2631, -162, -3107, -960, 1610, -295, -2575, -604, 1056, 1377, 294, -1360, -1655, 84, 2374, 524, -1861, -1336, 1306, 1466, 153, -2023, -294, 1990, 2083, -717, -1320, 1552, 1619, -615, -811, 893, 1871, 1468, 136, -2088, -2078, 1330, 2944, 716, -1659, -653, -45, -1244, -1362, 422, 2478, 2029, -1642, -3537, -968, 2251, 2477, 1426, -470, -1992, -1690, -95, 627, 1059, 1797, 2650, -1630, -4758, -1512, 2773, 3214, 561, -1613, -2460, -615, 240, 37, 821, 2028, 1406, -991, -1807, -1468, 1221, 4029, 2361, -2168, -3106, 229, 1470, -257, -48, 2014, 1358, -1736, -2366, -1047, 1193, 2904, 1841, -1855, -2180, -247, 223, -90, 74, -840, 717, 536, -1845, -3009, 884, 2948, -876, -2454, -778, 613, 441, -647, -1616, -1335, 272, 1246, -955, -2332, -908]
2763i08J641o35j057K96J179J138k187k231J439K843J6j962j115O15O33Q08M05
2780I18r19j02M87o56k857J374L501J385k250k922J26J854J968j462j105J613
2796I53j36k578l65J890J028J316r26l243p44K570K739j495j733J319j23o59j997
2813b184K59L523R61j686k780l38K470R11n92r7j106L74R68j110j449K846K206
2830C176j770l503N65K303P14p91j541l62K048J48r70j117J554P61q44j48j060
2847h37O39J990p95l415j67M030R79k404k462J371J409j41j99m77R44P18j823
2864f40j186L61J942J530j180l048n76J973K536m80k259J258Q00k512j491J900
2880a072K203J288j276l225j282K293K416j10j438J085j048j441K39k53K574J529
$$ y = [-908, 733, 98, -959, -663, 516, 1654, -533, -2764, -1325, 1518, 1534, -428, -1543, -928, -295, 513, 918, -1, -103, 384, -272, -3129, -1755, 1746, 3131, 881, -2041, -1915, -61, 1907, 445, -660, 953, 817, -1761, -2126, -236, 792, 2108, 1182, -2061, -2805, -235, 2504, 1009, -724, 595, 472, -187, -2184, -1925, 1598, 2559, 873, -1907, -2245, 225, 1136, 544, 447, -659, -285, 683, -427, -1876, 970, 3176, 1406, -2097, -1532, 771, 1485, 694, -847, -1209, 839, 987, 17, -1100, 454, 1215, 371, 223, -837, -198, 1792, 997, -2418, -2585, 1445, 2424, 20, -2442, -1071, 338, 197, -2, -479, 465, 1183, -640, -1826, -1465, 477, 2007, 827, -2221, -2797, -824, 1712, 1232, -1027, 231, 1031, -1481, -2972, -1072, 1131, 2419, 1143, -2082, -3364, -1071, 1345, 1235, -203, 882, -166, -1607, -1368, -1621, 953, 2482]
2896B482j168m206o49K867K500q84k47m20j289M25m29m52J856J900r02l003j234
2913b853K644K054M3j998m36L20J238j558j444K139J515o64j766m21M45J424Q12
2930A494j609j292J944J219j947j022J237J440J34j110j815O49J452K3k052L06
2946i49K496M3j815n79q71K199K273m49l614j89K069j14j298Q26J563j17j540
2963f6j758k11K641K521j168k853N76o85O35K1N67M9J759k59l610j096L728J269
2981B060n62k095k89l8J031P35p9m3P78j288k264j26K415K215o00j912k670O76
2999b056K563j11j236Q04J167j864r99K43J555J718n50j893j474R74K009o86j707
3016a543R15J46Q81o34j276O71J511J78k176l90J546J150l83j496q06P67J745
$$ y = [2482, 1314, -2892, -3541, -674, 1826, 942, 695, 275, -1014, -589, -1018, -1470, 386, 2286, 1384, -1619, -2853, -209, 1845, 1888, -110, -546, -226, 1012, -546, -1990, 149, 1664, 1000, -766, -1187, -742, 682, 1494, -115, -1407, 537, 1756, -191, -1213, 24, 1464, 1598, 488, -1327, -678, 774, 797, -1255, -949, 1547, 1590, -225, -804, -1675, 524, 2797, 2348, -1266, -1455, 614, 500, -798, 28, 1591, 1474, -66, -1824, -2035, 606, 3127, 1959, -894, -318, -1003, -368, -347, 220, 269, 2028, 1769, -1841, -2937, 791, 2060, 1498, -597, -886, -924, 107, 842, 763, 720, 1498, 210, -2054, -2180, 235, 2450, 1850, -62, -2732, -2056, 507, 396, -840, -36, 1131, -733, -1732, -1489, 66, 1784, 1234, -659, -2133, -1159, 850, 164, -1543, -628, -482, 399, -235, -1511, -840, 671, 849, -1327, -1717, -171, 979, 596, -900, -1706, -939, 806]
3033H06J50j840n7J567n25j359l16J969P49o00j236r42Q42K018N59k683p28J448
3051a78K9p83Q72O36L20p48j381j315J935K769q88j603q46k72R99J082j58l04
3069A66J583o20l084o85K647J737P9r12k633L98J740O12j406J26J446j89k224
3086a219L67J021J527P97k070k835J758J995k22j119L52K44r5j31j136m88K538
3103A284O49k484j469J736J204j45j494Q54M88K37o98j952Q92J910L64j453j422
3120a499J138R78q0j103m21N3K631j100k388K91J360P64k21o49Q08j34k58o36
3138d66j994K184K025o60j360j493M46J614j7J82K82L7o31k402J67K697J486k93
3156A804j972j888j018L540R80j334o76P19m54j190l38J763J898k31j895k059
$$ y = [806, 956, -884, -941, 626, 101, -1258, -1574, 395, 1144, 544, -692, -1634, -792, 1226, 1785, -898, -1626, -178, -149, -932, -60, 576, 896, 148, -1233, -2548, -613, 2156, 1268, -335, -1181, -1453, -454, 628, 470, 166, 1749, 1129, -1955, -2640, 7, 1744, 1823, 911, -1722, -1324, 416, 1028, -378, -252, 1194, 1005, -1219, -852, 169, 1696, 2493, 423, -2412, -654, 1341, 1119, 0, 352, 596, 501, 370, -766, -1254, 1284, 1933, -551, -2020, -284, 920, 775, -719, 135, 623, 860, 162, -1790, -898, 1012, 1376, -77, -1499, -361, 617, 537, -566, -987, -934, 1697, 597, -1791, -1500, -140, 624, 403, -246, 562, 428, 170, -466, -2460, -276, 1749, 1089, -271, -1764, -1318, 296, 279, 461, 743, 780, 149, -2253, -2086, 611, 2097, 1804, -168, -2056, -3074, 466, 1446, 112, -564, 155, -299, -1489, -1827, -64, 1834, 1603, -292, -2351]
3172b351P79K272P21j280r86R91j63p33k36L40J546N50j711k130Q76K528j34p90
3190H9j88m52R26K38j040p5J638N68j648r78Q73M66Q31j27j616j78J106J037k122
3209f52o73J483O97p40p86N77K41k9O94k069j55K832m33j182o9j60R52j2p04m52
3229f40M25M62r62k041K244J656k78r37j404o0J844J760j562j652J069o54K61
3246d69q87J387J152q59j30j851M45J780N83j320l81mO25n18PL19L36J223r74
3265D64l023P52K393P46j197j090Q0K20O85n82m96J214Q89j394j347R22O10L63
3283B09op04m99J284R04j739j096J779K19m29j109kQ55J109n64k317J186K146
3301A226j48j561p76O40J241N23j843l04K47J673j521n47P64J907m75j086j172
$$ y = [-2351, -1572, 700, 1421, 141, -845, 146, -17, -750, -986, -646, 900, 1450, -261, -2391, -1515, 1013, 879, 89, -99, -551, 375, 613, -427, -502, 1136, 1704, 56, -922, -49, 417, 1248, 1121, -495, -673, 433, 1470, -652, -1325, 158, 855, 115, -671, -94, 147, 118, 812, -1257, -1412, 1420, 987, -195, -264, -424, 528, 516, -188, -640, -215, 247, -715, -2756, -512, 1144, 866, -71, -1475, -1535, 309, 2069, 507, -1145, -76, -730, -469, -1356, 31, 1183, 324, 194, -1657, -1212, 568, 1151, -169, -550, -554, 71, -447, -440, -121, 215, 1438, 464, -2559, -1807, 586, 1332, 135, -955, -875, -655, 30, -552, -1048, 166, 1055, -339, -1686, -764, -154, 209, 203, -501, -1000, 284, 1188, -551, -1647, 132, 351, -78, -1187, -1189, -334, 775, 211, -2106, -920, 1226, 1078, -483, -1259, -619, 622, 1145, -698, -1002, -755, 918, -603, -1150, -386, 1521, 1046, -40, -1212]
3318a212N44Q30J014k19j685N13L19Q5k60L52Q68n41l43j597m73K996J795k434
3336E52j709O83N43ro37Q20L00R97j116k595J021J468J071o62j295n24M16J161
3354D85l38m79L31J538j634k570J571J573J07L01j097n68L03Q69r6m24r6J065
3372H41p65j088m8J324J389l68k025j95J095P22p01p48Q29K83m72l13m79k5J681
3391I37N3j310r81K339J20r42j898N28J406J503j731j149R11K17M3p22k4N49J74
3410B3l52n68qM97K281j124k431M63J600k34q73J198l07K80r61o95K83K050N60
3429A682j103j610m21K15J592O43j004O92K29q37j140m69K671P36j199j094j107
3446a524J299J061q1k11RM9q71k78N8J082J233r0k704j113J922J990j508j223
$$ y = [-1212, -668, 162, 1176, 957, -728, -215, 104, 189, -71, 281, 1149, 608, 265, -1332, -1805, 1191, 2986, 552, -1157, -474, 69, 60, -577, 243, 543, 1540, 424, -2171, -1150, 318, 1389, 727, -568, -1092, -676, 485, 147, -332, -1, 1537, -97, -2667, -1096, 477, 584, 885, -212, -780, -477, 392, 296, -128, -224, 841, 76, -1012, -1060, 264, 1653, 1285, -740, -935, 160, 882, 181, -567, 262, 545, 73, -240, -719, -744, 937, 990, -320, -1301, 1038, 1158, 216, -1682, -1154, 252, 1755, 24, -1125, -214, 3, 46, -676, -700, -151, 23, -329, -897, -905, -408, 1873, 749, -1682, -1219, 381, 147, -726, 472, 165, 445, -516, -1211, -928, 1122, 1682, 579, -1031, -1452, -1237, 355, 998, -6, 686, 915, 78, -1062, -1531, 1140, 1876, 677, -417, -1524, -225, 836, 755, 544, 553, 602, -269, -547, -489, 593, 1826, 1736, -968, -2081, -159, 1831, 323, -900]
3464i00R3N99N05r9r19J190L15m70o64j126J213R81n23q23o11R50J106m88j030
3483g01K40K086r82j427l21J764J99o2r27r33J422O20n90j390k62J800J84p12
3501Hm38j7J181j27j889q93K759Q41r75j249n2J48P98L30r58N59j65L18j635J33
3521a323J921J084j122j165j599Q69J619j44j163R19P60r67m55K74P44N24K38
3538A014j091j633N62J666O06j476J55N93r19j19L59M54M59N77k479N2J175L13
3556B68J54J25p63m2K80O09p29j128J690l67o02q65P78K41L48Ko43Q26J089m80
3576G91j429q63K544m62j5r8j153O99Q61j206r07K159J185j245j859n14J653J105
3594A246J31j561N45n82P16j381M85Q00J225r48j559m13R90K084n0j423q47Q37
$$ y = [-900, -807, -208, 297, 198, -721, 469, 784, 314, -350, -1476, -263, 718, 195, -628, -1239, -289, 817, 329, -701, -461, 1625, 643, -784, -1105, 659, 858, 796, -131, -1064, 358, 978, 388, -1002, -1264, 536, 720, 8, -430, -447, 734, 607, -1282, -2175, 584, 1425, 450, -799, -851, -703, 95, 425, -533, 26, -139, 179, -1456, -1323, 598, 1682, 560, -605, -2204, -1335, 284, 140, -1023, -104, 656, -311, -766, -492, 252, 776, 1014, -77, -1710, -1148, 518, 1124, -352, -197, 396, -523, -642, -283, 171, 630, 1207, -1272, -1220, -45, 268, 422, 547, -216, -258, 22, 631, -98, -1226, 464, 97, -505, -1370, -592, -351, -3, -1, -644, 182, 1271, 791, -638, -1501, 1043, 581, 566, 468, -685, 14, 875, -331, -1238, 921, 2106, 861, -998, -1512, 141, 1246, 1377, -184, 361, -221, 495, -886, -401, 399, 1624, 676, -883, -1296, -306, 1778, 1728, 305, -542, 295]
3612B95j92o86j79J776Q09j154q28j121J458R93J006j974q63O0J85J141j122P68
3630C72M6N3j049p35J330J008n8j573J36J5M40p5L97j000J228M80j678m36P12
3649c87J641K37j397j014J08J108m7o89j86O31n64M24m30N41o58J709M5k531M42
3668a017J805l59j132k54N87J112m99j67l89N92j00m86m61L33J575k92o86j256
3686a094l24K118K94q78o59J53J208j001q04J019K76O90j781r72J218J327R83
3703A773j758j029L81R55k51K71m78O47L45j178j099Q37J976l8r38j179l93O45
3721e11R06q3n48k48P21q38qM36P18M67n29j021m21R95Q82p79j168J437m18o17
3741f27l06L85N09J000n50j196R6J617m59j156J45N3J457n02k50p46P64J164p27
$$ y = [295, 103, -583, -762, 1014, 1823, 669, -159, -1280, 178, 1171, 2177, 203, -660, -600, -415, 726, -396, 372, 418, 471, -578, -1313, 17, 1025, 967, -606, -470, -455, -15, -90, 307, -693, 535, 1015, -663, -1099, -387, 1254, 1491, 94, -920, -812, 296, 249, -440, -626, 5, -559, -135, -565, -24, -682, 1027, 1072, -1459, -1017, 788, 429, -703, -957, -370, 742, 243, 76, -313, 279, 179, -307, -768, -435, 1140, 848, 162, -1094, -1418, 700, 994, 116, -543, -390, 818, -183, -987, 32, 308, 998, -783, -1755, -537, 790, 1773, 15, -1014, -633, 322, 71, 342, -136, 511, 856, -322, -1421, -584, 1392, 1354, 416, -763, -1156, -511, 395, 312, -236, -484, 237, -601, -609, -173, 545, 1012, 483, -538, -959, 36, 918, 139, -1029, 408, -10, -627, -933, -548, -39, 961, 411, -785, -689, 928, 469, -687, -542, -489, 968, 466, 216, -530, 234, 1398, 671]
3760F71k159J620M75j90r78J12j46J208K89j003j063J021j84m62M68J94P0P3l89
3779c73j04o62J102J065j239p67J5O33R60l05k75P6L67p82j410R67J124J361j493
3798B60j443j24J012R64m90l85M87M2o88q32P60J355l6p51m99j201J838L25k07
3817C87r84M34j68k89k85L30J195j2L02j486o53J768L56j144n05Q3Q12j0j95q52
3837i16P06N84j35j099J36J451M06k65j123J90n5M18J63j371O69J228o66l37j92
3856b08N57Q2n77o71K74R75R13j009j266O17N62N69n70P11q77JN73j028j98J644
3876A074J68j343o83M32O70O6K29r86J96L18n96k44N92J276p8o83j364l2O11J385
3896A008j022j051K79R43o93R1n71J081N24m36j277L43R35O48o23k64j77L19J87
$$ y = [671, -1488, 132, 607, 417, -561, -449, -595, 613, 902, -101, -1164, -143, -327, -789, -321, -127, -57, 16, -373, -477, -1139, -37, 1028, -211, -978, -963, -330, 630, 325, 50, 126, 493, -289, -1699, -732, 392, 1753, 260, -1183, -1307, -295, 669, 179, -206, 281, 323, -365, -1197, -437, 918, 882, 131, -368, -1569, 269, 594, 387, -597, -163, -331, -620, -905, -575, 620, 608, 910, -576, -1229, 539, 895, -249, -754, -671, 141, 131, -64, -916, -210, 374, 239, -860, -724, 727, 1133, 868, -255, -65, -120, 298, 461, -910, -241, 987, 321, -16, -208, 349, 431, -146, -817, -543, 432, 1345, 336, -930, -313, 249, 818, 248, 959, 82, 83, 656, -372, -570, 1074, 1242, -101, -784, -352, 318, 384, 613, -373, -177, 141, -455, -699, -107, 1169, 1091, 408, -956, -988, -377, 1008, -14, -1065, -786, 157, -536, -445, -1016, 65, 589, 153, -1124, -781, 154, 802, 179, -85, -262, 57, 244]
3915B44m46M95m41J018o77q66j009J958L91l77m22o62R16K81l64r05M65P22k15
3934A06p22M37L01k09N87r05j71Q71O39q53j444L42J292l20j75L09m88R62l58
3953B01n42l87J053P69j553m90O8J046P31j23j396l32Q34L82l47p4N57L61p11
3972D7m22o0L89J196o35m22o4J1L23m54k77M36J013o58j188j50O13P51L32q97
3992a16r56R75J31p3J15LO59m69j142k89J120Q10l1r24q37R16N18k63o34J05P65
4013C83j54m80j22P66N50r86r0k18O71M67j07j113L42R81K7j204K7j8O06J92l10
4034B10q53K05J260j283o91J098K77J73Q2j763N44O29M51j80n39O53M28o38q55
4053g92M75L91N61N74j548j17M22M29m88M29q0n19M63j099n3O96J122j48j351
$$ y = [244, -202, 293, -148, 870, 193, -673, -1682, 276, 667, 290, -132, -794, 122, 403, 39, -866, -401, 321, 106, -616, -179, 122, -87, 500, -405, -576, 295, 934, 81, -1363, -1021, 271, -49, -224, 85, -403, 559, 201, -341, -728, 325, 1094, -459, -949, -881, 165, 896, 773, -623, -955, -121, 261, -86, -160, 397, 758, 47, -375, -435, -46, 1150, 515, 93, 29, 40, 363, -91, -368, 68, 1081, 423, -765, -915, -302, 449, 781, -116, -1072, -97, 34, -39, 76, 79, 738, 269, -873, -1162, -42, 768, 737, -187, -1024, -108, 410, 147, -487, -382, 383, 229, -251, -373, 393, 943, -43, -133, -351, 320, 787, 680, -433, -91, 890, 917, -287, -260, -278, 328, 520, 210, -643, -438, 822, -461, -1152, -54, 223, 396, 478, -1285, -741, -112, 339, 159, -380, 273, 701, 63, -792, -317, 74, 635, 1209, -339, -456, -34, 395, -93, 336, 256, -263, 200, -899, -952, -256, 866, 718, -633]
4072f33l19K05J145m3r1j73N29m52p14l99O89R85m86m05o91J01J328N05j092l39
4092c50O03o6n34k52R36L61k97l56m27m7J160j7n55p36K21R44n30Q7l03M18Q89
4113A149j221m04K47J127l06r41L71K85o9M8m13j67P21R8n98p34Q50O72l25n33
4133a43j64L7J291n40j143J74M50L86o84n5L26N53j92j09q82R3J577J89j392j75
4153d03M26L1J97k35J93l71Q70p26k49K00J017j48j196m8k58R38N76r29q9M14
4173B10l0r68J42M15J088m21p28n92N11P95j67k48l80K38L12n66j6P2L26L67j95
4194A65j224L29R82j42n66L64P3k15O52q36N34QN2p8p90M48M50l2j32Q5n18Q66
4216D75n74l49l1O47N47o93m69M95m1J48r6p77N87M21L04o12q64P09N75L62m46
$$ y = [-633, -952, -747, 398, 355, 264, 91, 620, 168, -546, -945, -256, 729, 243, -162, -853, -752, 576, 1081, -11, -350, 253, 187, -347, -599, 337, 698, 401, 45, -382, -429, 731, 714, 159, -577, -356, 588, 58, 145, -158, 260, 1149, -72, -476, -229, 898, 592, -349, 22, 307, 238, 286, -127, -294, 427, 525, -73, -807, 43, 715, 390, -143, -307, -270, 1021, 481, -662, -488, -38, 348, -336, -391, -65, 488, 296, 187, -695, -602, 975, 1164, -228, -403, 23, 54, 251, 16, 209, -162, 708, -18, -267, -67, 950, 802, -394, -442, -700, 238, 814, -115, -204, 210, 180, -788, -646, -231, 857, 436, -292, -884, -373, 422, 255, 7, -373, -135, 177, -389, -405, -333, -7, 360, 165, -1059, -730, 252, 110, -456, -92, -19, -234, 418, -418, 116, 124, 176, 98, -692, -244, 206, 174, 42, 127, -391, 475, -99, -448, -479, 168, 715, 22, -447, 48, 7, 155, 59, -718, -131, 290, 594, -18, -882, -173, 402, 764, 318]
4237C18j26K45o5k61o88Q30Q35q61m55m30O55L12R48p22j035O82MM3m93O71M59
4258H66o53m95j84J93P68J62l36j124P06M15k88m48N74j05K64l32q69j51J533
4277D96Q4n64n44L44R5K64N6l13J50K08k72o11N01J15J75m50M56k30O7M23o32
4298a82m67L01P10k95n76K89K45L51Q3q25NM44K32p28j2K33J74n0j08l13O36K29
4320C76q53RJ58O18j79m84m14O59M77K11r58m62R99L20P2j272R75r6K8o71m10
4341h97O39N61K77r57k40N73J7N91n21J68J11j79k17n50K27M25O40m94r11O59
4361g8J60K88L5l46k71J024l05j406L87J096lm64q11M38M57N38o17q28N29Q91
4381G14o28m09N98N6m57L7j39k96M00P91o60l89k00J064m46r8J63j57O8J59l63
$$ y = [318, 192, 437, 372, 111, -577, 253, 1088, 227, -228, -658, -3, 309, 1257, 535, -500, 182, 186, 229, -264, 407, 866, 213, -282, -466, -273, 495, 657, 321, -803, -97, 318, 30, -418, 156, 51, 315, -17, -886, -1037, 496, 580, 16, -528, -184, -89, 175, 231, -82, 68, 276, 4, -607, -106, 9, 184, -266, 190, -40, 27, 450, -182, -649, -348, 362, 67, -509, -220, 25, 376, 459, -366, -361, 83, 315, -413, -425, -192, -18, -68, -176, -489, 147, 376, -477, -468, -310, 308, 129, -355, -769, -110, 367, 578, -380, -842, 157, 477, 549, -723, 252, 156, 184, -487, -897, -258, 303, 580, -377, -617, -44, -27, 564, 43, 211, 322, 143, -74, -624, -397, 28, 668, 174, -737, -78, 82, 370, 405, 59, -212, 812, 507, -899, -512, 584, 581, 117, -694, -256, 201, 739, 122, -706, -177, 714, 86, -323, 275, 331, -126, -89, -228, -524, -124, 667, 7, -382, -582, 482, 36, -62, 101, -56, 12, 171, -192]
4402a92l85J007J37q06r4P4j65J067o65m44K8O58Q3n6k27J35k21J81o37j25J138
4423D91N8j89q81L71j39K6J82L07J20j99k09n47M79J85Q59n39q26j02L18N3L10
4444A28J51k85K17j65q90N33N50K60m47m88Q2k04O52K35o44J68N71k95m15M5J40
4465a01N00J23o46p1l17Q72Q3q57N54L2l73O2j20K60N93k30k71n77j05J023Pq96
4487d55M68K76J04j9o45o8N78K12j306R81k08N62n18N5l80O54q4K91j156J74R92
4508E08Jr3m38j08J59K75o49M32M99j36m70k42R3J27N29m75J20k13L20J32l79
4529hQ0L65k13Q0p54j97N03O72J72o25m28L79k04j13M73R4L90l81m92n82O06P18
4551E35n70k62l71K82J30N2L32m42M27k06m25K33K89N46P1p42k75J109m40L58
$$ y = [-192, -577, 430, 567, -239, -333, -259, -424, 643, -22, -466, -438, 220, 303, 247, 20, 155, -66, 115, -522, -647, 491, 549, 360, -521, -150, -289, -263, -81, 226, 346, 147, -62, -609, -130, 55, 914, 375, -451, -553, -235, -182, 128, 279, -6, 211, 46, -844, -311, 239, 499, 52, -436, -354, -558, 94, 329, -315, -147, 424, 129, -286, -241, -101, 399, 522, -124, -195, -512, 360, 443, -414, 140, 172, -201, -139, -259, 1, 594, 364, 93, -484, -589, 434, 441, -455, 13, 289, 393, 374, -271, -339, 239, 451, -855, 126, -82, 480, -38, 17, -363, 291, 207, 498, -658, -484, 508, 509, 416, -22, -130, 29, 304, -345, 87, 586, 450, -20, -262, -169, -42, 487, 12, 132, -81, 239, 371, -8, 72, 437, 224, 304, -450, -647, -144, 528, 700, 75, -353, 26, -178, -291, 182, 276, 666, 285, -207, -789, -183, 535, -35, -297, -668, -386, -256, -204, 128, -314, 113, -93, -518, -285, 4, 550, 621, -121, -396, 713, 273, 631]
4571F31p85K01j09Q2N2j95M94p9l32r1R7K16K46l31o9m46K71N75j63n7m43L83
4593A48r6o1k66L33M28mm25l98N68k21r7J98k75L99o4j62m37K81O51l47r07L10
4615d44L90L70L4j7n97L69J3J1j08N63k87l47k05j83N33L94K52p96j7k67M07j78
4637a10K72K4q2K65m74j87M65p7N2k12j47L30P8n1m21J37O85n1m91o41O70M10
4659D44j82m03j86NN27k98p1k08O61K01m98l86M25M9K66o2m45J14Q49q68l55K54
4681a67K52L36J75j074P9L09n7J53L8K7K58k98m80L33q7L86J70k00o09KN96J60
4703C02m96j41N42m73p3J59K76L23r7m13n33L73M48r0j82J10K71m12Q9m86K69
4724b34J020j53q56n39P31L35j67M7P2rn3l48k26L40O72l52o46J02k98L10N25
$$ y = [631, -154, 47, -62, 20, 72, -123, 371, 292, -40, -131, -34, 182, 428, 97, 28, -418, -147, 428, 265, 208, -235, 148, 52, -9, -275, 58, 486, 482, 57, -341, 227, 6, -91, 107, -168, 231, 167, 5, -432, -151, 500, 153, -754, -444, -54, 316, 350, 333, -264, 105, 118, 129, 21, 584, 297, -50, -255, -438, 95, 489, 741, -55, -72, -339, 68, -110, 162, 186, 104, 369, -105, -292, 173, 96, 148, -64, -211, 119, 197, 146, -275, -138, 547, 496, 5, -636, 34, 444, 262, -141, -327, -322, 205, -93, -164, -372, 289, 490, -8, -394, 31, 80, 346, 284, -161, -47, 802, -66, -421, -167, 85, 421, 596, -478, -399, -90, -147, 6, 44, 71, 329, 31, -449, -116, -203, 183, 353, 153, -456, -454, 142, 302, -194, -335, 207, -266, -339, -180, 96, 419, 322, -91, -624, -251, 197, 107, -75, 35, 306, -106, -17, -503, -234, 786, 633, -223, -762, -31, 304, 137, 184, 256, 247, 194, -154, -380, -40, 632, 280, -366, -264, -562, -252, 273]
4745B73l20l23N20l8m6j23J64N2K15l62l29K40L5P71q35M5P0N85n23m54M8J92
4767a43L73j13m04J27J68M01p9n95K34Q3L68j68p06O59K03k41j97K5K65j22k43
4788a05l65N99K80J23n20q69L70Q66k1q2m87J58L05k23q0L62K92L6m49l69m28
4809f07J034o24L40J14j3p23L56k2j97O16O2l18p50R0P65K07k91m44M69R8k19
4830e7j12RK28K87k35N2l95K28M01n15n2k06l83R40n28K22r4N82j1m31J8K29R3
4853B70j11n53J60M98k70N45o63p0J47J83j50l30N12J54k10o61O05J74K7m41K
4874a82lN52l33J85n91J87K06l02O06k30O6M30k87q81K06K80K82L78k72n78J77
4895a04L75m65N0M22K07l01m16m20P92p9q8L44m23N63o92J90l09Q33k58l10Q6
$$ y = [273, -47, -370, 150, 112, 66, -57, 107, 159, 374, 12, -317, -77, -42, 729, -106, -61, 9, 594, 71, -383, -335, -143, 230, 117, -287, -160, 8, 409, 330, -265, -31, 52, 420, 252, -454, 205, 408, 167, -30, -5, 260, 138, -105, -470, 129, 409, 532, 12, -857, -487, 379, 358, 276, -211, -53, 252, 29, -51, 311, 603, 639, 190, -179, -607, 427, -197, 143, 257, 244, -479, -123, -145, -342, 274, 336, 18, -732, -642, 123, 330, 39, -405, 64, 162, -57, -169, -160, 68, 355, 120, 172, -223, 5, 406, -109, -161, -367, -750, 190, -338, -116, -210, 372, 361, -70, -52, 177, 270, 159, -394, -234, 264, -6, 539, -124, -194, -47, 136, -14, -344, 168, 322, 112, -549, 56, 230, 257, -184, -182, -185, 367, 34, 219, -372, -185, 21, -281, 325, 95, 161, 591, 304, -577, -371, -91, 191, 569, 297, -281, -104, 271, -194, -144, 278, 485, 184, -232, -652, 140, 61, -27, 317, -106, 457, -235, -45, -354, 479, 221, -89, -3]
4916co5p6R31p98m66K88N12j05n46L28K86l56N09l11l48K53N01l13k69j76J86
4937c8J72m59J14K40j13L24o42N14j80J75l8m38L03L33J23K93j214O96j02L73
4957D36j138N98n0J71M6P2k52M06j91j80o97M72Q77n29M8j44M16o66Q50n67n69
4978e91J201O9r66O98j114R99j63l15M57l57P7K96l85M3J41K08O9k99j84O64l50
4999A98p0n07k83P77L05k38m0l68k10P59k20l88M45L31jr02M83k60N26j12k31
5020fp31P03J74n25o6L00P4J40l24O17P5j88ko75M83M87q23O53n34K17J95j14
5042A30j7m46L08P10j565N36L26o3L18n31O68p95M09N15m16p2R5J09l33J8m6n1
5064a93M14k7o7n30J37K58k03L40q2k26P61l39m25j36O72n12J38M18j004R5M04
$$ y = [-3, -68, -144, 787, -11, -477, -189, 323, 218, -328, 0, 286, -70, 439, 128, -220, 33, 534, 221, -48, -224, -38, 134, -325, -211, 29, -84, 240, -402, 112, -68, 107, 69, -369, -66, 267, 390, 683, -531, 165, 63, 436, -702, -104, -154, 17, 63, 135, -117, 289, 98, -82, -779, -307, 570, 41, 89, -55, 361, -305, 545, -22, -591, 610, 679, -287, 411, -703, 296, 133, -182, 275, -82, -5, 291, -94, -51, 90, 298, 367, 68, -116, 548, 198, 128, -379, -662, 115, 420, 182, 142, -226, -436, 323, 103, -285, 160, 491, 490, -412, 71, -189, 337, 225, -6, -737, -34, 140, -385, -451, -151, -77, 63, -261, 356, 431, 243, 241, -434, 49, 536, -287, 366, -168, 49, 244, 130, 113, -333, -25, 685, -880, -344, -18, -81, 237, -294, 374, -421, -12, 503, 87, 15, 110, 219, -114, -96, -142, -193, 221, 194, 127, -403, -266, -8, -211, 129, 47, -179, 582, 243, -182, -318, 354, -158, -20, 398, -606, -511, -107]
5085a07L01l62K43j80J66k31q6K23L09m32m80K99O17k82J77o44M06N2m70o3K15
5106c29j78R15p18Q4P1j77L24n05N98q66R36J67p47M40J79K99m33k57J45N65j015
5127e02j4M67N89K68q46m83K86K47K96n66j28L42M49K54j162Q75l33j21p9J92
5147C1K89Nn90Q80n92J52m13K60k33m77J001k73P5o30L2N75k36K92k11L87j59
5168A65j91N3o0K45M77k62p07k0j39N77L51j9o83q1K76O78j121P52L85o68J29
5189A37J32m2k70K1n84R2N5M39l52K78L62K34n7m45l10J44J70N42j069J33O10
5210B20l38N06k95M06n60l5l9k03K72k82M76Rp34P96k09N69k56m9m26M97N77j559
5232f57P01L27j20m47M19p8l48P78p25j32L42J67O60p12l43L52L15j049O29L20
$$ y = [-107, 194, -168, 75, -105, 61, -170, -256, -33, 276, -156, -636, -337, 280, -2, 175, -469, -63, -11, -481, -544, -329, -507, 408, -310, -226, -155, -332, -8, -513, 85, -781, 155, 322, -425, 15, 194, 493, 60, -197, -52, 513, -502, -516, -49, 540, 808, -38, -521, -235, 12, 308, -258, -386, -44, 405, 659, -503, 372, 39, -82, -161, 31, 320, 325, -265, 615, 23, 175, -238, 22, -211, -688, 313, 40, 115, -515, -483, 92, -144, 148, -63, 324, 165, -26, 27, -33, 212, 689, 427, -280, -300, -439, 138, 489, 470, -213, -294, -18, 660, -461, 291, 676, 8, 137, 269, 227, -43, -22, -606, -514, -459, -20, -372, -94, 268, 502, 445, 0, -310, -166, 4, 546, -523, -390, 220, -118, 388, 93, 499, -61, -96, -135, -338, -66, -348, 128, 137, -597, 199, -10, 559, 303, 254, -172, 325, 902, -657, 44, 371, 251, -196, 223, 145, -203, 575, -150, -282, 60, 227, 887, 175, -168, 184, 499, -550, 79, 399]
5252C99J91J44l63m66l96R21l17K7p92K96P33j23L85n00j22l00K35k83M11O06
5272F86k86o04J06j63L12K56n25Q7N3k93M26q47K94Q36k24q1J76l67j2J030m04
5293D56L0m65k69m24O87J9P6m21o09O30M35j49n18O36m69K59O33j86m39L2j0P26
5315F60r18K98o8l93M55m08J2j23M64R15r5q23l43N13K0k94o4O38J59j175M04
5336a66n23J18N96m94M94q05J095M46n36j39l90M46L43q62JJ20P88o85m02O17
5356F2p20K71J67N96L8m69k8J52l48R52k66l33L3K64n79N92o34M87N0M07k87m51
5378d4N58k48j62j84k01R7J75P3j00j30M58k98j4l31k60J008p69j47L4P46o35
5399c74P19k90qm87K45O01o85P18j64n42P52J63m41k47N04j30k37k26J06Q44j001
$$ y = [399, 590, 734, 371, -95, -491, 430, 113, 140, -652, -356, 377, 254, 639, 139, 17, -283, -48, -331, 80, 686, 400, -204, -98, -261, 51, 307, -218, -131, -78, -371, 55, -792, -498, 338, 114, 33, 209, -158, -170, 860, 456, 486, 21, -248, -672, 15, 34, 110, -311, -920, -290, 145, -4, -522, 114, -355, -96, 537, 351, -88, -56, -66, 660, -258, 40, -28, -421, 34, -374, -362, -485, -21, 894, 799, -24, -367, 146, 166, -128, -192, 446, 605, -570, -166, -689, -571, 25, -469, 25, -780, 315, 761, 225, 86, -304, 142, 485, -377, -376, -256, 532, -153, -555, 62, -658, -387, -220, 376, 414, -55, -83, 69, -279, 673, 407, 74, 107, 371, -208, 384, -250, 237, 287, 694, 407, -44, 514, 266, 104, -80, -281, -184, -9, 64, -36, -166, 292, -6, -20, -351, -611, 397, -372, -519, -485, 261, -374, 345, 55, 47, -440, -195, 406, -279, 439, 275, -267, 485, 648, 207, -40, 464, 334, 97, -129, -23, 821, -180]
5420a80l36N09N98j02p09J80j51J75l22L51l37j81Q64p89N01R3k86o2j76R81p01
5441h0R1Qo9L81l29l96O67p97Q88j70m05M44m60O66k64L34k10L0n78J078o80r63
5463h14J97J013k52m81K39l06J195j588Q75j60n56O97M96n81K25k19J59j21O18
5482F36p53L18m24N51M95l95K81n32L59m96l24L41P38n07n13M18N49j203l5R81
5502D85n81M51l41o92M34L05j37m46k57N01M51J72j100J43R53n51J3R6N74Q2j294
5523g39J134o63L33Q43j780J773q73P4l44K63j47P4k80K64M74m58J009K41j711
5542e13R84l49o60P71m54L72j54N17l17K66n77J57p7L75m50L48P24r03J1J7l5
5563E3p92J155j75K15O05r42O66J88o64m7k8p65K95R49n63K15p31J035p3p07J97
$$ y = [-180, -516, -7, 591, 489, -220, -40, -191, -16, -338, 13, -324, -505, 359, -430, 71, 164, -122, -184, -360, 621, -80, 11, 19, -50, 331, 2, -394, 273, -524, 364, 194, -211, 233, -227, 439, 175, 509, 299, 329, -249, 829, 149, -814, -617, 396, 144, -337, -98, -404, 791, -797, 78, -82, -638, 59, 555, -26, 199, -20, 139, 18, 636, -117, 201, -223, 328, 823, 428, 709, 177, 536, 40, -284, 57, 795, 288, -225, 193, 742, -461, -496, 485, -96, 355, 14, -678, -244, 61, -76, -522, -779, -278, 173, 345, -755, -612, 341, -210, -197, -101, 473, 555, -739, 395, -268, 65, 908, -872, 901, 28, 102, -242, 21, -126, -52, -332, -68, 406, -52, 957, 1198, -513, 471, 122, -538, 233, -221, 151, -3, 514, 197, 463, -114, 43, -34, 341, -109, 239, 963, 60, 71, 88, 53, -739, 416, 241, 456, 1061, 119, 785, 973, 309, 262, 234, -531, -236, 713, 150, 365, -366, 669, 596, -111, 86]
5584H6l48k81p3P75K51m86m82P23p40P89n81N26L05l47r46J362P0j400J86M70
5604a41L86o94J186j313L85L32l15n33O17K44j66l8N39l23j52R6m81N04k78O53
5624E08j29o4m51M27o64K49L19n72N40k72L93m65K93K41M84j173O68k33k10k1
5644a32OM9L09q51K26O92n07o22n0J431L47j528P04l33m5O17j59m62M50J064j146
5665F0L71q44P68l44l2L6q1J34N07r79N97J29q62N94Q6o64O94n0j70j50K36n29
5687d93J000n79n21Q66K14m57M55l32l41M62j72Ok08R47j513M93p98J330o32k11
5707d84N97K75p62K57J60j207J619q94Q49p31k10J303r9n98O04n50j32l1K7N08
5727E01m75P4k81l52J401p48o12J50M42m81N14M76l94q32M11k61Q41n12J292j558
$$ y = [86, -262, -543, -616, 159, 410, -76, -558, 165, -575, 214, -367, 159, 464, 117, -829, 533, 603, -797, -611, -141, 245, -449, 737, -576, -191, 141, -174, -707, -90, 154, -12, -50, 489, 166, 14, 110, -371, 133, -145, 508, 379, 315, -136, 291, -373, -124, 195, -377, 163, -109, 284, -181, 112, 353, 837, -336, 332, 99, -111, -132, -126, -77, 232, -619, -393, 299, -208, -830, -880, 551, 898, -630, 74, -259, -304, 313, 154, -308, 142, 1206, 60, 431, -413, 355, 11, -21, 15, -66, 68, 575, -404, 193, 322, -540, 54, 140, -524, 170, 120, -50, -200, 36, -493, 507, -72, -593, 273, 487, 30, 485, 153, -188, 274, 102, 108, -100, 847, -666, -173, -971, 359, -273, -484, 113, 388, -374, -117, 43, -1164, 455, -439, 410, -321, -531, 772, 673, 75, 679, 129, -3, -34, -7, 501, 26, 100, -181, -533, 868, 120, -492, -342, 100, -381, 133, 609, 215, -617, -206, -467, 374, -138, 1154, -404]
5747d04J27J3K82j61M51j95l11j89K23k51L41P15j537P23O20o35j68R54n12j03
5767a7N1l23J341j221j56N96n95Q01k20r68J42M26J59K5k85K45j64m80J056m90
5787g7n4k99R61J51m17j95j94k80K49K00o47J030j85R8J80j100K50O46m55K64
5807A26m42l40L17J37L62m26P36K89r17m5l00M32j17J31k15L78r69J222m97k08
5827c46L36L6q21K70Q21K15lo50l42N64M40l27n98L4pQ77n82k37M30j32K3m7K15
5850A69m38j39L10L45p40R3L22k04L69j61l26N97l30k35K46N44m42k9L09M01l63
5871B98n65J022n78J64j68o6m00J61K22Lm52L42j13j29K29l85M30J57k34k43L96
5892I1m90j00K6L18N83m87J83n30K19M72m14M99j4o80M36K69m08M38n06j44M76
$$ y = [-404, -277, -264, 18, -143, 308, 113, -198, -387, -164, -415, -74, 641, -896, -173, 447, -188, -356, 598, 86, -17, 34, -289, 1052, -169, -325, 271, -324, 477, 257, -711, -569, -143, 16, 41, -244, 1, -163, -643, 413, -77, -131, -430, 531, 682, 265, 70, -124, -404, -155, 45, -602, 428, 243, 341, 521, -579, -329, 317, -138, 126, -316, -656, -339, -202, 160, -266, 470, 759, -158, -203, -503, -71, -188, -57, -272, 106, -863, 359, -138, -346, -10, 26, -795, -525, 296, 511, 508, -142, -484, 80, 520, 193, -405, -371, -378, 499, -83, -320, 110, -22, 1, -46, 169, -269, -408, -98, 247, -493, -400, -78, -282, 87, -74, -400, 197, -133, -368, -122, 422, -20, -49, 260, 661, 298, -267, 755, 177, 341, 173, 107, -293, -132, 90, 93, -359, -17, -130, -259, -30, -415, 15, 172, -62, -305, 91, -399, -499, -473, -155, 428, -59, 124, -406, -187, 285, -129, 370, 356, -324, 112, 381, -27, 411, -95, -239, 237]
5913B37l27pl68N93L4j16L35l54K70l67Nj07m03J35J121j47p33N84q06Q74o2k98
5935I3j056L89Q11o81K33k67R92j6m93n66M48k08J43m8N67K1P46p46j19M08r03
5956b52M38q41L64K39K24k14M15o77j28L53M01J41r93N42j23K4M9L83k60J41j96
5977C0J16m60J05P02r7o5p9q3p93J72P88J0l31o55j01J005j78k30K31J82m78K53
5999D4J54j45K23p28R47j023L47J83L90m13n06P97j04n97J412r89M01p39O94o90
6019c42N1J80m35M92n63p7L76K85m15K03j77P17o08O94n85L04K34R0m95o15O68
6040a8Q0k3K09j10k7n15L19j92M35n89m77Q15J125j164K18J52m01n50L83K55K38
6061A63k90k78O81l88l66j33j16Q82k03m35O01Q29j353J81R7M67m52m86R35l26
$$ y = [237, -90, -97, -465, 128, 162, 46, 381, 27, 297, -70, -65, -172, -575, -440, 681, 534, -199, 385, -421, 453, 391, 93, -963, -574, 237, -444, -211, -478, 514, 498, 5, -561, -113, -321, -178, -226, 341, 362, 1108, 362, 243, 651, -252, 186, -655, -291, -52, 172, -42, 373, -304, -432, -79, 322, 463, -530, 12, -111, -87, -38, 345, 85, 226, 30, 146, -314, -209, 493, 396, 331, 252, 169, -624, -452, 336, 346, 15, -640, -741, 264, 86, -144, 87, 269, -209, 44, 198, 53, 276, -452, 495, -528, -181, 2, 392, -21, -527, 270, 166, -431, 981, -8, 393, -346, 348, -342, -291, -111, -546, -54, -617, -694, -318, -33, -448, -245, -422, 295, -313, 381, -204, 100, 334, 424, -71, -686, -18, 62, 39, 248, 138, 111, -404, -85, -277, 158, -431, -908, -93, 1032, -132, 86, 238, -163, -713, -330, -75, 163, -127, -405, 276, -112, -478, -611, -727, 155, -48, -483, 118, 947, -406, -225, -128, 339, -113, -599, 336, 10]
6081A0j15K21L74j120Q48l65O15p22j72N86J76m69J82j04K91k71L29q9j027J785
6101I63j97o96p5n40L07P39k22n28P79k80n39Q92j52o16r9K50l86O17p25M11k30
6122c27K13n40M54O60l06p57P67l48J2L56k07K92M32r78n6N99k94n05P06K22n66
6143a71Q15n22l21j70J19j62Q69n67K3J54O06m57k88j9m81K32K47N50K22j34j017
6164d72k16N21J33l44O84k81M6M5K9j25j15n45R10k52K2J96J23j26o64O13j96
6185a4k47k34L65j76O56j58l99LK31LJ64l04K00N48k31m88K52Q01j472L04j97
6206c93N97o8l25K18L96o97J59m86L30k31N78M73r66J85n23R17n4J19j6k56M54
6227D11J81r01L0N53k37K5N82o21n75O24p06O34k01J34k37O29p15m39R18O42p06
$$ y = [10, -105, 116, 490, -630, 218, -147, 468, -254, -426, 160, 336, -133, 49, -55, 236, -35, 294, 205, -822, 963, 766, 70, -5, -545, -238, 501, 279, -249, 530, 250, -289, 603, 451, -165, -264, -14, -400, 217, -508, -97, -327, -114, -654, -200, 460, 154, -603, 164, -184, -172, 184, -23, 269, 701, -277, -333, 266, -28, -533, 173, 395, -171, 644, 122, -199, -369, -250, -412, 457, -110, -87, 67, 673, 216, -72, -91, -572, -340, -93, 457, 679, 545, -472, -688, -167, -34, -378, 306, 25, 71, 116, 145, 20, -95, -640, 270, 18, 40, 236, 359, 233, -431, 182, -14, -261, -495, -130, -306, 350, 192, -207, -204, 27, 30, 194, -110, 90, 638, 407, -81, 171, 972, -500, -196, -393, 204, 136, -189, 29, 425, -272, -113, -599, -269, -500, 78, 551, -415, -230, -753, 164, 110, 229, 213, -43, 411, 592, -309, -279, 274, 37, 62, 644, 23, -552, 72, -634, 0, -201, -67, -304, 325, -390, -829, 89, 731, 25]
6248B5o49J113j607J858j29q49J115q06l76J81O61q46P28K8o31p36K0J135K33
6267D68J71n61O59m95m42J10O49K00k07j99q62N44O85p71PL74J39p5m71J00j92
6288a69p8O51n54K84r90J739j544P77J6o16K93R5k89M98n2p35N52k64J032l58
6308B88j49m13J79N63J5n69j0P0j94K28j7l59N46j33k42k88N34M01k71l29K26
6329G6M72j07m09k09L47L1l08P22j029J055j251j66J225J40j113P1P85N3j91k44
6349e0L65J38o35O66o44j91L45k84J81j1N24n01l62k42M46J168r59j52R01k49
6369D54k58M48k80q26Q96k85j51m15J47R5Q59k65o81n8K29j6K73p39L28L92l9
6390A08k20Rl14K19L74m03l87L33k17L04m02n22J777m53q43J37J117q1q65O2K89
$$ y = [25, -624, 489, -1118, 740, 611, -238, 877, 71, -305, -124, 537, -309, 419, 447, -184, -920, -900, 235, 468, 639, 78, 737, 242, -200, -90, 559, 759, 552, 353, -509, 35, 720, -51, -44, 330, 469, 394, -77, 23, -169, -247, 404, -150, 134, -856, 883, -661, 116, 132, -484, -191, -96, -385, 113, 61, -674, -122, -386, 646, 288, 139, -274, -95, 468, 483, -86, -96, -26, -220, 8, -9, -368, 178, 45, -197, -485, 49, 450, 179, -150, 76, 548, 441, 32, -177, 170, 201, -107, 615, -414, 641, -610, -776, 449, 589, -524, -453, 332, 385, 194, -50, 315, 453, -182, 484, -160, -351, -6, -290, -109, -120, 404, -97, -459, -701, -255, 913, -46, -198, 703, 454, 196, 644, 364, -462, 434, 149, -2, -417, -270, -175, 684, 419, -262, -320, -91, -107, 166, -573, -245, 147, 108, -112, -103, -417, -198, 176, -227, -614, -281, -498, -194, -596, -1118, 659, 206, -637, -500, 617, 536, -329, -267, 22]
6411B2o13P69L65o39R98o35n05J233r13K87j82j16P8J70l86J14r67P72J63K61
6431B76o9q78N63m5K59N4r3k51K99K70j82K64o99N09J65m37K11k7J16q82Q90m70
6453a57JM82m30L63k74k67k84J026j024J405j27l23p03O22o07k52M38j10P62m19
6473A22o73K76O15j19r66p6J002K60J53j95p38j65M36R3L8o01Q58l27l76O16M11
6494F44j108P46k17M75r66j35L89K08n64R60n85m77O51K98p5n51N1N42K54L52
6514H92q06L73l26J7N35j013O21j25n64L30j73m21Q82m60k26L14L02j60o61K18
6534d51O10l88k66L76P75m42N78p66J55l67k64N86l74N37o14K98J72J13n61j93
6554d86O15K52p60K86k23O11p93P52o97N60J22J0o37M72j23o18M84n01J222o06
$$ y = [22, -591, 178, 543, -96, 902, 267, -238, 995, 82, 369, 187, 71, 149, 319, -67, 47, -920, -148, 15, 276, 207, -671, -108, -153, 106, 160, 67, -184, 115, 385, 203, 467, -232, 277, 442, 5, 216, 189, 305, -577, 313, -157, -156, 326, -104, 259, -15, -282, -566, 460, -564, 841, 714, 391, -312, 310, -297, -549, -111, -221, 541, 122, -551, -275, 340, 221, -745, -821, 181, 441, 594, 399, -339, -504, -68, 25, 63, -538, 320, -7, -383, 233, 644, -464, 282, 65, 540, -426, -561, -172, 36, -528, 432, -153, -630, 21, 319, 244, -307, -256, 286, 540, 892, 86, 459, 133, 150, 685, -328, 293, 168, -396, -66, -239, -660, 222, -238, -464, -150, 152, -8, -669, -451, 159, -229, -495, -119, 656, 214, 792, 26, 181, -186, -450, 136, -238, 299, -315, -17, 155, 268, -293, -486, 129, 381, -379, -93, -316, 295, -498, 254, -443, 117, 239, 249, -388, 84, -39, -657, -173, -674, 548, -58]
6574e8K69q26N04J96O51q38p99J601K10j792R96M67o15J53l95j71l4L59N85p28
6594b65j29Q27M8j338L25J145o52R73q29j21M18n34Q55k54o32j1k67L55O53j525
6614i58J103j38o34P04J002j187J42m10L73l93O76o15K49l04P13j58k5K41q04
6633d23K18j0l1M97k84K90m54j88m26K1J215l46O62k01r5q76P26j08m30O27n60
6654a76MM77j94l9n59Q66m20K46k67N4j90K25P96p28J73n71J7j76J386p34r11
6675g21R60j59M2J74K59p82j79L96O3K35m01N22o1r34M17L27J87k18O4K10J18
6696E19q91O3K92M49j5m90j67L80q97p1M01Q26o99J06O72m00j68r2M68J35j45
6717B76k70j17Q28r38K13O4L14m97K04L65k57l89L23k02l54J129j158J511n61
$$ y = [-58, 211, -615, -111, 85, 736, -102, -901, 700, 910, -882, 114, 581, -34, 119, -276, -447, -481, -122, 463, -265, -394, 433, 481, -857, -532, 613, -39, 934, 105, -16, 402, -132, 723, 469, -163, -174, -441, -86, 567, -958, 145, 7, -627, 77, 1079, -108, 34, -376, -3, -396, 280, -335, -86, -390, 323, 165, 140, 381, -423, -205, -215, -246, 251, -33, 257, -197, -385, -811, -790, 425, 79, 741, 540, 445, -431, 295, 187, -243, 384, -176, -172, 305, 111, 72, -487, 379, -41, 205, -62, -8, -198, 27, 823, 95, 268, -303, -286, -462, 924, 190, -721, 239, 80, 122, 296, 555, -227, -406, -10, 53, 288, -113, 409, 348, -586, -169, 158, 345, 127, 191, 401, 519, -372, -309, -17, 432, 417, -73, -240, 140, -757, -828, -427, 399, -300, -194, 478, 78, -90, -182, 286, 421, 276, 6, -111, 717, -221, -8, 56, 370, -127, 77, 442, 185, -204, 119, -83, -437, 692, -466, 1045, 484]
6736D84j25N6p14Q19j410J199n07q8J04L57o3K40j244L75L35M22M44m58L12p29
6756a91M03q39OO34L64k08j67N18p79J110q16j62q68M64O63l86k42j74J117r53
6776e06L85L19m36O40Lr59J83q4L13j2m08j18Q05n98N24j63n22L39k93o4J563
6797I11o19O5j095M81J41L7J02o44Q51J99m89m32L5L59J51ok43L55Jp82N47j49
6819b24j05N71o3n38J437j434R05l02n95m81Q43M39L03j128o25L81M07J13J69
6838G3m46N75R2n37l59P73j486J793k46o94J160j72J78j13m48R5j7j245J075l84
6858c33n46J615l17r65K30L64K70l54J90M01j931J251N46j283P67j4k47p0K46
6877a80k20J82Q43J24r66n12J26m7N76m57J368j07j083n15J131j81j224Q04Q80
$$ y = [484, 359, 415, -299, 520, -890, 309, -198, -286, -182, 175, 112, 352, -892, -517, -182, 240, 684, 226, 538, -191, 212, -627, -621, 13, 377, 169, 2, 520, -259, 851, 35, -127, -995, -531, 132, -254, -496, -670, 447, -506, -121, 198, -238, 402, 405, -554, -371, -455, -142, -154, -562, -680, 125, -473, 51, -112, -634, -295, -588, -652, 911, 292, 357, -738, -257, -116, -79, 23, -621, 230, 429, -60, -492, -457, -98, 53, 47, -196, 159, 160, -622, -75, -224, -329, 242, 179, -359, 1078, -356, 549, 247, -348, -829, 14, 453, 756, -372, -997, -616, -209, -96, 73, -373, 202, 294, -243, -602, 171, -1315, 478, 232, -462, 698, 526, 704, 591, 143, 238, 221, -1024, 51, -333, -879, 736, 419, -546, -316, 48, 318, -36, 154, 555, -1376, -125, 421, -862, -95, -109, -356, -426, -180, -400, -218, 625, 749, -217, -729, -603, -650, -74, -531, 837, 730, -353, -868, 263, 82, -1142, -338, 542]
6896E42J42p30m58O18P40l45p24N73J36q50O16K40M42p11k63l58M76O5j083J101
6916A69L10n46l90N61m27J297j250K06K5Q58j46p88L0L85m04K76l16J27j72P96
6936F01M13j312J272j100M80n59n38O4M32K05J146j307p10Q92j67k09Q80m01k66
6955a84j73m24O59o8L10l62J69o53J098l09k01J03o36J346k10r58p5N31K71j52
6975H2l10n41R74q6j65N12j181M06P55r17n34J577j57K59l67p13m3L82k91J037
6995F79o19m8p25J052K14m36o47N7Q48q40M0k00O24M38J25m61o45O01P79j190
7015c54m2L54M71j84l96j25P76l40n08K67K9Q54j264L1P59j74k85o11P20J644
7035A622j630k94Mol93L54M15M3L33p88O89m91K87n11p18J420k29r1j28j49K97
$$ y = [542, 684, -46, -504, 114, 854, 509, -215, 358, 494, -356, 260, 500, 942, 231, -32, -390, 86, 151, -932, 169, 479, -67, -457, 104, -323, 974, -276, -70, -45, 813, 667, -121, -91, 294, -110, 166, -150, -23, -195, 601, 1014, -298, 974, -126, 354, -205, -743, -679, -247, -42, 1104, -203, -913, -21, -188, -397, 483, 82, -184, -357, -781, -122, -190, 120, -242, -73, -726, 372, 63, -138, -35, -671, 675, 465, -493, -568, -37, 234, 82, -228, -769, 205, 119, -46, 466, -715, -309, 446, -471, -1005, 572, 415, 674, 307, -406, -449, -67, -358, 679, 60, 12, -713, 339, 553, 117, -530, -473, 375, -465, -425, -625, -1, 437, 562, 101, -544, 57, 836, -354, -396, -42, 429, 245, -151, -276, 500, 160, -348, -81, -52, 802, -462, -431, 328, 154, -131, -742, -22, 1622, -8, -302, -298, -304, -697, -343, 72, 115, 448, -340, 349, -142, 145, -366, -1084, 336, 107, 16, -112, -261, 36]
7056C6N89j038J00R75j018o68Q72K02o30l53K111j752N57K6q39J632p72k58R86
7075G58l13J072j408N25K19j417R05j165R46P43m82K7o06K13l22N19j1J73p04
7094c28N43j74j21K0l16M37o56J300j035R5L29Pk01O28o02R20j452N87N34J38
7114F53o26o83K37R10m77M17j46J72m16L8k30o7M7N87q30J212m57j295J486r31
7134c99j4k16N63o43O95l62q4j22Q08K37l68j98K88j20K08p08N03L84N8j052J345
7155H03l74j072O18k38L28j26m51r7Kj99P75k19P49r64J94K24O68l07J86p27J042
7176H15p69L93Q5q82Q8j30p02O52P29n58N16l0q1m18k50P38n77q52J477J68K8
7197D40j725J274j87J222j376P8K8P44J42j561J034j44N38j41K03k82Or70J010
$$ y = [36, 625, -413, -313, 662, -356, -1024, -152, 50, -580, -933, 1178, -574, -17, 9, -830, 802, 30, -228, 758, 445, 1517, 109, 634, 853, -564, 341, -824, 122, 865, 383, 410, -196, 17, -305, 214, 203, 376, -328, 215, 41, -80, -60, -376, 61, -595, 705, -330, -235, 94, 101, -100, 528, -74, 846, -606, -19, 515, 653, 27, -656, -419, 491, 14, 431, 285, 457, 41, 79, -151, -218, -171, 416, -414, 798, 341, -954, 532, -399, -413, -629, -66, -709, -14, -376, -460, -582, 226, 463, 95, -103, 185, 65, 273, -435, 68, 452, 510, -542, 803, 429, -643, -25, -263, 65, -61, -512, -609, -607, -806, -31, -250, 499, -465, -271, -47, 621, 314, 500, -227, 815, 46, 439, 524, -358, -270, -400, -1102, -450, 279, -279, 237, 207, 126, -292, -542, 196, -381, -1233, 244, 412, 440, -1285, -11, -198, 1024, -352, -274, -246, 498, 640, -921, 113, -31, 507, 366, 569, 287, 293, -677, 333]
7216C33j355J95J273j667J651k90Q3q01P57P69j718M95r87o1J996p10J01R6K79
7235D39N41j274M37n60M69Q06r99Rj093J221l82j11O21K47N66j147O92r06j99
7254f23P16J18p7l0k85P93m52L55j046Q53o89N83l46O19n91n28M23l7l55N65L92
7275C58o05L31J77P12j558O82o45P70m52M52j14o36J107N86j947J364r52K7O42
7294B99k94N55j085J59P52L8n51m58L82P96J88m68k37Q34k41k32j236l44J906
7313G63r73O55Rn5M1m73J99m76K64l33P65j133P48k27N00O68j528L94L34J95j58
7334A79o57Q79p03l20M37J632j771K43l75L50K10k14p7l86J062q90J44K36J48
7353A27r18K04j072M07J623l11Q25q86K01M9N98j582k12J185q45O55O46o6l11
$$ y = [333, -1022, -827, 446, -1221, 430, 140, 223, -578, 179, 948, -770, -275, -1262, -1323, 673, -37, 64, 160, 439, 980, -294, 143, -417, 52, 858, -141, -132, -1225, -4, -386, -497, 124, 371, 937, -210, 482, -424, -623, 93, 211, 134, 104, -181, 612, 160, 515, -531, 322, -367, 216, -130, 489, -102, -630, -207, -244, -599, -34, 358, -247, 84, 261, 973, -585, 97, -548, 222, -230, 222, 108, -528, 579, 1165, -782, 582, -370, -343, 299, 5, 560, -525, -366, 386, 424, -127, -585, -203, 593, 781, 313, 76, 910, 669, 437, -799, -1143, 763, -210, 445, 454, 399, 440, -33, 166, -310, -46, -379, 386, -747, 1, -226, 274, 942, -586, -192, 142, 337, 179, -478, 401, -302, -622, -185, 1447, -324, -81, -456, -106, 104, -110, -187, -573, 489, -401, -257, -21, 127, -791, -587, -1659, -1252, 371, 60, 885, -1, 200, 249, 847, -735, -947, 238, -607, 48, 694, 628, 317]
7372C17r59J83J249j245Q68j211O57N08q32M30p80P61k27M83q92J226o10M91l64
7391E3m81L31J01q96P84k04O20m97l06M87l3k71K87o41J095m4r38J239r31M35
7411A90q17K00J395m44k0j232l43J072l42O39J7o58L81o82o9R63j64j83k40J221
7431H84J92p23m93L91k31k45o8P99k18k00J91m01m56o1R77n53K54p05J288j151
7451e29k60O13r6M61m4K70l9K7j226J634k91l2l83m41O95m30p9Q40j415L82P36
7472C93m80J210j093j20p68J079q0j14o19J94n1l04Q63L0k72P23m44P55l63q14
7492b75Rl58P42K12p90J09J000m13l31M7K3p59J179j023N64k32k41J712q93q96
7512f14J52J44O72M71o55J26k02k6N24j134J477j843R59j05j8m00O79m39J187
$$ y = [317, -642, -459, 790, -455, 413, -798, -141, 367, -465, -35, -815, -54, -281, 202, -690, 536, -74, 417, 53, -428, -97, 4, -892, -108, -312, 308, -189, -495, -8, -41, -312, -25, -666, 429, 385, -553, 686, -245, 190, -627, -427, 968, 524, 504, -728, -1071, 1, -341, 298, 315, -343, 38, -644, -713, 250, 86, -97, -337, 884, 1076, 353, -140, 251, 20, -225, -293, 506, 288, 88, 279, -122, -578, -639, 338, -215, 39, -666, 622, -529, -789, -176, -272, 189, 145, 415, 376, 403, -823, 811, 520, 488, 105, -336, 359, -71, -150, 690, -725, -343, 393, -87, 1123, 30, -90, -858, 221, 141, 27, -592, -398, -449, -753, 110, 140, -132, 591, 147, 902, 539, -275, -266, -624, 118, 330, -460, -351, 649, 236, -95, -48, -25, -784, 395, -628, -64, -296, -537, 1175, 282, -614, -462, -318, 354, 825, 170, 296, 94, 68, 592, -542, 935, -908, 51, -54, -72, -472, 207, -232, 955]
7531I55j409M97K55k00k46r6j97K76r95J47J641k43o75n32J193o16j26k3M19J99
7551B24M26m31n62J233p84J3k03q95N0P23P50q33o4n69J100r01L83O00o48l9M23
7572dj70n18J471j557R83m77p3j15RP69M92J51j554L63k08J55N10m57P13p98L4
7593b81J140j122Q4k75k0R00L03j608J694p44J31o32J021p06m25O28R36j401k53
7612f30L70K29N06n20O44o38l3l3N16n52n57O48L52j212J231o53O2J041m72q31
7632e32P24j94L8J77j205n69J313N95o57r3R7Q57K5N12j430R13j201J618j330
7651c42J14p3M41J32r47L04j33L20p61R11J163j921O33O28j450J276j167Q27L39
7670B94k73q08J750n20r91O45k49N89j065Q81p06j34J847l81j412O01L68J76j157
$$ y = [955, -454, 43, 298, 98, -148, -244, -441, -165, -1160, -1013, 628, 385, -290, -822, 371, -245, -371, -394, 25, 224, 650, 219, -343, 890, 106, 119, -84, -979, -929, -206, 544, -289, -353, -922, 178, -723, -340, 260, -388, -427, -4, -174, -692, 779, -778, 205, -272, -345, -460, -451, 318, 810, 961, -593, -230, -438, -283, 227, -230, 483, -315, -281, 859, -263, -179, -454, -474, 426, 729, -879, 815, 71, 202, -430, 591, -115, -540, 88, 1024, -377, -630, -260, -31, 475, -45, 599, -39, -72, -105, 411, -141, -698, -50, 302, -910, 321, -332, -270, 771, 299, -532, 192, -2, 36, 213, -992, -1561, -248, 347, -310, -403, -306, 551, 576, 1088, -342, 571, -630, 988, -342, -228, -301, 140, 272, -675, -371, -504, -184, -945, -34, 1129, -792, -159, 469, -981, 295, -872, -45, 294, 21, -787, 963, 443, -548, 97, -152, 437, -628, 253, -453, -587, 1260, 879, -533, 68, 436, 612, -545]
7689e45Q56j192Q96j144R10J79K00P41j343J33L49P64n84K06m76J01n10J349m02
7708D88j20l37o86Q98O5m92L68J95n82N09n32N00o38k20J061O1J14l74q88N60
7728e0k03M94m59O57n44L43M64q18k53m69J644k80m41m41l06O91l97j28J174p54
7748g6O9m77L34K04O30r56M68q4K56l9j5M43j976J434L4j31l88L14r5n67k75J632
7770G39p64k36n57O36N45l88j74m62N41o6l24j69J156l68kn55P70k00J37j471
7790a212J305r17P81l89L51N05n5j209n13J051K65n89l8O86m47J318p74j99k17
7809b97m56l44R51K83p1J93M33j347Q18p10M83j91K52M76j43J32p79P37j206M68
7829c18P63j466J767j38l63p04O67l36K3P2oj72K56j89J305p64m54j69N33L54
$$ y = [-545, 311, -881, 15, -1129, -219, -40, 160, 901, -442, -309, 40, 804, 220, 426, -50, 51, -459, 890, 488, 368, 31, -655, 243, 308, -184, 184, 379, -203, 306, -226, 274, -364, -584, 477, 538, 652, 278, -610, -50, -253, 241, -218, 439, -105, 238, 702, -116, -369, -838, 806, 526, 85, -356, -662, 29, -368, -496, 678, -76, -7, -484, -150, 54, 684, -272, 196, 112, 368, 329, 314, 757, -1219, 215, 249, 118, -270, 44, -51, -618, -893, 739, -25, -261, -818, -182, 363, -25, -199, -661, -120, -186, -510, -679, 477, 109, 107, -448, 322, 122, 259, -1212, 93, -824, -43, -432, -81, 424, 369, -840, -1353, -302, -37, -626, -664, 22, -425, 893, 119, -80, -297, -753, -1097, -146, 137, 66, 259, 692, -655, 163, -547, -64, -255, -3, 473, 330, 462, -317, 420, -786, -318, 445, -1021, 746, 608, 245, -459, 208, -128, -105, -33, -39, -211, 45, -144, 1161, 397, -57, -226, 307, 661]
7849F61m72k05O85O41p97j467J561M17m10j422j03R72j370J353L17J18p5j783
7867a379P55J227m25j040J3J531q40M49r32J169r55L21K63K64q89J126n80k94
7885b16J49K79J025j037o65J80k05Q78n72o06j30Q75m94J042j026Q5j55J79O41
7904B27l60j33l68O64m67Q20j18j501Q13L91M63q87J052r67R31l01r03J162l46
7923A72m81k2r8O99j223N22O22n50o74R87m0K64l82k64K60M80m73k5O40L50L33
7944A097p41k03p94M30o02R63k54K19k57R04k538J768M3k84k79L56K82J286j465
7963f9ql74R64n49J358j133k6o83K17J81q3P92j096L06Q5K17j80j62K28N4J417
7984A456j111p3L46j3p92P61l57j001J864p24o01P15j450Q37J290n69q57n0K34
$$ y = [661, 189, -16, 669, 1310, 513, -954, 607, 1024, 614, -808, -911, 61, -1309, 44, 361, 479, 404, -1379, -624, 603, 178, -862, -849, 682, -158, 291, -641, 528, -427, -106, 157, 421, -468, 658, 78, -216, -67, 212, 1237, 200, -465, -285, -490, 388, -184, -790, -920, -45, -539, 503, -523, -438, -593, -414, 227, -133, -266, -634, 30, -437, 383, 265, -1236, -423, -32, 431, -456, 596, -371, 560, 259, -644, 518, 172, -309, -331, -429, 270, -953, -431, 191, -359, -1033, -46, -86, 178, -204, -468, -208, 272, -201, -226, 414, 764, 1097, 356, 153, -641, -211, -813, 150, -104, 115, -142, 762, -1776, -8, 35, -249, -528, -172, 110, 1396, -69, -77, -451, 513, -36, 1322, 189, 163, -520, -303, -122, -205, 587, -509, -203, -118, 99, -81, -243, -15, 39, 1456, 345, 272, 618, 605, -187, 574, 217, -784, 1080, 356, -245, 470, -980, -143, 1147, 578, -279, -329, -95]
8003i5J075p83M0o25Pm21Q56J68n61n11Q68n64L35p20J300o91P81r60J317o24
8023A92K85M48r06p3p71q7O05M32K78q36L09P17o34M07R9j054M61N03m21J1J17
8044H2M91p20q5J35K78k49Q08l84k52p74R6N65J22K3p36J168l70q49J053L58p95
8065c5k57M44r8J47N31r38R7K83L48l5N48m57j364N99k70q30J694n79J82K88m98
8086b00J2Q63j214N2O70l11j20o1P04l88O48m24j269J136o82J93P04P4l65J20
8106A42k83N93j679J817M45j302q3j79J84L83P48O44j479K28q76J500J7m29J30
8125E21j127J108j011J475r04R73o87j028M06K29n1j31J352o39p56K15q92R14
8143c3P76p32n64R92J47q37o65O13K77o95J76j86N85J41J05K30j46O82j091J03
$$ y = [-95, 980, 197, 237, -388, -381, -802, 54, 222, -339, -850, 18, -546, -211, -931, 369, -322, 459, -501, 816, 192, 477, 925, 19, -54, -825, -912, -307, 125, 403, -433, -124, 593, -41, 366, 465, -589, -128, 375, -46, -35, 82, 573, -147, -232, -97, 181, -68, 740, 356, 104, -670, -574, -9, 113, 136, -600, 568, 198, -651, 402, 760, -35, -292, 152, 54, 201, 732, -206, -109, 174, 522, 487, 1035, 578, -786, -187, -457, -1287, 407, -172, 10, 298, -200, -188, 675, -539, -487, 183, -128, -248, -309, 395, 7, 655, 231, -1038, 98, -584, -391, 313, 387, 22, 142, -141, 452, -1227, 590, 1035, -267, -350, -529, -345, 38, 786, 1430, -49, 179, -697, 803, 820, 391, 521, -606, 502, -509, 966, 62, 1035, 348, -680, -274, -45, -96, -227, 1125, 486, -270, -55, -947, -33, 743, 11, -553, 439, 586, -251, -916, -303, -26, -721, -545, -731, -146, -5, 100, 330, 184, 866, -225, -122]
8163a22m23N19J290j318m39P51M29o87J244k438J758l75n83J064k457J464N68
8180B45p33O72P66r69j015k92K115j987J714R46j545
$$ y = [-122, -545, -26, 1264, -54, -493, 258, 687, 0, 1244, -1194, 564, 189, -394, 670, -1787, -323, 245, -488, 184, 950, -19, -1034, -1326, 789, -1198, 516, 1462, -83]
8191h3
$$ Imaginary data points
##PAGE= N=2
##DATA TABLE= (X++(I..I)), XYDATA
0@%%%%%%Pj5J6j6K3l1L9m7N5p0Q6j01J17j35J59j89K20k52K90l35L82m33M92n56
30b94O25p04P92q86R88j104J229j364J515j679J860k061K281k525K798l102L445
47A814l835M281m798N402o123P003q103R524j1437J4178j8460K6146m4240J63312
61A34664J40733k59242p5009N5775P3532r96L9081O555n1629q6612j4065L7471
73B58P1553L4209j6082p0034o3497O553P7355L2757k3594n030J9874n2111o8242
86e6031M1004R5579M480m8256k3150k2875k9547L5267P0637M614n7558k9967R036
99f767J2710M947J5596K2036p871m3271j8128L8384L4915j5504j6424M24j2492
112H555L270L2797o968n0746Q306N3659j3181o5047l270N6032J5867m6970l8999
$$ y = [0, 0, 0, 0, 0, 0, 0, 7, -8, 8, -8, 15, -16, 23, -24, 31, -39, 47, -54, 63, -72, 87, -102, 118, -134, 156, -179, 203, -230, 262, -294, 331, -373, 419, -467, 521, -583, 646, -718, 797, -882, 978, -1083, 1198, -1327, 1471, -1631, 1814, -2021, 2260, -2538, 2864, -3259, 3744, -4359, 5165, -6272, 7906, -10554, 15592, -28648, 134664, 275397, 16155, -58854, -3079, 70453, 69457, 108538, 115093, 63464, -23148, -37213, 258, 71811, 106020, 89938, 19904, -43593, -37040, 40315, 73072, 49478, 44448, 64322, 12211, -56031, -15027, 80552, 85032, 36776, 13626, -9249, -38796, -3529, 67108, 71722, 14164, -15803, -6767, 5943, 10890, 26486, 48522, 40651, -2620, -20748, 17636, 52551, 37047, 20623, 21047, 8555, 11825, 44622, 37654, -13092, -4786, 48873, 35692, -29355, -32625, 23407, 39274, -7696, -46695]
125d6695J7364M4992P213l6054j6114J5758j44r900J5772J9608m496j1842k2120
138b6658k3338K9785O4446k035p3835l1682M0018L0505q748q035Q202M589j6262
151a3048k5330M060L9164K0173j8586j6488o025q440J3843L4786L250k7177L085
164C267J0506k6009j5521L4300L4985j1758l5744k6673N877L2461J9720j8043
176G368k3057l180O634J0721N11j4001J229K8212L624m0102m440M2117N004l5356
190a4716l492K9848R178j8288j8652m565K0666J9333r729k7172Q91J9585P847
203A0734j2568k0827M807L8463J8812m1963l4754K6722L1479r832m421J4091n242
216A5501k5493o749P597K1106K6906n92m6040l6528J6790M0190K4002j6560l1755
$$ y = [-46695, -29331, 15661, 22874, -13180, -29294, -13536, -13680, -23580, -7808, 11800, 7304, -4538, -26658, -49996, -20211, 44235, 42200, -31635, -63317, -23299, 7206, -1542, -9577, -1375, 3214, -13048, -38378, -34318, 4846, 25019, 6433, -10055, -16080, -24520, -10677, 24109, 27359, 182, 3267, 13773, -12236, -27757, 6543, 41528, 29770, -5974, -32647, -26770, 5691, 25411, 7368, -15689, -18869, -12235, -1514, -1003, -15004, -13775, 14437, 18061, -22041, -26481, 15636, 20640, -14716, -18208, 11640, 20818, 2530, -16122, -20687, -21, 19312, 9583, -17589, -16698, 2887, 10734, -1834, -22661, -17854, 20609, 39421, -2542, -37296, -10574, 20905, 11073, 6652, 20743, 15501, -9992, -16741, -9144, 11962, 38868, 38276, -7764, -44292, -27502, 12688, 36690, 20130, -11625]
229a1625q351J3233n379r385K8157L1226j8803m0699q297J0763J8165K9564L521
242C2090l3133j9088J3110L184n503J5915K3727l938l4312l0744P366M4401K2982
255C6057k3126k6417M197L807o016Q362J2640J410L797o350k7923p923L8504K5081
269C6100k1741k3674L695J0033j716o749j609J3103J2735j6564k5910N996K2314
282F013L870q159q422n226J0959J8368j5338k6821J2967L0910k634j9886l080
295f479Q011J243k195l497M080J7619K969l0342k0369J8283K6800Q186r538k0552
309e781j0366J3239Q032j0899Q192K7601o578l9100j6792J9154L0469J9664j2200
322B4635l3900j3731J6401R448j375R004J1495j1300k4092j6017P825L6479K7453
$$ y = [-11625, -19976, -6743, -12122, -21507, 6650, 37876, 19073, -21626, -29923, -19160, -995, 28569, 32090, -1043, -20131, -7021, -3837, -9340, 6575, 30302, 26364, -7948, -38692, -31326, 13075, 36057, 12931, -13486, -9289, -5482, -11498, -3136, 9504, 10914, 14711, 8361, -19562, -27485, 11019, 36100, 14359, -9315, -5620, 4413, 2697, -4052, -5661, 7442, 20177, 3613, -22297, -16301, 6013, 9883, 1724, -6698, -11924, -965, 17403, 2065, -24756, -11789, 19121, 16487, -3399, -6479, 1532, 2775, 580, -2917, 1163, 18782, 21751, -8591, -28960, -10677, 16123, 24309, 14771, -5781, -16147, -2908, 5124, -5775, 2417, 30018, 23440, -15660, -32452, -13298, 17171, 36835, 24635, -9265, -22996, -6595, 2853, 1478, 10482, 21977, 10677, -13415, -29432, -21607, 14872, 42325]
335D2325k3655m2569m668J9543Q967L099R483n32p703j0697j7773J810L5105K3668
349C6403k0735l2431n307J2928J5887Q772q696n294N479o535k1298N055L1811
362A6039J0491j9264k0949o137J3289K0635l69k0140j608J5434l562j4590K547
375h184J3112M274n141j4763q678J9359J9223j5434k5562O226J9407M949o953
388A835r736n822R012P812j1263l715J8646P447k1877j5469P955J7544J3228l129
402A2468k3606j0587J5149R698p019M108J3727k605j7620j4027K131K1672K6157
415B9646r166l2380q617J5590N955K63P884L980n604j2654j7088j433L0537K7171
429C4084j5602l1852q644J0782J4479R421l139n612J670l425k1563n38L1642J8637
$$ y = [42325, 18670, -23899, -28567, -9024, -57, 3042, 12525, 11993, 4290, -6407, -24180, -22370, 12735, 36403, 15668, -16763, -22070, -9142, 6745, 15517, 6821, 1527, 7006, 471, -20827, -15772, 16039, 26530, 7266, -13683, -19820, -6531, 14104, 13735, -6405, -8013, 7421, 3859, -10731, -8184, 4928, 9202, 4061, -10702, -19380, -21, 19202, 3768, -21794, -15568, 3839, 8788, 1835, -7901, -13723, -4711, 3101, -8162, -11877, 6769, 14216, -7661, -23130, -15175, 2369, 15597, 12468, -11138, -21725, -6576, 3122, -3897, 211, 13938, 11333, -6287, -20314, -18183, 3489, 29646, 20480, -11900, -20517, -4927, 1028, 1291, 9175, 13155, 7551, -5103, -22191, -23624, 6913, 34084, 18482, -13370, -22014, -11232, 3247, 12668, 9529, 3917, 5587, 2162, -19401, -19939, 11703, 30340]
443C0340j5774k4129r222P201K0250N883j2666p166J1254j193j5970K30J5864
456D902J0472l092j3721j2802J0540K0646m713j9291O007J6273o11j2473o206
469d069N77J2521R715j0780j4798R844J3457j2149j5208O583J5683R263r406k2763
483a1530p395K0816J5333q354p894N399q35j1049k967L285J3851J7093o785l4132
497a5164j1336K3597J8977m059p638l023m532m400o795K379K1207J8351j5192
510A2372k9138p968J3869J8832J4103n046j7906l718M636o948n28K6764J6746
523C6070k2882k9507n279J7215K2760O398j5796j4955K258J756m603L002J3306
536I743N979n326j4344j6313Q605K9715N779k1744q385J0398p62q443L313R239
$$ y = [30340, 14566, -9563, -18785, -11584, 8666, 14549, 1883, -5283, 5971, 4778, -11192, -10962, 4902, 15374, 12282, -1439, -14241, -3701, 16945, 12232, -7059, -1052, 15221, 14610, 2137, -4069, -3492, 9029, 18744, 7964, -6834, 3010, 16467, 4318, -10890, -4307, 11376, 20639, 11233, -11530, -18925, 1891, 17224, 8870, 976, 6375, 5540, -5509, -8476, -5191, 8660, 25753, 18968, -15164, -26500, -2903, 16074, 12015, 4377, 1354, -3178, -7578, -14373, -11994, 9213, 27564, 12372, -16766, -24734, -10865, 7967, 22070, 17024, -882, -4600, 36, -6912, -7440, 19324, 36070, 13188, -16319, -21598, -4383, 18377, 24775, 8979, -5976, -3718, -1962, -6565, -3563, 9743, 15722, 10396, -3948, -20261, -11656, 18059, 23838, 2094, -6291, 4107, 3345, -5098, -1785, 7454]
550G454O254k037j4274j2998R304J8925K42j4379n980L519R329K980j2758p981
564a2400J7160J4801j4027j3065J0082P307p441k299N006L934M007q00j5986p981
578a1702J6149J5043o652j5037m177P787P423r194j2467J5013K3013j2372k9086
591a6259l296J9617J2983L908l667j4022q464P571M874l333J0522J3177j2012
604A1599k7534q890K2660K6226j909k5751j2732J1387O816r165M765J3406j907
617H971j1142k420n757j439K0565J5863j8765k1030P677J1703k739m330M917O290
631H364n093j5979o048J4261J3818p106j2470k770J041O466J3142n307k1995N434
645a4242K5559o58k4063j44J9940M18j1527j127P760O076k795j1484n691R017
$$ y = [7454, 13708, 11671, -2603, -15601, -6297, 12628, 12870, -1509, -7489, -3970, 5359, 8339, -4419, -12400, 4760, 19561, 5534, -7531, 2551, 9858, 2417, 118, 5124, 9058, 13065, 12265, -3721, -11702, 4447, 19490, 12838, -2199, -6376, 1411, 8834, -360, -12827, 2186, 25199, 12827, -16259, -19555, 62, 13045, 16953, 13286, -736, -9200, -1629, 3245, -88, 10434, 23611, 11599, -15935, -24825, -2165, 24061, 22152, -3599, -16331, -4944, 1872, -7293, -2528, 10878, 8971, -2171, -4591, -10348, -11787, 8778, 24641, 5876, -15154, -7477, 4226, 1487, -2843, 2074, 8364, 3271, -12708, -18756, -4495, 9323, 2217, -10253, -13023, -11982, -5516, 7626, 2319, -19676, -14242, 11317, 10659, -13404, -13548, 6392, 6810, -4717, -5844, 1916, 7992, 5197, -6287, -11978, -2961]
659b961J0770K12q048q495J386J0670j322j5849O132K9180j699l8172j0265K8832
673C71J7901n380q001n865p805j062O221Q693P569P46j1812j6607o188J2247K2730
688A3758P379k2079k0902R798J2564q567l97K0504N522k0263j1685K489M972J4125
702G218J9120n541k6298j2089J3586J5935M132l801o13L41j5941j4153J4917K9014
716B5827m34k2942j0541K990L522R030P673q764o376J0733K22k0169l658K4301
730A1414J5984j4838k2652j378J5252P135j1410m775J2252J458j8323o081J0975
743d987P182J113j989j1870p285J7540J3485j6706j7306J4863K0694m585j6957
756f808m102Q588O205q34k088M748J648j1100n265O436M297L249P713n752k3468
$$ y = [-2961, 7809, 8021, -27, -8522, -7136, 3534, 2212, -13637, -7505, 21675, 19976, -18196, -28461, 371, 18272, 12892, 4891, -974, -8779, -9841, -3620, 5073, 12642, 13388, 1576, -15031, -21219, -8972, 13758, 21137, -942, -21844, -12046, 518, -8049, -8446, 12058, 17580, -2683, -14368, -11879, -6907, 7218, 26338, 20797, -5501, -17590, -4004, 11931, 16063, 12262, 11649, 11990, -3951, -18104, -3187, 25827, 25393, 2451, -8090, -5100, -1578, 7452, 15125, 6361, -15, 10718, 10940, -9229, -12887, 11414, 27398, 12560, -10092, -11470, 3782, 10917, -493, -5268, 6984, 8442, -9881, -15962, -4987, 2195, 3308, 1319, -10551, -17836, -296, 13189, -3517, -20823, -5960, 14734, 10149, -6808, -10910, -2322, 3883, 3049, 961, 5709, 7357, -3743, -9008, -2572, 1725, 4974, 12687, 6935, -16533]
771a6533j073K3250O010j3318k010R436m572j2348j590J1504J1439K427j0412
784B210j5031m080R304J3186O198j2065j0924M757K030j3652j38K5738R450k6755
798i772j9498J1117J5454K169j107j771l655l62j42m486L624J3658R410q542j8848
813a2751o948J6868K0146o992j7585K838R065q586p359J2912J0260p273r539k407
827g351M40P986R974n329j4062Q23J1299M960p189q663L011R845o31j3860J794
842f953J3337j042j5245j610Q263L433K973q70j2940p094J3319R874p350n698
856g603P841L429r098r696N968J9577Q096j5897j8844L585J4070N960J310m57
870H241q945n719L147k005j535J5322J2708j5813k4354K237J8527R706l016p806
$$ y = [-16533, -17606, 5644, 11654, -1664, -3674, 5762, 1190, -11158, -12748, -1244, 10195, 12622, 2210, -12821, -16901, -7597, 5589, 11787, -278, -11202, -6445, -4415, -18067, -18205, 7533, 16983, -9772, -29270, -18153, -2699, -530, -1637, -3408, -7063, -7425, -7567, -12053, -8429, 5229, 14639, 6097, -12751, -19699, -2831, 17315, 10323, -7262, -4424, 4641, -3945, -11304, 1608, 11868, 4595, -4944, -7351, -6911, 1075, 11049, 5720, -8342, -7519, 3780, 8740, 1551, -7112, -4101, 5744, 5113, -8747, -6953, 6384, 5342, -9903, -11513, -3250, 183, 3156, 2286, -10654, -17748, -4429, 5445, -1905, -7603, 238, 3667, -5431, -15127, -9159, 10418, 18514, 2617, -16227, -12642, 1428, 7388, 8698, 8241, -704, -6423, -3276, -5281, -6816, 8506, 21214, 5401, -18953, -16716, 1811, 11517, 8501, 695]
884F95l123R77l742n061Q624J5100O46j2346j2072m810P529J8874M245j7618r735
899a1817R457J862r382L288J3924K123j0605j1205j987J1593J3186k953j1116
912c632k324M770L500M04l968j366Q483N600j2166r612J1493R911q981q685N927
927f46O849r47n423p734o27J2981P900o940r286K80K939J237j92m8N918N947j0107
944B101j5803M535J8734M423r490n992k094p82K778K271k18O785N591j0030j7770
959a4961J501J6538J2046j187j2861r196L579P144j999K618J1416J92j5898j1846
973a2914L812J2368J4127K468j7439j3634O043Q631m22K172O479j839j0227j0393
987a0768p49J4947J6269m143j9777p202P762O086K401J742j869k050j107o533
$$ y = [695, -2428, -1451, -5193, -10254, -1630, 13470, 14116, 1770, -10302, -15112, -7583, 11291, 15536, -2082, -11817, -2360, -498, -9880, -6592, 7332, 9455, -1150, -12355, -14342, -2749, 10437, 7484, -3632, -5956, -1186, 2314, 2718, -1250, -2616, 5867, 11467, -699, -10311, 1182, 11093, 2112, -6573, -646, 6203, 5256, -167, -7901, -8528, 4453, 12353, 5413, -3873, -3593, -654, 583, 391, 343, 6261, 12208, 2101, -13702, -9167, 9567, 13990, 4500, -1492, -3586, -4368, -1590, 681, 463, 7248, 12839, 2809, -14961, -13460, 3078, 15124, 13937, 1076, -8120, -4541, 2603, 604, 3222, 14638, 14830, -1068, -12914, -9102, 3266, 17393, 19861, 2422, -11212, -5169, 3462, 3040, 5212, 11691, 9852, -375, -10768, -11517, 3430, 19699, 15556, -4221, -11423, -3661, 2425, 4826, 6568, 4699, 2649, 1542, -4991]
1001d991m371J1165J3251p238j4868k632Q408P195l11p287m059P676M630q872
1015b304o221P782P274k932n523l242K949Q864J26j2660l988J1904P036p119o208
1030d262P10L161K117j616l765M058Q344o178j4152L41J2389P474p93r481q645
1045a0298L291Q495j343m705N975N568r115j0710K182R260J0338J801j2996j1337
1059a3594N285R137n46n87N362J098q547q048j689J0300J6168J2j9245j1253Q607
1074g540R899K629n35k999l210K02k560l652Q158J2108l405j3779l844N297O548
1089C317L294m645n181L811N118p073p323O511R206k709o641l999N51P297L157
1104D691p527m932Q235N966p146n436K369M194K782j788n395J316Q988k274j1890
$$ y = [-4991, -9362, 1803, 15054, 7816, -7052, -9684, -1276, 5919, 5608, -1679, -5738, 1938, 6568, -2304, -8525, -743, 6531, 3599, -1924, -5166, -2217, 6647, 6773, -5887, -9875, 2029, 9065, 1946, -4262, -3552, -391, 1726, 110, -3655, 403, 8747, 2569, -11583, -11242, 1147, 8621, 7828, -1653, -10298, -7007, 1488, 145, -4560, 1415, 6983, -2132, -12842, -10660, -1400, 8938, 10739, -2257, -13594, -8309, 828, 282, -305, 5057, 6155, -2392, -10440, -12129, -1829, 14339, 14351, -4894, -16147, -7540, 2359, 4988, 4453, 1454, -1756, -1554, -4114, -7766, 392, 12500, 9095, -4684, -8528, -3231, 3317, 6611, 1966, -3215, 596, 5714, -1359, -8682, -2171, 7035, 4326, -2315, -6314, -5763, 1534, 4691, -2836, -7768, 467, 6433, -713, -6149, -3780, 414, 3196, 1408, -3987, -2671, 6317, 4043, -7847]
1119g847r78J1604O510l722p620p091K635J0386J277o815K471N010n834j0181
1133a0195K239J0197Q667L67j2685j1836N490J2416L008l415q00j703o971l439
1147h660J226P716J1947q00j8630j2503J0112J2759J219k001l752l575j586l29
1161f857j439P093J2098k107j5612p804N840J0825O516l879r472q87N629l336
1175c392n995P781J0706l364j0495n480J894R578O846m616q323K086N819k805
1189B40m409L080O129K553l344r499j350J0435M526p914m755N630J987l421k152
1204b264j678K046N654o6q494j902P777K357p074k309N932O868m62r000p419O269
1220c765J0206no660p63J293k469M68J103J743N697L294j2229j1790P171J5206
$$ y = [-7847, -8825, 2779, 9289, 5567, -2053, -9144, -6509, 3877, 5154, -1661, 810, 5820, -14, -10195, -7956, 2241, 10908, 11275, -1410, -13246, -7756, 4660, 7668, 4253, 3453, 1750, -5221, -8660, -7434, 282, 12229, 11429, -7201, -19704, -9592, 3167, 4386, 2385, -1367, -4942, -6528, -6857, -8296, -1203, 10895, 8788, -6824, -14628, -8788, 2037, 8553, 4674, -4798, -5685, -56, -3392, -9387, -1606, 9100, 5736, -4759, -10239, -8345, 1233, 8079, 3463, -4860, -2774, 3045, 240, -4169, -1089, 5040, 7593, 4249, -5250, -6600, 3835, 8361, 447, -4308, 1322, 3309, -112, -2264, -3942, -1896, 3758, 3692, -4802, -6704, 1073, 3430, -3644, -5953, -21, 6847, 6385, -2615, -10034, -3765, 6441, 6436, -224, -987, 306, -2163, -1695, -592, 1151, 6848, 10142, -2087, -13877, -6706, 8500]
1235H500K130p195m689j362J909Q07q19M942P838k890j2837m778N994Q980O140
1250A2670k614j1478o959R323L242n915J610R332k600j3348m799O581R164L698
1264G907n810q063J083M679mj556K593L014M05l245q889k327J3892R818j1420
1279B077j3179N711P856j272l482J099k20O64M80l378n21O012J890m966l691J068
1295c852P037L452n627j0782M444J2751l49j0151k17N226l201k378K985J401J50
1310H89K214l768r891R23J2561O128o234p917j188M766K053m262K522R643l69
1325H070j4308o455R769Q653K698k718q458q012O683R163m016m701O505L349r306
1340c084q587L896J1601N134n737r409J095N153j221p16N326K890l979k674m036
$$ y = [8500, 10630, 3435, -1254, -2616, -707, 100, -719, 4223, 12061, 9171, -3666, -8444, -2450, 6530, 12670, 10056, -1422, -8381, 942, 4184, -1731, -121, 9211, 6611, -6737, -11536, -4955, 4209, 7907, 2097, -5966, -4883, -204, -208, -1764, 829, 3843, 4248, 1003, -7886, -10213, 3679, 13497, 2077, -11102, -5391, 2465, 1193, -2289, -1190, -1410, -746, -266, -3644, -4165, 1847, 3737, -1229, -4920, -3852, 3185, 6637, 1010, -9772, -5328, 7423, 7074, -3077, -3294, 1932, -1269, -3647, -662, 739, 889, 3103, -665, -10556, -9633, 2928, 9056, 2822, -5095, -6283, -1517, 536, -3726, -1204, 8439, 8070, -6238, -12693, -2924, 5729, 8427, 5709, -2749, -10761, -4078, 5085, 1069, -3632, 2873, 6222, -3084, -11671, -7775, 3826, 8960, 3223, -6186, -5091, 62, -1159, -1875, 3451, 6341, 2362, -312, -4348]
1355d348k865P543J2893m832j5556r19R344J530l872P81L091O25l491n090J805
1370c361O717K969l637l094L47J84L363J516o625q81R872K675j1696n519P647
1385D77N027l824l686J017J382J323k681n815J925Q153K968n277o781l303N741
1400c354Q111k474m961M293M080j0917q693J0327J3145j591q392p307j511N310
1414c934P646j98l214L6q21m313k279L704P962P205o070j5020j170J2525N694
1429G753m361o97L510n895o395J964M152N406N127m354j2742m853Q316R592K78
1444F801n877n130J758J694m397Q1J0265M685j0477q881L228M707M072K867l266
1459B130o729M37O558j781m609M103O532l700q108k053P250P355l676q666P79
$$ y = [-4348, -7213, 330, 13223, 8391, -7165, -8084, 1260, 2790, -1082, -301, 2790, 3415, -76, -5166, -3361, 3356, 6325, 2688, -406, -59, 125, 3488, 5004, -1621, -2502, 7370, 10045, -1651, -7170, 477, 5504, 1680, -2006, -989, 393, 1716, -965, -6780, -4855, 3298, 6266, 989, -5792, -9095, -3354, 4757, 2283, -2678, 1615, 5695, -5222, -13915, -3588, 9557, 7966, -426, -7733, -9244, -3934, 3712, 3514, 300, 336, -485, -4798, -7077, -3373, 4589, 11794, 5724, -9296, -10466, 2059, 7753, 3392, 2695, 6205, 310, -6085, -4121, 31, 5437, 10564, 6210, -6532, -11385, -3069, 6523, 6801, 924, -4206, -2448, -754, -5151, -5070, 5195, 9880, -597, -9478, -6250, -1543, 2529, 5396, 2130, -4599, -4162, 2396, 615, -3994, 109, 6641, 2941, -5167, -7220, 30, 7385, 3709, -4957, -4178]
1474d178P798N45l952O24N74q0K654J580o258N68Q690j316j0556q2J0113L617
1490A0341o553o121P42M194K357l729p01K435L58l588j780J106J576O264J705
1505H606j0971p405Q500Q350m452m150M177J293o475k626L186N089M870k853q685
1520c546l805M312O170K884k647m300k01K800l519l573P582J0560p048j1714M54
1535e591O847L401%r97l870K70K728k892k996L543N549o17o450m452J648P983
1551D104Q13p759k171P746j8o259j075M644J626J04q29n051j506O385K850n832
1567b228k356N399L492m027n674q98O135N545l500o250J654L261k203j603L750
1582D97K248J351j864o324m355Q344R276k942p910j582L498R3j284l03M016M951
$$ y = [-4178, 3620, 4165, 213, 837, 1411, 1331, 3985, 5565, -693, -125, 8565, 7249, -3307, -3389, 6724, 10341, 3788, -2333, -1591, 2603, 4960, 1231, 530, 2965, 3323, -265, -2045, -939, 637, 6901, 8606, -2365, -9770, -1270, 7080, 2628, -1522, 2655, 3948, -2527, -5153, -1967, 3122, 7992, 5139, -3546, -7351, -3039, 3131, 6015, 3368, -932, -1133, 1667, -1852, -5425, 2157, 12717, 5669, -6045, -5591, 1256, 4657, 4657, 3660, -210, 60, 2788, -104, -3100, 443, 5992, 5375, -1075, -5527, -3879, 4104, 4917, -2842, -5013, 2733, 2715, -3544, -4619, 25, 1651, 1755, 926, -4125, -5631, 754, 3604, -2228, -4584, 815, 4307, 280, -5394, -6292, -157, 5388, 1888, -4362, -2708, 553, -1650, -3253, 497, 2745, 4096, 2232, -4092, -8447, -103, 9173, 6231, -1679, -3261, 237, 330, -954, -1257, 2759, 7710]
1598G710m098j0479k066Q570O561m74l510m810k964L105L608p82J256O011m588
1613C050j1387j042R292P227K93o099o335K69M603J344j477M304J428n541m516
1628d587p64L477O834L347o365q568K888O127j223k150L120J624k146l902k745
1643e033L294P653N87p659l958K767M031r5j200k746J138M086k406o177J854O674
1659B810J69o701n41L091K786L55m023l932L452O579k126n389K60K694K06j130
1675a440q93Q97M223M67q517m053P399P797j741n297l252o71L238K594o65n57
1691d71L364j445q031j528Q130N676o69n981o145J060O895J111m109J238M251
1706C346l254m777p17L022N100L641n615q934J953O597J583k815J119N53j430
$$ y = [7710, 3612, -6867, -8933, -363, 6198, 5724, 2214, -2596, -5560, -2455, 1153, 371, 1627, 7638, 3050, -8337, -9379, -87, 7140, 7433, 1334, -5001, -4732, -129, 1215, -262, 4042, 5470, -71, -4587, -5351, -1874, 4960, 8307, 1942, -6626, -3738, 2389, 1166, -984, 2136, 3760, 1614, -2288, -5033, -1739, 5914, 6501, -1158, -5116, -2349, 1682, 1587, 387, -2359, -1221, 2865, 459, -5718, -3864, 2810, 2979, -3722, -4263, -1172, 1614, 1969, -2054, -5986, -2534, 4045, 1919, -3470, -3210, -516, -310, -1440, -2333, -1436, 2787, 3254, -5263, -9316, -1917, 5880, 4139, -1158, -4410, -5081, -1843, 751, 86, -471, 2893, 1448, -6583, -8111, 19, 5695, 5026, -955, -7100, -6040, 855, 1966, -2143, -905, 3346, 92, -4685, -5402, -2380, 2720, 6361, 746, -8188, -6235, 362, 1945, -870, 249, 802, -628]
1721f28k501j998J645P506K423p700n855L753N081N36j777j250l08L302l95m533
1737b699q60O295K313n731k756J914L284J176k199m323K599N234j210n207J31
1752b039L495O69j391j586k2L124J799n364n152M825P395p31n717l580Q57K181
1768a237L336j170n29J685p32o166k062O440O063m26n313n730r55O858M162k017
1784B207j842K425k660m802l62N483M798J422n530q082L22P895L542k794j271
1799G51m43j919k107k78K240N818L352p576q050K922O153K683j078k436j899L85
1815a482J49k367O45O371K283o732o086J593M705M632j351n077j886L500J279
1830A76l803Q93M130N61k991j554j89K281L827j513n644Q03O332pl834k477K297
$$ y = [-628, -3129, -5127, -3482, 4024, 6447, -1253, -7108, -3355, 1726, 2262, 485, -765, -1073, 2229, 1834, -2699, -3559, 2736, 5049, -682, -3438, -1524, 1760, 2936, 737, -3586, -987, 4247, 3037, -2170, -2039, 1456, 2125, 734, -852, -874, 2250, 4049, -1315, -6467, -1642, 5753, 5022, -695, -4275, -3418, -1237, 2099, 929, 400, 2085, 1353, -4813, -6875, -435, 5628, 5202, -111, -5841, -6796, 62, 4224, 2207, 365, 2790, 130, -4672, -5034, 449, 5247, 6669, 1139, -6943, -6621, 1274, 4816, 2022, 751, 308, -1611, -3718, -3996, -1756, 4062, 7414, -162, -8212, -5290, 863, 3546, 2468, 32, -1867, -1482, -1333, -3700, -3055, 3316, 5599, -1133, -7219, -5626, -921, 3711, 2360, -2717, -4603, -1103, 176, -3627, -2734, 1396, 1957, -1034, -2588, -2777, -496, 3331, 1818, -3826, -3023, 3309, 3302, -532, -3009, -712]
1847g12K857J143k986k578K728K148l437k988M423L657p24k823m617n33O021M463
1863F042m326l901J874J410l069r84L601L373J017m763o698J661O732K989k499
1878B459l512p99m59L55J377l29L212L805m887r468K705Q214L473l013k664k032
1894a563k60J823P76Q7L648J017n178n116Q98N964M907j656p536k311M968K618
1910C086l694k93M942K62m168k144l39K528L877k79n747k428M815K899l544j892
1926b119J168J981M43l535j954L066L671l213m618L224M090n94k095k982j327
1941d794M164N162k341n424N87M073j529k307K242K905L40l910m115J495O936
1956C484J423m468j419j99N82R22K79n62R12L616k024p449n48P744M542l495m135
$$ y = [-712, 2145, 3288, 302, -2276, 452, 2600, -837, -3825, 598, 4255, 3531, 708, -3909, -4442, 1579, 6042, 1716, -2185, -311, 1099, -1970, -2954, 647, 4020, 5037, 274, -6424, -4763, 1969, 4958, 2459, -1053, -1852, -2311, -1956, -579, -908, 2304, 6109, 1222, -8246, -5541, 2673, 6146, 3133, 469, -1563, -1823, 0, 776, 863, 4511, 5528, 350, -4766, -3868, 2096, 7003, 5347, -2189, -4500, 468, 3086, -608, -901, 4041, 4303, 135, -2009, -2348, 180, 4057, 3778, -1969, -4397, 418, 3317, -227, -2119, -951, 1030, 1473, -2062, -4016, -950, 2721, -492, -5110, -1886, 2204, 1610, -485, -3467, -4794, -630, 4532, 2191, -3233, -2646, 1427, -102, -2409, -167, 2738, 3078, -832, -4947, -3452, 3484, 4907, 439, -980, -1179, -597, 325, 604, 42, 954, 4570, 2546, -4903, -5451, 2293, 6835, 3340, -795]
1973g95j220R18J435J05K37K645N70m178m132J093M024L597j06n065n106L842
1989b136N055j739l582L974K136l448m376J254L158M278N0n048k553K991K175
2004B189p98j049k91J622R81k471m053K596O021q49o291N01M829Q69l568k010
2020a772J864K744K018k849l598O36K763J233j835q68O55J040p23m245l81O431
2036C113L196n894m122K354R60m41J407P27o38P30j348l248j891O067N278k655
2052C595n182m034K574M746J053k770J368P52l982m967L454N915K225k452l808
2067a513n161J553O690K534l794j719K147k182l605J442N707M809k539q604k187
2082f422N102M288k57r81j005k457n76J464n96O31N005k60p416l602O001N420
$$ y = [-795, -2015, -1097, 338, 443, 680, 3325, 3895, -283, -4415, -3322, 702, 4299, 4193, -872, -5978, -2136, 2919, 1180, -2402, 1572, 3708, 260, -4116, -2862, 296, 4574, 4624, -424, -2977, 14, 2189, 1391, 342, 51, 1673, 2654, 183, -3870, -1274, 4747, 3898, -2393, -1892, 2937, 3806, 238, -1772, 92, 2836, 4854, 2005, -1593, -957, 1806, 3039, 1204, 336, 991, 2031, 1308, -2937, -3318, 3113, 6309, 415, -3707, -1353, -393, -834, 573, 1300, 662, 1392, 44, -3204, -5095, 972, 6250, 3595, -1587, -5621, -3047, 1699, 2752, -18, 1350, 2102, -1880, -6847, -3393, 2522, 4747, 2295, -1513, -6674, -5121, 1569, 4103, 309, -1410, 737, -1445, -5050, -3608, 2099, 6908, 4369, -4235, -6422, -1320, 2968, 2711, 1730, 725, -1732, -2308, -844, -1440, -809, 4196, 3936, -3480, -7082, -1081, 4339]
2098D339k087l342m97J277J074j703j200K388K076j306k254m76K01J853K720k950
2114A13m589L325M787l009n107L077L004L6k871k10J486K071K6l494j485L370
2130E30L064J09m015k990J610M830Q26l812m41L462j203n695J227N386K963k988
2146B863l526k255Q91M396J770k342j547P15j48j746l52K523L530j45o867l103
2162e343M178M892r19l168Q03j224k47j69N45O11K288J206m619m622L466N292
2178B970n08l064j723Q32K787j090k747J826M463r46n257j35J501K136J091o13
2194A523l455l91M443k44m032p09M127J254k237k475L81K352J184l153j530L424
2210D62K160k123k917j56J241J618K169k028k402J775J210l909j009M806L106
$$ y = [4339, 2252, -1090, -1587, -310, 764, -939, -2139, 249, 2325, 1019, -1235, -1711, -1510, 343, 3063, 113, -4476, -1151, 3636, 627, -4480, -1403, 1601, 1637, -1234, -1444, 42, 2113, 2139, -1355, -2840, 530, 3594, 3703, -312, -3302, -1692, 3138, 3964, 152, -289, 3173, 1970, -3725, -2498, 2888, 5851, 2863, -663, -2918, -2027, 2369, 4139, 1797, 250, 965, 817, -929, -1281, 1242, 4772, 4627, -2240, -5343, -1165, 3727, 2808, -360, 443, -781, -1028, -1197, -652, -41, 2247, 3453, -1166, -5788, -2322, 2970, 2462, -602, -2325, -1493, 1294, 204, -2543, -717, 3746, 2800, -2457, -2592, -1091, 1045, 2136, 1523, -1932, -2323, 2120, 1876, -2156, -2865, 1262, 2516, 279, -2196, -1815, 537, 1721, -1432, -2962, 462, 2622, 499, -2418, -2574, -1333, 285, 2454, 426, -1976, -201, 1009, -2900, -3909, 897, 4003]
2225D003k512m608k288K748M777J663l589k191Q20r70N4J545J527J520L64m482
2241a619m889L455O699J161m710j986O15k7K36J230J253J624o09m215l185K291
2257b676N513J399k189l941j175K291K425k588L33M115n05m890k904L279L382
2272A869J428j541l646r18L134N03k120P04K075N38k121l138K09L647L644k781
2288A486m651J753K996q04k074J234P00P24M81k930k246K886K995j545k814R30
2304h79J964M55k993j496J455L866Q81m135k411K559P46p75K47P78N15j13j714
2321a050l044J830M990K80m504j758Q52J264J613o86j33O53P93l346l113M081
2337a278M052l81l191k039n33K481K631r58j957Q31J131k768j556K013L329J456
$$ y = [4003, 1491, -3117, -5405, -2657, 2120, 3783, 194, -1997, -1177, -2147, -2093, -548, 979, 2499, 2863, -1619, -6508, -3053, 3646, 4807, 97, -1889, -1274, -1301, -1065, 165, 1418, 3042, 2433, -1782, -4967, -2676, 2837, 4236, 2047, -1894, -3069, -778, 1647, -941, -608, 3507, 3002, -1888, -4792, -1513, 1869, 3297, 1756, -1890, -2808, 326, 829, -1291, -587, 1488, 2026, -95, -3233, -3024, 623, 4267, 1486, -3165, -1412, 1584, 780, -1294, -60, 640, 1364, 1845, -1085, -3331, -445, 2550, 1005, -1809, -879, 1085, 1540, -1453, -2949, -1494, 2372, 3253, -882, -3293, -734, 12, -763, -516, 262, 777, 664, -1050, -4094, -2264, 2726, 3006, -1498, -3256, -2404, -1140, 473, -213, -346, 307, 1100, -2246, -5359, -1278, 2774, 2393, -798, -2837, -3370, -889, 1742, 784, -1173, -342, 789, -1979, -3535, -1522, 1807, 3263]
2353C263l475k669m51L510J767k278q34J143O93j640j101M79K119J712j503m524
2369c789K17M403Q93k141j596J437P91n5o93j056J651K003k067l160J472K993
2385A303L08j782j823J48K495K363k896k994J845K669j127j591Q36J768N8j542
2401C8l455P73M710K120m105k631Q75J438J435n65o04P73O88k093l018K307M223
2418B909M82k820k519j278J999L006m09j856J082O95k623k569K562L528J196k131
2434A254l996j200K883L258j315j121J492o26j971o50J181K230K467j316n309
2449b739j563L888K794j098j305j20K18m46j687L64L133K219j592m851Q37J680
2465b68J860J93k072j193J370J114j393k008K257K412j289k490m44K214J135m39
$$ y = [3263, -212, -2881, -3332, 178, 1945, -333, -1167, -24, 669, -971, -2072, -1593, 526, 2238, 735, -3789, -3572, 831, 1724, -417, -2013, -576, 215, 160, -533, -1589, 62, 2065, -2, -3162, -1690, 1303, 1611, -171, -1994, -1846, 649, 3012, 116, -2878, -1033, 1636, 509, -1082, -246, 1522, 1580, 38, -3417, -2644, 2066, 4186, 81, -2550, -1675, -237, 1198, 633, 29, 802, 1490, -603, -3621, -1314, 2909, 3391, 571, -1948, -3226, -1227, 1779, 1370, -486, 596, 1291, -1332, -3901, -1339, 2189, 3385, 1254, -2742, -3942, -1059, 2199, 884, -237, 1255, 629, -1342, -1992, -811, 1419, 3886, 2570, -2739, -4302, -414, 2380, 1282, -23, -143, 75, -371, -2058, -1694, 1439, 3658, 2066, -2785, -1948, -268, 1592, 1785, -287, -1480, -110, 1004, -389, -2397, -140, 2272, 983, -1507, -1951, 263, 1398, 959]
2481I59k137m62L009J235l087k719K392K401N61j717o38l79J520J54l006O3M569
2498B718R69l875k238R45K610J726l25k681K51R81l51k259J377L205M11j968l051
2515a555j509L223L585p59k690J07L94j667l19J887J298Q42o25m294k122M030
2531a74L247o82k261r86O9K51M95o78J796K590k411m584M23L271K680r40k219
2548a13q83m77K154j9j339N37K503r99l004k87J599K023O59k378j199J026J835
2565A638j708k021J666K276l78j552j102Q8K152J436k954j796K371J467j777j758
2581a952P13N95J259m77j781J62R46O36k335Q88K032P48j171k065j779J916L540
2598A875k34l649q72L113k57j302L50J341P99n31k922j320K634K929m38k236o43
$$ y = [959, -1178, -1640, 1369, 2604, -483, -3202, -810, 1591, 2152, 435, -203, -582, 938, 1092, -1914, -1851, 2718, 3687, -188, -2426, -1481, 1129, 2855, 2530, -151, 100, 1081, 730, -1529, -152, 3053, 3464, 1496, -1555, -3064, 159, 3744, 2985, 295, 402, 796, -871, -1190, 697, 1995, 2837, 2212, -2082, -4204, -174, 3073, 2391, 130, -856, -787, -536, -41, -719, 1077, 3667, 1256, -3328, -2905, 366, 3046, 2106, -113, -996, -1473, 681, 662, -677, -140, 2363, 1364, -1640, -1927, -328, 1695, 2354, -24, -1223, -197, 1638, -70, -2091, -425, 1851, 1473, -79, -1181, -1093, 1059, 2495, -459, -2255, 116, 1583, -194, -1952, -1239, -644, 615, 138, -1643, -1481, -535, 101, -2234, -1346, 686, 1434, 263, -1802, -3581, -1665, 1875, 1641, -2008, -2880, 233, -24, -1326, -976, 365, 1164, 633, -2289, -3609, -975, 1954, 1516, -720, -1363]
2615a363j15J338j02o2L30K452q95m028j401M195L073j756k060j516K57J639J029
2632A015j224n1J374r83j833q39J862K065N06k776j610J812K135q89k492K036
2648A08J455j265j112o86K53J448J528j480k927J651K610j308j671q32J749K396
2664A917m59k722m20L112j28j956JJ957O09j503j004j384J324L875K85m300j768
2681b564K580J352j228K38L76J815r33l993o18L215L368r95l318n61p90P98K345
2698A087M84j353k77M86l169j521M929L473k202l612j522Q26K322J260j384j6
2714a89J104j402k084k2K608J955M69j631m551L55L944J579k792J71J218n88j938
2731a794j85K300J766L56k255l702J285L348L85o71j296l85J439K62j967o9K989
$$ y = [-1363, -1478, -140, -242, -304, 26, 2478, 1583, -2445, -3846, 349, 3422, 1666, -394, -1910, -1653, -14, 1015, -209, -260, 1114, 131, -1702, -2541, -679, 1386, 1892, -884, -2494, -682, 1453, 564, -1928, 108, 1563, 298, -814, -1500, -1247, 201, 1729, 249, -2678, -1027, 1583, 275, -1396, -2228, -479, 1917, 1458, -1264, -1684, 1428, 1300, -656, -655, 1302, 1911, 408, -596, -1980, -656, 3219, 3504, -796, -2564, 16, 1368, 140, 378, 754, 2569, 1636, -2357, -2975, 240, 3608, 2613, -705, -1266, -2056, -1258, 1087, 1571, 218, -59, 427, -2742, -4263, 666, 4139, 1937, -1675, -3197, -2371, -49, 1211, -173, -189, 915, -487, -2571, -2593, 15, 1970, 2439, 808, -3743, -3388, 556, 2135, -657, -486, 732, 144, -1794, -1979, 321, 2087, 2443, 188, -3514, -2229, 1119, 1504, 833, -463, -848, 591, 853, -1114, -1183, 1806]
2748A806O64l528j605K279J696p23j160p13R06J191N83j918r73K063Q21q52j915
2765a378J55J621J436k722j853J761M236j631l047QJ006N41Q29m52j01m96K33
2782A46o33j850K358K825M92m103j902J043K492J895k181j479J598m47r19n59
2798a224K726Q47r07j063k314l02L427K044k579j727J074J232j696r61J642K036
2814B255m64k522k294J044L634L3j037j443l94J97O58j46m64J217J815k351k032
2831b294K1L835Qj859o26k64J557P30j213j137J118Q72j772J07j38O49P65n44
2849a85k292J55M204P10m153p04J751N64J68l44n65p6P10j056j181J240K776J01
2867A823k463j467n87K972J810j386k368O57J525k562k46J800K648p69j632k198
$$ y = [1806, 2470, -1058, -2663, -384, 1312, 589, -571, -1284, -378, 813, 1396, -522, -1495, 568, 1389, 537, -1378, -1223, 398, 1834, -888, -2741, -980, 3256, 1625, -1422, -1414, -408, 133, 962, 510, 409, -87, 146, -487, -2337, 21, 2846, 3338, -765, -2667, -1624, 868, 2763, 582, -897, 701, 254, -665, -1224, 1502, 2349, 1442, 379, -1935, -2237, 1190, 3234, 655, -1072, 2, 1234, -462, -1423, 219, 2255, 1791, -731, -3025, -1981, 1653, 1686, 649, -794, -1188, -991, -333, -479, -943, 274, 2089, -262, -2294, -2273, 1562, 1570, -289, -915, -1179, 378, 1108, -105, -1242, -124, 748, -1024, -917, -1055, -406, 359, -185, -2477, -2322, 1882, 2592, -1561, -2265, -514, 50, 218, -126, -691, -767, -57, -1113, -2294, -1054, 1722, 1823, -640, -2107, -2694, 278, 2088, 702, -1666, -1009, 516, -2046, -2292, -492, 2156, 1387, -245, -2443]
2883b443k26K331K531j666j081n49j6p3L6P29J328J264k552k997J217K210J949
2900A992j832q24o3p11M09J033m81P50J576j823k983K51L382Q11k51k116m22J013
2918b89J323j293j391K124L70p33j998O15R84Q69N82j453j422J270J279j193j186
2935a542J476J076K60j600j041M74J297L0j760Q12K035r75j021j086Q53J879J023
2952B190j500k600l70L109K72k118R60J252q76j232l88k61K423J726k150k992
2968b555J359J204k0k87M96K48p3n25k311J0L868J389k361k383k56J868N64L17
2986E52l99O67L30j270k002J224K570J135k493k213j156K369K020k65j612O9J220
3003G46j143j023L89K098O90j048j287j008J658K073j010k748O75J676K53j326
$$ y = [-2443, -2669, -338, 2193, 527, -554, -1103, -1119, -1192, -1156, -427, 901, 2165, -387, -3384, -2167, 43, 1992, 160, -664, -727, -1438, -1029, 4, -477, 273, 1849, 26, -2957, -2706, 676, 1487, 1236, -880, -1302, -289, 1034, -259, -1650, 474, 844, 111, -1887, -1272, -288, 581, 1163, -290, -1712, -442, 837, -356, -1542, -66, 1010, 1270, -330, -1371, -897, 400, 430, -1330, -518, 1517, 542, -479, -1565, -712, 1167, 2190, 690, -1910, -2280, 829, 1101, -1017, -57, 1195, 319, -913, -1301, -1562, 861, 2587, 437, -2555, -1196, 8, -12, -299, 197, 445, 372, -153, -2464, -2454, 1414, 2803, 442, -1941, -2197, -329, 235, 552, 153, 820, 1150, -120, -2122, -898, 1672, 2807, 314, -1899, -3055, -686, 1334, 1069, -543, -474, 746, -397, -1420, -1031, 1067, 1757, 709, -578, -1586, 72, 2145, 1135, -1613, -938, 738, 991, -335]
3019c35o08J437L42J35k704L93K274N73r27j694K47J100Q44m93j007p08K251j87
3037I33k067R86J759n77n46j862k84K415J937j783j667k78J021K2n6O72K52K27
3055A104p95j945k49K882K238j791k189k44O88N48P51p77k76J72l75k247O05L379
3073A479J304k169j339p95K87J793J121j146q06N71n00j446o5K036J297j102j269
3090g49j854J152K608m96j337M23N54n24J40K30j77O63O03j357k286K540Q90j193
3108a70n54o1J131J40l90j585n1K728j23j786J49PP79k98m96n90R06R49j2k746
3128b073N27J999k7j217J01n3j40O18r18m02J652J807j301k898K15J359J371R5
3146G15m85n67l47R05j178n85K842J576k006j955q56R35K453R90j707j527n19
$$ y = [-335, -943, 494, 836, 971, -1733, -1340, 934, 1507, 580, -1114, -867, 233, 1077, 584, -423, -1131, 1120, 933, -1134, -148, 1611, 1034, 488, -1374, -1658, 757, 2694, 911, -756, -1034, -13, 9, -47, 625, 877, 1104, 309, -1636, -1885, 997, 3235, 1444, -745, -989, -301, 247, 998, 221, -55, 117, -258, -2505, -1900, 1479, 2783, 614, -725, -1520, -1233, 560, 1681, 535, -271, 300, -200, -1646, -1711, 325, 1622, 520, -749, -2603, -1451, 1157, 661, -676, -253, 301, -223, -83, 147, -30, 633, 1236, -121, -2407, 133, 1023, -170, -724, -785, 346, 486, 96, -1489, -1540, 1188, 1065, -721, -572, -565, 214, -84, -580, -1170, -264, 685, 673, -2073, -1546, 453, 426, -791, -690, -743, -883, -265, -1183, -1585, 67, 1874, 573, -2325, -2110, -751, 620, 715, 230, -337, -684, 221, -957, -1542, 1300, 2876, 870, -1085, -1941, -1006, 1447, 2437, 730, -797, -1316]
3163a316J049r45P21J978J000j588k310n82J084L038k47j760j16L84n80L68k01
3180b3L87J296q2j920k299J526K888j93j537j145O62M03O9o37k41J731J007k228
3198c36j324J114J413Q89k010k16l05K087j73j772l14J940M20q48j653J006L88
3215C06J67l13r18Q31J236N75l107N67J151K62M98q15j232J426Q9j131l75R65
3233A82J707j394j457j269J260J246P64j388j608R64O41L65o80Q11M88k07j109
3250f84j013L75K653N91k181j034Q29N66q35L26Q52k19K20n91j484J270J146Q64
3268A651j953p47K03R56N03o90k93J000J145j833k005K167J142j26r83j135l84
3285a382K158P86j811o69J596J049j580j010Q9O23J087m15j676Q08J932r45j647
$$ y = [-1316, -267, -1212, -491, 1487, 2487, 899, -1411, -1993, -909, 2129, 1882, 122, 6, 390, -190, 178, -23, 364, 1660, 1578, -342, -2641, -1115, 1773, 1580, 43, -1102, -440, -37, 32, -605, -846, 885, 1892, -336, -1660, -546, 867, 1756, -254, -470, -775, 1312, 1139, -633, -947, 993, 1413, 565, -1088, -82, 306, 473, 160, -758, 73, 1309, 1884, -1223, -656, 495, 757, 1255, 440, -792, 634, 723, -408, -783, 182, 1889, 495, -962, -2231, -971, 275, 1039, -349, -1957, -993, -352, 13, -667, 144, 632, 425, -684, -1697, -1322, 1331, 1922, -259, -1293, -464, 102, -733, -407, 445, 226, 446, -145, -1629, -359, 787, 1651, -302, -1049, -846, 110, 613, -77, -370, 630, 1775, -58, -2063, 104, 1246, 1120, 137, -998, -1382, 776, 1562, -249, -918, 678, 1727, 147, -863, -774, -151, 936, 521, -1155, -347, 1585, 640, -1007]
3302a007l56J054J364n50p12p20n2J508r9j621J253J487q16j502m86J178Q78O10
3320A411j475j778O71J381n30O25M19j41l61n92r21L99K971K68k770j447J380
3337d90J139l07L81n88N80o54o35j303J398K442k2j972j290L26J77J758R0j555
3355e25J76J242j354j765J360K481k31j796k88n01J048N91j40j077J90R51l08
3372E4j683M41J808L37j155j507L32J604M49o48j132J332M60q54L68o0n28J480
3390A098r36j344K27J461N96j451m27J49J581P1q75j127J40J483K35j550J468
3407G99l40l18j73p62M5J703J149j439k309P31J187M70q94N9J14K37o58r11j15
3426a425L144M9j988r75p6J332P39J280j890j016P61O6j316O42K851l91j467j202
$$ y = [-1007, -1363, -309, 1055, 505, -207, -927, -979, 529, 430, -1191, 62, 1549, 733, -769, -1255, -77, 801, 1411, -64, -1842, -1171, 210, -320, 305, 724, 583, 222, -370, -1291, -892, 2079, 2347, -423, -1870, -490, 649, 342, 723, 135, 715, 61, -574, -1877, -479, 1963, 1941, -31, -1321, -995, -818, 940, 1030, -525, -349, 893, -461, -2226, -866, 1615, 1384, -412, -700, -1201, -153, 438, 298, -779, -589, 362, 54, -1629, -1188, 620, 957, -198, -1705, -1373, 231, 680, 32, -1100, 232, 692, -162, 206, 146, -382, 1098, 162, -1182, -955, 506, 1102, -349, -776, -627, 954, 1025, 150, -977, -837, 646, 881, -669, 799, 459, 141, -32, -794, -749, 954, 2103, 664, -1645, -914, 273, 743, -151, -92, 22, 259, -399, -1310, -1425, 1719, 1768, -220, -1195, -1271, 61, 800, 2080, 190, -826, -65, 1, -1315, -673, 2178, 1787, 320, -882]
3444h82m71J339J821j110o33L33m42k48l47O13R75K05J86j869j455K763J512j463
3462H27j316K55K46l05j55k3N19R35j098n83o3J214Q32q19j403Q8M59J191n5j882
3482a136O06Q33n34o35L11Q00K50j037K02L9J3J808j179j270n51J507N14m91n47
3501d97O02L55K11j702J28J806r4j182j148O37J184Q45n54n34l47K37K00q69K37
3520d85J207M97j209j426MJ378J388K62j923K15L67o10q91J490O71L0m20j761
3538a216o19K166L03N20k204K33J367j217M88O04j32P32n43j882mJ660J336p59
3556H33l37j324O38L56L04j282R5J380M08j480p38J222O92l03n52k85O30Q17o72
3575D02j608J000J240n95n14m6m18P95M37k54j354P86J163j056j300K18J866N34
$$ y = [-882, -1353, -14, 1807, 697, 64, 397, -45, -293, -640, -27, 948, 1153, 1339, -530, -1985, 778, 2290, 827, -489, -234, 12, -293, -448, -471, 48, 983, -115, -698, -761, 453, 1285, 466, -937, -849, -390, 801, 746, -1136, -530, 303, -231, -866, -555, 245, 495, -542, -340, -301, -288, 1520, 341, -929, -1480, 27, 541, 50, -497, 105, 460, 671, -1031, -903, 903, 809, -373, -1521, -884, 300, 1145, 591, 57, -290, -53, 147, -722, -485, 722, 1219, 10, -1416, -1412, -34, 1354, 1616, -307, -92, 275, -335, -1226, 264, 935, 965, 545, -1216, -1835, 331, 634, 1154, -1050, -817, 550, -667, -179, 425, 293, 1025, 482, -1400, -1404, 256, 1592, 833, 496, -828, -190, 166, 470, -812, -717, 663, 1071, -409, -1147, 75, 767, 464, -88, -373, 257, 1074, 402, -1206, -206, 1034, 439, -75, -121, -539, 256, 693, 439, -915, -129, 1034, -22, -1322, -1104, 762, 1296]
3593A296j208o89L9k5M85k36o25J719L18r03j048q60J568J234N67k366o09J098
3611b45N91n41n3Q27j74p70n55n08J118K081n86k077p34J173M43l66M62J01m59
3630b72L26j074j99J540J326j348j140Q3R75K64p8o98K20J66Km23r42J584M91
3649H03N46k415m35R01J847n67j592L69J172P2n61q62J124P5l94k03q92P65J362
3668A115o72j767R01J170k70O9m56l64Q92n9n88k19J114K4l29j165k89Q56O78
3687F41J267j980p16Q77O58o40j17O32O1o38j403J206K75J784n82j895n81J016
3705a35L99P5K64m08J71j15o83j086K010J501r43n68j541J095J29M96p31J13K41
3724B84K93p74J01J03K54P06j507r2m42J925m8j507j87Q26J42n50o09J365P07
$$ y = [1296, 88, -601, -562, -587, -102, -338, -963, 756, 1074, 171, -877, -1737, -169, 1065, 1632, -734, -1343, -245, 346, -195, -248, 579, 405, -365, -920, -1428, -310, 1771, 1185, -892, -1626, -453, -10, -376, 86, 187, -272, 54, -1020, -1219, 321, 1647, 299, -841, -758, 217, 481, 403, -295, -75, 91, 93, -330, -1272, 312, 803, 1349, -1066, -1501, -600, 1247, 680, -912, -543, 629, 701, 140, -722, 402, 477, 83, -120, -1012, -247, 1115, 443, -1324, -423, 747, 477, 546, 90, -274, 618, 559, -29, -248, 866, 890, 561, -604, -893, -37, 641, 1908, -72, -788, 89, 747, 107, -10, 622, 683, 45, -1358, -152, 123, 1907, 1325, -570, -1151, -135, 264, 339, 603, 195, 366, 251, -432, -1518, 492, 1993, 1050, 482, -1059, 36, 165, 661, -70, 43, 284, 577, -197, -96, 7, 261, 967, -540, -632, -1074, 851, 803, -704, -891, -65, 77, -473, -1082, 283, 990]
3743I90r47m37n74M22J182M04j859M74O79J89P9j026n74P20M55O8j281Q45Q56
3762F65J16j575k07J352M42k1j101o03M45J265K28j569P24K98p39L09j158Q92
3780b37R64R8j314j294J353Q54J59L5j084nK95m74K1N46J331J96k511j02R60M21
3800B12N80l41j356P56L18m49q01J675L70m95j040l91L08J727N56q46j486O07
3818i6J048j018l97Q90J115j215r85J43l76J423Q39m62j688O04Q99r94p2j22N87
3837A23J042j148j515J182P57N77j148Q2k42L30L96k09j114N17J008k12j275J22
3855g27J052j77J1l68k25J005M72j429o05J340n26J171j639N66K12l19J072j006
3873a20o0N19L46j213k63N6R12J209o45j300L58O71k85j064J123P90J5j776M3
$$ y = [990, 43, -394, -968, -546, 636, 1040, -819, -345, 334, 523, 602, -424, -998, -278, 177, 245, -1036, -191, 665, 781, -794, -1001, 351, 793, 772, -329, -932, -487, 778, 1006, -563, 161, 459, -280, 29, -1129, -237, 727, 825, -489, -1783, -430, 424, 583, 618, -466, -471, -176, -650, -629, -83, 1248, 1444, -1067, -1169, -209, 212, 792, 451, -905, -149, 169, -280, -1081, 594, 964, 469, -571, -962, -654, 1073, 1629, 783, -703, -96, 952, -66, -463, 427, 1542, 327, -658, -515, -891, 532, 1371, 909, -779, -175, 724, -270, -342, -464, 123, 1165, 17, -1498, -316, 441, 1018, -130, -48, -290, 40, 436, 227, -887, -370, 638, 426, -849, -727, 325, 148, 159, -209, -434, 571, 1043, -386, -991, 349, -177, 994, -645, -79, 133, -186, 886, -120, -180, 339, 685, -528, -791, -735, 177, 1386, 741, -559, -201, 470, 185, -879, 244, 1034, 1049, -727, -684]
3892f84k25R64R20l23j798M39N16R5n89O16Q33p19l79p01j07J238P39q59p54K82
3912d96K61L90j06k35K41M19n64r61L87J190P41r62q96J06O10N53j58p31j6P50
3932E23K77p89r7P71k4m09o64N54Q3N71n75j336O70J723m76p18k31Q0J56k44M39
3953B84l41P51p4m87r70P02N67J62m90l95K49L13j73p54P01J047n49j136j59M17
3973c35J73J447p70q95l07J143m81J90M52k55j66n59m46J69R07J526j278j643
3991a128P73P48k49k5K01l90J55l31o12N4R24Q55r02r69M0J083k40m8J11m44R32
4012E38J52j535K64J166l41k47m66K84j41J159p28o24J91R77l04p22k6J26M87
4031B10K26m62p94R29N84n23o19R9J261j76o36q54K13N81O55l49o39K44J26l49
$$ y = [-684, -909, 55, 975, 652, -1146, -707, -191, -96, -685, -69, 764, 45, -334, -1035, -1142, 96, 835, -24, -778, -496, -235, 155, 49, -186, 55, 474, -90, -1051, -664, 526, 1267, 305, -591, -485, 125, 678, 520, -211, -227, 523, 800, 11, -86, 685, 661, 252, -412, 142, 225, 796, 221, -1115, -445, 1278, 802, 84, -147, -67, 89, -155, 284, -57, 694, 620, 133, -837, -135, 432, 594, 104, -291, -42, 271, 98, -656, 45, 1092, 543, -593, -752, -335, -162, 1285, 515, -380, -687, 456, -25, 165, 617, 362, 196, -363, -809, -640, 267, 1793, 515, -1128, -355, 393, 144, 119, 320, -70, 85, -246, -858, -804, 120, 975, 73, -896, -856, 227, -13, -61, 50, -394, 538, 690, -845, -581, 585, 244, -3, -469, -185, -326, 833, 105, -519, -328, 649, 345, -377, -403, -277, 210, 436, -26, -820, 109, 693, 170, -449, -350, 911, 735, 99, -755, -542, 39, 694, 345, -294, -50, 76, -273]
4051b73n14J22R73J239n37r48q21R75K34j81r3P8l78l79q3J41N25J258p28j434
4071h24j5P29O51m88P9j65J60m25m62J5J297N63r37j001j39Q30J443o93j027m47
4091h56J225k38r71L83R46L0j50j205q8Q47Q81K77j604J70N49m8J98p32M23K00
4111B37K84r80r6Q32J003o68j116J61Q82L10o91m48K84P0K66n47k32M41J92j89
4131el20o95J686K13j021m60l47R52R8j94Q6j37k11K5j7m85J469K69m53j157j
4152g05N77L85L68n87j04K95l31l04Q7M97K15j6j075j19J078K08J56o52m93K38
4172b82N19l30p07J579L18j196k99j5J92P39L6m58n26P62j75l06J46k66O88J7
4192D36m44j086J127M01L32q51j19M34k39M01m41q9J18L42m71n84O18N73o82L66
$$ y = [-273, -787, -665, 308, 1547, 1010, 62, -759, 216, 450, 269, 176, 254, -124, -503, -586, -445, 80, 1338, 610, -824, -839, -110, 541, 53, 132, -33, 127, -298, -760, -745, 552, 1115, 178, -823, -962, -132, 1311, 618, -409, -856, 369, 131, -840, -457, 489, 519, 369, -836, -924, -77, 804, 1081, -523, -353, 196, 148, 346, -386, 37, 237, 521, -459, -555, 277, 1280, 612, -504, -343, 539, 849, 158, -290, -6, 64, 330, -217, -449, -8, 184, -5, -325, -1020, 666, 879, -142, -602, -949, 3, 101, -93, -7, -144, -355, -330, -347, -832, 637, 906, 453, -704, -705, -128, 257, 625, 38, -66, 229, -102, -406, -319, 178, 393, 377, -698, -817, 261, 469, 625, -27, -520, -282, 237, -93, -800, 779, 1097, -99, -398, -413, -221, 518, 554, 96, -430, 332, 157, -149, -3, -269, 419, 436, -8, -1094, 33, 434, 766, -85, -204, 230, -9, 392, -49, -138, -20, 322, -149, -733, -115, 458, -224, 142]
4212A42l65K12R59k04j128j88J091j38p4k53j44M57k36k58L18K68J60Q4j584L80
4232e01O84Q22j41p01q08O19K62o4j072Q47M79l16n07m21P13L68Q2l88p26Q56
4252H7K59R5q04M42R11j305L2n15N66J045J5j232j49N26K41m31M07k52M74r10
4272d98N2k40N09J077l67j168j19Q74j38J93p57M67P1O98p80n89M51R23l44j49
4292A66m01K20M7k3J65o11K28M71m48o72N82M88l23L1k80J18N98M31r71n63Q95
4313A48O07m89m74k80L47K43O30j185j25Q74j20m69l91J150j29j39l80k21j0R67
4333E54L44j100L15L06l03kp08K77P64J26q22m41N47L76k55q8J62n5K07o65p0
4354e31L35O34L96j110l43M26N41J83m66j05n90Q88j29l86Q9Q36n8m47m01m2K14
$$ y = [142, -223, -11, 948, 744, -384, -572, 519, 381, 307, 54, -90, 367, 131, -127, 191, 459, 619, 703, -881, -501, 183, 1005, 864, 163, -645, -26, 236, 172, -900, -53, 426, 110, -397, -818, -105, 263, 345, -43, -769, 87, 346, 441, -363, 79, 990, -315, -283, -798, -232, 813, 828, -404, -553, -27, 214, -217, 190, -62, 412, -498, -446, -686, -177, 900, 533, -635, -754, 120, -18, 175, -582, -115, -44, 654, -126, -715, -264, 659, 315, 166, -235, -15, 32, 9, 174, -437, -209, 262, -186, -858, -276, 212, -111, -80, -360, -242, 356, 787, -184, -747, 148, 755, 266, -208, -488, -141, 102, 732, -453, -578, 296, 176, -293, -684, 466, 337, 198, -182, -403, -413, 554, 898, -202, 113, 419, 116, 114, -594, -317, 447, 573, -249, -690, -143, 233, -22, -110, 52, -3, 204, -461, -531, -196, 438, 834, -276, -619, -193, 348, 531, 65, -40, -630, 258, 129, -257, -168, 668, 610, 163, -238, -280, -66]
4375f6J49J72q93L40R57k71n87L55J51M57r79m46K51N48M51p26m07K56P46k00
4395B58n70R9m0M53k4m21k23Q21n5m60k37R6L97N8o36M15j54k42P86m73j96N97
4417B49k0n82J51J56K25N17n18p47K41Q84K16q98J57K58j32l09j89K4L69P76o76
4438A52l59j95M63J31J68m26m72P25k91l83r2J025L40j029j21L05J27N85l49n88
4458b84J83j22N06p44J97J047N1m82j186K15O14P94k24j003J58O76m51L42k17
4477G0j34P01l32p10M51R6N36j012N8RL95L90o06m63Q2R52j15m80j13K27M25l44
4499H3K41l30K22L04n71n84M3Q88J61q09M44m33K34L7m3l60J14O45l92o41N32
4520b15L39M21m22m38j6N61n2j07o53Q50L20o30l92J53O71j97k14P4l15L40n2
$$ y = [-66, 83, 255, -638, -298, 659, 388, -199, 156, 307, 764, -215, -661, -410, 138, 589, -137, -544, -288, 458, 258, -312, -213, -253, 200, 176, -245, -468, 353, 298, -162, -399, -303, 94, 152, -484, -69, -223, -465, 321, -152, -348, 249, 229, -353, -202, -46, 179, 696, 178, -569, -328, 556, 772, -126, 31, 289, 157, -152, -341, -317, 52, 828, 152, -207, -402, 61, 192, 360, -66, -538, 187, -104, -487, -579, 446, 786, -243, -364, -59, 68, 653, 304, -284, -101, -223, 283, -461, -264, 783, 834, 352, -834, -619, -5, 789, 565, -438, -280, 396, -55, 287, 70, -64, 637, 305, -405, 46, 142, 678, -334, -276, -267, 128, 518, -88, -551, -469, 483, 368, -112, -225, 2, 427, 83, 324, -6, 216, 520, -51, -635, -592, 296, 457, -352, 92, -341, -107, -70, -113, -473, -359, 286, -106, -747, -215, 124, 545, 123, -315, -331, 230, 178, 71, -582, 268, 588, -42, -434, -281, 390, 193, -21, 53, -262, 78, 26]
4541B6j10K94L07j49o23m05M41R0P11Jj030K34k32P27n13r1J50K20j83k62j55
4562e52N12L24L12r22P7K72M29J37j086N31p8N91r30LL28N03l87j16p8K32j82
4583h0L89j68k70M73L34k89k84r8K91q4j87L45j92M98m04q64M15O01L3j60l68
4604f9N00o08J25r8j24J16N40m14L1q0K2R35n50p34k60J91O73m07J05P24m14l07
4626a03n25N72L8Q23l56m39n60N58J25M02l15k67L20r6m16l84K46M61N88q59P3
4647a14Q3j4J10K3m16K97K79k82m36R68j43j53k88j12K74P7J26k24m31P10m22
4668h8j4o3m75Q76m5O8m54o0M05k16l65J95M99J57k35o36P6M52M83j96o45N24
4690B43M4o87k20N05K97j8O8p22K23N5O28m32J8k79L19M6n36K81K89J36M75q43
$$ y = [26, -84, 210, 517, 368, -255, -660, -219, -129, 582, 583, -447, -213, -445, 282, -231, -322, -172, 48, -135, -397, -552, -40, 284, 596, -326, -249, 23, 452, 589, -497, 34, -44, 547, -383, -380, -52, 451, 64, -52, -130, 102, -80, 309, 141, -129, 344, 678, 389, 105, 7, 298, 214, 27, 372, 180, 678, 274, -590, -175, 426, 459, 299, -69, 431, -177, -52, -150, -274, -158, 382, -32, -1, -81, -59, 876, 326, -408, -668, -477, 196, -211, -106, 618, 204, -103, -628, -56, -18, 805, 449, 10, -550, 8, 133, 535, 220, -47, 273, 177, -239, -623, -377, 84, 672, -187, -114, -31, -45, 65, 88, -328, -31, 248, -34, -470, 498, 355, 202, -86, -198, 76, 153, 279, 55, -376, 334, -88, -102, -165, -640, 236, 191, 259, -195, -255, 150, -66, -431, -236, 263, 420, 185, -451, -375, 77, 560, 364, -281, 243, 287, -400, -620, -115, 182, 164, 232, -490, -267, -212, 416, -16, 2, -277, 42, 88, -448, -167, 122, 258, 733, -110]
4712a10n37N76L18n1M7k24j57L1p0j02P4L61N2k92p71R24K16L15j95m93K21k38
4734a05K28l13P02j94O41o86p61M09M90j12n62O05o10O41o13MM48R2k15o1j81
4755a53K18M36m3l15J77j48K02m52k56k28N68Q4k80l06N01L0L53p68M3O50m9J51
4777D15p66n12O66P86n34m45P52j74q7j01o9M4J42j71m81k51O54O40j04k07k87
4798i0l68N05k7k11L02K10l8p71j12Q15N05n37n06m09N79L92o5k57l0K86J98q37
4820d66L72o6K5L45n18J2m2N36m32M26J14j92j28p5j14o7L11L16n84j34K89J47
$$ y = [-110, -647, -71, 247, 196, 243, 19, -138, -107, -177, -279, -205, 156, 208, -84, -855, 69, 285, 600, 405, -88, 133, -105, 123, -190, 512, 318, 959, 273, -488, -79, 411, 299, -263, 342, -268, 373, -240, -236, 212, 304, 89, 28, -153, 65, 501, 458, 143, 320, 172, 374, -78, -334, -562, 6, 90, -190, -496, 5, 35, 388, -380, -337, 313, 264, 415, -351, -863, -197, 589, 55, -390, 362, 188, 101, 0, -69, -25, 117, -54, -535, -786, -132, 508, 404, 197, -90, -458, 47, 20, -191, 111, 321, 283, -488, -600, 215, 720, 183, -323, -732, -153, 239, 174, -83, -113, 173, 371, -466, -94, -160, -135, 210, -308, -296, -338, 198, -234, 192, 306, 114, -14, -89, -203, -270, 41, 357, -227, -361, -72, 75]
$$ [...]
8191b94
##END NTUPLES=NMR FID
##END=
