##TITLE=1H_SA_51.203
 CDCl3, 8 sc, 
 5.6.2020
##JCAMPDX= 6.0         $$ Bruker NMR JCAMP-DX V2.0
##DATA TYPE= NMR FID
##DATA CLASS= NTUPLES
##ORIGIN= UXNMR, Bruker Analytische Messtechnik GmbH
##OWNER= root
$$ XWIN-NMR		Version 3.5
$$ Fri Jun  5 11:58:08 2020 Russian Standard Time (UT+4h)  she@DPX200
##.OBSERVE FREQUENCY= 200.1315
##.OBSERVE NUCLEUS= ^1H
##.DELAY= (6, 6)
##.ACQUISITION MODE= SIMULTANEOUS
##.ACQUISITION SCHEME= undefined
##.AVERAGES= 8
##.DIGITISER RES= 18
##SPECTROMETER/DATA SYSTEM= spect
##.PULSE SEQUENCE= zg30
##.SOLVENT NAME= D2O
##.SHIFT REFERENCE= (INTERNAL, D2O, 0, 15.7039)
##AUDIT TRAIL= $$ (NUMBER, WHEN, WHO, WHERE, WHAT)
$$ ##TITLE= Audit trail, XWIN-NMR		Version 3.5
$$ ##JCAMPDX= 5.01
$$ ##ORIGIN= Bruker BioSpin GmbH
$$ ##OWNER= she
$$ F:/spectra/data/she/nmr/H-F/1/audita.txt
$$ ##AUDIT TRAIL=  $$ (NUMBER, WHEN, WHO, WHERE, WHAT)
(   1,<2020-06-05 11:57:11.35 +0400>,<she>,<DPX200>,
      <created by zg, POWCHK disabled, PULCHK disabled
       configuration hash MD5:
       00 E9 B6 7A A2 85 ED C7 34 08 36 98 17 FE 4E 26
       data hash MD5: 16K
       12 FF AC C0 99 AA 6D E8 99 4D EF E8 1A 08 2D 50>)
$$ ##END=
$$ 
$$ hash MD5
$$ 8B C6 30 E0 5D 16 50 89 AB 06 11 DF 0E 4C 2F 82
##$RELAX= 
##$RELAX= 
##$RELAX= 
##$RELAX= 
##$RELAX= 
##$RELAX= 
$$ Bruker specific parameters
$$ --------------------------
##$DU= <F:/spectra>
##$EXPNO= 1
##$NAME= <H-F>
##$PROCNO= 1
##$TYPE= <nmr>
##$USER= <she>
##$AMP= (0..31)
100 100 100 100 100 100 100 100 100 100 100 100 100 100 100 100 100 100 
100 100 100 100 100 100 100 100 100 100 100 100 100 100 
##$AQSEQ= 0
##$AQ_mod= 1
##$AUNM= <au_zg>
##$AUTOPOS= <>
##$BF1= 200.13
##$BF2= 200.13
##$BF3= 200.13
##$BF4= 200.13
##$BF5= 200.13
##$BF6= 200.13
##$BF7= 200.13
##$BF8= 200.13
##$BYTORDA= 1
##$CFDGTYP= 0
##$CFRGTYP= 5
##$CHEMSTR= <none>
##$CNST= (0..31)
1 1 145 1 1 1 1 1 1 1 1 1 1 1 1 1 1 1 1 1 1 1 1 1 1 1 1 1 1 1 1 1 
##$CPDPRG= <>
##$CPDPRG1= <>
##$CPDPRG2= <>
##$CPDPRG3= <>
##$CPDPRG4= <mlev>
##$CPDPRG5= <mlev>
##$CPDPRG6= <mlev>
##$CPDPRG7= <mlev>
##$CPDPRG8= <mlev>
##$CPDPRGB= <>
##$CPDPRGT= <>
##$D= (0..31)
0 1.2 0 0 0 0 0 0 0 0.06 0 0.03 0 0 0 0 0.0002 0 0 0 0 0 0 0 0 0 0 0 0 
0 0 0 
##$DATE= 1591343830
##$DBL= (0..7)
120 120 120 120 120 120 120 120 
##$DBP= (0..7)
150 150 150 150 150 150 150 150 
##$DBP07= 0
##$DBPNAM0= <>
##$DBPNAM1= <>
##$DBPNAM2= <>
##$DBPNAM3= <>
##$DBPNAM4= <>
##$DBPNAM5= <>
##$DBPNAM6= <>
##$DBPNAM7= <>
##$DBPOAL= (0..7)
0.5 0.5 0.5 0.5 0.5 0.5 0.5 0.5 
##$DBPOFFS= (0..7)
0 0 0 0 0 0 0 0 
##$DE= 6
##$DECBNUC= <off>
##$DECIM= 24
##$DECNUC= <off>
##$DECSTAT= 4
##$DIGMOD= 1
##$DIGTYP= 9
##$DL= (0..7)
0 120 120 120 120 120 120 120 
##$DP= (0..7)
150 150 150 150 150 150 150 150 
##$DP07= 0
##$DPNAME0= <>
##$DPNAME1= <>
##$DPNAME2= <>
##$DPNAME3= <>
##$DPNAME4= <>
##$DPNAME5= <>
##$DPNAME6= <>
##$DPNAME7= <>
##$DPOAL= (0..7)
0.5 0.5 0.5 0.5 0.5 0.5 0.5 0.5 
##$DPOFFS= (0..7)
0 0 0 0 0 0 0 0 
##$DQDMODE= 0
##$DR= 18
##$DS= 0
##$DSLIST= <SSSSSSSSSSSSSSS>
##$DSPFIRM= 0
$$ [...]
##$SUBNAM2= <"">
##$SUBNAM3= <"">
##$SUBNAM4= <"">
##$SUBNAM5= <"">
##$SUBNAM6= <"">
##$SUBNAM7= <"">
##$SUBNAM8= <"">
##$SUBNAM9= <"">
##$SW= 24.9337058887773
##$SWIBOX= (0..15)
0 0 2 0 0 0 0 0 0 0 0 0 0 0 0 0 
##$SW_h= 4990.01996007984
##$TD= 16384
##$TD0= 1
##$TE= 0
##$TE2= 300
##$TE3= 300
##$TEG= 300
##$TL= (0..7)
0 120 120 120 120 120 120 120 
##$TP= (0..7)
150 150 150 150 150 150 150 150 
##$TP07= 0
##$TPNAME0= <>
##$TPNAME1= <>
##$TPNAME2= <>
##$TPNAME3= <>
##$TPNAME4= <>
##$TPNAME5= <>
##$TPNAME6= <>
##$TPNAME7= <>
##$TPOAL= (0..7)
0.5 0.5 0.5 0.5 0.5 0.5 0.5 0.5 
##$TPOFFS= (0..7)
0 0 0 0 0 0 0 0 
##$TUNHIN= 0
##$TUNHOUT= 0
##$TUNXOUT= 0
##$USERA1= <user>
##$USERA2= <user>
##$USERA3= <user>
##$USERA4= <user>
##$USERA5= <user>
##$V9= 5
##$VALIST= <valist>
##$VCLIST= <CCCCCCCCCCCCCCC>
##$VD= 0
##$VDLIST= <DDDDDDDDDDDDDDD>
##$VPLIST= <PPPPPPPPPPPPPPP>
##$VTLIST= <TTTTTTTTTTTTTTT>
##$WBST= 1024
##$WBSW= 4
##$XGAIN= (0..3)
0 0 0 0 
##$XL= 0
##$YL= 0
##$YMAX_a= 44301
##$YMIN_a= -41799
##$ZGOPTNS= <>
##$ZL1= 120
##$ZL2= 120
##$ZL3= 120
##$ZL4= 120
##$ABSF1= 10
##$ABSF2= 0
##$ABSG= 5
##$ABSL= 3
##$ALPHA= 0
##$AQORDER= 0
##$ASSFAC= 0
##$ASSFACI= 0
##$ASSFACX= 0
##$ASSWID= 0
##$AUNMP= <proc_1d>
##$AZFE= 0.1
##$AZFW= 0.1
##$BCFW= 1
##$BC_mod= 2
##$BYTORDP= 1
##$COROFFS= 0
##$CY= 11.3945322036743
##$DATMOD= 1
##$DC= 2
##$DFILT= <>
##$DTYPP= 0
##$F1P= 16.9975609425685
##$F2P= -3.02152046262296
##$FCOR= 0.5
##$FTSIZE= 0
##$FT_mod= 4
##$GAMMA= 1
##$GB= 0.15
##$INTBC= 1
##$INTSCL= 1
##$ISEN= 128
##$LB= 0.24
##$LEV0= 0
##$LPBIN= 0
##$MAXI= 10000
##$MC2= 0
##$MEAN= 0
##$ME_mod= 0
##$MI= 1.114404
##$NCOEF= 0
##$NC_proc= 0
##$NLEV= 6
##$NOISF1= 3.799351
##$NOISF2= 2.8
##$NSP= 1
##$NTH_PI= 0
##$NZP= 0
##$OFFSET= 15.70392
##$PC= 1
##$PHC0= -9811.457
##$PHC1= 38.80082
##$PH_mod= 1
##$PKNL= yes
##$PPARMOD= 0
##$PSCAL= 0
##$PSIGN= 0
##$REVERSE= no
##$SF= 200.130013532006
##$SI= 16384
##$SIGF1= 3
##$SIGF2= 2
##$SINO= 400
##$SIOLD= 16384
##$SREGLST= <1H.CDCl3>
##$SSB= 0
##$STSI= 0
##$STSR= 0
##$SW_p= 3612.71676300578
##$SYMM= 0
##$S_DEV= 0
##$TDeff= 0
##$TDoff= 0
##$TI= <>
##$TILT= no
##$TM1= 0
##$TM2= 0
##$TOPLEV= 0
##$USERP1= <user>
##$USERP2= <user>
##$USERP3= <user>
##$USERP4= <user>
##$USERP5= <user>
##$WDW= 1
##$XDIM= 8192
##$YMAX_p= 0
##$YMIN_p= 0
$$ End of Bruker specific parameters
$$ ---------------------------------
##NTUPLES= NMR FID
##VAR_NAME=  TIME,          FID/REAL,        FID/IMAG
##SYMBOL=    X,             R,               I
##VAR_TYPE=  INDEPENDENT,   DEPENDENT,       DEPENDENT
##VAR_FORM=  AFFN,          ASDF,            ASDF
##VAR_DIM=   8192,          8192,            8192
##UNITS=     SECONDS,       ARBITRARY UNITS, ARBITRARY UNITS
##FACTOR=    0.0002004,     1,               1
##FIRST=     0,             0,               0
##LAST=      1.6414764,     0,               0
##MIN=       0,             -41799,          0
##MAX=       1.6414764,     44301,           0
$$ Real data points
##PAGE= N=1
##DATA TABLE= (X++(R..R)), XYDATA
$$ [...]
$$ plain form
2210 -369 -1377 656 255 -944 -285 312 -624 -561 199 -323 -592 212 -194 -1479 -209 560 -1178 -423
2228 -423 407 -310 -775 -89 -184 -998 -182 462 -1243 -866 118 -119 -1006 70 -268 -1215 -509 435 -1104
2247 -1104 -1107 451 -852 -1566 590 214 -848 -248 452 -411 -1043 320 -84 -902 81 249 -984 209
2265 209 314 -902 -576 564 -239 -1039 295 731 -744 -379 554 -134 -645 433 -87 -267 676 499
2283 499 -139 211 1053 -395 -287 1075 187 -599 547 885 -470 157 848 216 -246 966 393 -398
2301 -398 1230 1211 -187 241 1151 209 282 1218 810 -508 552 1048 -255 313 653 212 -253 790 322
2320 322 -644 446 1153 -327 391 918 -331 -557 1243 791 -877 297 715 -217 -231 339 155 -613
2338 -613 235 415 -471 18 346 -767 -67 306 -492 -981 363 90 -1283 -506 12 -950 -673 -3 -69
$$ packed form
2210c69j008K033m01j199O59N97r36O3P60n22k69Q04m06j285J270P69j738P55
2228d23Q30p17m65O86r5q14Q16O44j705L77R84k37q87J076l38r47P06R44j539
2247a104lJ558j303p14K156l76j062O00P00q63o32J363m04q18R83J68j233J193
2265B09J05j216L26J140q03q00J334M36j475L65R33o88n11J078n20j80R43j77
2283D99o38L50Q42j448J08J362q88p86J146L38j355O27O91o32m62J212n73p91
2301c98J628j9j398M28R10r42P3R36m08j318J060M96j303N68L40m41m65J043m68
2320C22r66J090P07j480P18N27j249k26J800m52j668J174M18r32j4N70j84p68
2338f13Q48J80q86M89L28j113P00L73p98m89J344k73j373P77N18r62K77O70o6
$$ plain form
2357 -69 -687 -138 47 -807 -336 -65 -532 -695 190 -102 -1164 45 175 -946 -517 83 -682 -934 257
2376 257 -588 -1167 -32 -240 -911 -57 -40 -718 -780 604 -232 -989 -30 312 -807 -487 428 -678 -818
2395 -818 60 -123 -679 266 367 -418 120 811 -411 -586 536 -64 -570 274 289 -720 170 984 303
2414 303 -499 568 637 -239 364 670 27 93 1017 134 -307 1089 328 -567 259 885 -129 -17 1146
2433 1146 357 -361 560 710 4 768 429 -249 329 1134 121 16 969 546 -400 726 925 -350 -44
2452 -44 989 215 -394 793 521 -184 261 506 -18 -157 903 -18 -369 464 379 -525 -222 859 -415
2471 -415 -870 642 313 -679 249 305 -465 54 158 -39 -620 392 -458 -963 413 202 -956 -330 614
2490 614 -481 -810 380 -182 -854 -354 -25 -733 -299 203 -767 -790 116 -311 -1046 137 294 -1114 -463
$$ packed form
2357f9o18N49J85q54M71K71m67j63Q85k92j062J209J30j121M29O00p65k52J191
2376B57q45n79J135k08o71Q54J7o78o2J384q36p57R59L42j119L20R15j106j40
2395h18Q78j83n56R45J01p85N38O91j222j75J122o00n06Q44J5j009Q90Q14o81
2414C03q02J067O9q76O03L06o43O6R24q83m41J396p61q95Q26O26j014J12J163
2433A146p89p18R21J50p06P64l39o78N78Q05j013j05R53m23r46J126J99j275L06
2452d4J033p74o09J187k72p05M45K45n24j39J060r21l51Q33q5r04L03J081j274
2471d15m55J512l29r92R28N6p70N19J04j97n81J012q50n05J376k11j158O26R44
2490F14j095l29J190n62o72N00L29p08M34N02r70k3R06m27p35J183J57j408O51
$$ plain form
2509 -463 412 -492 -1001 95 -38 -1402 -259 332 -993 -461 216 -205 -548 737 150 -755 154 493
2527 493 -323 -292 573 -104 -421 402 525 -525 -26 216 -193 -443 601 -34 -308 785 334 -624 337
2546 337 588 -403 270 799 265 -236 527 546 -135 114 741 -23 189 597 452 -398 1071 318 -292 375
2566 375 934 -205 -368 867 331 -110 676 832 -226 374 906 93 179 1068 74 -492 703 503 -736
2585 -736 -59 805 -72 -578 531 318 -761 170 57 -162 150 711 -345 -492 353 -199 -486 -41 329
2604 329 -543 -34 568 -350 -917 669 -35 -645 -89 256 -674 -636 -23 -182 -671 137 35 -951 -381 -84
2624 -84 -811 -578 418 -593 -1060 317 -72 -1191 -323 -51 -537 -403 -28 -440 -766 -72 -188 -1059 103
2643 103 378 -359 -535 333 -108 -647 -129 106 -1023 -185 351 -297 -152 198 -215 -832 245 379 -508
$$ packed form
2509d63Q75r04n09J096j33j364J143N91j325N32O77m21l43J285n87r05R09L39
2527D93q16L1Q65o77l17Q23J23j050M99K42m09k50J044o35k74J093m51r58R61
2546C37K51r91O73N29n34n01P63J9o81K49O27p64K12M08j45q50J469p53o10O67
2566C75N59j139j63J235n36m41P86J56j058O00N32q13Q6Q89r94n66J195k00j239
2585g36O77Q64q77n06J109k13j079R31j13k19L12N61j056j47Q45n52k87M45L70
2604C29q72N09O02r18n67J586p04o10N56L45r30L8O13j59m89Q08j02r86N70K97
2624h4p27K33R96j011m67J377l89j119Q68K72m86J34L75m12l26O94j16q71J162
2643A03K75p37j76Q68m41n39N18K35j129Q38N36o48J45L50m13o17J077J34q87
$$ plain form
2662 -508 -96 633 -259 -256 535 25 -350 649 329 -474 147 337 100 -73 973 245 -185 778 182 -183
2682 -183 350 743 60 4 714 361 -233 555 915 -177 157 907 285 94 528 60 -83 293 68 -25
2702 -25 370 326 1 5 858 473 -465 569 604 202 -95 346 215 -303 223 193 -245 335 424 -390 -78 553
2724 553 -76 -556 938 243 -871 218 490 -296 -438 803 70 -701 87 -339 -459 152 292 -710
2742 -710 -83 136 -376 -981 318 -301 -976 12 209 -618 -721 42 -212 -931 -428 66 -416 -351 30 -270
2762 -270 -404 189 -711 -942 430 -193 -628 39 198 -530 -499 300 -221 -380 245 -27 -342 -41 113 -820
2782 -820 -397 765 -204 -662 -8 182 -639 -303 445 -235 -341 443 213 -155 217 186 -450 196 377 -105
2802 -105 -44 664 200 -165 320 843 -328 476 813 69 -126 495 437 -423 322 663 -65 -94 762 321 -161
$$ packed form
2662e08M12P29q92LP91n10l75R99l20q03O21J90k37j73J046p28m30R63n96l65
2682a83N33L93o83n6P10l53n94P88L60j092L34P50o22j91M34m68j43L76k25r3
2702b5L95m4l25MQ53l85r38J034L5m02k97M41j31n18N26l0m38N80Q9q14L12O31
2724E53o29m80J494o95j114J089K72p86j42J241p33p71P88m26j20O11J40j002
2742g10O27K19n12o05J299o19o75R88J97q27j03P63k54p19N03M94m82O5L81l00
2762b70j34N93r00k31J372o23m35O67J59p28L1P99n21j59O25k72l15L01J54r33
2782h20M23J162r69m58O54J90q21L36P48o80j06P84k30l68L72l1o36O46J81m82
2802a05O1P08m64l65M85N23j171Q04L37p44j95O21n8q60P45L41p28k9Q56m41m82
$$ plain form
2823 -161 932 63 -202 376 530 -274 564 834 47 -346 267 461 -64 327 560 -31 196 618 139 -6
2843 -6 703 197 -538 302 526 -397 -132 352 -56 -380 492 58 -611 374 432 -427 -163 251 -185 -582 610
2864 610 86 -813 136 338 -190 -18 425 -217 -595 279 0 -717 -197 67 -475 -601 349 21 -836 226
2884 226 -21 -937 -491 449 -373 -502 432 -230 -699 179 86 -260 -419 252 -244 -432 83 -347 -842 199
2904 199 214 -823 -250 432 -286 -433 -4 -35 -295 128 359 -408 -29 246 -523 -365 305 121 -743 -29
2924 -29 3 -140 -16 418 8 -413 679 247 119 631 882 -534 218 463 -32 -19 683 81 -20 530
2944 530 746 -70 291 468 288 -104 599 517 33 485 442 -175 256 534 10 188 129 316 -235 455 522
2965 522 -177 -56 410 -27 -458 349 273 -755 577 357 186 -397 471 58 -21 540 188 -359 235 389
$$ packed form
2823a61J093q69k65N78J54q04Q38K70p87l93O13J94n25L91K33n91K27M22m79j45
2843fP09n06p35Q40K24r23K65M84m08l24Q72m34o69R85N8q59K64M14m36l97J192
2864F10n24q99R49K02n28J72M43o42l78Q74k79p17N20K64n42j26R50l28q57J062
2884B26k47r16M46R40q22j29R34o62m69Q78r3l46j59O71m96j88N15m30m95J041
2904A99J5j037N73O82p18j47M29l1k60M23K31p67L79K75p69J58O70j84q64P14
2924b9L2j43J24M34m10m21J092m32j28N12K51j416P52K45m95J3P02o02j01N50
2944E30K16q16L61J77j80l92P03q2m84M52m3o17M31K78n24J78n9J87n51O90O7
2965E22o99J21M66m37m31Q07p6j028J332k20j71n83Q68m13p9N61l52n47N94J54
$$ plain form
2985 389 -355 -464 200 106 -461 228 451 -311 -162 614 -654 -339 -216 -361 -265 45 43 -534 -319 365 -141
3006 -141 -287 422 -399 -787 -70 -90 -710 -50 300 -407 -148 73 -186 -745 -416 -278 -655 -302 377 -540
3026 -540 -824 219 -189 -242 -279 227 -834 -218 179 -538 -868 257 -159 -348 432 -62 -294 -425 496 -442
3046 -442 -401 629 3 -517 -33 394 -259 -223 406 88 -168 79 -57 -404 45 530 -293 -115 939 33
3066 33 -287 255 53 -606 210 428 -412 -112 398 453 -63 597 662 -402 537 640 -290 173 839 218 79
3087 79 417 466 -305 145 676 -49 364 580 73 -395 472 555 -52 253 778 -178 -239 708 227 -206 183
3108 183 258 -570 -158 328 110 -246 487 53 -384 65 273 -505 -325 454 -427 -338 129 -144 -697 148 51
3129 51 -902 -72 71 188 -271 -62 -171 -678 54 -97 -821 197 295 -745 -583 406 -157 -678 197 273
$$ packed form
2985C89p44j09O64r4n67O89K23p62J49P76j268L15J23j45R6L10kn77K15O84n06
3006a41j46P09q21l88P17k0o20O60L50p07K59K21k59n59L29J38l77L53O79r17
3026e40k84J043m08n3l7N06j061O16L97p17l30J125m16j89P80m94k32j31R21r38
3046d42M1J030o26n20M84M27o53L6O29l18k56K47j36l47M49M85q23J78J054r06
3066C3l20N42k02o59Q16K18q40L00N10N5n16O60O5j064R39J03r30M63O66o21j39
3087G9L38M9p71M50N31p25M13K16n07m68Q67Q3o07L05N25r56o1R47m81m33L89
3108A83P5q28M12M86k18l56P33m34m37M49K08p78J80P79q81Q9M67k73n53Q45r7
3129E1r53Q30J43J17m59K09j09n07P32j51p24J018R8j040J62R89n63n21Q75P6
$$ plain form
3149 273 -670 -450 -36 -370 -531 -265 2 -522 -367 268 -332 -221 190 -578 -276 3 61 -551 125 374
3169 374 -191 -139 401 72 -265 144 -528 -485 339 -75 -368 -210 546 -188 -142 415 285 -153 147 67 -100
3190 -100 -101 618 132 -414 197 218 -197 250 456 80 -309 590 405 -204 586 368 -440 348 1031 247 -64
3211 -64 725 462 207 407 162 -258 -115 993 20 -532 246 254 -285 269 424 56 129 813 40 -790 319
3232 319 598 -251 128 -42 67 -24 290 -434 -96 370 -196 -774 117 209 -186 -24 65 -229 -657 -43 -81
3253 -81 -471 1 76 -15 -164 219 -306 -83 347 -30 -525 -43 421 -464 -8 249 -518 -691 -53 167 -881
3274 -881 -373 156 -230 -88 351 59 -319 244 469 -633 61 132 -397 -379 391 -539 -526 -3 -68 -792 -14
3295 -14 193 -83 -325 180 -356 -51 736 465 -581 -95 264 -391 47 347 532 -721 554 676 -213
$$ packed form
3149B73r43K20M14l34j61K66K67n24J55O35o00J11M11p68L02K79N8o12O76K49
3169C74n65N2N40l29l37M09o72M3Q24m14k93J58P56p34M6N57j30m38L00q0j67
3190a00jP19m86n46O11K1m15M47K06l76l89Q99j85o09P90k18q08P88O83p84l11
3211f4P89k63k55K00k45m20J43J108r73n52P78Qn39N54J55l68P3O84p73q30J109
3232C19K79q49L79j70J09r1L14p24L38M66n66n78Q91R2l95J62Q9k94m28O14l8
3253h1l90M72P5r1j49L83n25K23M30l77m95M82M64q85M56K57p67j73O38K20j048
3274h81N08N29l86J42M39k92l78N63K25j102O94P1n29J8P70r30J3N23o5p24P78
3295a4K07k76k42N05n36L05P87k71j046M86L59o55M38L00J85j253J275J22q89
$$ plain form
3314 -213 -266 354 -51 211 758 294 -235 343 460 -146 23 186 -285 -116 460 515 -134 527 521 -366 279
3335 279 393 164 258 402 230 -448 353 752 -233 135 742 487 -114 262 380 291 805 534 72 -176 755
3356 755 -49 -297 75 166 -212 342 203 -352 -352 529 -166 -301 108 289 -499 350 224 13 115 496 -21
3377 -21 38 -101 -278 0 294 492 -693 -228 447 -486 -498 17 116 -631 20 139 -693 -476 -387 240 -574
3398 -574 -84 -45 -115 -6 49 5 -596 -231 219 -456 161 638 -527 -356 60 -649 -27 256 -158 -303 326
3419 326 211 -58 88 114 174 -706 205 -551 -199 113 61 -283 -113 -96 -582 66 257 192 -455 375 185 -510
3441 -510 320 465 358 -570 873 107 -718 975 368 256 185 282 -352 -40 501 80 -324 369 226 170
3461 170 627 319 57 178 573 60 493 479 705 -109 261 528 228 -248 219 285 -226 108 62 -16 -169
$$ packed form
3314b13n3O20m05K62N47m64n29N78J17o06J69J63m71J69N76N5o49O61oq87O45
3335B79J14k29R4J44j72o78Q01L99r85L68O07k55o01L76J18q9N14k71m62k48R31
3356G55q04k48L72R1l78N54j39n55%Q81o95j35M09J81p88Q49j26k11J02L81n17
3377b1N9j39j77K78K94J98j185M65O75r33j2N15R9p47O51J19q32K17Q9O27q14
3398e74M90L9p0J09N5m4o01L65M50o75O17M77j165J71M16p09O22K83m14j45O29
3419C26j15k69J46K6O0q80R11p56L52L12n2l44J70J7m86O48J91o5o47Q30j90o95
3441e10Q30J45j07r28J443p66q25J693o07j12p1R7o34L12N41m21m04O93j43n6
3461A70M57l08k62J21L95n13M33j4K26q14L70K67l00m76M67O6n11L34m6p8j53
$$ plain form
3482 -169 640 63 -240 -85 131 -426 -11 395 -160 -158 392 279 -281 531 -213 -222 111 56 -135 -485 263 -68
3504 -68 -454 158 330 -374 98 259 -83 -392 1064 -28 -47 404 -52 -560 -564 493 -621 -671 554 -254
3524 -254 -338 233 323 -655 -9 413 -148 -90 -20 -542 -190 51 -269 -813 -40 552 -534 -168 -25 -624 -588
3545 -588 355 -307 -448 -84 409 -204 -545 89 1 -110 -59 -37 102 -585 621 306 -912 143 565 -568
3565 -568 -442 589 -168 -723 233 330 113 575 791 -598 -59 332 76 378 184 83 -280 568 254 -534
3585 -534 199 320 -571 385 287 14 26 893 520 156 329 463 41 84 204 -89 -280 435 160 -6 474
3606 474 322 11 -47 394 -346 -260 -15 503 -307 745 566 253 -211 168 -380 -317 188 733 -246 -487 823
3627 823 337 352 121 -66 24 -80 132 83 -228 276 -311 29 524 69 -441 -211 -199 -240 -655 66 -414 24
$$ packed form
3482a69Q09n77l03J55K16n57M15M06n55KN50j13n60Q12p44rL33n5j91l50P48l31
3504f8l86O12J72p04M72J61l42l09J456j092j9M51m56n08mJ057j114n0J225q08
3524b54q4N71R0r78O46M22n61N8P0n22L52K41l20n44P73N92j086L66J43n99L6
3545e88R43o62j41L64M93o13l41O34q8j11N1K2J39o87J206l15j218J055M22j133
3565e68J26J031p57n55R56R7k17M62K16j389N39L91k56L02j94j01l63Q48l14p88
3585e34P33J21q91R56r8k73J2Q67l73l64J73J34m22M3J20k93j91P15k75j66M80
3606D74j52l11n8M41p40Q6K45N18q10J052j79l13m64L79n48O3N05N45r79k41J310
3627H23m86J5k31j87R0j04K12m9l11N04n87L40M95m55n10K30J2m1m15P21m80M38
$$ plain form
3649 24 592 -686 75 -186 111 -393 -8 -421 -66 33 611 -517 156 319 68 -70 -647 -162 -263 -541
3669 -541 532 -226 -656 112 64 155 -323 298 -365 -372 212 336 -592 -93 324 -841 155 604 -81 463 110
3690 110 108 -709 559 199 262 -164 -446 595 -388 130 -173 -687 527 -144 -112 191 -656 -337 968 502
3710 502 251 -146 294 67 -55 -23 596 126 -347 379 -293 93 239 -221 95 336 664 313 -144 585
3730 585 407 -201 443 130 529 -645 348 223 -125 323 136 -432 387 261 -2 -136 -453 269 -380 196
3750 196 548 -242 121 143 -20 -384 23 115 -334 51 264 -602 -156 247 -166 -522 93 169 -167 259 -311
3771 -311 -533 -82 162 -633 29 480 151 -164 -38 255 -418 -590 -69 -195 -12 1287 191 -267 42
3790 42 -40 -232 -136 -35 -506 79 -25 -219 -1050 -125 281 -131 -30 -99 -790 -658 757 -355 -370 568 -92
$$ packed form
3649B4N68j278P61k61K97n04L85m13L55R9N78j128O73J63k51j38n77M85j01k78
3669e41J073p58m30P68m8R1m78O21o63pN84J24r28M99M17j165R96M49o85N44l53
3690A10kq17J268l60O3m26k82J041r83N18l03n14J214o71L2L03q47L19J305m66
3710E02k51l97M40k27j22L2O19m70m73P26o72L86J46m60L16K41L28l51m57P29
3730E85j78o08O44l13L99j174R93j25l48M48j87n68Q19j26k63j34l17P22o49N76
3750A96L52p90L63K2j63l64M07R2m49L85K13q66M46M03m13l56O15P6l36M26n70
3771c11k22M51K44p95O62M51l29l15J26K93o73j72N21j26J83J299j096m58L09
3790D2q2j92R6J01m71N85j04j94q31R25M06m12J01o9o91J32J415j112j5R38o60
$$ plain form
3811 -92 185 433 119 -147 21 -287 -191 -201 384 59 -567 377 1017 82 -935 295 0 -132 -34 522 -203
3832 -203 372 -9 -261 336 2 34 -154 538 452 -245 286 -72 -605 793 233 342 -59 426 493 265 -362
3853 -362 247 -178 -572 100 473 -294 207 460 790 -65 70 706 -194 548 166 279 20 684 471 -370
3873 -370 995 28 -508 506 315 -629 -883 292 -521 593 -236 32 -386 634 430 44 -250 94
3891 94 28 221 587 -435 -149 299 709 61 -363 -494 125 541 -181 360 -424 342 -123 -309 -653 -207
3911 -207 -211 -66 -150 -610 162 -24 -818 159 -190 749 157 -25 -12 -473 -167 -288 -821 -64 290 248 -119 -415
3933 -415 102 158 392 21 9 74 -917 -191 288 -305 -591 -600 -493 -87 346 -660 -263 319 -162 -383 -19
3954 -19 35 -237 -207 -30 -374 -615 393 -225 -257 -173 29 -211 954 383 -501 -578 540 543 372 158 -204 -32
$$ packed form
3811i2K77K48l14k66J68l08R6j0N85l25o26R44O40r35j017J230k95j32R8N56p25
3832b03N75l81k52N97l34L2j88O92q6o97N31l58n33J398n60J09m01M85O7k28o27
3853c62O09m25l94O72L73p67N01K53L30q55J35O36r00P42l82J13k59O64k13q41
3873c70J365r67n36J014j91r44k54J175q13J114q29K68m18J020k04l86k94L44
3891I4o6J93L66j022K86M48M10o48m24j31O19M16p22N41p84P66m65j86l44M46
3911b07mJ45q4m60P72j86p94R77l49R39n92j82J3m61L06j21n33P57L54m2l67k96
3933d15N17N6K34l71j2O5r91P26M79n93k86rJ07M06M33j006L97N82m81k21L64
3954a9N4k72L0J77l44k41J008o18l2Q4K02k40J165n71q84p7J118Lj71k14l62J72
$$ plain form
3976 -32 400 -4 -133 -127 548 -106 -52 359 497 -33 319 212 577 -352 -379 -351 -361 498 740 -2 1 145 -33
3999 -33 406 325 527 -840 -106 -158 -102 524 757 -114 -528 101 273 -72 45 172 656 -128 348 -139 21
4020 21 -410 333 406 -276 -198 -410 -860 -702 -55 -715 -16 -491 -228 73 -335 -37 -297 -589 131 -76 -195
4041 -195 21 473 -640 208 -731 212 743 -513 -796 186 -109 -208 148 35 63 481 -376 -994 -381 -185
4061 -185 527 -890 -169 -132 -436 -643 370 -73 -42 392 187 -289 175 704 -947 557 -378 -480 -224
4080 -224 -58 1043 -9 -556 -181 266 286 452 -123 -641 225 -14 178 5 -452 -79 -395 35 -525 151
4100 151 223 513 -48 -451 905 -764 225 680 40 -459 22 158 0 77 346 -396 117 -376 1200 -331
4120 -331 440 429 276 656 -265 467 -188 312 -83 -167 -548 -71 557 -623 -214 280 -374 176 177 -63 -101
$$ packed form
3976c2M32m04j29OO75o54N4M11J38n30L52j07L65r29k7K8j0Q59K42p42LJ44j78
3999c3M39q1K02j367P34n2N6O26K33q71m14O29J72l45J17J27M84p84M76m87J60
4020B1m31P43P3o82P8k12m50J58O47o60O99m75K63L01m08K98k60k92P20k07j19
4041a95K16M52j113Q48r39R43N31j256k83R82k95r9L56j13K8M18q57o18O13J96
4061a85P12j417P21L7l04k07J013m43L1M34k05m76M64N29j651J504r35j02K56
4080b24J66J101j052n47L75M47K0J66n75n18Q66k39J92j73m57L73l16M30n60O76
4100A51P2K90n61m03J356j669R89M55o40m99M81J36j58P7K69p42N13m93J576j531
4120c31P71j1j53L80r21P32o55N00l95q4l81M77O28j180M09M94o54N50Jk40l8
$$ plain form
4141 -101 1076 87 -174 678 -150 198 160 111 38 360 692 710 126 275 112 -565 -628 -88 113 -54 424
4162 424 -283 -419 -409 553 -289 -290 -449 -335 -283 586 -514 202 -5 557 135 240 160 -626 -659 321 405 -1017
4184 -1017 713 765 -655 330 203 -47 227 118 -86 -216 548 -180 119 -819 -319 -391 -601 -84 -837 -511
4204 -511 21 187 408 -473 -5 -354 -273 528 -304 -450 229 143 -275 373 539 -210 -618 16 -157 -1580
4224 -1580 324 25 189 793 -5 977 -2 380 130 -564 425 247 -48 117 512 -91 21 184 45
4243 45 211 328 788 -256 -180 286 119 -323 772 105 -201 298 444 -471 -556 273 600 353 -110 180
4263 180 -486 -164 -16 -754 246 208 -180 13 -968 512 124 -67 100 -174 -688 -17 -771 100 233 13
4283 13 -430 130 274 413 -87 683 51 -78 -24 -272 -550 251 -499 421 -472 -550 203 688 -33 -222 -582
$$ packed form
4141a01J177r89k61Q52q28L48l8m9p3L22L32J8n84J49j63o77o3N40K01j67M78
4162D24p07j36J0R62q42jj59J14N2Q69j100P16k07N62m22J05q0p86l3R80Q4j422
4184a017J730N2j420R85j27k50K74j09k04j30P64p28K99r38N00p2k10N17p53L26
4204e11N32J66K21q81M68l49Q1Q01q32j46O79q6m18O48J66p49m08O34j73j423
4224a580J904k99J64O04p98R82r79L82k50o94R89j78k95J65L95o03J12J63j39
4243D5J66J17M60j044P6M66j67m42J095o67l06M99J46r15q5Q29L27k47m63K90
4263A80o66L22J48p38J000l8l88J93r81J480l88j91J67k74n14O71p54Q71J33k20
4283A3m43N60J44J39n00P70o32j29N4k48k78Q01p50R20q93p8P53M85p21j89l60
$$ plain form
4304 -582 158 813 -284 -329 -258 88 -610 251 -105 5 -404 -202 -243 296 -395 -873 242 -207 179 -101
4324 -101 -139 -416 -478 -273 -281 509 -64 309 160 -158 -57 1147 -212 77 68 630 -130 -398 204 -433 364
4345 364 -229 612 910 15 352 -196 -510 34 -486 215 -498 -975 425 584 -372 30 102 5 136 167 550
4366 550 -556 548 1011 515 -5 -562 -489 629 -98 220 190 -54 353 134 -1025 -68 170 238 -60 -196
4386 -196 -704 -265 -293 70 -325 -307 376 -240 38 98 83 281 488 400 -162 90 -242 -220 -363 269 -496 596
4408 596 -508 -182 -104 -394 512 157 -379 387 120 493 367 246 -172 -426 860 -68 113 16 -239 -458
4428 -458 509 -292 193 624 -208 -87 244 -211 -302 -382 -130 225 -197 -389 -319 212 346 -117 126 -543 -151
4449 -151 -562 -456 -90 113 16 -191 66 -18 602 700 324 151 -27 537 207 -368 511 -239 -440 -142 106
$$ packed form
4304e82P40O55j097m5P1L46o98Q61l56J10m09K02m1N39o91m78J115m49L86k80
4324a01l8k77o2K05qP90n73L73j49l18J01J204j359K89rN62p60k68O02o37P97
4345C64n93Q41K98q95L37n48l14N44n20P01p13m77J400J59r56M02P2r7J31L1L83
4366E50j106J104M63m96n20n57P3J118p27L18l0k44M07k19j159R57K38O8k98j36
4386a96n08M39k8L63l95J8O83o16K78O0j5J98K07q8n62K52l32K2j43O32p65J092
4408E96j104L26P8k90R06l55n36P66k67L73j26j21m18k54J286r28J81r7k55k19
4428d58R67q01M85M31q32J21L31m55r1q0K52L55m22j92P0N31J34m63K43o69L92
4449a51m11J06L66K03r7k07K57q4O20R8l76j73j78N64l30n75Q79p50k01K98K48
$$ plain form
4470 106 47 258 -296 -727 -726 716 -301 -34 -362 196 -125 240 120 238 -88 167 -66 -111 144 -75 -319
4491 -319 112 473 -283 -122 701 260 60 -402 440 -101 -285 281 -5 -366 160 383 -32 858 125 -203
4511 -203 -60 402 200 167 118 307 392 76 1 -7 485 1224 -161 91 -185 -205 46 -198 -158 -316 404 295
4533 295 533 212 -136 225 -433 307 573 -237 -113 -290 245 -221 172 -279 180 -101 357 349 223 103 -181
4554 -181 -359 -230 -284 -138 -100 -3 -26 314 67 873 241 -81 186 222 546 -108 -18 -360 -237 343 -7 265
4576 265 239 348 288 -123 -368 83 63 79 -519 374 153 -23 83 -248 -258 -165 -165 23 -310 24 439 -70 267
4599 267 21 183 -110 230 26 -257 128 467 -7 -74 77 -289 -13 759 -3 134 304 373 -13 -136 290
4620 290 158 -220 252 334 -404 -651 175 513 101 -126 -27 -39 -113 12 -344 -22 -67 290 -328 -152 -38 349
$$ packed form
4470A06n9K11n54m31JJ442j017K67l28N58l21L65j20J18l26K55k33m5K55k19k44
4491c19M31L61p56J61Q23m41k00m62Q42n41j84N66k86l61N26K23m15Q90p33l28
4511b03J43M62k02l3m9J89Q5l16p5qM92P39j385K52k76k0K51k44M0j58P20j09
4533B95K38l21l48L61o58P40K66q10J24j77N35m66L93m51M59k81M58qj26j20k84
4554a81j78J29n4J46L8R7k3L40k47Q06o32l22K67L6L24o54R0l42J23N80l50K72
4576B65k6J09o0m11k45M51k0J6n98Q93k21j76J06l31j0R3%J88l33L34M15n09L37
4599B67k46J62k93L40k04k83L85L39m74o7J51l66K76P72p62J37J70O9l86j23M26
4620B90j32l78M72Q2p38k47Q26L38m12k27R9j2p4J25l56L22m5L57o18J76J14L87
$$ plain form
4642 349 -135 -26 -297 30 462 11 307 229 -44 -64 151 -92 176 163 -149 53 -73 516 524 -370 -70 140
4664 140 -255 291 427 116 -475 515 9 186 -361 21 -200 -16 186 -153 279 262 -148 -646 370 -503
4684 -503 -50 366 266 -506 531 -228 -598 471 123 468 66 129 -354 31 297 95 -347 -135 -253 -245
4704 -245 111 -107 -109 267 55 75 495 -59 -102 151 313 -508 -526 -142 -247 92 66 -427 -449 129 -218 -121 1
4727 1 -146 -267 421 121 170 529 -236 -261 -553 -243 288 50 -28 181 232 -286 260 -321 -113 -232 -433 -475
4749 -475 110 87 15 -306 299 -135 -7 231 -76 -174 -5 59 -117 230 534 83 86 374 -78 -136 284 487
4771 487 -38 378 -529 151 -479 151 453 8 220 131 -354 82 359 -92 -377 -351 138 -202 211 313 232
4792 232 74 173 -378 -18 108 189 8 -251 232 -226 -179 -43 210 126 131 313 -175 -291 789 -6 -456 -88
$$ packed form
4642C49m84J09k71L27M32m51K96p8k73k0K15k43K68j3l12K02j26N89Qq94L00K10
4664A40l95N46J36l11n91R90n06J77n47L82k21J84K02l39M32j7m10m98J016q73
4684e03M53M16j00p72J037p59l70J069l48L45m02O3m83L85K66k02m42K12j18Q
4704b45L56k18kL76k12K0M20n54m3K53J62q21j8L84j05L39k6m93k2N78l47R7J22
4727Aj47j21O88l00M9L59p65k5k92L10N31k38p8K09N1n18N46n81K08j19k01m2
4749d75N85k3p2l21O05m34J28K38l07r8J69O4j76L47L04m51LK88m52n8M20K03
4771D87n25M16r07O80o30O30L02m45K12q9m85M36K77m51k85K6M89l40M13J02q1
4792B32j58R9n51L60J26Q1j81k59M83m58M7J36K53q4NJ82m88j16J080p95m50L68
$$ plain form
4814 -88 21 -134 -124 -225 -51 320 98 5 248 310 -45 -430 137 34 -113 -438 -175 -562 -262 33 38 -299
4836 -299 -502 -139 -448 112 186 87 42 269 256 -109 4 -120 -341 -30 50 -693 60 343 376 -27 -221 439
4858 439 10 313 350 -51 251 -34 -144 20 239 30 214 167 -472 -333 -54 -22 251 -196 -101 300 -110
4879 -110 -161 342 -53 867 324 -123 242 -52 109 229 -150 -450 -51 -19 221 97 -316 -163 49 201 -332
4900 -332 -150 -46 125 371 528 -358 576 559 228 -230 160 30 25 321 -206 -116 54 -124 -42 76 -578 359
4922 359 -95 221 276 -15 206 575 -323 424 470 -81 292 266 -93 -571 205 -84 229 0 561 -226 33
4943 33 283 -330 -276 -84 -399 -389 89 163 218 -29 359 451 -257 -35 25 182 105 80 459 -201 -277 385 -176
4966 -176 -96 45 272 -19 176 110 -51 -416 -74 176 -185 -440 6 199 -60 56 -425 -437 666 283 -31
$$ packed form
4814h8J09j55J0j01J74L71k22r3K43O2l55l85N67j03j47l25K63l87L00K95Nl37
4836b99k03L63l09N60P4r9m5K27j3l65J13j24k21L11Q0p43P53K83L3m03j94O60
4858D39m29L03L7m01L02k85j10J64K19k09J84m7o39J39K79L2K73m47R5M01m10
4879a10n1N03l95R20n43m47L65k94J61J20l79l00L99L2K40j24m13J53K12J52n33
4900c32J82J04J71K46J57q86R34j7l31m58L90j30nK96n27R0J70j78Q2J18o54R37
4922C59m54L16N5k91K21L69q98P47M6n51L73k6l59m78P76k89L13k29N61p87K59
4943C3K50o13N4J92l15J0M78P4N5k47L88R2p08K22O0J57p7k5L79o60p6O62n61
4966a76Q0J41K27k91J95o6j61l65L42K50l61k55M46J93k59J16m81j2J103l83l14
$$ plain form
4987 -31 -102 53 312 -59 215 251 148 -333 -336 -420 468 -14 -250 159 206 67 -564 413 -144 -484 329 261 -289
5010 -289 219 -147 -331 407 56 239 67 245 -269 88 -5 -52 43 -58 371 -377 500 -731 458 279
5030 279 578 -88 344 -34 600 -3 -68 -329 -84 -777 -317 -189 313 86 -318 349 -26 -108 122 -288 573
5051 573 350 563 -29 363 -359 -487 287 -417 -471 -80 384 284 -463 41 -552 -495 130 46 -845 -323 -13
5072 -13 -577 386 -230 135 226 -530 -164 -145 134 -228 -542 175 23 108 58 382 -162 -298 144 -90 -106 -559
5094 -559 -184 216 -260 -15 -69 291 -102 19 -342 -288 125 -312 -406 -15 65 -466 -118 -430 143 47 -194 118
5116 118 -281 -563 -613 34 469 -66 262 -189 -293 -122 19 0 471 -330 343 346 76 99 155 -79 366 239
5138 239 -411 0 779 -84 -348 720 369 -325 -166 316 117 361 395 -32 -147 -16 -18 -476 16 559 46
$$ packed form
4987c1p1J55K59l71K74L6j03m81lq4Q88m82k36M09M7j39o31R77n57l40Q13o8n50
5010b89N08l66j84P38l51J83j72J78n14L57r3m7R5j01M29p48Q77j231J189j79
5030B79K99o66M32l78O34o03o5k61K45o93M60J28N02k27m04O67l75q2K30m10Q61
5051E73k23K13n92L92p22j28P74p04n4L91M64j00p47N04n93N7O25q4q91N22L10
5072a3n64R63o16L65R1p56L66J9K79l62l14P17j52Q5n0L24n44j36M42k34j6m53
5094e59L75M00m76K45n4L60l93J21l61N4M13m37r4L91Q0n31L48l12N73r6k41L12
5116A18l99k82n0O47M35n35L28m51j04J71J41j9M71q01O73Lk70K3N6k34M45j27
5138B39o50M11P79q63k64J068l51o94J59M82j99K44L4m27j15J31km58M92N43n13
$$ plain form
5159 46 -376 297 109 248 -77 273 62 -502 518 -428 -31 307 -68 -296 97 -76 249 74 209 -225
5179 -225 -487 -102 117 -14 -669 303 198 229 8 129 40 156 -151 429 -793 -169 770 -16 -92 -160 283
5200 283 -13 -368 88 -271 232 436 -385 -81 -280 46 411 133 -59 14 -198 -206 -487 -46 -391 -175 -10
5221 -10 -34 -250 -527 -554 -517 302 202 327 56 -50 182 229 187 -354 479 -441 -559 -352 -229 768 140 -813
5243 -813 -529 510 362 569 67 505 -304 223 488 -285 346 -13 -255 -432 326 -169 115 301 -101 -27
5263 -27 45 -700 185 -555 244 434 -272 -156 96 -332 195 287 699 312 696 -70 375 319 251 -117 -579 -538
5285 -538 -201 182 -63 353 66 -133 -17 212 -219 140 135 916 178 71 -62 -118 76 -137 -549 163 385
5306 385 35 606 -190 938 13 398 -111 45 188 -13 113 -628 162 -21 -113 166 4 119 -175 -56
$$ packed form
5159D6m22O73j88J39l25L50k11n64J020r46L97L38l75k28L93j73L25j75J35m34
5179b25k62L85K19j31o55R72j05L1k21J21q9J16l07N80j222O24R39p86p6o8M43
5200B83k96l55M56l59N03K04q21L04j99L26L65k78j92P3k12qk81M41l45K16J65
5221a0k4k16k77k7L7Q19j00J25k71j06K32M7m2n41Q33r20j18K07J23R97o28r53
5243h13K84J039j48K07n02M38q09N27K65p73O31l59k42j77P58m95K84J86m02P4
5263b7P2p45Q85p40P99J90p06J16K52m28N27R2M12l87L84p66M45n6o8l68m62M1
5285e38L37L83k45M16k87j99J16K29m31L59nP81p38j07j33n6J94k13m12P12K22
5306C85l50N71p96J128r25L85n09J56J43k01J26p41P90j83r2K79j62J15k94J19
$$ plain form
5326 -56 111 313 339 571 -32 883 3 -387 -550 161 -78 -61 -22 370 -478 -99 -41 -42 163 301 329 69 406
5349 406 -246 128 827 322 678 305 100 -647 -194 476 520 74 893 -469 -219 171 -1125 292 666
5368 666 -269 -42 -8 -125 624 -299 627 -114 -281 390 -896 -218 -207 -269 109 664 -106 -97 -96 -596 -73 83
5390 83 -13 860 586 265 1017 50 25 18 -31 -232 -58 719 807 682 -367 275 121 -62 90 18 -607 95
5412 95 394 -495 -452 745 -231 94 535 -2 453 -314 197 546 291 124 144 -148 -68 236 -85 239 -521
5433 -521 -677 509 279 135 396 475 -24 -63 -488 -360 183 460 433 -312 -148 -297 443 -697 167 -337
5453 -337 37 322 5 540 270 -419 -153 -161 695 240 -369 363 -282 678 415 323 -155 -206 152 40 292
5474 292 949 -86 -393 -328 508 -348 143 -8 -392 692 -35 359 155 -58 -230 329 -59 -132 -509 246
$$ packed form
5326e6J67K02K6K32o03R15q80l90j63P11k39J7L9L92q48L79N8jK05J38K8k60L37
5349D06o52L74O99n05L56l73k05p47M53O70M4m46Q19j362K50L90j296J417L74
5368F66r35K27L4j17P49r23R26p41j67O71j286O78J1o2L78N55p70RJn00N23J56
5390H3r6Q73k74l21P52r67k5pm9k01J74P77Q8j25j049O42j54j83J52p2o25P02
5412I5K99q89M3J197r76L25M41n37M55p67N11L49k55j67K0k92Q0L04l21L24p60
5433e21j56J186k30j44K61P9m99l9m25J28N43K77k7p45J64j49P40j140Q64n04
5453c37L74K85l17N35k70o89K66qQ56m55o09P32o45R60k63r2m78n1L58j12K52
5474B92O57j035l07O5Q36q56M91j51l84J084p27L94k04k13j72N59l88p3l77P55
$$ plain form
5494 246 -99 92 -234 277 -78 -148 -48 498 84 245 -686 -406 -523 240 -225 205 290 225 215 -363 23
5515 23 -491 -346 429 291 -213 646 1265 156 365 -278 -384 -344 285 229 696 -49 -299 227 -343 526 137
5536 137 -200 -238 14 160 -251 412 192 123 215 613 145 -333 176 76 667 -100 713 369 -10 713 -1
5557 -1 251 -258 -231 827 -509 -492 606 -267 -32 -34 135 82 -613 -513 18 -315 -80 -1 -195 257 -972
5578 -972 80 873 -485 66 255 263 -365 95 71 -356 -27 -603 346 -501 255 430 -495 415 -77 261
5598 261 78 -27 -575 375 -174 -108 31 -111 -210 2 35 -191 -364 39 104 168 486 564 38 60 -111 -273
5620 -273 -171 -571 -147 34 -282 -273 -75 209 91 -100 -107 357 -377 403 652 -528 210 45 340 226 38
5641 38 625 268 -125 -305 338 -604 34 -213 -106 153 11 58 289 -332 -295 172 198 52 -106 682 568
$$ packed form
5494B46l45J91l26N11l55p0J00N46m14J61r31K80j17P63m65M30Q5o5j0n78L86
5515B3n14J45P75j38n04Q59O19j109K09o43j06M0O29n6M67p45k50N26n70Q69l89
5536A37l37l8K52J46m11O63k20o9R2L98m68m78N09j00N91p67Q13l44l79P23p14
5557aK52n09K7J058j336J7J098q73K35kJ69n3o95J00N31l33K35P9j94M52j229
5578i72J052P93j358N51J89Qo28M60k4m27L29n76R49q47P56J75r25R10m92L38
5598B61j83j05n48R50n49O6J39j42r9K12L3k26j73M03O5O4L18P8n26K2j71j62
5620b73J02m00M24J81l16RJ98K84j18j91pM64p34P80K49j180P38j65K95j14j88
5641C8N87l57l93j80O43r42O38k47J07K59j42M7K31o21L7M67K6j46j58P88j14
$$ plain form
5662 568 296 -388 388 -461 454 598 -95 -370 45 -65 458 334 -44 299 705 7 -230 -439 -106 402
5682 402 235 -265 -235 451 -541 342 -342 121 75 153 -247 -236 -552 -42 -222 870 -212 -441 -542 -434 -362
5703 -362 109 -342 -106 217 2 -180 -105 167 135 -484 -268 372 -371 -130 -121 -562 -449 295 -398 682 238
5724 238 182 -337 453 -184 -793 -324 81 258 -38 -236 -167 134 -75 -226 -251 -588 521 516 52 142 -51 200
5746 200 -597 303 210 559 514 48 87 -28 285 -222 -717 391 -247 -414 -165 255 73 -438 -539 294 -54
5767 -54 160 316 -307 -350 -102 291 485 122 221 -508 102 -668 -166 708 72 3 -92 200 -12 -479 523
5788 523 23 -289 -398 61 71 442 -216 -96 602 390 142 175 70 -114 -57 582 124 -172 622 266 489
5809 489 -494 -185 -486 -201 405 -61 59 157 246 -50 199 -368 -178 -260 -318 429 -111 376 63 -129 -326
$$ packed form
5662E68k72o84P76q49R15J44o93k75M15j10N23j24l78L43M06o98k37k09L33N08
5682D02j67n00L0O86r92Q83o84M63m6P8m00J1l16N10j80J092j082k29j01J08P2
5703c62M71m51K36L23k15j82P5K72l2o19K16O40p43K41Rm41J13P44o93J080m44
5724B38n6n19P90o37o09M69M05J77k96j98O9L01k09j51k5l37J109nm64R0j93K51
5746B00p97R00r3L49m5m66L9j15L13n07m95J108o38j67K49M20j82n11j01Q33l48
5767e4K14J56o23m3K48L93J94l63R9p29O10p70N02Q74o36o9r5K92k12m67J002
5788E23n00l12j09M59J0L71o58J20O98k12k48L3j05j84N7O39m58k96P94l56K23
5809D89r83L09l01K85O06m66J20R8Q9k96K49n67J90q2n8P47n40M87l13j92j97
$$ plain form
5830 -326 -6 48 74 -230 -127 -184 -596 -24 -273 485 -442 -87 141 270 -322 -393 -279 -53 321 527 -201
5851 -201 141 -104 -102 154 525 -121 -672 -100 -254 255 -531 207 -271 -22 -323 -391 56 -154 185 294 -291
5872 -291 -219 74 118 216 122 242 -541 575 -245 -145 489 -138 -221 -533 12 228 -34 72 -160 310 115
5893 115 -195 196 -534 -688 -79 28 -326 256 528 -49 191 -264 97 -57 -137 -85 -264 -26 714 -7 152
5914 152 136 216 473 426 191 97 324 248 -726 -44 617 463 -303 -156 51 -346 -267 276 -233 464 -593 303
5936 303 252 121 -611 -248 46 152 -78 -321 -226 -388 -30 108 -521 -50 147 213 300 281 126 349 -314 -322
5958 -322 -411 153 -83 -205 -284 -85 902 154 271 180 699 -80 84 -97 -197 -48 144 134 324 -170 -473
5979 -473 59 391 -192 -333 52 -19 204 432 -166 4 -70 83 -71 140 476 155 -480 6 -163 -330 -164
$$ packed form
5830c26L20N4K6l04J03n7m12N72k49P58r27L55K28J29n92p1J14K26L74K06p28
5851b01L42k45KK56L71o46n51N72j54N09p86P38m78K49l01o8M47k10L39J09n85
5872b91P2K93M4R8r4J20p83J116q20J00O34o27q3l12N45K16k62J06k32M70j95
5893A15l10L91p30j54O09J07l54N82K72n77K40m55L61j54q0N2j79K38P40p21J59
5914A52j6Q0K57m7k35r4K27p6r74O82O61j54p66J47K07l97P9N43n09O97j057Q96
5936C03n1j31p32L63K94J06k30k43R5j62L58J38o29M71J97O6Q7j9j55K23o63q
5958c22q9N64k36j22p9J99R87p48J17r1N19p79J64j81j00J49J92j0J90m94l03
5979d73N32L32n83j41L85p1K23K28n98J70p4J53j54K11L36l21o35M86j69j67J66
$$ plain form
6000 -164 -167 108 166 -209 124 -290 269 102 -303 232 219 -190 -266 261 -37 -30 -384 119 -146 35 177 551
6022 551 -470 -120 221 83 118 157 455 114 77 -287 253 -356 -15 -108 374 333 14 -144 -22 -150 226
6043 226 108 92 187 325 560 -277 -14 -386 15 -52 -164 64 340 -152 222 -155 -251 -114 371 -59 164
6064 164 -90 -390 239 26 10 205 218 19 -68 -132 379 -124 62 155 -219 -220 -55 61 -9 339 81 244 -89
6087 -89 281 210 -177 -22 -158 178 -192 271 120 60 20 -106 158 -195 287 151 29 74 -258 224 1 -7
6109 -7 168 189 -167 -170 -66 -38 42 158 -22 149 -89 137 -11 22 -10 -46 13 50 290 -230 -217 301 -205 64
6133 64 -33 -52 -35 28 -260 39 -125 33 -34 -205 -137 225 -192 57 -89 20 -6 -171 53 -76 -57 182 -158
6156 -158 71 99 -50 3 -87 55 184 -80 69 -85 100 -220 -44 30 171 80 -436 -101 140 96 -182 83
$$ packed form
6000a64lK75N8l75L33m14N59j67m05N35j3m09p6N27k98Pl54N03k65J81J42L74
6022E51j021L50L41j38L5L9K98l41l7l64N40o09L41r3M82m1l19j58J22j28L76
6043B26j18j6R5J38K35q37K63l72M01o7j12K28K76m92L74l77r6J37M85m30K23
6064A64k54l00O29k13j6J95J3j99q7o4N11n03J86R3l74jJ65J16p0L48k58J63l33
6087h9L70p1l87J55j36L36l70M63j51o0m0j26K64l53M82j36j22M5l32M82k23q
6109gJ75K1l56lJ04K8Q0J16j80J71k38K26j48L3l2l6N9L7K40n20J3N18n06K69
6133F4r7j9J7O3k88K99j64J58o7j71O8L62m17K49j46J09k6j65K24j29J9K39l40
6156a58K29K8j49N3r0J42J29k64J49j54J85l20J76P4J41r1n16L35K41m4k78K65
$$ plain form
6178 83 -55 228 104 80 -87 113 240 -173 -159 21 55 375 -104 -52 84 170 160 -97 -27 -9 -60 -287 50
6201 50 374 134 60 371 -85 -64 299 -8 145 -212 -9 146 302 50 -109 -167 91 71 -155 -198 -139 -84 62
6224 62 341 8 -203 -102 -60 40 -116 78 -233 99 -272 -168 -94 270 40 -249 33 223 230 -166 -169 -8
6246 -8 -341 76 28 170 147 167 -99 -100 -244 -142 -37 68 101 137 165 -75 102 44 206 371 98 -114 206 -44
6270 -44 -79 292 -167 91 68 -185 251 14 82 -132 50 -59 48 129 -37 -10 -104 -85 149 -47 459 96 -91
6293 -91 -210 -43 19 233 -15 -166 54 230 -18 -158 126 179 12 -122 189 -120 -93 -46 -104 -249 42 95
6315 95 -134 -198 -126 -227 -117 -82 156 207 114 30 -48 148 203 136 -286 -94 19 -121 350 -264 216 112 -146
6338 -146 292 -13 71 115 -255 -26 -6 140 -36 -164 1 -71 49 243 -31 43 56 64 -176 111 -232 -214 374
$$ packed form
6178H3j38K83j24k4j67K00J27m13J4J80L4L20m79N2J36Q6j0k57P0J8n1k27L37
6201E0L24k40p4L11m56K1L63l07J53l57K03J55J56k52j59n8K58k0k26m3N9N5J46
6224F2K79l33k11J01M2J00j56J94l11L32l71J04P4L64k30k89K82J90Pl96lJ61
6246hl33M17m8J42k3K0k66jj44J02J05J05L3L6K8k40J77n8J62J65k73k12L20k50
6270d4l5L71m59K58k3k53M36k37O8k14J82j09J07Q1j66K7r4J9K34j96N06l63j87
6293i1j19J67O2K14k48j51K20J76k48j40K84N3j67j34L11l09K7M7n8j45K91N3
6315I5k29o4P2j01J10L5K38N1r3q4p8J96N5o7m22J92J13j40M71o14M80j04k58
6338a46M38l05Q4M4l70K29K0J46j76j28J65p2J20J94k74P4J3Qk40K87l43J8N88
$$ plain form
6361 374 109 -256 145 225 -35 -30 -14 150 -170 201 278 -195 -174 188 17 -100 37 200 26 -261 41 187
6383 187 84 -196 38 94 22 175 -248 155 -169 -57 122 234 -31 89 91 -68 122 -223 50 -200 15
6404 15 -246 132 211 78 112 -86 -125 202 96 58 22 361 242 134 -2 347 8 -261 111 -64 135 -134
6426 -134 307 -10 128 -127 -106 -76 -44 -142 141 82 40 -10 -90 -135 181 -46 -304 14 214 -64 -192 -51 165
6449 165 -43 37 -3 261 -125 -27 -5 211 -12 202 41 -116 196 137 281 -83 91 40 279 273 12 23 -56
6472 -56 92 -23 -245 -301 -24 74 -152 183 98 101 70 -247 -87 278 -390 77 -26 28 6 -24 181 16 -97
6495 -97 -165 4 -104 -121 -185 -270 -127 145 -290 218 222 14 22 300 313 225 -95 -22 144 88 -61 153 -133 113
6519 113 174 -208 -108 -359 317 -129 181 9 143 2 44 -96 -50 -103 125 303 224 -20 51 24 -146 16
$$ packed form
6361C74k65l65M01Q0k60NJ6J64l20L71P7m73K1L62j71j17J37J63j74k87L02J46
6383A87j03k80K34N6p2J53m23M03l24J12J79J12k65J20Kj59J90l45K73k50K15
6404A5k61L78P9j33L4j98l9L27j06l8l6L39j19j08j36L49l39k69L72j75J99k69
6426a34M41l17J38k55K1L0L2r8K83n9m2n0q0m5L16k27k58L18K00k78j28J41K16
6449A65k08Q0m0K64l86R8K2K16k23K14j61j57L12n9J44l64J74n1K39ok61J1p9
6472e6J48j15k22n6K77R8k26L35q5Ll1l17J60L65o68M67j03N4k2l0K05j65j13
6495i7o8J69j08j7o4q5J43K72m35N08Mk08QK78J3q8l20P3J66n6j49K14k86K46
6519A13O1l82J00k51O76m46L10j72J34j41M2j40M6n3K28J78p9k44P1k7j70J62
$$ plain form
6541 16 -59 101 -135 -79 -143 79 133 164 -29 186 -117 131 210 103 183 -135 -60 -320 51 -151 -26 277 -59
6564 -59 55 328 186 80 -41 -125 114 -187 51 -164 126 198 128 76 113 -32 -46 39 219 -84 -122 79 31
6587 31 -108 158 93 -24 -34 -90 -63 98 -14 64 -46 -135 42 8 112 157 -41 -41 5 -249 20 108 141 -164 316
6612 316 -61 155 80 -272 -131 -285 22 59 40 103 -145 1 -217 242 -130 -115 102 257 109 234 3 -19
6634 -19 -12 83 58 189 -131 -102 -182 -111 308 -168 -82 -173 -164 -24 173 -146 305 -153 163 127 321 -69 167 145 -104
6659 -104 -113 -292 -53 -212 -316 -6 154 183 99 -112 -48 147 -201 11 69 2 43 1 104 14 51 -86 -38 -66
6683 -66 -103 -62 -302 -165 -69 -38 -65 -190 100 -109 62 -223 -103 -305 -12 70 7 251 295 -118 -150 -167 -69 -185
6707 -185 25 362 11 28 152 -15 145 111 -189 56 146 -24 -60 225 -20 -252 95 -58 111 -19 24 107
$$ packed form
6541A6p5J60k36N6o4K22N4L1j93K15l03K48P9j07Q0l18P5k60L71k02J25L03l36
6564e9J14K73j42j06j21q4K39l01K38k15K90P2p0n2L7j45j4Q5J80l03l8K01m8
6587C1j39K66o5j17j0n6K7J61j12P8j10q9J77l4J04M5j98%M6k54K69Q8L3l05M80
6612C16l77K16p5l52J41j54L07L7j9O3k48J46k18M59l72J5K17J55j48J25k31k2
6634a9PR5k5J31l20K9q0P1M19m76Q6r1RJ40J97l19M51m58L16l6J94l90K36k2k49
6659a04rj79K39j59j04L10J60K9q4k11O4J95l48K12N8o7M1m2J03r0L7j37M8k8
6683f6l7M1k40J37R6L1k7j25K90k09J71k85J20k02K93Q2o3K44M4m13l2j7R8j16
6707a85K10L37l51J7J24j67J60l4l00K45R0j70l6K85k45k32L47j53J69j30M3Q3
$$ plain form
6729 107 101 152 34 53 -15 -156 104 -240 -103 121 25 -190 131 255 59 130 110 92 -97 -149 172 -32 65 -8
6753 -8 12 118 -130 -159 263 -231 -25 -17 -25 74 -140 16 40 -133 124 -244 -91 -111 -310 -103 119 67 -284 -94
6777 -94 -411 77 55 127 254 -72 -117 272 34 -88 -117 -123 245 -97 55 -175 82 125 -145 -135 -137 -67 -198 65
6801 65 221 -191 -177 -33 72 -27 -88 80 169 -45 -55 -128 -104 -106 259 140 -2 26 -207 256 36 198 87 163
6825 163 147 38 84 49 91 -47 -124 88 -165 30 -240 -170 -44 17 40 -60 -139 154 154 -143 -54 -126 -78 -84 281
6850 281 193 228 -178 33 97 162 -27 127 145 99 76 -25 75 42 132 203 71 -98 78 214 -28 -338 -76
6873 -76 127 239 -32 117 92 -7 -65 -103 173 -112 27 74 -263 34 4 33 -216 -186 -162 67 82 7 -26 -4 -194
6898 -194 -228 -316 237 34 -117 113 12 -66 -182 111 99 -113 -93 36 61 -82 -59 104 44 56 132 -58 -20 -64
$$ packed form
6729A07oN1j18J9o8j41K60l44J37K24r6k15L21J24j96P1k0j8j89n2L21k04R7p3
6753hK0J06k48k9M22m94K06QqR9k14J56K4j73K57l68J53k0j99K07K22n2l51J90
6777i4l17M88k2P2J27l26m5L89k38j22k9oL68l42J52k30K57M3k70J0kP0j31K63
6801F5J56m12J4J44J05r9o1J68Q9k14j0p3K4kL65j19j42K8k33M63k20J62j11P6
6825A63j6j09M6l5M2j38p7K12k53J95k70P0J26O1K3j00p9K93%k97Q9p2M8oL65
6850B81q8L5m06K11O4O5j89J54J8m6k3j01J00l3R0P1j32j69J76J36k42l10K62
6873g6K03J12k71J49k5r9n8l8K76k85J39M7l37K97l0K9k49L0K4K29J5p5l3K2j90
6898a94l4q8N53k03j51K30j01p8j16K93j2k12K0J29K5j43K3J63o0J2P6j90L8m4
$$ plain form
6922 -64 64 72 94 -111 121 15 -105 -126 13 -32 32 183 -98 -57 20 -153 -386 -34 294 -217 75 -36 -206
6945 -206 59 -112 -188 -68 -18 233 -104 -160 32 -50 -169 -126 6 67 -37 50 -18 -318 -79 -1 -106 178 -74
6968 -74 -38 21 -1 93 111 -87 -54 -279 -47 -107 -200 -127 -9 28 -167 180 -9 66 385 -3 77 43 8 180 132
6993 132 -146 167 -111 -83 -13 -414 -221 -37 127 -38 62 -110 -131 110 -72 -89 -23 -156 -147 -29 173 46
7015 46 -153 26 -54 69 6 268 -23 0 -23 -84 -46 -29 -99 -57 23 152 -34 159 149 74 134 -314 74 -134 -155
7040 -155 -235 -33 28 -227 -26 -161 102 -245 -104 158 86 85 -58 -33 -59 384 -22 258 248 81 -33 -70 327
7063 327 124 -83 -34 34 73 5 -101 143 25 -301 -53 -15 -288 265 -189 185 23 -6 168 96 -134 72
7085 72 -251 -56 -20 -237 105 80 -5 -41 130 12 -294 -207 139 331 65 216 -125 287 7 139 198 269 -100
$$ packed form
6922f4J28QK2k05K32j06j20k1J39m5O4J51k81M1P7j73k33L52L28n11K92j11j70
6945b06K65j71p6J20N0K51l37n6J92q2j19M3J32O1j04Q7o8l00K39P8j05K84k52
6968g4L6N9k2R4J8j98L3k25K32o0r3P3J18L7j95L47j89P5L19l88Q0l4l5J72m8
6993A32k78L13k78K8P0m01J93J84J64j65J00j72k1K41j82j7O6j33RJ18K02j27
7015D6j99J79q0J23o3K62k91K3k3o1L8J7p0M2Q0J29j86J93j0p5O0m48L88k08k1
7040a55q0K02O1k55K01j35K63l47J41K62p2jj43K5k6M43m06K80j0j67j14l7L97
7063C27k03k07M9O8L9o8j06K44j18l26K48L8k73N53m54L74j62k9J74p2k30K06
7085G2l23J95L6k17L42k5q5l6J71j18l06Q7L46J92k66J51l41M12k80J32N9P1l69
$$ plain form
7108 -100 -250 -70 5 155 15 53 -76 25 -38 -288 -187 -202 195 278 -59 107 17 -174 -50 111 -7 84
7130 84 -32 24 62 -204 110 -129 -98 -167 -120 171 -87 74 106 81 -181 130 -7 -61 -57 -48 188 -317 -39 175
7154 175 -64 158 193 -48 181 -30 173 60 -155 335 130 79 -28 156 71 -143 207 -210 64 -185 163
7175 163 146 -121 24 204 22 160 172 6 356 -23 -241 13 170 -51 126 -111 237 134 27 140 -32
7196 -32 17 208 140 29 5 146 -16 -137 -64 127 23 193 -315 199 240 60 136 75 -26 69 183 154 -35
7219 -35 -211 -242 102 156 49 92 11 -61 33 -14 93 -171 358 30 112 75 124 16 70 70 -190 22 64 -22 86
7244 86 7 -156 145 119 93 -211 274 -86 -4 -23 -256 25 -12 -60 133 106 -58 -136 -51 -28 10 -37 -83 161 -133
7269 -133 -396 209 -93 -196 123 -121 -143 76 267 -80 -312 91 65 -55 -11 297 -128 -471 -189 277 107
$$ packed form
7108a00j50J80P5J50j40L8j29J01o3k50J01j5L97Q3l37J66r0j91J24J61j18R1
7130H4j16N6L8k66L14k39L1o9M7K91k58J61L2k5k62L11j37n4MRK36n05K78K14
7154A75k39K22L5k41K29k11K03j13k15M90k05n1j07J84q5k14L50m17K74k49L48
7175A63j7k67J45J80j82J38J2j66L50l79k18K54J57k21J77k37L48j03j07J13j72
7196c2M9J91o8j11k4J41j62j21P3J91j04J70n08N14M1j80P6o1j01R5J14k9j89
7219c5j76l1L44N4j07M3q1p2R4m7J07k64N29l28Q2l7M9j08N4%k60K12M2q6J08
7244H6p9j63L01k6k6l04M85l60Q2j9k33K81l7m8J93k7j64p8Q5K3L8m7m6K44k94
7269a33k63O05l02j03L19k44k2K19J91l47k32M03k6j20M4L08m25l43K82M66j70
$$ plain form
7290 107 -109 137 55 -138 -14 -199 227 -97 -75 194 125 -94 18 -85 -94 -220 -215 -150 137 200 272 -125 212
7313 212 66 -158 8 18 45 -82 -82 4 -2 -104 -146 65 -208 139 -12 -59 -56 43 -254 245 -115 -64 -25 229 111
7338 111 76 286 -160 -256 64 -104 57 -78 -74 -82 112 268 -52 188 -69 -36 93 162 203 217 -94 218 159 -176
7362 -176 -163 16 -247 25 31 -186 -69 84 -14 -235 68 -147 -131 -193 137 -29 -68 -86 27 84 44 -186 -42
7385 -42 17 67 141 161 182 12 -140 150 -54 -206 -63 379 -150 -179 -144 -28 99 -213 334 -106 -172 76 -46
7408 -46 93 -148 -150 140 218 216 -148 116 -101 40 -147 70 132 96 -87 214 -33 7 -164 -229 -2 -292 130
7431 130 144 185 -1 1 185 -89 -70 -448 -150 -26 92 -197 202 68 307 83 -78 149 185 -83 -104 173
7453 173 135 139 213 -95 113 69 -174 -139 38 -39 10 -4 -306 -459 -138 -129 37 -291 173 126 24 103 24 23 2 -66
$$ packed form
7290A07k16K46q2j93J24j85M26l24K2K69o9k19J12j03rj26NO5K87O3P2l97L37
7313B12j46k24J66J0K7j27%Q6oj02m2K11k73L47j51m7LR9k97M99l60N1L9K54j18
7338A11l5K10m46r6L20j68J61j35MqJ94J56l20K40k57L3J29O9M1J4l11L12n9l35
7362a76J3J79k63K72Ok17J17J53r8k21L03k15J6o2L30j66l9j8J13N7m0k30J44
7385d2N9N0P4K0K1j70j52K90k04j52J43M42n29k9L5J16J27l12N47m40o6K48j22
7408d6J39k41kK90P8kl64K64k17J41j87K17O2l6j83L01k47M0j71o5K27k90M22
7431A30J4M1j86KJ84k74J9l78K98J24J18k89L99j34K39k24j61K27L6k68k1K77
7453A73l8MP4l08K08m4k43L5J77p7M9j4l02j53L21RJ66l28M64m7j02P9p9jk1o8
$$ plain form
7479 -66 97 284 81 62 -23 -48 67 167 -232 -13 -166 -11 154 -90 152 135 63 -20 56 183 -39 168 -9
7502 -9 -91 181 181 -185 -40 -76 -124 9 -97 -34 -13 140 12 54 103 51 -162 93 163 193 83 -26 -93 -45 -83 266
7528 266 -305 13 -6 -89 100 -83 -104 -149 -325 -65 298 87 43 -22 10 -57 -104 54 -29 -58 73 54 -120 182
7552 182 -26 -120 150 -188 -207 45 85 3 -110 103 -3 3 141 -59 -53 391 131 -90 289 60 -121 14 -115
7575 -115 35 0 -205 57 -165 158 15 -97 149 266 -8 85 -15 -201 38 9 144 14 15 -41 -180 -46
7597 -46 -244 -51 112 467 94 97 -153 32 54 42 -177 186 -76 152 88 -275 67 -84 -72 -38 142 214 281
7620 281 284 234 139 65 147 -81 71 7 81 -52 -31 161 -80 -8 -167 35 270 234 20 42 129 1 -187 140
7644 140 -285 96 14 0 162 -19 -243 -27 -84 -36 -192 -12 246 -138 254 44 -14 -231 -198 35 40 -158 -125
$$ packed form
7479f6J63J87k03j9q5k5J15J00l99K19j53J55J65k44K42j7p2q3P6J27k22K07j77
7502iq2K72%l66J45l6m8J33j06O3K1J53j28M2M9n2k13K55P0L0j10j09o7M8l8L49
7528B66n71L18j9q3J89j83k1m5j76K60L63k11m4o5L2o7m7J58q3k9J31j9j74L02
7552A82k08r4K70l38j9K52M0q2j13K13j06OJ38k00OM44k60k21L79k29j81J35j29
7575a15J50l5k05K62k22L23j43j12K46J17k74R3j00j86K39k9J35j30Jn6j39J34
7597d6j98J93J63L55l73Lk50J85K2j2k19L63k62K28o4l63L42j51J2L4J80P2O7
7620B81Ln0r5p4Q2k28J52o4P4j33K1J92k41P2j59K02K35l6k14K2Q7j28j88L27
7644A40m25L81q2j4J62j81k24K16n7M8j56J80K58l84L92k10n8k17L3K33Nj98L3
$$ plain form
7667 -125 84 -47 -283 -51 -127 -95 174 16 -35 163 -120 -115 -202 12 115 135 141 135 83 -158 -226 -212 -211 145 251
7692 251 -95 -156 86 -290 -12 86 67 46 -48 -145 9 194 -262 -27 79 -46 430 54 82 239 243 -3 -179
7715 -179 -221 193 19 -49 252 -74 264 146 -239 -62 2 -58 -146 297 192 57 -241 -47 -240 -26 -35 147
7737 147 59 0 135 74 -90 -80 -97 33 45 -69 -4 41 -243 -130 -55 85 217 -302 177 84 -58 -2 190 -41
7761 -41 -29 -113 -261 184 -19 -86 -264 225 -166 -162 -257 -37 76 -169 -388 -58 -68 -176 -13 -354 -6 -11 -213
7784 -213 97 -101 -313 31 -253 370 -162 221 -153 -38 -205 -190 133 -51 235 -25 -7 -84 -65 34 188 -104
7806 -104 139 -99 -10 151 -237 120 12 274 30 223 206 359 144 23 95 19 31 129 -144 74 16 156
7828 156 66 3 -24 -102 181 -374 -57 198 -172 235 -188 174 -23 -207 -106 -81 132 152 -257 -19 -5 4 -201
$$ packed form
7667a25K09j31k36K32p6L2K69j58n1J98k83Nq7K14J03K0Oon2k41o8J4JL56J06
7692B51l46o1K42l76K78R8j9k1r4r7J54J85m56K35J06j25M76l76K8J57Mk46j76
7715a79m2M14j74o8L01l26L38j18l85J77O4o0q8M43j05j35k98J94j93K14rJ82
7737A47q8n9J35o1j64J0j7J30J2j14O5M5k84J13P5J40J32n19M79r3j42N6J92k31
7761d1J2q4j48M45k03o7j78M89l91Mr5K20J13k45k19L30j0j08J63l41L48nk02
7784b13L10j98k12L44k84O23n32L83l74J15j67J5L23j84K86k60J8p7J9R9J54k92
7806a04K43k38Q9J61l88L57j08K62k44J93j7J53k15j21P2p6J2R8k73K18n8J40
7828A56r0o3k7p8K83n55L17K55l70M07m23L62j97j84J01K5K13K0m09K38J4Rk05
$$ plain form
7851 -201 66 -92 73 -22 -284 54 16 29 93 138 -42 202 132 54 -8 94 -220 134 220 217 -42 -45 97 107 221
7876 221 -89 -134 -236 127 -31 86 -86 -124 -45 108 290 -232 -54 83 -59 24 -23 80 121 -121 -158 199
7898 199 -141 159 -54 23 172 -254 -116 72 170 72 -61 52 111 -186 -194 -146 153 172 100 261 -28 -79 -79 79
7922 79 -180 -13 172 44 93 -75 131 180 83 -37 -223 236 65 41 -124 125 186 -7 -112 132 -124 40
7944 40 154 130 -65 144 47 132 3 -165 188 40 -17 92 -8 20 -234 -201 -122 -105 -45 -244 -108 54 -110
7967 -110 163 198 214 345 189 101 -190 93 73 -222 156 337 80 -388 328 -44 -228 94 -187 -33 -88 389
7989 389 -95 -275 199 91 -389 30 116 -80 88 109 17 -237 191 107 -175 -21 -30 -78 -131 40 124 411 -100
8012 -100 -149 86 114 84 47 -46 111 177 -418 -279 102 -19 -14 -38 132 -136 29 124 151 99 262 -376 -65 95
$$ packed form
7851b01K67j58J65r5k62L38l8J3O4M5j80K44p0p8o2J02l14L54Q6lk59lJ42J0J14
7876B21l10m5j02L63j58J17j72l8P9J53J82n22J78J37j42Q3m7J03M1k42l7L57
7898A99l40L00k13P7J49m26J38J88R8r8j33J13N9k97qM8K99J9p2J61k89n1%J58
7922G9k59J67J85j28M9j68K06M9r7j20j86M59j71k4j65K49O1j93j05K44k56J64
7944D0J14k4j95K09r7Q5j29j68L53j48n7J09j00K8k54L3P9J7O0j99J36J62j64
7967a10K73L5J6J31j56q8k91K83k0k95L78J81k57m68P16l72j84L22k81J54n5M77
7989C89m84j80M74j08m80M19Q6j96J68K1r2k54M28q4k82J54rm8n3J71Q4K87n11
8012a00m9K35K8l0l7r3J57O6n95J39L81j21Nk4J70k68J65R5K7n2J63o38L11J60
$$ plain form
8036 95 174 -181 339 153 62 -87 -149 91 -29 11 -83 79 198 -183 -355 179 19 28 -216 56 84 -59 55
8059 55 290 -33 280 -251 130 -67 1 79 38 23 -358 295 -272 18 -69 -250 -121 246 101 270 51 183
8081 183 -32 137 -291 35 127 -9 -94 51 121 351 125 -185 -173 -49 -274 96 69 290 161 -110 -70 91
8103 91 267 -39 8 161 120 -202 -72 -321 279 255 -94 209 31 219 452 31 250 31 99 -13 -259 -78
8125 -78 -24 -15 -249 -421 244 145 146 -8 -232 60 181 46 94 -235 -80 -140 -98 -152 226 76 -48 23 48 168
8149 168 -48 179 40 114 62 -111 -179 -25 -265 -71 -104 106 -163 168 -19 14 5 164 -114 -82 -16 -87 27
8172 27 -237 52 -70 -219 175 -68 -39 2 145 -186 -20 -372 -28 -179 -340 211 -23 -67 -13
$$ packed form
8036I5P9l55N20j86r1j49o2K40j20M0r4J62J19l81j72N34j60Rk44K72K8j43J14
8059E5K35l23L13n31L81j97O8P8m1j5l81O53n67K90q7j81J29L67j45J69k19J32
8081A83k15J69m28L26R2j36q5J45P0K30k26l10J2J24k25L70k7K21j29k71M0J61
8103I1J76l06M7J53m1l22J30k49O00k4l49L03j78J88K33m21K19k19O8j12k46J81
8125g8N4Rk34j72O65r9Jj54k24K92J21j35M8l29J55o0M2n4L78j50j24P1K5J20
8149A68k16K27j39P4n2j73o8J54k40J94l3K10k69L31j87L3rJ59k78L2O6p1J14
8172B7k64K89j22j49L94k43K9M1J43l31J66l52L44j51j61N51k34m4N4
8191a3
$$ Imaginary data points
##PAGE= N=2
##DATA TABLE= (X++(I..I)), XYDATA
$$ plain form
0 0 0 0 0 0 0 0 0 0 0 0 0 -8 8 -8 8 -8 10 -16 16 -18 24 -26 32 -34 41 -47 52 -60 69 -77 87 -98 110 -121 136
35 136 -152 170 -187 209 -231 256 -282 314 -347 384 -427 474 -529 592 -666 749 -853 978 -1140
54 -1140 1351 -1642 2069 -2758 4062 -7394 35276 44301 -35141 -12363 39471 24738 -23395 -5012
68 -5012 28585 19637 -11590 -8989 16570 24485 -4960 -15300 14539 25078 -9267 -12256 19483
81 19483 16758 -10824 -2871 14696 4919 -2800 6762 4513 -79 5442 3231 -2330 7099 7409 -5377
96 -5377 -1000 11011 -716 -7466 9361 7948 -10426 -3604 11076 945 -8395 696 5077 -1672
110 -1672 -4389 -4922 1424 7198 -5991 -16315 4616 15702 -12982 -21199 13025 14533 -20812 -16632
124 -16632 15602 8703 -18556 -12617 8833 6304 -9786 -13766 1456 12248 -5632 -21640 -178
$$ packed form
0@%%%%%%%%%%%qJ6j6J6j6J8k6L2l4M2n0N8o6P5q8R9j12J29j46J64j85K08k31K57
35A36k88L22l57L96m40M87n38N96o61P31q11R01j003J121j258J415j602J831k118
54a140K491k993L711m827O820j1456M2670R025p9442K2778N1834j4733m8133J8383
68e012L3597q948l1227K601K5559P915k9445j0340K9839J0539l4345k989L1739
81A9483k725k7582P953J7567r777p719R562k249m592N521k211n561R429L10j2786
96e377M377J2011j1727o750J6827j413j8374O822J4680j0131r340R091M381o749
110a672k717n33O346N774j3189j0324K0931J1086k8684q217L4224J508l5345M180
124a6632L2234o899k7259N939K1450k529j6090l980J5222J0792j7880j6008K1462
$$ plain form
137 -178 17494 -7198 -22069 4964 13826 -11578 -14431 6067 5907 -7678 -6251 -2479 -58 2618
151 2618 -4136 -9427 2509 6257 -9749 -8625 8461 3064 -11670 -2346 6977 -2696 -4862 2727
165 2727 125 -3525 1432 295 -3823 2303 2143 -3496 2125 4649 -4968 -1271 10370 924 -9518
180 -9518 5124 12895 -5664 -7361 11746 8725 -6829 -3443 8600 7997 -127 -3671 2158 11737
194 11737 4619 -9004 1160 18617 3685 -15501 3691 20106 -647 -11789 6772 13632
206 13632 -584 -5131 1996 7451 5712 -2512 -5587 7919 11810 -5454 -7988 10939 10092 -9060
220 -9060 -4757 11545 4799 -5191 -136 4277 1666 590 -786 -1192 4238 2509 -6932 -1291 7825
235 7825 -1827 -8442 3427 4386 -8299 -2753 7078 -2952 -8165 2384 2621 -7126 -3836 1721 -2158
$$ packed form
137a78J7672k4692j4871K7033Q862k5404k853K0498j60j3585J427L772K421K676
151B618o754n291J1936L748j6006J124J7086n397j4734R324R323r673k166P589
165B727k602l650M957j137m118O126j60n639N621K524r617L697J1641r446j0442
180i518J4642P771j8559j697J9107l021j5554L386J2043o03q124l544N829R579
194A1737p118j3623J0164J7457j4932j9186J9192J6415k0753j1142J8561O860
206A3632j4216m547P127N455j739q224l075J3506L891j7264k534J8927q47j9152
220i060M303J6302o746r990N055M413k611j076j376m06N430j729r441N641R116
235G825r652o615J1869R59j2685N546R831j0030n213J0549K37r747L290N557l879
$$ plain form
250 -2158 -3803 -3294 -4185 900 197 -8120 -6421 6253 177 -14512 -3102 10330 -3804 -14956
264 -14956 -811 7384 -5119 -9475 -1706 1504 -1117 -6099 -7895 1713 6701 -8309 -12467 5449
278 5449 7076 -10832 -9549 6691 3273 -9590 -4994 3938 2122 -2425 -4676 -2875 4173 3083
292 3083 -7006 -4180 8778 1449 -9777 461 9207 -2128 -5426 4221 3910 -2260 1236 2923
306 2923 -1122 2173 3986 -1224 574 5539 508 -782 4985 1965 -3406 4904 6657 -3835 -1633
321 -1633 9863 2593 -5996 3761 8968 -52 -2012 4134 4139 3044 1710 -1008 2998 8520 -333 -6088
337 -6088 6622 11094 -4791 -6613 9460 8227 -5445 -2224 6556 3987 -718 -1481 570 5831
351 5831 4060 -5112 -3547 9469 4146 -9431 -836 10609 107 -8764 1593 5670 -1871 -3504
$$ packed form
250b158j645N09q91N085p03q317J699J2674o076j4689J1410J3432j4134j1152
264a4956J4145Q195j2503m356P769L210k621m982j796R608M988j5010m158J7916
278E449J627j7908J283J6240l418j2863M596Q932j816m547k251J801P048j090
292C083j0089K826J2958p329j1226J0238Q746j1335l298R647l11o170L496J687
306B923m045L295J813n210J798M965n031j290N767l020n371Q310J753j0492K202
321a633J1496p270q589R757N207r020j960O146Nj095j334k718M006N522q853n755
337f088J2710M472j5885j822J6073j233j3672L221Q780k569m705p63K051N261
351E831j771r172J565J3016n323j3577Q595J1445j0502q871J0357M077p541j633
$$ plain form
365 -3504 194 -175 1304 -280 -4228 -665 4970 -3314 -7834 2826 3854 -6446 -3481 4450 -1848
380 -1848 -6175 1725 1312 -5729 -2314 1766 -3830 -3511 600 -1687 -3564 150 -2328 -4042 1757 -582
396 -582 -8022 -1947 5367 -4611 -9549 2811 4944 -6936 -6392 2904 1692 -4166 -3085 -1611 553
411 553 874 -5747 -5180 5583 3087 -9629 -4691 8852 1398 -10030 -634 7254 -990 -5180 177
426 177 2211 1219 -385 -3284 225 5851 117 -6032 3701 7731 -4050 -5216 5959 5631 -3753
441 -3753 -144 5069 533 951 3118 475 955 5311 1048 -1627 4369 4573 -1690 2073 5907 -1109
457 -1109 -956 6259 3081 -2977 3835 6531 -1251 -1571 5973 3653 -1426 1956 2807 1810 3329 897
473 897 -1423 4673 5471 -4284 -2092 8594 3888 -7208 -58 8192 863 -5477 1578 3701 880
$$ packed form
365c504L698l69J479j584l948L563N635q284m520J0660J028j0300K965P931o298
380a848m327P900m13p041L415M080n596L19M111k287j877L714k478j714N799k339
396e82p440O075P314r978m938J2360K133j1880N44R296j212n858J081J474K164
411E53L21o621N67J0763k496j2716M938J3543p454j1428R396P888q244m190N357
426A77K034r92j604k899L509N626n734o149R733M030j1781j166J1175l28r384
441c753L609N213m536M18K167k643M80M356m263k675N996K04o263L763L834p016
457a109J53P215l178o058O812K696p782l20P544k320n079L382Q51r97J519k432
473H97k320O096P98r755K192J0686m706j1096P150Q250p329o340P055K123k821
$$ plain form
488 880 -251 -1456 -186 4622 671 -6639 1008 7344 -3057 -7892 4345 5017 -4725 -4489 3045
503 3045 1201 -2346 -1363 -2468 -608 1659 -3009 -5345 1995 1897 -6367 -4614 3579 -832 -6898 -1270
519 -1270 1997 -3497 -3060 1373 -2142 -2728 154 -1940 -4502 119 -685 -3979 -753 479 -4325 -1865
535 -1865 2805 -2452 -5213 1396 1935 -6568 -2775 4135 -466 -5657 -475 2059 -1702 -1605 -1822 -1107
551 -1107 2661 640 -5771 -455 7178 -1074 -7210 2700 7290 -2800 -4142 4091 4029 -2043 -798
566 -798 1603 2822 3153 -1372 -2272 4663 5096 -3212 -2312 7060 3046 -4643 773 6688 1505 -1617
582 -1617 2462 2051 137 2087 935 403 4379 1931 -1784 1936 5283 99 -1230 5542 3411 -1888
598 -1888 2055 4978 -368 -1094 4344 1542 -1664 1768 3464 605 733 1649 137 1945 2034 -1835
$$ packed form
488H80j131j205J270M808l951p310P647O336j0401m835J2237O72r742K36P534
503C045j844l547R83j105J860K267m668k336P340r8q264J753Q193m411o066N628
519a270L267n494M37M433l515n86K882k094k562M621q04l294L226J232m804K460
535a865M670n257k761O609N39q503L793O910m601n191N182K534l761R7k17P15
551a107L768k021o411N316P633q252o136R910M590j0090j342Q233o2o072J245
566g98K401J219L31m525r00O935M33q308R00R372m014p689N416N915n183l122
582a617M079m11j914J950j152n32L976k448l715L720L347n184j329O772k131n299
598a888L943K923n346p26N438k802l206L432J696k859J28R16j512J808Q9l869
$$ plain form
614 -1835 -337 5345 583 -5038 1867 6088 -2096 -4777 2502 3550 -3037 -1818 962 511 112 -1577
630 -1577 -3806 1123 4294 -3663 -4949 4227 1955 -6288 -2751 4654 -1927 -5622 -1033 1334 -1250
645 -1250 -1868 -2207 -2340 275 -850 -5045 -3105 2799 -2458 -6361 -428 2467 -4626 -4176 981 -1591
661 -1591 -3316 -1304 -1308 -3275 -478 137 -3693 -800 686 -2841 -2939 1406 -1657 -4062 1043 961 -4296
678 -4296 -1623 3153 -849 -4384 1670 2197 -2138 -1632 1231 482 634 850 -1356 1049 4071 -1151
694 -1151 -3858 4103 4791 -3989 -1821 6229 3045 -3334 897 4274 1889 274 459 1159 3604 2642
710 2642 -2065 -568 6548 2429 -4815 2849 7049 -379 -2700 3922 4008 -96 785 2122 1366 2060
726 2060 1520 -463 2504 4344 -997 -1694 4322 3038 -2097 1155 4986 -466 -1138 3242 1484 -1952
$$ packed form
614a835J498N682m762n621O905M221q184k681P279J048o587J219K780m51l99j689
630a577k229M929L171p957j286R176k272q243L537P405o581l695M589K367k584
645a250o18l39j33K615j125m195J940N904n257l903N933K895p093M50N157k572
661a591j725K012mj967K797O15l830K893J486l527r8M345l063k405N105q2n257
678d296K673M776m002l535O054N27m335N06K863p49J52K16k206K405L022n222
694a151k707P961O88q780K168Q050l184o379M231L377k385j615J85P00K445r62
710B642m707J497P116m119p244P664M200p428k321O622Q6m104Q81J337p56O94
726B060n40j983K967J840n341o97O016j284n135L252L831n452o72M380j758l436
$$ plain form
742 -1952 2273 2365 -1614 -350 2314 -179 -1264 1828 -784 -2057 1901 200 -3843 932 3278 -3129
758 -3129 -4119 3428 1046 -4234 -1558 2573 -1377 -1889 -650 -1065 -381 583 -3257 -3008 2832 -8 -6177
775 -6177 -1883 4023 -2135 -5418 355 1886 -2981 -2499 -86 -519 -1028 -1696 -2685 -471 2020 -2783
791 -2783 -4705 2223 2105 -4825 -2694 3349 -745 -4758 -327 891 -2198 -1612 832 -1515 -480 857
807 857 -1985 -1851 1709 300 -2565 1789 1804 -2300 -1071 3643 -898 -2782 3039 2549 -2713 -317
823 -317 3733 -84 -1043 2056 1567 -477 1620 673 -836 2829 2578 -2707 -329 5255 1271 -3325
839 -3325 2229 4900 -830 -797 2330 2465 1602 1576 -247 1090 4650 1061 -2902 3065 5126 -1558 -2087
856 -2087 5210 4115 -2658 -220 4144 1007 -467 1763 680 1076 1748 -831 -669 3724 1551 -2994
$$ packed form
742a952M225R2l979J264K664k493j085L092k612j273L958j701m043M775K346o407
758c129r90P547k382n280K676M131l950n12J239m15O84R64l840K49N840k840o169
775f177M294N906o158l283N773J531m867M82K413m33n09o68r89K214K491m803
791b783j922O928j18o930K131O043m094m013M431J218l089N86K444k347J035J337
807H57k842J34L560j409k865M354J5m104J229M714m541j884N821m90n262K396
823c17M050l817r59L099m89k044K097r47j509L665k51n285K378N584l984m596
839c325N554K671n730L3L127J35q63k6j823J337L560l589l963N967K061o684n29
856b087P297j095o773K438M364l137j474K230j083L96O72k579J62M393k173m545
$$ plain form
872 -2994 920 4463 -1124 -1779 3495 2196 -2518 159 1732 -1457 -292 1822 -1069 -1568 280 929
888 929 -1609 132 457 -2405 -951 1533 -2290 -2154 1621 260 -4043 -531 1692 -2196 -2975 450
904 450 -390 -2002 -1327 -1280 -1585 730 -871 -4592 -921 2692 -3183 -5021 1137 1373 -5349 -3039 1892
921 1892 -129 -2720 -1906 -1084 -1179 -86 -2509 -2205 1828 484 -4955 -1766 3290 -722 -4638 1292
937 1292 2367 -2282 -2109 1568 15 -1496 444 -547 -801 1707 601 -1988 631 2224 -1006 -875
953 -875 2703 277 -1664 1485 2505 -1453 744 3614 263 -1286 2624 1551 -174 1480 1755 51
969 51 794 2606 -1328 1306 4413 713 -2153 2681 3471 -1223 -754 3866 1896 -1118 595 2089
985 2089 999 1398 287 -530 2730 2922 -1757 -493 4571 1282 -3422 593 3675 -262 -1262 2430
$$ packed form
872b994L914L543n587o55N274j299m714K677J573l189J165K114k891m99J848O49
888I29k538J741L25k862J454K484l823J36L775j361m303L512K223l888p79L425
904D50q40j612O75M7l05K315j601l721L671L613n875j838O158K36o722K310M931
921A892k021k591Q14Q22r5J093k423L04M033j344n439L189N056m012l916N930
937A292J075m649J73L677j553j511J940r91k54K508j106k589K619J593l230J31
953h75L578k426j941L149J020l958K197K870l351j549L910j073j725J654K75j704
969E1P43J812l934K634L107l700k866M834P90m694M69M620j970l014J713J494
985B089j090L99j111q17L260J92m679J264N064l289m704M015L082l937j000L692
$$ plain form
1001 2430 1036 -969 717 15 -510 1543 -359 -2682 -100 3097 -1871 -2679 1475 1102 -2721 -67
1017 -67 2034 -1462 -1670 735 -922 -1840 472 -53 -2588 191 799 -2672 -1352 829 -1565 -2676
1033 -2676 663 -458 -2802 -141 1638 -2840 -3257 1062 -518 -3065 -249 58 -1589 -1058 -617 -2811
1049 -2811 -334 1360 -2519 -3112 1883 309 -4207 -1756 2498 -943 -3880 225 423 -1197 -1501 -285
1065 -285 -903 982 68 -2382 -515 3038 -1619 -3763 2070 1921 -2726 -1019 2878 573 -1371 729
1081 729 1438 -540 1265 985 -1290 688 2403 -1081 -412 2301 893 -1380 1456 3146 -534 -126
1097 -126 3064 486 -504 1939 1944 -642 692 1699 256 151 2087 -81 409 2928 1022 -903 2202
1114 2202 3462 -1609 491 4097 802 -1599 987 2977 -161 -84 1437 570 643 1648 -576 -184
$$ packed form
1001B430j394k005J686p02n25K053j902k323K582L197m968q08M154l73l823K654
1017f7K101l496k08K405j657r18K312n25k535K779O08l471J320K181k394j111
1033b676L339j121k344K661J779m478m17M319j580k547K816L07j647N31M41k194
1049b811K477J694l879n93M995j574m516K451M254l441k937M105J98j620l04J216
1065b85o18J885r14k450J867L553m657k144N833j49m647J707L897k305j944K100
1081G29P09j978J805k80k275J978J715l484O69K713j408k273K836J690l680M08
1097a26L190k578r90K443Nk586J334J007j443j05J936k168M90K519j906j925L105
1114B202J260n071K100L606l295k401K586J990l138P7J521q67P3J005k224L92
$$ plain form
1130 -184 2525 -241 -2811 845 3333 -1640 -2000 2271 1153 -1297 34 958 -728 -409 -80 -1187
1146 -1187 -66 1227 -1572 -2618 1199 1255 -3098 -950 2326 -1268 -2295 670 164 -2086 -108 -241
1162 -241 -1883 -627 421 -1481 -1063 534 -1133 -3272 388 164 -3606 -1109 819 -2378 -2415 810
1178 810 49 -2934 -254 590 -2150 -1815 159 -678 -942 -7 -1091 -1861 741 425 -2887 -106 2002
1195 2002 -1310 -3288 1881 1691 -2229 -708 1077 -351 -364 962 -323 115 1511 -676 -1567 2051
1211 2051 1837 -2516 -916 3250 921 -1686 1242 2123 -632 124 1142 -265 473 2263 -812 -180
1227 -180 2769 931 -1324 1578 2958 -63 -173 3325 1168 -750 2440 1894 249 1313 2532 -453
1243 -453 505 2325 464 -566 1527 1141 -395 1463 1688 -1239 119 2929 612 -1503 996 2571
$$ packed form
1130a84K709k766k570L656K488m973l60M271j118k450J331R24j686L19L29j107
1146a187J121J293k799j046L817N6m353K148L276l594j027K965n06k250J978j33
1162b41j642J256J048j902M18J597j667k139L660k24l770K497J928l197l7L225
1178H10p61k983K680Q44k740L35J974q37k64R35j084p70K602l16l312K781K108
1195B002l312j978N169j90l920J521J785j428j3J326j285M38J396k187q91L618
1211B051k14m353J600M166k329k607K928Q81k755P56J018j407P38J790l075O32
1227a80K949j838k255K902J380l021j10L498k157j918L190n46j645J064J219k985
1243d53R58J820j861j030K093l86j536J858K25k927J358K810k317k115K499J575
$$ plain form
1259 2571 -1341 -596 2657 907 -326 353 -241 -558 1569 389 -1619 719 1696 -2429 -1219 2704
1275 2704 560 -2779 184 2057 -993 -1509 831 126 -1091 372 -884 -1638 1076 417 -3135 -164
1291 -164 1343 -1438 -2260 1145 122 -2426 -836 -49 -1392 -1506 445 -1317 -2149 515 -985 -2338
1307 -2338 482 426 -1740 -1120 393 -1489 -1759 791 -557 -2272 119 319 -1707 -178 496 -858
1323 -858 -1421 569 13 -1349 497 453 -2259 -37 1889 -976 -1724 1983 1124 -2109 -196 2679 12
1340 12 -1146 1023 38 173 983 194 -1060 1526 1417 -1574 -132 2826 91 -1620 2152 1451 -1058
1357 -1058 517 1922 430 183 1698 476 419 2358 1476 -717 1699 3053 -436 -151 2474 1298
1373 1298 -791 1672 1953 -330 443 2365 126 132 1675 1166 -283 1414 1589 -946 716 1762 -713
$$ packed form
1259B571l912P45L253j750j233O79n94l17K127j180k008K338R77m125J210L923
1275B704k144l339K963J873l050n16K340p05j217J463j256p54K714o59l552K971
1291a64J507k781q22L405j023k548J590P87j343j14J951j762q32K664j500j353
1307b338K820n6k166O20J513j882k70K550j348j715K391K00k026J529O74j354
1323h58n63J990n56j362J846m4k712K222J926k865p48L707q59l233J913K875k667
1340A2j158K169r85J35Q10p89j254K586j09k991J442K958k735j711L772p01k509
1357a058J575J405j492k47J515j222n7J939q82k193K416J354l489K85K625j176
1373A298k089K463K81k283P73J922k239OJ543n09j449J697J75k535J662J046k475
$$ plain form
1390 -713 -137 1843 550 -1636 1415 2002 -2056 -497 1779 -269 -1581 1084 315 -1473 296 336
1406 336 -1523 -91 712 -1552 -1531 2180 -550 -3264 357 1341 -1613 -1937 681 -402 -1860 -515
1422 -515 -811 -1438 166 -949 -2487 -522 1096 -1984 -2518 849 -29 -3206 -1074 1024 -1768 -1945
1438 -1945 4 -738 -1742 212 -637 -1893 10 580 -1491 -1057 1323 -921 -1754 762 571 -2019
1454 -2019 -70 1129 -618 -1580 1035 192 -1459 1031 326 -616 433 1220 -692 -671 1326 -377 -1511
1471 -1511 1750 981 -1843 41 2126 -251 -647 1607 1308 -327 941 1158 -529 623 1772 -255
1487 -255 1062 2519 688 -986 2418 2073 -603 170 2522 474 -886 1876 976 173 1130 1079 -232
1504 -232 571 2640 -617 -307 2336 712 -1523 1387 3023 -499 -259 1531 435 -960 792 733
$$ packed form
1390g13N76J980j293k186L051N87m058J559K276k048j312K665p69j788J769M0
1406C36j859J432Q03k264K1L711k730k714L621R84k954l24K618j083j458J345
1422e15k96o27J604j115j538J965J618l080n34L367q78l177K132K098k792j77
1438a945J949p42j004J954q49j256J903N70k071M34K380k244q33K516j91k590
1454b019J949J199j747r62K615q43j651K490p05r42J049P87j912K1J997j703j134
1471a511L261p69k824J884K085k377l96K254k99j635J268K17j687J152J149k027
1487b55J317J457j831j674L404l45k676P73K352k048j360K762r00q03R57n1j311
1504b32Q03K069l257L10K643j624k235K910J636l522K40J790j096j395J752n9
$$ plain form
1520 733 -1107 565 917 -885 226 1431 -779 -815 946 358 -1674 553 1104 -1424 -559 1594 -454
1537 -454 -1874 383 513 -1320 -623 700 -1185 -804 0 -1230 -1305 563 -273 -2240 395 705 -2116
1554 -2116 -2171 819 -423 -2355 4 -134 -1243 -885 -415 -1564 -857 209 -826 -1669 1033 348 -2507
1571 -2507 -492 1012 -1978 -1687 634 26 -1667 -150 304 -1193 159 655 -935 -679 1075 -1029
1587 -1029 -1642 1215 685 -1393 -613 1219 -641 -1069 819 605 -1088 607 965 -907 -107 1380 73
1604 73 -548 901 -10 -614 1020 1090 -919 844 1610 -302 -887 2229 1326 -728 174 1635 -283 82
1622 82 1682 364 -68 1296 419 -301 1731 1287 -1029 881 2638 468 -909 1112 1583 115 183
1639 183 1395 619 390 890 -76 -156 1626 648 -1324 733 1708 -1262 -1367 1626 290 -1187 534
$$ packed form
1520G33j840J672L52j802J111J205k210l6J761n88k032K227N51k528Q65K153k048
1537d54j420K257J30j833O97J323j885L81Q04j230p5J868q36j967K635L10k821
1554b116n5K990j242j932K359j38j109L58M70j149P07J066j035q43K702o85k855
1571b507K015J504k990K91K321o08j693J517M54j497J352M96j590K56J754k104
1587a029o13K857n30k078P80J832j860m28J888k14j693J695L58j872Q00J487j307
1604G3o21J449r11o04J634P0k009J763P66j912n85L116r03k054R02J461j918L65
1622H2J600j318m32J364q77p20K032m44k316J910J757k170j377K021M71j468O8
1639A83J212p76k29N00r66q0J782r78j972K057R75k970j05K993j336j477J721
$$ plain form
1656 534 750 -657 301 542 -920 -694 629 -1094 -865 348 307 -1710 56 1041 -1377 -986 1345
1673 1345 -898 -1667 409 -518 -1553 -820 244 -738 -1086 772 -711 -1548 60 -548 -1778 -485 530
1690 530 -1834 -1472 723 -792 -2017 265 537 -1279 -1230 294 -643 -454 526 -482 -1053 209 60
1707 60 -1842 -266 900 -1069 -1176 1100 259 -1524 20 578 -809 -810 1184 -608 -423 1242 -227
1724 -227 -1267 1149 733 -1285 -1 1301 112 -1114 923 604 -175 899 1223 -410 29 1208
1740 1208 260 -26 1141 615 -860 1053 1755 -590 777 1932 7 -340 1530 1247 -864 703
1756 703 2032 -97 9 1198 1474 -87 910 445 -770 934 1142 -676 573 1892 78 -834 1253
1773 1253 1626 -751 -365 1283 -56 -450 862 300 22 595 532 -827 492 1041 -689 -532 1282
$$ packed form
1656E34K16j407R58K41j462K26J323j723K29J213m1k017J766R85k418L91K331
1673A345k243p69K076r27j035P33J064r82l48J858j483q37J608o08j230J293J015
1690E30k364L62K195j515j225K282K72j816M9J524r37J89R80j008n71J262j49
1707F0j902J576J166j969j07K276q41j783J544N58j387jJ994j792J85J665j469
1724b27j040K416m16k018J284J302j189j226K037l19p79J074L24j633M39J179
1740A208r48k86J167n26j475J913P02k345J367J155j925l47J870k83k111J567
1756G03J329k129J06J189K76j561R97m65j215J704K08j818J249J319j814r12K087
1773A253L73k377L86J648j339l94J312n62k78N73o3j359J319N49j730J57J814
$$ plain form
1790 1282 20 -2258 328 888 -1174 -469 822 -751 -1135 85 -272 -1498 458 15 -1150 -439
1806 -439 640 -1005 -1611 209 -565 -1845 -77 -187 -1792 -670 667 -1114 -1783 357 -441 -1563
1822 -1563 -238 -469 -1515 -382 678 -1051 -1063 658 -449 -1192 486 1050 -1581 -911 606 -449
1838 -449 -1489 143 -1 -812 -378 161 -1297 69 888 -1041 -1402 954 391 -1475 450 1331 -641
1855 -641 -1234 938 481 -260 608 720 -623 229 1171 -494 -301 1621 -349 -857 1113 1388 -148 935
1873 935 1373 -82 -632 1738 963 110 903 1015 -426 857 1633 496 -12 1223 473 -663 1620
1890 1620 854 -85 280 1785 -133 13 1683 753 -446 394 475 -120 192 619 57 307 1028 -182
1908 -182 -798 1025 965 -585 -111 1333 -97 -894 332 477 -979 104 172 -968 116 476 -768
$$ packed form
1790A282j262k278K586N60k062P05J291j573l84J220l57j226J956m43j165P11
1806d39J079j645o06J820p74j280J768j10j605J122J337j781o69K140p98j122
1822a563J325k31j046J133J060j729j2J721j107p43J678N64k631O70J517j055
1838d49j040J632j44q11M34N39j458J366Q19j929l61K356n63j866J925Q81j972
1855f41n93K172m57p41Q68J12j343Q52R42j665J93J922j970n08J970K75j536J083
1873I35M38j455n50K370p75q53P93J12j441J283P76j137n08J235p50j136K283
1890A620p66r39L65J505j918J46J670r30j199Q40Q1n95L12M27n62K50P21j210
1908a82o16J823o0j550M74J444j430p97J226J45j456J083O8j140J084L60j244
$$ plain form
1925 -768 -743 884 -465 -1344 669 817 -1620 -787 482 -649 -835 22 -85 -1492 -212 279 -1134
1942 -1134 -467 227 -1191 -1426 408 -262 -1592 -402 452 -1380 -889 919 -357 -1162 -69 2 -1437
1959 -1437 -421 188 -1218 -1115 -93 -822 -1382 297 -370 -1199 -158 386 -1043 -738 616 -454 -1467
1976 -1467 505 434 -384 -101 750 -30 -235 866 -365 -943 1210 299 -953 156 1441 -201 -566
1993 -566 1194 384 -823 148 519 -488 638 1281 -61 550 1712 86 -648 1096 1211 -686 210
2010 210 1835 392 72 1262 757 76 464 658 198 653 1301 408 -332 1284 186 -568 963 702
2028 702 -813 589 1158 -203 -169 977 463 -478 534 1080 -242 -36 1118 -219 -65 726 -199 -829
2046 -829 447 373 -798 -208 831 -119 -1002 632 295 -542 -290 333 -878 -94 414 -789 -748 615
$$ packed form
1925g68K5J627j349q79K013J48k437Q33J269j131j86Q57j07j407J280M91j413
1942a134O67O94j418k35J834o70j330J190Q54j832M91J808j276q05J093P1j439
1959a437J016O09j406J03J022p29n60J679o67q29J041N44j429L05J354j070j013
1976a467J972p1q18K83Q51p80k05J101j231n78K153r11j252J109J285j642l65
1993e66J760q10j207R71L71j007J126O43j342O11J162j626p34J744J15j897Q96
2010B10J625j443l20J190n05o81L88J94m60M55O48q93p40J616j098p54J531k61
2028G02j515J402N69j361L4J146n14r41J012N46j322K06J154j337J54P91r25o30
2046h29J276p4j171N90J039r50q83J634l37q37K52O23j211P84N08j203M1J363
$$ plain form
2064 615 -18 -886 -309 188 -1072 -983 796 -546 -1275 139 127 -1282 -758 -139 -1096 -1048 -83 -1049 -860
2083 -860 414 -379 -1195 -620 344 -1288 -603 307 -542 -1292 163 554 -994 -446 6 -755 -725 640 -135
2102 -135 -573 469 293 -875 -335 492 -902 -457 912 107 -884 455 508 -492 -396 975 -251 -401
2120 -401 908 152 -148 748 458 -726 214 1331 -360 -369 1169 462 -660 760 1399 434 146 926
2138 926 226 -107 890 483 -174 1176 1163 -722 378 1773 402 -136 1064 1031 -405 473 1197 -24
2156 -24 251 1005 504 -591 958 -62 -744 386 764 -425 13 1275 -208 -672 791 350 -645 450
2174 450 1200 -402 -429 438 -351 -573 324 13 -1328 -198 465 -885 -760 289 -575 -1180 282 131
2192 131 -1136 -654 212 -841 -793 -165 -432 -694 -78 -11 -913 -430 178 -1332 -840 979 -522 -964 6
$$ packed form
2064F15o33q68N77M97j260Q9J779j342p29J414j2j409N24O19r57M8R65r66J89
2083h60J274p93q16N75R64j632O85R10q49p50J455L91j548N48M52p61L0J365p75
2102a35m38J042j76j168N40Q27j394M45J369q05r91J339N3j000R6J371j226j50
2120d01J309p56l00Q96k90j184R40J117j691rJ538p07j122J420O39r65k88P80
2138I26p00l33R97m07o57J350j3j885J100J395j371n38J200l3j436Q78P24j221
2156b4K75P54n01j095J549j020o82J130L78j189M38J262j483m64J463m41r95J095
2174D50P50j602k7Q67p89k22Q97l11j341J130O63j350J25J049q64o05J462j51
2192A31j267M82Q66j053M8O28k67k62O16O7r02M83O08j510M92J819j501m42R70
$$ plain form
2211 6 298 -1062 -484 641 -1024 -982 9 -113 -625 382 -263 -894 -218 698 -847 -486 626 162 -1013
2230 -1013 116 596 -660 -382 443 -855 -550 596 115 -522 510 701 -376 177 550 -160 -442 897
2248 897 251 -650 453 1007 -313 167 1149 89 -176 1136 503 -416 702 778 -314 90 1254 -236
2266 -236 -61 933 545 -605 609 1491 162 -276 1099 571 -365 598 723 25 331 1050 -230 196
2284 196 766 112 -200 948 844 -327 -387 986 172 159 901 470 -298 619 447 -528 555 666 -366
2303 -366 -174 1176 53 -586 353 548 -760 -326 147 -482 -642 209 -154 -995 410 131 -525 -485 79
2322 79 -873 -345 287 -703 -1173 160 137 -1001 -350 462 -744 -1203 177 -182 -1094 -481 11 -854 -377
2341 -377 -211 -1003 -700 500 -692 -942 -148 473 -1298 -807 330 -485 -961 64 168 -595 169 235 -889
$$ packed form
2211FK92j360N78J125j665M2R91j22n12J007o45o31O76R16j545L61J112m64j175
2230a013J129M80j256K78Q25j298L05J146m81o37J032J91j077N53L73p10k82J339
2248H97o46r01J103N54j320M80R82j060k65J312o33r19J118P6j092M04J164j490
2266b36J75R94l88j150J214Q82j329m38J375n28r36R63J25o98L06P19j280M26
2284A96N70o54l12J148j04j171o0J373q14j3P42m31p68R17j72r75J083J11j032
2303c66J92J350j123o39R39J95j308M34M73o29j60Q51l63q41J405k79o56M0N64
2322G9r52N28O32r90m70J333k3j138O51Q12j206m59J380l59r12O13M92q65M77
2341c77J66p92L03J200j192k50P94O21j771M91J137q15m76J025J04p63P64O6j124
$$ plain form
2360 -889 -298 271 -217 -725 776 180 -1009 -45 499 -438 -531 780 -99 -675 510 222 -463 426 857
2379 857 -252 128 872 45 -55 482 578 -278 328 963 -27 152 1098 316 -275 949 848 -466 590
2398 590 844 -102 -152 491 338 -380 845 694 -486 456 1403 -241 -66 878 316 -219 709 572 -317
2417 -317 203 607 79 205 663 223 -181 710 407 -578 289 874 77 -571 279 406 -157 233 415 -336
2437 -336 235 685 -389 -639 674 -54 -871 268 175 -967 -509 665 -461 -1028 399 -40 -1016 20
2455 20 -138 -725 -190 424 -776 -573 307 22 -903 254 250 -830 -625 343 -612 -946 153 -129 -1255
2474 -1255 -149 242 -884 -759 6 -439 -802 389 -114 -830 -18 351 -958 -558 628 -414 -627 298
2492 298 301 -488 -233 342 -463 -325 483 -194 -215 384 442 -842 28 649 -322 6 959 170 -259 445 784
$$ packed form
2360h89N91N69m88n08J501n96j189R64N44r37r3J311q79n76J185k88o85Q89M31
2379H57j109L80P44q27j00N37R6q56O06O35r90J79R46p82n91J224j01j314J056
2398E90K54r46n0O43j53p18J225j51j180R42R47j644J75R44n62n35R28j37q89
2417c17N20M04n28J26M58m40m04Q91l03r85Q67N85p97o48Q50J27n63L90J82p51
2437c36N71M50j074k50J313p28q17J139r3j142M58J174j126n67J427m39r76J036
2455B0j58n87N35O14j200K03Q80k85r25J157mj080K05R68r55l34J099k82j126
2474a255J106L91j126J25P65m45l63J191n03p16Q12L69j309M00J186j042k13R25
2492B98Lp89K55N75q05J38Q08o77k1N99N8j284Q70O21r71L28R53p89m29P04L39
$$ plain form
2513 784 -11 306 555 -41 188 870 231 -134 791 522 -237 651 854 -198 -51 874 648 -340 636 805
2533 805 -410 111 1070 115 29 689 140 -18 807 619 126 299 882 -257 -406 911 103 -574 539
2552 539 634 -87 -339 452 58 -403 609 192 -344 477 180 -327 129 775 -406 -750 522 406 -326
2571 -326 111 550 -697 -426 95 -304 -808 301 -144 -806 162 257 -583 -561 184 -503 -862 280 218 -1038
2591 -1038 -591 261 -791 -632 351 -256 -677 119 332 -522 -134 85 -920 -490 233 -446 -601 107 195
2610 195 -1026 73 133 -388 -213 292 -70 -759 106 181 -524 165 73 -472 -490 791 -48 -846 298 697
2630 697 -332 8 513 -412 -223 486 237 -97 -18 576 -321 372 644 -198 -33 998 257 -466 286 820
2650 820 -322 150 912 96 -126 532 628 32 512 896 -168 531 698 10 5 779 146 -308 432 991
$$ packed form
2513G84p95L17K49n96K29O82o39l65R25k69p59Q88K03j052J47R25k26r88R76J69
2533H05j215N21R59r55q6O60n49j58Q25j88m93J73N83j139j49J317q08o77J113
2552E39R5p21k52P91l94m61J012m17n36Q21k97n07M56O46j181l44J272j16p32
2571c26M37M39j247K71N21l99n04J109m45o62R68R5q40K2P45o87l59J142o2j256
2591a038M47Q52j052J59R83o07m21P96K13q54L88K19j005M30P23o79j55P08Q8
2610A95j221J099O0n21J75N05l62o89Q65P5p05O89r2n45j8J281q39p98J144L99
2630F97j029L40N05r25J89P09k49l34P9N94q97O93K72q42J65J031p41p23P52N34
2650H20j142M72P62q16k22O58R6n96M80L84j064O99J67o88nP74o33m54P40N59
$$ plain form
2670 991 -38 108 981 251 -245 496 574 -575 401 431 -102 103 855 -351 30 726 393 -531 241 602
2690 602 -383 -65 725 -403 -566 523 265 -558 120 373 -624 -343 355 -155 -890 414 229 -747 94
2709 94 494 -517 -376 193 -436 -877 184 -182 -724 86 100 -727 -394 107 -351 -979 309 66 -935
2728 -935 -391 -88 -603 -740 121 -306 -629 -14 -4 -747 -154 263 -992 -375 304 -331 -755 358 180 -1045
2748 -1045 -133 83 -206 -353 389 282 -765 136 285 -232 84 275 -316 -187 556 75 -471 427 118
2767 118 -499 12 407 -182 -444 546 213 -281 217 526 156 43 820 302 83 737 553 -659 611
2786 611 848 -240 138 1153 278 -407 747 292 -457 379 623 -120 244 769 115 -29 826 428 -392
2805 -392 321 629 123 140 998 72 -400 658 353 -125 433 574 -347 -99 630 313 -440 252 -31 -607
$$ packed form
2670I91j029J46Q73p30m96P41P8j149R76L0n33K05P52j206L81O96l33r24P72L61
2690F02r85L18P90j128j63J089k58q23O78K53r97K81O98n10p35J304j85r76Q41
2709I4M00j011J41N69o29m41J061l66n42Q10J4q27L33N01m58o28J288k43j001
2728i35N44L03n15j37Q61m27l23O15J0p43N93M17j255O17O79o35m24J113j78j225
2748a045R12K16k89j47P42j07j047R01J49n17L16J91n91J29P43m81n46Q98l09
2767A18o17N11L95n89k62R90l33m94M98L09l70j13P77n18k19O54j84j212J270
2786F11K37j088L78J015q75o85J154m55p49Q36K44p43L64N25o54j44Q55l98q20
2805c92P13L08n06J7Q58r26m72J058l05m78N58J41r21K48P29l17p53O92k83n76
$$ plain form
2825 -607 8 290 -569 -226 551 -301 -617 -44 -45 -598 -315 92 -632 -464 262 -512 -571 104 36 -834 -341
2846 -341 634 -580 -528 404 -433 -669 -187 -222 -712 -156 422 -682 -608 107 65 -986 89 198 -1114 -308
2866 -308 234 -362 -722 184 -114 -333 135 478 -411 -574 366 -524 -565 130 127 -396 176 -53 -819 135 666
2887 666 -129 -227 286 38 -507 171 272 -296 -221 287 199 -305 445 538 -354 80 347 -467 24 477 240
2908 240 43 422 935 -540 231 822 300 -242 868 107 12 595 9 -437 443 784 -402 -134 801
2927 801 122 -259 812 627 48 239 515 -332 178 548 259 232 476 700 -464 505 392 -234 30 666
2947 666 72 -601 538 601 -580 -34 581 -180 -443 451 -212 -392 -47 227 -622 -198 467 -399 -381 83
2967 83 108 -613 465 773 -572 -441 -97 -89 -440 284 -17 -884 340 179 -866 -64 345 -847 -928 70
$$ packed form
2825f07O15K82q59L43P77q52l16N73jn53K83M07p24J68P26p74n9O75o8q70M93
2846c41R75j214N2R32q37k36M82l5m90N56N78j104P4P15m2j051J075J09j312Q06
2866c08N42n96l60R06k98k19M68L43q89j63R40q90m1O95ln23N72k29p66R54N31
2887F66p95r8N13k48n45O78J01n68P5N08q8n04P50R3q92M34K67q14M91M53k37
2908B40j97L79N13j475P71N91n22n42J110p61r5N83n86m46Q80L41j186K68R35
2927H01o79l81J071j85n79J91K76q47N10L70k89k7K44K24j164R69j13o26K64O36
2947F66n94o73J139O3j181N46O15p61k63Q94o63j80L45K74q49M24O65q66J8M64
2967H3K5p21J078L08j345J31L44Ql51P24l01q67J224j61j045Q02M09j192q1R98
$$ plain form
2987 70 -22 -1009 102 346 -782 -1053 178 -558 -670 223 -242 -608 8 -88 -746 -586 458 -556 -692
3006 -692 245 259 -479 -260 -20 -848 -433 149 -56 -542 395 211 -625 265 276 -272 77 309 -3 -697 503
3027 503 647 -280 -332 753 -160 -14 498 264 108 526 101 -453 339 800 -144 -182 596 217 -346 514
3047 514 203 -224 -257 575 -1 -79 946 179 96 499 410 -253 453 651 26 58 613 197 -89 169 579
3068 579 -238 -64 539 -103 -228 388 249 -459 5 -362 -66 -179 761 -573 -353 357 430 -641 -187 741
3088 741 -233 -312 296 47 -388 151 -71 -761 152 446 -600 -215 198 -381 -326 382 -74 -464 35 285
3108 285 -432 -152 215 -204 -626 304 -112 -715 -494 110 -240 -319 488 -31 -650 333 -161 -738 -410 176
3128 176 -194 -709 83 -38 -393 0 -289 101 355 270 -104 -152 504 -483 -512 286 183 -230 238 537 161
$$ packed form
2987G0r2r87J111K44j128k71J231p36j12Q93m65l66O16r6o58J60J044j014j36
3006f92R37J4p38K19K40q28M15N82k05m86R37j84q36Q90J1n48L49K32l12o94J200
3027E03J44r27n2J085r13J46N12k34j56M18m25n54P92M61r44l8P78l79n63Q60
3047E14l11m27l3Q32n76p8J025p67q3M03q9o63P06J98o25L2N55m16k86K58M10
3068E79q17J74O03o42j25O16j39p08M64l67K96j13R40j334K20P10P3j071M54R28
3088G41r74p9O08k49m35N39k22o90R13K94j046L85M13n79N5P08m56l90M99K50
3108B85p17K80L67m19m22R30m16o03K21O04l50p9Q07n19o19R83m94n77L28N86
3128A76l70n15P92j21l55L93k89L90K54q5l74m8O56r87k9P98j03m13M68K99l76
$$ plain form
3149 161 -218 315 -148 -563 295 245 -315 -102 514 -281 -16 582 83 -494 156 649 -16 138 539 465 -120
3170 -120 220 -1 -249 381 637 160 180 533 13 -406 392 117 393 366 437 -174 22 573 -204 -573 431
3191 431 311 -164 389 125 -230 -39 728 50 -276 161 167 -431 728 160 -250 174 650 134 -404 353
3211 353 -85 -192 113 172 -146 -254 440 -375 -303 316 261 -425 -206 68 -337 -397 -34 -296 -181 -62 8 -641
3233 -641 -60 334 -108 -107 273 -581 -492 -149 -42 -677 -90 229 -554 -431 22 -318 -422 -91 15 -512 -185
3254 -185 428 -583 -448 92 -332 -194 -52 -32 -589 -293 338 -791 -198 116 5 -446 -3 189 -1009
3273 -1009 222 4 -105 -544 533 189 -615 561 274 -533 -304 516 133 -112 574 226 -54 137 426
3292 426 -507 99 382 235 -50 651 701 -257 109 726 -420 45 833 672 -19 273 182 -114 434 719
$$ packed form
3149A61l79N33m63m15Q58n0n60K13O16p95K65N98m99n77O50M93o65J54M01p4n85
3170a20L40k21k48O30K56m77K0L53n20m19P98k75K76k7P1o11J96N51p77l69J004
3191D31j20m75N53k64l55J91P67o78l26M37On98J159n68m10M24M76n16n38P57
3211C53m38j07L05N9l18j08O94q15P2O19n5o86K19K74m05o0L63k62J15J19P0o49
3233f41N81L94m42JL80q54Q9L43J07o35N87L19p83J23M53l40j04L31J06n27L27
3254a85O13j011J35N40m24J38J42K0n57K96O31j129N93L14j11m51M43J92j198
3273a009J231k18j09m39J077l44q04J176k87q07K29Q20l83k45O86l48k80J91K89
3292D26r33O06K83j47k85P01N0r58L66O17j146M65P88j61o91K92r1k96N48K85
$$ plain form
3312 719 -42 100 365 128 94 529 261 -169 -208 453 -692 651 604 -90 49 470 538 533 11 383 -183
3333 -183 -434 272 147 82 629 304 -701 268 254 -480 -409 399 -205 -634 497 2 -371 -95 29 -110
3353 -110 -19 -305 -492 -423 -26 -121 -259 -436 812 -443 -978 304 -187 -679 154 -203 -470 -423 97 -94
3373 -94 -350 -111 -311 -533 -140 -406 -523 379 311 -384 -253 351 100 -929 127 173 -576 -434 240 90
3393 90 -149 -220 4 -658 93 62 -811 -87 110 177 -403 559 283 6 314 414 -93 -442 191 -410 -455 299
3415 299 41 140 574 557 -838 173 410 -357 -311 199 201 -315 26 608 18 267 663 400 9 339 1
3436 1 -226 211 699 -51 -14 727 -169 -306 544 269 -312 -467 150 439 -540 323 -146 64 -25 224 -81
3457 -81 173 39 94 96 860 -477 -179 448 566 -184 135 266 -28 -80 -47 -626 -202 -100 27 -449 -95 35
$$ packed form
3312G19p61J42K65k37l4M35k68m30l9O61j145J343m7o94J39M21O8nn22L72n66
3333a83k51P06j25o5N47l25j005R69j4p34P1Q08o04m29J131m95l73K76J24j39
3353a10R1k86j87O9L97r5j38j77J248j255n35J282m91m92Q33l57k67M7N20j91
3373i4k56K39k00k22L93k66j17R02o8o95J31O04k51j029J056M6p49J42O74j50
3393I0k39p1K24o62P51l1q73P24J97O7n80R62k76k77L08J00n07l49O33o01m5P54
3415B99k58R9M34j7j395J011K37p67M6N10Kn16L41N82n90K49L96k63l91L30l38
3436Ak27M37M88p50L7P41q96j37Q50k75n81j55O17K89r79Q63m69K10q9K49l05
3457h1K54j34N5KP64j337K98O27J18p50L19J31k94n2L3n79M24J02J27m76L54J30
$$ plain form
3479 35 -146 -129 459 122 -388 19 -95 -349 -168 250 -441 -116 529 4 -103 734 327 -807 -323 -89
3499 -89 -360 1 19 -194 -511 -76 395 -417 -237 234 -758 -691 -202 137 -563 -87 275 303 -99 400 -333
3520 -333 -650 190 -326 -490 -1 112 -496 -240 -346 128 -241 360 209 -532 270 458 -161 -159 292 -346 -716
3541 -716 355 313 -452 -457 409 102 -306 24 154 -221 1102 -419 39 506 530 -103 -61 933 -78 -602
3561 -602 307 807 -468 -61 531 280 -150 -42 -87 -359 449 -552 -128 327 765 64 276 634 -324 148
3581 148 378 206 -76 -6 313 -435 161 568 -65 -55 348 -8 25 117 -6 -32 -64 430 330 -947 -9 168
3603 168 -429 108 557 20 -642 513 -194 -269 -17 473 -58 235 280 -47 -537 282 -573 -494 -101 -255 -332
3624 -332 -332 308 97 -136 276 -231 55 -65 326 -116 -557 -147 146 -616 432 77 -198 119 -188 258
$$ packed form
3479C5j81J7N88l37n10M07j14k54J81M18o91L25O45n25j07Q37m07j134M84K34
3499h9k71L61J8k13l17M35M71q12J80M71r92O7M89L39p00M76L62K8m02M99p33
3520c33l17Q40n16j64M89J13o08K56j06M74l69O01j51p41Q02J88o19KM51o38l70
3541g16J071m2p65nQ66l07m08L30J30l75J323j521M58M67K4o33M2R94j011n24
3561f02R09N00j275M07N92k51m30J08m5k72Q08j001M24M55M38p01K12L58r58M72
3581A48K30j72k82P0L19p48N96M07o33J0M03l56L3R2j23k6l2M94j00j277R38J77
3603A68n97N37M49n37o62J155p07p5K52M90n31K93M5l27m90Q19q55P9L93j54p7
3624c32%O40k11k33M12n07K86j20L91m42m41M10K93p62J048l55k75L17l07M46
$$ plain form
3644 258 -506 96 -270 -439 -408 -75 38 -359 -103 362 -277 450 94 204 -121 -263 -690 55 -274 35
3664 35 71 -131 -53 -785 95 492 -916 202 -321 310 139 879 -457 -1 434 146 86 -31 967 -529
3684 -529 202 497 -216 227 647 -324 295 526 436 388 67 565 365 58 639 116 -408 333 225 189 448
3705 448 624 670 -351 -24 661 -200 -17 -86 -288 50 569 23 -417 464 267 -108 658 835 182 -277
3725 -277 -323 -69 -488 -96 386 131 -357 411 -87 -585 -99 -260 96 808 135 -578 -401 703 -429 -404
3745 -404 797 -171 -737 -588 -138 -223 -725 116 -862 201 131 -130 -510 -304 422 128 -156 119 -832 -424
3765 -424 -79 -136 -443 -247 -234 -372 -276 411 -505 456 576 778 101 -750 330 -665 -53 231 -409 -613 -67
3786 -67 141 -1195 238 -155 232 -483 24 -298 -307 261 71 143 587 347 -670 -609 223 308 -481 83 -111
$$ packed form
3644B58p64O02l66j69L1L33J13l97K56M65o39P27l56J10l25j42m27P45l29L09
3664C5L6k02P8p32Q80L97j408J118n23O31j71P40j336M56M35k88o0j17R98j496
3684e29P31K95p13M43M20r71O19K31r0m8l21M98k00l07N81n23n24P41j08l6K59
3705D48J76M6j021L27O85q61J83o9k02L38N19n46m40Q81j97l75P66J77o53m59
3725b77m6K54m19L92M82k55m88P68m98m98M86j61L56P12o73p13J77J104j132K5
3745d04J201r68n66J49M50q5n02Q41r78J063p0k61l80K06P26k94k84K75r51M08
3765d24L45n7l07J96J3j38R6O87r16R61J20K02o77q51J080r95O12K84o40k04N46
3786f7K08j336J433l93L87p15N07l22rN68j90P2M44k40j017O1Q32Q5p89N64j94
$$ plain form
3807 -111 -41 -307 -147 -115 -230 333 488 -355 59 -203 5 441 335 294 -471 556 4 -219 567 882 729
3828 729 338 306 -316 -432 320 539 -190 550 564 236 -62 227 -569 -398 509 84 -140 -236 -203 230 -130
3849 -130 635 328 -675 409 281 92 53 772 -330 356 433 -145 -527 232 360 -321 49 140 -687 -552
3869 -552 -169 -115 246 90 -352 -408 356 -239 -168 403 -407 839 424 -208 545 -88 -88 -211 1 -80 160 -158
3891 -158 276 60 272 13 -273 253 -428 -563 -146 -280 -317 276 -300 -76 -654 76 359 -810 -35 -193
3911 -193 -714 297 419 -141 -249 403 -358 -357 161 591 -230 355 251 307 329 114 483 -238 164 -272 -161
3932 -161 444 291 -213 223 143 94 38 617 622 202 667 -64 -265 -25 139 -148 -305 571 -95 146 368 558
3954 558 -562 -1016 638 28 -394 -17 13 105 80 765 -111 281 672 -9 432 307 687 -81 233 -474
$$ packed form
3807a11P0k66J60L2j15N63J55q43M14k62K08M36j06m1p65J027n52k23P86L15j53
3828G29l91l2o22j16P52K19p29P40J4l28k98K89p96J71R07m25k24r6L3M33l60
3849a30P65l07j003J084j28j89l9P19j102O86P7n78l82P59J28o81L70R1q27J35
3869e52L83N4L61j56m42n6P64n95P1N71q10J246m15o32P53o33%j23K12q1K40l18
3891a58M34k16K12k59k86N26o81j35M17j34l7N93n76K24n78P30K83j169P75j58
3911a93n21J011J22n60j08O52p61JN18M30q21N85j04N6K2k15L69p21M02m36J11
3932a61O05j53n04M36q0m9n6N79Nm20M65p31k01K40J64k87j57Q76o66K41K22J90
3954E58j120m54J654o10m22L77L0R2k5O85q76L92L91o81M41j25L80p68L14p07
$$ plain form
3974 -474 412 10 -111 82 333 649 -275 45 -171 687 -78 -543 204 -38 -139 -561 949 -225 103
3993 103 -220 -764 -233 276 -161 77 461 -94 -397 -381 668 -898 -930 -210 -162 -559 -106 515 -78 32
4013 32 -6 149 -13 353 -326 -885 -417 -411 -589 181 -281 -398 -326 265 377 -572 676 -561 -318 -500 -366
4034 -366 572 -205 94 190 -578 141 556 -659 -502 -50 -293 -315 365 -44 -152 45 469 -61 -161 -258 448
4055 448 114 261 323 -353 -881 -95 107 -795 1087 316 55 216 634 85 84 53 -459 106 187 -43 162
4076 162 -397 -358 -513 534 419 -25 167 683 406 -809 200 -596 72 -352 1123 1 646 -45 187
4095 187 -216 471 667 -333 343 323 -120 -17 -46 190 41 -870 -110 -35 533 474 -556 -895 318 -307
4115 -307 265 -497 718 -284 -438 154 277 -298 237 927 -283 877 -346 687 -420 346 123 35
$$ packed form
3974d74Q86m02j21J93K51L16r24L20k16Q58p65m65P47k42j01m22J510j174L28
3993A03l23n44N31N09m37K38L84n55l03J6J049j566l2P20M8l97M53O21n93J10
4013C2l8J55j62L66o79n59M68Oj78P70m62j17P2N91J12r49J248j237K43j82J34
4034c66R38p77K99R6p68P19M15j215J57M52k43k2O80m09j08J97M24n30j00r7P06
4055D48l34J47O2o76n28P86K02r02J882p71k61J61M18n49jl1n12N65Q1k30K05
4076A62n59L9j55J047j15m44J92N16k77j215J009p96O68m24J475j122O45o91K32
4095A87m03O87J96j000O76k0m43J03k9K36j49r11P60P5N68n9j030l39J213o25
4115c07N72p62J215j002j54N92J23n75N35O90j210J160j223J033j107P66k23q8
$$ plain form
4133 35 215 -96 157 -151 737 -152 -381 284 180 -335 108 -154 129 -98 747 -533 19 92 -306 -457
4153 -457 127 118 -6 -487 352 -152 -475 105 257 -555 -217 -411 102 -352 107 -225 -714 502 -63 -115 465
4174 465 53 -131 80 264 302 360 19 65 24 -142 65 187 -213 -100 -468 -443 -38 43 -181 -15 -461 -587
4196 -587 429 284 460 286 613 386 -225 502 857 499 50 812 648 375 -765 -214 225 614 -158
4215 -158 260 435 186 -511 -680 352 345 -170 286 37 59 423 1023 -335 111 731 262 190 222 -224 19
4236 19 107 -725 -690 -520 575 -191 -261 610 -74 141 -336 -135 -383 229 -235 -479 -211 -156 -635 -821 127
4257 127 -492 -300 86 480 -86 86 199 -435 114 253 -129 -221 -127 233 -512 246 -932 465 -407 729
4277 729 88 -264 -336 69 -419 -321 -500 1071 -483 -397 171 60 -211 -838 181 -60 205 188 -232 9
$$ packed form
4133C5J80l11K53l08Q88q89k29O65j04n15M43k62K83k27Q45j280N52P3l98j51
4153d57N84rj24m81Q39n04l23N80J52q12L38j94N13m54M59l32m89J216n65n2N80
4174D65m12j84K11J84L8N8l41M6m1j66K07J22m00J13l68K5M05Q1k24J66m46j26
4196e87J016j45J76j74L27k27o11P27L55l58m49P62j64k73j140N51M39L89p72
4215a58M18J75k49o97j69J032pn15M56k49K2L64O00j358M46O20m69p2L2m46K43
4236A9Q8q32L5J70J095p66p0Q71o84K15m77K01k48O12m64k44K68N5m79j86R48
4257A27o19J92L86L94n66J72J13o34N49J39l82r2R4L60p45P58j178J397q72J136
4277G29o41l52p2M05m88R8j79J571j554Q6N68j11k71o27J019k41K65j7m20K41
$$ plain form
4297 9 -278 -824 -101 -497 -247 -1188 89 -406 -671 -48 252 -607 584 806 370 54 -517 619 373 362
4317 362 -106 337 -286 507 10 -320 632 559 -141 -87 -289 -46 -139 -253 390 -603 5 -26 -717 -468 -76
4338 -76 166 186 131 896 44 -14 553 -325 522 618 325 -467 -168 463 -46 586 700 7 138 285 837 158
4360 158 664 169 -562 113 384 136 429 -266 -233 -1156 -513 -121 -384 0 -321 -490 219 508 -57 472
4380 472 207 74 -892 622 695 -93 400 464 -27 89 378 458 -492 327 -656 230 -76 -505 627 308
4400 308 379 105 -781 -239 -352 5 -262 52 3 -167 -390 -500 -198 -3 175 -398 -4 330 15 -892 54
4421 54 -461 -888 -195 251 90 -170 -65 352 -638 -243 386 40 -124 -243 -265 -253 247 -27 -288 439 -340
4442 -340 -495 152 61 -475 -52 -36 274 -329 -198 -48 -337 -328 434 0 250 192 -130 -529 -328 -73 -105 311
$$ packed form
4297Ik87n46P23l96K50r41J277m95k65O23L00q59J191K22m36l16n71J136k46j1
4317C62m68M43o23P93m97l30R52p3p00N4k02K43r3j14O43r93O08l1o91K49L92
4338g6K42K0n5P65q52n8N67q78Q47R6k93p92K99O31n09O32J14o93J31J47N52o79
4360A58N06m95p31O75K71k48K93o95L3r23O43L92k63L84l21j69P09K89n65N29
4380D72k65j33r66J514P3p88M93O4m91J16K89Q0r50Q19r83Q86l06m29J132l19
4400C08P1k74q86N42j13L57k67L14m9j70k23j10L02J95J78n73L94L34l15r07R46
4421E4n15m27O93M46j61k60J05M17r90L95O29l46j64j19k2J2N00k74k61P27p79
4442c40j55O47r1n36M23J6L10o03J31J50k89RP62m34K50n8l22l99K01K55l2M16
$$ plain form
4464 311 106 82 -38 434 -27 81 -285 73 -519 -372 108 -118 36 146 -307 4 90 122 -521 -553 231
4485 231 322 56 198 769 -326 245 501 -156 -280 496 284 -296 -361 -303 -390 117 -10 -349 63 -303 95
4506 95 -698 117 286 -318 143 161 115 -131 227 530 -183 -202 252 -208 -112 179 -318 -339 -275 451 -167 204
4528 204 -225 -129 -216 -402 168 -233 599 -273 -478 -310 -175 187 -333 -97 -72 -806 -80 -264 -360 -694 -6
4549 -6 -193 -25 -57 -453 32 135 -276 52 -386 -77 -151 -673 286 292 107 -119 96 -23 0 578 138 139 -86
4572 -86 291 -125 -76 -222 -314 -31 64 -368 -260 104 224 275 84 132 151 52 188 -111 157 -16 -144 -445 423
4595 423 508 -430 -82 41 -66 -300 151 61 294 488 105 -107 -288 287 -416 128 -228 -53 -17 84 104
4616 104 12 12 -142 -225 215 504 124 424 451 509 -407 -14 -240 -37 -276 -187 32 -305 71 149 -86 85 -16
$$ packed form
4464C11k05k4j20M72m61J08l66L58n92J47M80k26J54J10m53L11Q6L2o43l2P84
4485B31R1k66J42N71j095N71K56o57j24P76k12n80o5N8q7N07j27l39M12l66L98
4506I5p93Q15J69o04M61J8m6k46L58L03p13j9M54m60R6K91m97k1O4P26o18L71
4528B04m29R6q7j86N70m01Q32q72k05J68J35L62n20K36K5p34P26j84r6l34O88
4549fj87J68l2l96M85J03m11L28m38L09p4n22R59Oj85k26K15j19K3N78m40Jk25
4572h6L77m16M9j46r2K83R5m32J08L64J20N1j91M8J9r9J36k99K68j73j28l01Q68
4595D23Q5r38L48J23j07k34M51r0K33J94l83k12j81N75p03N44l56J75L6J01K0
4616A04r2%j54q3M40K89l80L00K7N8r16L93k26K03k39Q9K19l37L76P8k35J71j01
$$ plain form
4639 -16 -23 -360 122 304 502 -630 231 -345 -158 -21 -289 -461 181 174 -234 -102 222 -296 -434 329 -89
4660 -89 4 89 236 -214 153 351 427 -399 33 79 -438 97 -296 -642 -16 295 -111 282 306 58 -432 -240
4682 -240 166 265 98 71 137 -222 451 534 -335 -576 179 -233 -311 -106 -39 -353 109 382 -306 151 -13 -284
4704 -284 33 -282 1 59 77 69 -311 -208 -103 18 -239 172 177 -473 280 248 -402 170 448 -501 38 -79
4726 -79 -92 320 -115 242 -76 -171 -171 -160 -256 -81 -95 -67 192 366 67 -147 289 107 -184 233 -455 -345 198
4749 198 -167 -175 -312 -111 192 -241 -116 123 275 457 112 -352 29 36 -131 -499 337 103 -81 -105 -336 -130
4771 -130 -185 413 347 -119 -46 242 -281 -127 93 -293 -161 372 -144 -107 -56 -13 -124 -15 -32 -531 331 371 -76
4794 -76 -308 305 244 -311 26 549 27 74 309 -70 -235 27 7 -388 82 -610 -120 -152 103 -112 -433 161
$$ packed form
4639a6pl37M82J82J98j132Q61n76J87J37k68j72O42pm08J32L24n18j38P63m18
4660h9R3Q5J47m50L67J98P6q26M32M6n17N35l93l46O26L11m06L93K4k48m90J92
4682b40M06R9j67k7O6l59O73Q3q69k41P55m12p8K05O7l14M62K73o88M57j64k71
4704b84L17l15K83N8J8ql80J03J05J21k57M11No50P53l2o50N72K78r49N39j17
4726g9j3M12m35L57l18r5%J1r6J75j4K8K59J74k99k14M36j82k91M17o88J10N43
4749A98l65qj37K01L03m33J25K39J52J82l45m64L81Pj67l68Q36k34j84k4k31K06
4771a30n5N98o6m66P3K88n23J54K20l86J32N33n16L7N1M3j11J09j7m99Q62M0m47
4794g6k32O13o1n55L37N23n22M7K35l79j65K62k0l95M70o92M90l2K55k15l21N94
$$ plain form
4816 161 -81 448 575 -202 81 -189 -77 -181 -451 108 42 -422 -255 462 -98 -138 -55 -65 -136 75 196 -419
4838 -419 320 383 -21 43 534 -33 217 -445 686 165 -681 315 -5 -256 -423 7 -108 152 669 138
4858 138 498 250 305 238 12 -183 -14 -420 -75 -233 -147 249 -260 -579 -341 66 165 -191 -168 -252 -205 -647
4880 -647 156 -29 144 123 -508 -92 46 -45 -173 -105 224 166 300 714 -280 156 25 -104 319 251 221 -137
4902 -137 159 403 -2 458 30 -68 -51 -128 -178 -78 -64 -210 -92 -204 -94 405 374 143 165 71 637 15 -332
4925 -332 390 -132 -421 -392 -23 455 -399 216 -212 196 -257 274 7 -190 197 -598 -164 -246 -39 -359 -628
4946 -628 129 27 -314 170 431 -314 131 189 155 -72 348 365 93 328 -295 -472 119 47 175 151 10 -75
4968 -75 337 461 505 -44 -141 187 -258 144 181 93 12 353 -241 -654 255 321 -193 -121 295 -451 -504 -522 21
$$ packed form
4816A61k42N29J27p77K83k70J12j04k70N59o6m64J67P17n60m0Q3j0p1K11J21o15
4838d19P39O3m04O4M91n67K50o62J131n21q46R96l20k51j67M30j15K60N17n31
4858A38L60k48N5o7k26j95J69m06L45j58Q6L96n09l19K38M07R9l56K3q4M7m42
4880f47Q03j85J73k1o31M16J38r1j28O8L29n8J34M14r94M36j31j29M23o8l0l58
4902a37K96K44m05M60m28r8J7p7n0J00J4j46J18j12J10M99l1k31K2r4N66o22l47
4925c32P22n22k89K9L69M78q54O15m28M08m53N31k67j97L87p95M34q2K07l20k69
4946f28P57j02l41M84K61p45M45N8l4k27M20J7k72K35o23j77N91p2J28k4j41q5
4968g5M12J24M4n49r7L28m45M02L7q8q1L41n94m13R09O6n14P2M16p46n3j8N43
$$ plain form
4991 21 -266 293 449 -468 422 322 210 -121 129 -381 382 301 264 81 -473 450 -28 -172 -389 159 -191
5012 -191 -486 -56 134 92 136 -336 152 266 -398 2 181 427 -37 -227 -214 357 51 -476 85 -1207 501
5033 501 382 -197 -665 129 255 -455 362 -112 -59 252 -164 -178 -118 41 190 -130 386 -99 332 95 90 -498
5055 -498 -391 560 170 -155 662 -59 654 -203 -154 141 74 -337 -369 -87 -256 -210 -96 48 -100 -234 78
5076 78 -72 25 28 -556 43 41 -81 728 424 185 316 494 -179 -149 -98 -40 -597 272 373 262 -486 -734 -428
5099 -428 -227 -3 -33 -59 -178 562 -115 462 300 -4 140 346 16 384 95 -335 -303 248 -257 -57 602
5120 602 -310 338 -376 -15 275 -277 506 124 509 -882 -628 77 108 557 245 66 -73 -190 102 -242
5140 -242 699 196 -346 -332 511 83 -141 263 -425 220 117 -90 581 246 145 -497 -330 480 -110 603
$$ packed form
4991B1k87N59J56r17Q90j00j12l31K50n10P63q1l7j83n54R23m78j44k17N48l50
5012a91k95M30J90m2M4m72M88J14o64M00J79K46m64j90J3N71l06n27N61j292J708
5033E01j19n79m68P94J26p10Q17m74N3L11m16j4O0J59J49l20N16m85M31k37nn88
5055d98J07R51l90l25Q17p21P13q57M9K95o7m11l2K82j69M6J14J44j48j34L12
5076G8j50R7Ln84N99kj22Q09l04k39J31J78o73L0N1N8n57Q69J01j11p48k48L06
5099d28K01K24l0k6j19P40o77N77j62l04J44K06l30L68k89m30L2N51n05K00O59
5120F02r12O48p14L61K90n52P83l82L85j391K54P05L1M49l12j79j39j17K92l44
5140b42R41n03n42J4Q43m28k24M04o88O45j03k07O71l35j01o42J67Q10n90P13
$$ plain form
5160 603 -541 -211 -70 -124 -474 243 -283 103 -137 -228 205 369 -123 -361 -352 -83 403 175 -213 -74 111
5181 111 -168 4 551 217 -362 -213 -84 -591 91 -220 -941 587 650 111 131 -828 81 -443 -317 272
5201 272 -367 192 44 358 -421 -10 43 -344 14 391 -61 15 -364 29 -298 329 148 344 -12 42 166
5222 166 320 536 -32 11 -75 -349 -536 253 276 755 152 258 197 185 -50 92 148 8 245 -377 462 -496
5244 -496 413 -594 231 -132 -32 481 -70 183 -356 -516 125 -364 774 135 -92 306 637 138 -601
5263 -601 362 -5 -83 -219 -10 249 -116 191 -163 -680 519 -207 -310 8 -3 -481 61 -146 187 -327
5283 -327 178 -49 46 -180 59 273 -193 322 -101 137 618 295 234 129 269 -389 -169 370 315 207 -338
5304 -338 -223 461 411 -158 32 103 238 52 335 263 58 -101 -334 -441 288 463 -145 -229 -117 -546 13
$$ packed form
5160F03j144L30J41n4l50P17n26L86k40r1M33J64m92k38RK69M86k28l88J39J85
5181A11k79J72N47l34n79J49J29n07O82l11p21J528O3n39K0r59R09n24J26N89
5201B72o39N59j48L14p79M11N3l87L58L77m52P6l79L93l27O27j81J96l56N4J24
5222A66J54K16n68M3q6k74j87P89K3M79o03J06o1j2k35J42N6j40K37o22Q39r58
5244d96R09j007Q25l63J00N13n51K53n39j60O41m89J138o39k27L98L31m99p39
5263f01R63l67p8j36K09K59l65L07l54n17J199p26j03L18j1m78N42k07L33n14
5283c27N05k27R5k26K39K14m66N15m23K38M81l23o1j05J40o58K20N39n5j08n45
5304c38J15O84n0n69J90P1J35j86K83p2k05j59k33j07P29J75o08q4J12m29N59
$$ plain form
5325 13 -205 139 -35 -320 -97 -418 83 -531 -621 229 -232 -578 -150 -181 40 464 258 354 8 -800 512
5346 512 287 556 -164 549 109 498 -169 -268 231 240 -51 -318 -263 6 111 208 541 -478 -7 -448 -1029
5367 -1029 -584 60 230 -110 312 -859 273 613 112 84 -57 570 -212 377 -630 50 796 762 173
5386 173 -260 437 417 19 1136 -481 -54 266 74 -301 -294 -385 107 -181 -282 -73 -701 650 -98 -632
5406 -632 -197 -46 672 91 -227 13 414 -249 -456 464 67 599 161 368 403 -63 578 -43 206 -367
$$ packed form
5325A3k18L44j74k85K23l21N01o14r0Q50m61l46M28l1K21M24k06R6l46q08J312
5346E12k25K69p20P13m40L89o67r9M99Rk91k67N5K69J05R7L33j019M71m41n81
5367a029M45O44J70l40M22j171J132L40n01k8j41O27p82N89j007O80P46l4n89
5386A73m33O97k0l98J117j617M27L20j92l75Pr1M92k88j01K09o28J351p48n34
5406f32M35J51P18n81l18K40M01o63k07R20l97N32m38K07L5m66O41o21K49n73
$$ [...]
8191a28
##END NTUPLES=NMR FID
##END=
