##TITLE=1H_SA_51.200
 CDCl3, 8 sc, 
 1.6.2020
##JCAMPDX= 6.0         $$ Bruker NMR JCAMP-DX V2.0
##DATA TYPE= NMR FID
##DATA CLASS= NTUPLES
##ORIGIN= UXNMR, Bruker Analytische Messtechnik GmbH
##OWNER= root
$$ XWIN-NMR		Version 3.5
$$ Mon Jun  1 12:21:34 2020 Russian Standard Time (UT+4h)  she@DPX200
##.OBSERVE FREQUENCY= 200.1315
##.OBSERVE NUCLEUS= ^1H
##.DELAY= (6, 6)
##.ACQUISITION MODE= SIMULTANEOUS
##.ACQUISITION SCHEME= undefined
##.AVERAGES= 8
##.DIGITISER RES= 18
##SPECTROMETER/DATA SYSTEM= spect
##.PULSE SEQUENCE= zg30
##.SOLVENT NAME= DMSO
##.SHIFT REFERENCE= (INTERNAL, DMSO, 0, 15.7039)
##AUDIT TRAIL= $$ (NUMBER, WHEN, WHO, WHERE, WHAT)
$$ ##TITLE= Audit trail, XWIN-NMR		Version 3.5
$$ ##JCAMPDX= 5.01
$$ ##ORIGIN= Bruker BioSpin GmbH
$$ ##OWNER= she
$$ F:/spectra/data/she/nmr/H-F/1/audita.txt
$$ ##AUDIT TRAIL=  $$ (NUMBER, WHEN, WHO, WHERE, WHAT)
(   1,<2020-06-01 12:20:15.20 +0400>,<she>,<DPX200>,
      <created by zg, POWCHK disabled, PULCHK disabled
       configuration hash MD5:
       00 E9 B6 7A A2 85 ED C7 34 08 36 98 17 FE 4E 26
       data hash MD5: 16K
       36 F8 B9 E7 00 63 C0 98 54 A3 F8 80 7E AC BB 1A>)
$$ ##END=
$$ 
$$ hash MD5
$$ 8D 8C 1A C2 84 76 06 56 D4 1F CF 75 99 EC 7F DA
##$RELAX= 
##$RELAX= 
##$RELAX= 
##$RELAX= 
##$RELAX= 
##$RELAX= 
$$ Bruker specific parameters
$$ --------------------------
##$DU= <F:/spectra>
##$EXPNO= 1
##$NAME= <H-F>
##$PROCNO= 1
##$TYPE= <nmr>
##$USER= <she>
##$AMP= (0..31)
100 100 100 100 100 100 100 100 100 100 100 100 100 100 100 100 100 100 
100 100 100 100 100 100 100 100 100 100 100 100 100 100 
##$AQSEQ= 0
##$AQ_mod= 1
##$AUNM= <au_zg>
##$AUTOPOS= <>
##$BF1= 200.13
##$BF2= 200.13
##$BF3= 200.13
##$BF4= 200.13
##$BF5= 200.13
##$BF6= 200.13
##$BF7= 200.13
##$BF8= 200.13
##$BYTORDA= 1
##$CFDGTYP= 0
##$CFRGTYP= 5
##$CHEMSTR= <none>
##$CNST= (0..31)
1 1 145 1 1 1 1 1 1 1 1 1 1 1 1 1 1 1 1 1 1 1 1 1 1 1 1 1 1 1 1 1 
##$CPDPRG= <>
##$CPDPRG1= <>
##$CPDPRG2= <>
##$CPDPRG3= <>
##$CPDPRG4= <mlev>
##$CPDPRG5= <mlev>
##$CPDPRG6= <mlev>
##$CPDPRG7= <mlev>
##$CPDPRG8= <mlev>
##$CPDPRGB= <>
##$CPDPRGT= <>
##$D= (0..31)
0 1.2 0 0 0 0 0 0 0 0.06 0 0.03 0 0 0 0 0.0002 0 0 0 0 0 0 0 0 0 0 0 0 
0 0 0 
##$DATE= 1590999614
##$DBL= (0..7)
120 120 120 120 120 120 120 120 
##$DBP= (0..7)
150 150 150 150 150 150 150 150 
##$DBP07= 0
##$DBPNAM0= <>
##$DBPNAM1= <>
##$DBPNAM2= <>
##$DBPNAM3= <>
##$DBPNAM4= <>
##$DBPNAM5= <>
##$DBPNAM6= <>
##$DBPNAM7= <>
##$DBPOAL= (0..7)
0.5 0.5 0.5 0.5 0.5 0.5 0.5 0.5 
##$DBPOFFS= (0..7)
0 0 0 0 0 0 0 0 
##$DE= 6
##$DECBNUC= <off>
##$DECIM= 24
##$DECNUC= <off>
##$DECSTAT= 4
##$DIGMOD= 1
##$DIGTYP= 9
##$DL= (0..7)
0 120 120 120 120 120 120 120 
##$DP= (0..7)
150 150 150 150 150 150 150 150 
##$DP07= 0
##$DPNAME0= <>
##$DPNAME1= <>
##$DPNAME2= <>
##$DPNAME3= <>
##$DPNAME4= <>
##$DPNAME5= <>
##$DPNAME6= <>
##$DPNAME7= <>
##$DPOAL= (0..7)
0.5 0.5 0.5 0.5 0.5 0.5 0.5 0.5 
##$DPOFFS= (0..7)
0 0 0 0 0 0 0 0 
##$DQDMODE= 0
##$DR= 18
##$DS= 0
##$DSLIST= <SSSSSSSSSSSSSSS>
$$ [...]
##$SUBNAM2= <"">
##$SUBNAM3= <"">
##$SUBNAM4= <"">
##$SUBNAM5= <"">
##$SUBNAM6= <"">
##$SUBNAM7= <"">
##$SUBNAM8= <"">
##$SUBNAM9= <"">
##$SW= 24.9337058887773
##$SWIBOX= (0..15)
0 0 2 0 0 0 0 0 0 0 0 0 0 0 0 0 
##$SW_h= 4990.01996007984
##$TD= 16384
##$TD0= 1
##$TE= 0
##$TE2= 300
##$TE3= 300
##$TEG= 300
##$TL= (0..7)
0 120 120 120 120 120 120 120 
##$TP= (0..7)
150 150 150 150 150 150 150 150 
##$TP07= 0
##$TPNAME0= <>
##$TPNAME1= <>
##$TPNAME2= <>
##$TPNAME3= <>
##$TPNAME4= <>
##$TPNAME5= <>
##$TPNAME6= <>
##$TPNAME7= <>
##$TPOAL= (0..7)
0.5 0.5 0.5 0.5 0.5 0.5 0.5 0.5 
##$TPOFFS= (0..7)
0 0 0 0 0 0 0 0 
##$TUNHIN= 0
##$TUNHOUT= 0
##$TUNXOUT= 0
##$USERA1= <user>
##$USERA2= <user>
##$USERA3= <user>
##$USERA4= <user>
##$USERA5= <user>
##$V9= 5
##$VALIST= <valist>
##$VCLIST= <CCCCCCCCCCCCCCC>
##$VD= 0
##$VDLIST= <DDDDDDDDDDDDDDD>
##$VPLIST= <PPPPPPPPPPPPPPP>
##$VTLIST= <TTTTTTTTTTTTTTT>
##$WBST= 1024
##$WBSW= 4
##$XGAIN= (0..3)
0 0 0 0 
##$XL= 0
##$YL= 0
##$YMAX_a= 265275
##$YMIN_a= -111747
##$ZGOPTNS= <>
##$ZL1= 120
##$ZL2= 120
##$ZL3= 120
##$ZL4= 120
##$ABSF1= 10
##$ABSF2= 0
##$ABSG= 5
##$ABSL= 3
##$ALPHA= 0
##$AQORDER= 0
##$ASSFAC= 0
##$ASSFACI= 0
##$ASSFACX= 0
##$ASSWID= 0
##$AUNMP= <proc_1d>
##$AZFE= 0.1
##$AZFW= 0.1
##$BCFW= 1
##$BC_mod= 2
##$BYTORDP= 1
##$COROFFS= 0
##$CY= 11.3945322036743
##$DATMOD= 1
##$DC= 2
##$DFILT= <>
##$DTYPP= 0
##$F1P= 16.9975609425685
##$F2P= -3.02152046262296
##$FCOR= 0.5
##$FTSIZE= 0
##$FT_mod= 4
##$GAMMA= 1
##$GB= 0.15
##$INTBC= 1
##$INTSCL= 1
##$ISEN= 128
##$LB= 0.24
##$LEV0= 0
##$LPBIN= 0
##$MAXI= 10000
##$MC2= 0
##$MEAN= 0
##$ME_mod= 0
##$MI= 1.114404
##$NCOEF= 0
##$NC_proc= 0
##$NLEV= 6
##$NOISF1= 3.799351
##$NOISF2= 2.8
##$NSP= 1
##$NTH_PI= 0
##$NZP= 0
##$OFFSET= 15.70392
##$PC= 1
##$PHC0= -9801.644
##$PHC1= 22.60082
##$PH_mod= 1
##$PKNL= yes
##$PPARMOD= 0
##$PSCAL= 0
##$PSIGN= 0
##$REVERSE= no
##$SF= 200.130013532006
##$SI= 16384
##$SIGF1= 3
##$SIGF2= 2
##$SINO= 400
##$SIOLD= 16384
##$SREGLST= <1H.CDCl3>
##$SSB= 0
##$STSI= 0
##$STSR= 0
##$SW_p= 3612.71676300578
##$SYMM= 0
##$S_DEV= 0
##$TDeff= 0
##$TDoff= 0
##$TI= <>
##$TILT= no
##$TM1= 0
##$TM2= 0
##$TOPLEV= 0
##$USERP1= <user>
##$USERP2= <user>
##$USERP3= <user>
##$USERP4= <user>
##$USERP5= <user>
##$WDW= 1
##$XDIM= 8192
##$YMAX_p= 0
##$YMIN_p= 0
$$ End of Bruker specific parameters
$$ ---------------------------------
##NTUPLES= NMR FID
##VAR_NAME=  TIME,          FID/REAL,        FID/IMAG
##SYMBOL=    X,             R,               I
##VAR_TYPE=  INDEPENDENT,   DEPENDENT,       DEPENDENT
##VAR_FORM=  AFFN,          ASDF,            ASDF
##VAR_DIM=   8192,          8192,            8192
##UNITS=     SECONDS,       ARBITRARY UNITS, ARBITRARY UNITS
##FACTOR=    0.0002004,     1,               1
##FIRST=     0,             0,               0
##LAST=      1.6414764,     0,               0
##MIN=       0,             -111747,         0
##MAX=       1.6414764,     265275,          0
$$ Real data points
##PAGE= N=1
##DATA TABLE= (X++(R..R)), XYDATA
$$ [...]
2266b330j470K073L862J436j702k273j281o81R26K803K460j199k614j190k91Q49
2282f22J849K363l28l089k155J162J798N53N72L82j629j422L99J399P4l32r0M87
2300A371o94r46R96K15m71l97J383M54p88j625L08J78K35R33R32m37j830j056
2318a239L24J302J121J183j98k398k081N56J954J856L28n93j770k433o24K890
2334A78L011L75j674k524j880M17K501K809n8j789k014j163R1J672K379J087j491
2351A927k979j863J164J895J774Q62j208k586j634P02K634J453M70j032k658j577
2367b656P35K581J721o38j339j182r35R71J221J289j88j287o75l08Q10O51L21
2384A092K8r68j16N58M48m96p09N65M6N30K8j29l05p63k92L51J280Q78k15j064
$$ y = [-2330, -3800, -1727, 2135, 3571, 1869, -404, -1685, -2366, -1440, 1363, 3823, 2624, 10, -1180, -1471, -622, 1227, 3590, 3262, 173, -1982, -820, 978, 1531, 2103, 2485, 856, -566, -167, 1232, 1306, 974, 884, 1371, 677, -269, 727, 942, 471, 74, 1457, 1911, 1123, -502, -194, -16, 219, 1152, 2084, 1647, -183, -1239, -915, 387, 1508, 2691, 2493, 95, -1986, -1430, 524, 2380, 2708, 2115, 345, -2088, -2712, 178, 3189, 3564, 1890, -634, -2514, -2097, 404, 3213, 3155, 1366, -648, -1811, -1720, -48, 2331, 3418, 1927, -1052, -2915, -1751, 144, 1918, 2780, 1572, -1014, -2648, -1946, 688, 2141, 2611, 1579, -1079, -2656, -1921, 660, 2381, 1743, 404, -778, -1713, -742, 479, 1768, 1580, 293, -382, -690, 120, 771, 1092, 1120, 152, 36, 594, 1042, 546, -163, 402, 448, 978, 1006, 877, 572, -191, -483, -132, 1148, 2026, 1811, 747]
2404G47j884n30J864J711O21j032j290j698pJ351K265J136j261k518j647N49J433
2421a90K540O95r20k908j640L93K272K624J047j581k998k240J088K486K347O02
2437C617k073k585k089R11K462L013K54k015k939j467L31L081K677j42k499k183
2453a646r62P35K165J568K70j390k975j031J037K024J208P9j686j420o39P65J851
2470d7M35j09j095p14n44N49J243K1n23r3k19L30n83K28K99L26kPJ01l40m79L32
2492h77J47k79R54O11l74j575q33P10J324P70K04o97j601j196P11J772J414j56
2510A029q69k216j351N36K564J905m31j839j963p66P44K030K614k07k133k291
2526b644r66J342K552K148K54k526l044k30J732K367J327L87k260k699r55K304
$$ y = [747, -1137, -1667, 197, 1908, 2529, 1497, 207, -1491, -1498, -147, 2118, 3254, 1993, -525, -2172, -1623, -190, 2350, 3045, 2125, -783, -2423, -2030, 242, 2866, 3913, 2332, -666, -2906, -1818, 668, 3015, 3617, 1544, -1041, -3130, -2219, 243, 3256, 3510, 1495, -1444, -2911, -2580, 501, 3178, 3036, 537, -1646, -2608, -1873, 292, 1860, 2130, 740, -2235, -3266, -2229, -205, 1003, 1082, -604, -2024, -2663, -1898, -47, 388, 279, -816, -1530, -2074, -1525, -282, -261, -784, -877, -1096, -766, -1349, -1121, -822, -496, -498, -491, -390, -730, -1209, -877, -730, -1009, -55, 556, 182, -1393, -2226, -1516, -192, 578, 782, 85, -1516, -2712, -2001, -229, 1185, 1029, 160, -2056, -3407, -2871, -307, 1598, 1167, -672, -2635, -3401, -2657, -627, 1987, 1780, -353, -2644, -3610, -2268, 284, 2432, 2686, 160, -2884, -3114, -1382, 985, 2312, 2699, 439, -2260, -3215, -911]
2542i11K973J341j353j766k047OJ731K248P41j170j133j151m74R42J606J335q36
2559B082j718m91K9O2J048J262k27j678j350K15J076P09j13L6p41j078K43J490
2577H56R6j083J68L1JJ75L00j08p83l09J297R15k7j237n19m55q2J193J860k43
2597B046j722j566Q32L84O81J382P09j713j928p20J375J953R63L23j892k718l77
2614a988J904K149R53p93j753j994j154J637L348J344k510k088j002Q4Q71K130
2630A138J416j303k286j357O68J187J258Q54j91k108j617P34J264P69N58J14j380
2647b82j648n8K140R38j76m13l65r47M4J247J242p51j315P95O87k19r46N89Q40
2666A402k91m32L10L63o54j124P63P25Q2L18K81j450j214p0J583J075m51q8n0
$$ y = [-911, 2062, 3403, 2050, 284, -1763, -1757, -26, 2222, 2963, 1793, 660, -491, -965, -23, 1583, 2918, 2082, 364, -127, -98, -36, 1012, 2274, 2047, 369, -981, -766, 310, 1019, 906, 942, 201, -877, -634, 856, 952, -131, 37, 68, 69, 244, 544, 436, -347, -656, 641, 1556, 1529, 292, -227, -682, -764, 429, 2289, 2046, 324, -1242, -410, -26, 655, 2037, 2746, 1033, -895, -1615, -240, 1713, 2676, 2999, 1107, -1611, -1988, -84, 2065, 3018, 2225, 472, -1522, -2676, -1039, 2309, 3653, 1143, -945, -1947, -1863, -992, 1138, 2554, 1251, -1035, -2392, -1724, -537, 721, 1575, 1384, -724, -2341, -1607, -343, 426, 984, 1098, -282, -1930, -1988, 152, 1090, 914, 501, 136, -811, -767, 480, 1722, 971, -344, 451, 1138, 919, -27, 562, 1402, 1111, 679, 989, 1352, 698, -426, 337, 1062, 1144, 1462, 1743, 293, -921, -991, 592, 1667, 1216, 1128, 1078]
2685A078k465j264J820L004K88j684j673r33o47J394K977J643k471k861r03L84
2701b313K070J939J952k037l786n62J426K011J049P78q81l004j870J623K332J717
2717B444j11p54j780k026j70L224K577o79k150j657n56mJ826K654J78k765k250
2734a999M54L48J410J554K81k204j671J58J882k79L41Q91n16k107j062J991J352
2751H24r01q70O76j76r72O6J428j59r50N93O68m25l28K94K61j044m42J763J041
2770A347r59j465J90P13k3R26J254o59k406m78J114J240L78L21O3k117j678J433
2788h06K388P67q36o01j153j500q2K746J832p01j982j010n61J92J882K400l72
2805B603k485j905K62J256L24J779P46k251k273l1J755J721J63K20q42k267l17
$$ y = [1078, -1387, -2651, -831, 2173, 2461, 777, -896, -1829, -2476, -1082, 1895, 3538, 1067, -1794, -2697, -2313, -243, 1696, 3648, 1611, -2175, -2737, -1311, 700, 1749, 2527, 1646, -1358, -3228, -1605, 727, 2444, 2333, 1579, -201, -2227, -2397, 827, 3404, 2725, 575, -1082, -1638, -1642, 184, 2838, 3016, 251, -1999, -1545, -1197, 213, 1767, 2048, -156, -1827, -1669, 213, -66, 275, 1166, 650, -1457, -2519, -528, 824, -77, -947, -271, -447, -1419, -1353, 75, -84, -1034, -441, 227, -198, -526, -232, 29, -1015, -1457, 306, 1347, 388, -1077, -887, -174, -197, 729, 1983, 1324, -1082, -1560, -446, 794, 1172, 1493, 1556, -561, -2239, -806, 1582, 2349, 1513, 912, -241, -1741, -1823, 923, 2755, 2054, 72, -938, -1499, -1307, 575, 2975, 2603, 118, -1787, -1525, -269, 55, 1834, 2580, 329, -1944, -1975, -220, 1501, 1664, 1884, 1042, -1225, -1542]
2822a542J166K248j10n83l11j413r21J410K040K69j337j086pJ54K07R97O20p79
2840A022j539N09P84P6l15M05j07p52n8J008M91j041p59J37R85o2N7J97o57j347
2860i66n3J684R49l27o56r42r76j96K262J374m86j790p48k35L23P93K323L45k282
2879C96k028o6J644P74J316O56j943k340p15J547K357L94L71j243k332j375J640
2896i47K776R72q42j713j367o38R07K239J831j196j926j442j27P69K273J201r79
2913A791k393p31M35J099P40N80N3j194j487P9J143J204M4m6p54j289k10J493
2931E57Q20k70m60J12j69p41oR07J98o59J36L12J15j080K26P6M17K43M03oj098
2952C3r17P46Q59M12J2m67m96j063q2J470J280n24q59n82q00l68J545R49P58j464
$$ y = [-1542, -376, 1872, 1762, 1179, 868, -545, -1466, -56, 1984, 2253, 916, -170, -177, -23, 184, 1181, 1801, 1022, -517, -8, 776, 852, 537, 942, 835, 83, 25, 1033, 1524, 483, -276, -139, 846, 784, 841, 1038, 381, -966, -1019, 665, 1614, 1287, 631, -311, -1287, -1483, 779, 2153, 1667, -123, -871, -1106, -783, 10, 2333, 2678, 396, -1632, -1698, -54, 720, 2036, 2692, 749, -1591, -2306, -759, 1598, 1992, 2363, 1120, -1212, -2587, -947, 1829, 2801, 1959, 246, -1121, -1759, -852, 1387, 3218, 2022, 96, -1346, -1473, -704, 1569, 2770, 1791, -602, -1333, -898, 201, 941, 1521, 1574, 380, -1107, -1028, 115, 1319, 1363, 1317, 563, -726, -936, 557, 1377, 1107, 647, 759, 590, -151, -157, 750, 948, 289, 425, 737, 852, -228, -2, 74, 491, 734, 1137, 1131, 33, -884, -138, 721, 1133, 1145, 678, 182, -881, -963, 507, 1787, 1263, 404, -178, -978, -1346, 199, 1148, 1906, 442]
2972D42j372n50L92P18J601J230j527k170o31M71J856J060L73r82k302j035J309
2989a117J484J189J94j009j789r11R06J840Q66l44r64j411o68M15J621J539l26
3006A515j828j037j45N62J349N01j45j149r24L13O14M58J14L80p96p26L65O01
3024B2O28r92K05j32K34J00P6K7j99l08Q9O10q6K06J56j193J33R4J109L83k58
3045I04p59m88p4K87J245P23q33j129r87K40J195J094N69q68j402r27J21J423
3063C34J460j65o33j344j594M39J566J928L69j537j417j240P16J941J558k58j596
3080E27j130r20M69J639J375M69j410k126l93J034J644P15j48j064j276o06P72
3097d29J098P47Np88j357k52Q39Q11N14k46o60m23m86K61M12O03j2o65l92Jr4
$$ y = [442, -930, -1480, -1088, -370, 1231, 2461, 934, -1236, -1867, -1396, 460, 1520, 1893, 911, -1391, -2426, -1117, 367, 1556, 1750, 741, -1048, -1959, -1053, 787, 1653, 1309, 345, -1066, -1734, -1319, 302, 1841, 1515, -313, -1350, -1495, -933, 416, 917, 772, -377, -1301, -988, -374, 84, 198, 578, -218, -944, -579, 22, 650, -342, -137, -269, -35, 65, 141, 168, -31, -339, -250, 360, 274, 480, 636, -557, -424, -330, 779, 1162, 904, 145, -343, -417, -130, 1115, 1838, 1005, -124, -1111, -871, 324, 1418, 1987, 1119, -283, -1210, -1089, 334, 1794, 1629, 996, -348, -1942, -1503, 63, 1991, 2360, 823, -594, -1834, -1118, 823, 2381, 2123, 527, -603, -1523, -1054, 585, 1960, 2429, 1019, -1107, -1500, -466, 1178, 1893, 1745, 681, -595, -1201, -429, 669, 1416, 1421, 633, -724, -976, -137, 674, 1188, 942, 282, -141, -627, -366, 46, 649, 637, -28, -420, -419, -513]
3118e13M00K36m94KL2J08j04o27K46N7L76K1M15m39J3m91J47N47M34K63m31q04
3140f06o55L93J164Q80k01o90j218o24N47J316R78J03j533j096m20R17J391J056
3158A702J21k071j265l55J095J473R52k60j752j476m76J883J313O34j077r86r88
3175a533n08J248J519P47o56j422j022l33J259J299J344j344j305m37L33R97Q70
3192A056O68p13r89p69J82Q20P43M82o75k78q07L51L34M96n3L08n23m18k66N71
3212E20M46qm33l4L7P3l94K68k84l38O14K72l65j30n21k8j51P26N61m5o86j178
3234a078O1Q52Q03j6L93j150q84L43P44Q33K80m09o39j191k26P21J539N70p62
3253G84j040o65p8O76J347N39l98j422p02L28N64J149P47q13j227j198M76J442
$$ y = [-513, -113, 123, -371, -369, -337, -229, -333, -960, -714, -657, -281, -260, 155, -284, -271, -762, -615, -68, 366, 629, 198, -606, -1261, -868, 296, 1176, 975, 285, -933, -1557, -1010, 306, 1284, 1387, -146, -1242, -1662, -745, 646, 1702, 1823, -248, -1513, -1868, -773, 700, 1652, 1392, -360, -1836, -2312, -429, 884, 1518, 441, -545, -1533, -2041, -793, 726, 1473, 817, -605, -1627, -1960, -701, 598, 1942, 598, -707, -1144, -811, 186, 1056, 1724, 1011, 22, -747, -565, 255, 998, 1480, 805, 527, -280, 71, 405, 901, 848, 1156, 633, 215, -51, 520, 966, 958, 525, 491, 528, 601, 207, 475, 191, -147, 467, 739, 374, 244, -277, -305, -456, 270, 831, 786, 100, -1078, -1017, -165, 638, 622, 1015, -135, -1019, -676, 68, 901, 1181, 772, 133, -1058, -1284, -563, 976, 1546, 784, -256, -921, -999, -323, 1024, 1563, 1165, -257, -959, -631, -67, 1082, 1829, 1016, -211, -1409, -933, 509]
3271E09N43K64o09q64j133M95R63J053m75m52r09l66K73N87P52l67m72j32m09
3290g49k00M14J455R4r23p76K34N68Q7k37K23J42m17r1N69L4n65O1K59m0M1N60
3312G43n76n74j41O62J007k1m80l46m93j65N49J073L31q18p25k31j27P29O15Q24
3332A836r32j408o13N92P88P27N10l15j471j248N26J316J421k52o69j471j054
3349a717P00J566R84n63p35p54p52n2J404J441j81j299j464L51R3Q75J182J83
3367A262j041r39m26N61O55O30P09r81j386l80J133P62K37p0k89j137k21O02J043
3386G24K15o39n92J58l43k28J066Q0m97m50L74K69p88J49K47K29o5r4N98n30m27
3407e44l9M26k71M14N31l17q13p68N83Q69K33k88j5l90j124L86J253J013l82n76
$$ y = [509, 1052, 1316, 707, -157, -1290, -795, 168, 1221, 746, 294, -615, -981, -708, -121, 631, 264, -208, -340, -749, -949, -535, 920, 1014, 91, -685, -451, 117, 204, -33, 190, 332, -85, -176, 393, 427, -138, -77, 182, 142, 183, 743, 167, -407, -548, 114, 1121, 1100, 620, 274, -219, -384, 165, 1238, 1569, 751, 26, -205, -332, 397, 1012, 1836, 904, -504, -1117, -525, 263, 990, 1500, 1185, -286, -1534, -1008, 308, 1729, 1477, 808, -663, -1717, -1017, 549, 1533, 970, 235, -519, -1271, -1323, 81, 1522, 1341, 42, -1422, -1071, -978, -103, 1079, 1262, 221, -718, -1144, -583, 72, 702, 1411, 430, -956, -1336, -203, 559, 796, 726, 437, -700, -921, -319, 724, 939, 300, -292, -134, -477, -705, 361, 441, -56, -506, -132, 137, -651, -502, -255, -26, -91, -185, 413, -117, -544, -583, -157, -428, -14, 517, 200, -613, -1381, -798, 71, 304, 16, 1, -389, -1513, -1127, 126, 1139, 757, 181]
3427A81r04K3K07R56J106l20j086j002J5N2R28J275K17j448j184j85J023J356
3445A210K34j1j212j442JJ180J158J67k65m65j494r6Q23J677K60r99j021m53J25
3464f23N33R42L55m58j488JM67r6Q13L00j78j152n31R95O92l39l0L36q13m95L10
3485d59R99L8n60%j86K07M18j71J83m96j29M23L80l19m62O4Mm41N84O61k8p85
3507g5n54Q8k8N79Q72K45q57j371J05L70O61O51K58o32j393m57J213P35O62o26
3527D46m13r45m59M74J554L54m52j015n69j81P74Q01J108o46j329o44K60M07Q63
3546C88P94%j404j179L07J185J009k48q5q41n93N7P68P42k62m31o4m13j94K58
3566b06N59K56p47j52K75l17p0O33L90n82k9JJ60n90J71N23J44k28K07j72j45
$$ y = [181, -723, -700, -493, 463, 1569, 1249, 163, -839, -824, -772, 156, 1431, 1648, 200, -984, -1169, -146, 1210, 1444, 1433, 221, -1221, -1220, -40, 1118, 1285, 1020, 555, -939, -1035, -212, 1465, 1725, 726, -295, -748, -623, -90, 852, 1207, 749, -739, -738, -271, -367, 446, 746, 568, -584, -1115, -120, 572, 233, 203, 539, -274, -769, -459, 540, 578, 18, 18, -168, 39, 457, 286, 469, -27, -156, 267, 647, 328, -134, -70, -66, -507, 77, 738, 710, -75, -629, -541, -569, 10, 882, 1127, 270, -1101, -996, -626, 35, 686, 944, 312, -1081, -1538, -325, 410, 1072, 446, 33, -912, -1371, -897, 657, 1011, 559, -456, -1025, -1206, -432, 369, 1477, 831, -498, -1142, -882, -475, 388, 1182, 1182, -222, -1401, -1094, 91, 1100, 852, 767, -74, -667, -610, 158, 900, 638, 207, 143, -270, -464, -206, 353, 609, -138, -290, -15, -332, -402, 231, 621, 39, 10, 11, 171, -419, -248, 275, 419, 191, 398, 226, 81]
3587H1k62qM71J31o6j75j74k24k97N38P99J11o60l66k72m06O81Q11K63o46j084
3608g54L9L94J21R18O2k5j190q43M07J284L66J36p78j154m35N33J220O26J30q85
3628A72p68j045N19J351P47q2j159o71k33O97M71M72Q1q93o10k40M19Q89O15j29
3648F03r27o50j7O50O31K0j37J27q34k67M70M22K72l56k62m10K13K37J23K30l36
3669a98j93j90J18K49J23Q6l68k96L63K09K66m31n2J23j60O01J15j18p58m3J79
3690c75L11Q17Q4n13m32q49O3Q44R26R8n17q17p1J7N64J069j4q90q43l65L24J189
3712F20M41K09j030j010j86N72Q58N61l21k13j112j40K94R25O02l51p23o56k41
3731i01N51Q42N74l68n85k5p08L86N65N00p4o40j51l20L90K04L96j18l82j68j13
$$ y = [81, -181, -189, 282, 413, 347, 172, -2, -226, -523, 15, 814, 925, 265, -101, -373, -779, -98, 713, 976, 330, -754, -715, -321, -200, 718, 780, 755, -435, -1278, -871, 413, 779, 915, 137, -1017, -1452, -919, 301, 927, 1057, 172, -596, -1641, -1122, 229, 976, 894, -265, -936, -1169, -472, -1, 471, 552, -341, -951, -1191, -772, 117, 732, 603, -324, -974, -991, -341, 290, 310, 173, 300, -534, -801, -331, 91, 363, 7, -255, -665, -452, -215, -92, 138, -198, -391, -581, -463, -214, -91, -5, -373, -669, -306, -97, 169, -262, -314, -191, -351, 250, 365, 247, -511, -554, -375, -64, 753, 837, 324, -108, -957, -894, -50, 876, 974, 457, -360, -431, -414, 150, 1219, 1205, 315, -528, -893, -569, 620, 1061, 1270, 240, -770, -956, -384, 474, 1035, 714, 501, -611, -751, -457, 468, 1070, 719, -4, -660, -901, -350, 492, 1066, 698, 113, 88, -620, -234, 331, 831, 757, 117, -34, -354, 36, 240, 636, 518, 136, -32, -145]
3752a45M54j72k6N64k15m69L15K72N8m93k60K25kL10m5m70k69J18N09K19k27p3
3774A78m33k65l1P12L04M36j018l42n0n2P42N86k6r20l42n84M44J033N20j25q95
3795a28n78l19K42J043Q62o10m12q63k75Q46P99P42l02q85j105K67Q02Q50K55
3814A231l03j116l10j61R96J71N32l73r18o91J77O07Q54J57l16p34q85M50L93
3833b39R04K21m40p05p47Q3Q30P21n9m08o13J07R6M43K01o9k65j51K06j25J79
3854A70k5J49j06j36M26P6k4n26K32N5N28l44J98q1o12p8L73O4M66J52p36o25
3876d04j57O72N00j49j42p89j50J19j9R71K87l23q35m84K59J19R12L85l82p45
3896c55o17LL75Q89Q6L3q36o65J31P11Q02O0l69j035l48M62O25R23J66n80o77
$$ y = [-145, 309, 137, 111, 675, 460, -9, 306, 578, 636, 143, -117, 108, 106, 416, 371, -99, -368, -250, 259, 478, 251, 178, -255, -520, -551, 161, 465, 901, -117, -459, -509, -561, 181, 767, 741, -179, -521, -1105, -661, 372, 892, 767, -128, -706, -1025, -783, 260, 1122, 512, 100, -763, -1038, -192, 607, 1349, 1047, 162, -943, -676, 126, 976, 1231, 928, -188, -498, -659, 337, 508, 1040, 667, -251, -942, -765, -158, 696, 853, 537, -197, -1082, -632, -239, 665, 886, 446, -259, -1006, -923, -93, 628, 569, 161, -452, -345, -249, 194, 395, 326, 61, -90, 116, -9, 170, 145, 294, 188, 52, 478, 554, 530, 4, 236, 291, 819, 475, 673, 592, -20, -98, 275, 339, 805, 957, 221, -404, -561, 111, 611, 462, 320, -469, -619, -500, -519, 452, 739, 416, -419, -903, -644, -525, 387, 772, 390, -355, -972, -969, -594, 295, 381, 414, -422, -1087, -956, -245, 557, 617, 248, -787, -1135, -673, -48, 875, 1041, 461, -216]
3917b16n11M44O62P70n58n63o79K06M86L27J66j59l30o13K03L69J1L41j86m5k97
3938a72m36O75q2l7j20R7L4l1k93L54k03l3k0K27J07q6k51k14J63J8L35K93j07
3961B18n34K22Q8K42J89K99l57k33n39P42L73p5J82j24r71j27j18R06J08K74k82
3982D83l13j126K23Q87R25l10l04o66o36N57M16Q55K90j043o39j94J23Q13N80
4001I21k10m58p19k44N31Q5L37j95j12l54j52L10M79K49j8m67j87l55K24N91M13
4022F69k22p51N26n14J78J31L27j84k94k23J47K48k30l8K04l9K6K29k58n15K64
4043c19N26L53m56j05n7j59l17K36O59J40k48n32P5k09j62N35M83R7q24l68K51
4064d01k98R31N88j49j127m69L30L92N38J99N4q60n30k9O94N40N27o56n83m23
$$ y = [-216, -727, -283, 379, 1149, 591, 28, -651, -445, 41, 368, 534, 375, 45, -568, -365, 4, 15, 356, 170, 125, -172, -608, 67, -15, -52, -172, -75, -41, -72, -365, -11, -214, -247, -267, -40, 67, -19, -270, -484, -321, -303, 32, 325, 218, -316, -94, -6, 236, 425, 724, 367, 134, -405, 337, 710, 635, 817, 693, -278, -405, -523, 383, 491, 765, 483, 170, -956, -733, 154, 1079, 769, 465, -201, -837, -280, 136, 991, 1281, 238, -401, -595, -472, 341, 921, 711, 253, -466, -710, -179, -94, 243, 48, -64, -418, -570, -260, 219, 468, 450, -17, -204, -559, -335, 256, 669, 447, -304, 222, -292, -114, 17, 344, 160, -134, -357, -210, 38, -192, -230, -26, -65, -39, 190, -68, -583, -319, 207, 560, 104, -1, -58, -217, -534, -298, 361, 501, 253, -279, -204, -413, -575, -40, 443, 540, -284, -652, -401, -699, 232, 820, 671, -456, -925, -595, -203, 335, 534, 588, -272, -802, -831, -137, 403, 930, 274, -309, -732]
4084g32n8L53J096j3n98j88n41j29N70P25P10p48p86j12K84J79P72K4r6r05k57
4105d50M41K55M75k81M3n12n45M33M94k25K6o8J44l75j37L61J61j06k6o3n9k65
4127b79J63K30j62m06K92L12k07J63m99J60J00q5M42r4k97k57N4L5J88p7P20m70
4149B6n93LL45N42K06o6l94m97j30M38L44L61j75l48o11j10K63P55K06k70n75
4170b80l04j99M5O79O56j74p32m35j16Q04K97L31j55p65j79r0K89N71P3k5j80
4191A11o28l12J017M90j39r20pJ43k48L14P10J04n64j8j87J51j58M57Q0p8k74
4212D4j94K91k49K93m3j33J92n82L34K05o8q6K70J73k39N1j60k04o8L03J57om36
4235a55K14j81k33K8Q02M47p70k41l25M87N4N44J50k44q32j71p9P96M65n8l11
$$ y = [-732, -790, -437, 659, 646, 48, -140, -681, -810, -240, 485, 1195, 447, -339, -451, -167, 12, 784, 808, 712, -193, -450, -9, 246, 721, 440, 483, -29, -574, -141, 353, 128, 154, 86, 230, -145, -282, 79, 240, 134, 108, 45, -14, -279, -116, 114, -48, -454, -162, 150, -57, 106, -393, -233, -133, -218, 224, 130, -167, -424, -370, -335, -147, -224, 496, 26, -567, -564, -219, 323, 529, 463, 69, -428, -558, -120, 224, 585, 410, 62, -549, -659, -396, 359, 565, 295, -280, -584, -783, -738, -59, 597, 423, -309, -744, -860, -56, 241, 572, 417, -348, -527, -617, -328, 243, 316, 291, 111, -517, -829, 188, 678, 539, -381, -388, -245, -493, -179, 531, 635, 71, 53, -134, 17, -141, 316, 396, 318, 44, -150, 141, -108, 185, 142, 9, 201, -381, -47, 158, 90, 4, 274, 447, 208, 259, 99, -105, -173, 130, 287, 281, -155, 59, -122, -355, -327, 475, 922, 152, -89, -414, 73, 127, 671, 821, 577, -255, -426, -505, 291, 756, 698, 387]
4256C87m73n65NR29O40k54o29n76p7K60O69M76r0n64k75k45Q5O40J79Q6m03o40
4278d35l81O72K50M31Rj81p83N0K09M93K15Q5o02p21j15O30K97J58j20M1k81l70
4300d49K46N42J60k38o58J59K45J5j02K72n77J71K39J76K84n77l14L37K15l25
4320a79M95l06M3l58J60J66M59o09L54n04J78L4J02M68l75L51o13k48J12L29M67
4341E26k45k38m16k13M48M74K58l36Oq92j31N51N11K90k69k65p27k8M50M84L94
4362F32l79j90k3n13R9N54N39k46m28k62J0J63N38R1j75l96j08j07K44L21L04
4383F68l81q9p94K84M45J15m3m43M6k3K93k22L81k06j9j73PL06J92l12k9m8J63
4406A18K07k12N2n14K38k0K51K18p6k62m21J52J7M63K04j25l82m96K31L42K93
$$ y = [387, -86, -651, -646, 283, 923, 669, 40, -536, -613, -353, 316, 792, 702, 138, -137, -382, -297, 343, 522, 608, 205, -435, -816, -144, 106, 537, 546, 365, -418, -368, -159, 334, 549, 634, 32, -689, -804, -174, 123, 281, 161, 202, -79, -449, -203, 339, 499, 261, -397, -238, 7, 22, -80, 192, -385, -214, 25, 201, 485, -92, -406, -69, 146, -179, 316, 10, 53, -305, -145, 21, 480, -129, 225, -279, -101, -67, 35, 503, 128, 479, -134, -382, -270, 59, 526, 281, 43, -373, -586, -138, 336, 594, 258, 264, -628, -759, -208, 303, 593, 324, 59, -668, -696, -246, 238, 632, 253, 63, 40, -473, -374, 180, 719, 473, 45, -217, -207, -44, 494, 585, 410, 14, -94, -201, 43, 364, 668, 287, 198, -596, -312, 133, 248, 205, -238, -192, -215, 78, -144, 237, 31, 12, -161, -154, 152, 344, 32, 3, -45, 118, 325, 113, 165, -349, -111, -131, 120, 338, 262, 0, -421, -269, -252, 211, 415, 290, -92, -588, -357, -15, 278]
4427B78n7J32l18n61K24k7O70N78m22r37j76r6M06M59L89l36l61k60q07P13O63
4448A54M85k24o23n20n5R13L83K07m90n14l73L35M20K16M52l74m87m15J58L86
4468C4O57k42r4l99k2j07J88L62O2o3l53j33j04O00J43m5m26J12j95K74j36M4
4490A57p3R0k27k10q6Q5j54l1L4M12j12K69n17n5J71O7O34k78j64N2j08Q3j17
4513g8N91qj54k40l63K90j83O86O3j63p20m51K08N99M06j01P6p32k84J33M16N59
4535E50k17m51o8l09J06L00O89k21k41o50k42L3L48M36o0l12n04j84L44L56L87
4556I0L03p60m32L16M0L53K98j63j64j44l08N36m2L37k46j16l34K53J78J06o58
4577e57Q39n14K77k74o2J85L80k67jq5R3j82K33p3J34m53N27k4r5j57j17q1J24
$$ y = [278, 221, 353, 35, -526, -302, -329, 341, 919, 497, -440, -616, -712, -306, 153, 542, 206, -155, -415, -1222, -509, 154, 639, 415, -208, -728, -783, 130, 513, 720, 230, -284, -657, -322, 98, 314, 766, 392, -95, -510, -352, 34, 691, 449, 355, -44, -66, -173, 15, 377, 439, 376, 23, -110, -214, 386, 529, 484, 58, 170, -25, 249, 113, 157, 84, 174, -53, -263, -349, -264, -418, -449, -415, -3, -115, 154, -363, -418, -247, -180, 454, 176, 12, 64, -44, 39, -78, 513, 505, 351, 111, -252, 38, -145, 541, 604, 441, -279, -730, -522, 77, 483, 382, 458, -274, -558, -425, -9, 550, 333, -118, -186, -495, -389, -89, 600, 379, 138, -512, -754, -721, -373, 63, 3, -309, -813, -997, -653, -297, 90, 393, -367, -799, -483, -443, -90, 208, 45, -119, -263, -571, -35, -77, 260, 14, -102, -436, -183, -5, 101, -557, 282, -232, 45, -229, -291, -106, 274, 7, 6, -79, 14, -168, 65, -8, 126, -327, 200, 176, 81, -76, -193, -274, -150]
4600a50J74J03k73j69M1l65J93N00J81j51o48l7J38J21P64K1l39o72K01KM83N46
4622F64k3m75n91k65N03K15M01L3k34m25l92L04N51M22K0m53k61j53j16R19j44
4643E00k79K50j002J59J87O77P3m43j70l9k99K87l0L61k47m50k18M08R8K63k6
4664F0J86Np78K32N30r7m9K39l11k80J36k5K30l55J80K16N4k10n5n8K3o8K76K05
4688B86k40j36K25n02L18J83L50l49j95j94J8p3N61O1J85o78m81L81J01L2M80
4709C33Ko73l39j5O03j14O74k45p6n49N1M09L31J66j0p92K4n0M29J53n5k0m24
4732a87l05L14J70L00L8J32n87k14k72P54M09K7j46m91n4j76N44k8M30m10k52
4753dk22j06O23M31n19j47k14J00J1J67J00Oj63k71L17K02j09k06M2j11M46j59
$$ y = [-150, 24, 127, -146, -315, -274, -639, -446, 54, 235, 84, -564, -601, -463, -342, 422, 443, 104, -568, -367, -365, 118, 664, 641, 166, -425, -690, -187, 28, 429, 462, 228, -197, -589, -285, 266, 688, 708, 255, -6, -159, -275, 644, 500, 221, 471, -531, -372, -185, 492, 565, 122, -48, -87, -386, -99, -129, 232, -15, -465, -683, -275, -177, 86, 60, 246, 251, -527, -295, 235, 138, 89, 328, 17, -263, -127, -152, 78, -277, -97, 119, 173, -37, -92, -150, -127, -195, 81, 286, 46, -90, 135, -367, -49, 134, 484, 135, -60, -254, -236, -309, 252, 313, 498, -180, -661, -280, -179, -147, 333, 335, -338, -677, -692, -89, -203, 471, 226, 150, -399, -348, 61, 392, 558, 548, -244, -220, -270, 159, 312, 257, 237, -187, -492, -178, -8, 292, 330, 462, -125, -339, -611, 143, 552, 579, 433, -58, -112, -288, 256, 228, 658, 248, -4, -226, -332, 291, 722, 203, 56, -158, -58, -47, 120, 220, 226, 63, -208, 109, 311, 202, -4, 38, -73, 373, 214]
4775B14n4K42m36n2J91k4M8k0mNn67L13J89K75n93L31m11j69M44K32M27k96p57
4798d72K27R7O9N06K78o70m79m4M79K14j07K01j31n33m26L74M96L05j36j70k39
4819a61l34j2N11L0K62m86q2j09K72M29N8L6m38k46l1J23K90K49j99n8n02K47
4841a51Q8L63n85M44m7n32L41j07L58L0k08j29J68k6K7k64L38j93n6K45Q1j33
4863E2j47j20j38L49m7L84l06k56O6j42M15K22j29n1j85ok81N52K09J25k41o08
4885b83m9K22J37K80R4m8o55j18r1M22O33K08q40k23J2J00L32L82k92m21r8j98
4907d94M07j5K94J21k80m99k7J58L58J19K33j26n36rp9N63R6R7n37r6j43P9L54
4930C8M26j09l52l00P7J43J36O5J5J3m14J51pRL1J24O2k05O8J33j62R2O2j72J65
$$ y = [214, 160, 402, -34, -86, 105, 81, 129, 109, 105, 110, -457, -144, 45, 320, -273, 58, -353, -522, -78, 154, 581, 285, -472, -245, -148, -79, 427, 705, 35, -444, -488, -9, 205, 98, 299, 168, -365, -791, -417, 79, 384, 248, 78, -161, -495, -507, 4, 34, 296, -190, -272, -381, -109, 320, 378, 414, -24, -270, -301, -178, 112, 361, 162, 104, -398, -151, -63, 300, -285, 159, 112, -420, -79, -186, 172, 202, -6, -135, 33, 7, 34, -230, 108, -85, -141, 104, 185, 52, -95, -215, -353, -4, -51, 333, 27, -229, -163, -305, 110, 332, 203, 152, -33, -39, -320, 232, 441, 566, 325, -283, -332, -110, 27, 307, 401, 353, -302, -420, -511, -89, 544, 752, -88, -311, -299, -199, 133, 515, 223, -198, -296, -494, -87, -102, 192, 313, 33, -466, -493, -335, 23, 142, 375, 249, -287, -296, -375, 188, 284, 381, -156, -252, -395, -316, 38, 464, 355, 3, -297, -220, -77, 59, 124, 139, 152, -262, -111, -118, -109, -78, 46, 108, -97, -29, 104, -58, 34, 96, -76, 89]
4955H9k13j83M46q9j29J16qR5k0k70j39J81M80K3l25o9k52J28J33O9L59j5m94
4978h7J14n19L27J41K61J45m09o15M84l3N29j69k0R2o27L31r6M70K73n16N5o12
5000d81N04P9N50j0l34l18n3j40L14l7J17l7n78L57Q4J3j71M42K6k16p1k07M65
5023B98J32n14K98j8j02L9k6L12l71J60k84m9K03j05r5K47l90K62J23L0k50l48
5045d48L84J0J84M0j26J4l18L52m6M8J29L61n04o08J79K79L70j13l99R2k5j33
5067b78J57Q9L06J46l88l28l11L89L15M43j79o38K80l81j44P32J24Q7m18q02L33
5088d66K97O15K56o82j51l93L64Q2L51R2k91j51k58K6L75J77%k33l56K53N5K50
5110B12p4J01l48k4K05k65L01J0n5%J4k70M9M46L3j86m0K9l06k2L21J68k44q8
$$ y = [89, -124, -307, 139, 50, -79, 37, 29, 124, 104, -166, -305, -124, 356, 379, 54, -15, -267, -139, -6, 63, 422, 407, -87, 27, -492, -165, -24, 237, 382, -27, -642, -158, -191, 338, 169, 149, 241, -386, -55, -151, 319, 592, 76, 131, -481, 23, 102, 652, 642, 308, -10, -63, -203, 111, 74, 191, 154, -424, -67, 17, 30, -141, 301, 327, 111, 40, -167, 298, 430, -84, 214, 196, 94, 133, 107, 419, 48, 208, -76, -125, 78, -27, -122, 125, -265, -3, 120, 150, -100, -448, -64, -54, 130, 170, 44, 58, -260, 92, 46, 94, 223, 584, 80, -528, -349, -70, 300, 187, -212, -120, -145, -278, -121, -32, 274, 420, 32, -296, -607, -218, 97, 540, 361, -277, 3, -378, -522, 210, 334, 421, 3, -799, -466, -169, 446, 702, 20, -131, -524, -160, -78, 273, 365, 74, -77, -335, -309, 66, 243, 243, 10, -346, -93, -38, 212, 138, 239, -109, -133, 72, -193, 108, 118, 63, 63, 77, -193, -144, 302, 335, 149, 109, 138, -168, -190, 131, 299, 55, -33]
5134c3j06L56j02l20M05j51j21J4j97L67j01j8j85M2J20J10j50o3n5J25k49L93
5156H1p9K12l16k5J71K4L6J66k49j70k81M2L20L46j27N8l43k16o9L55K00R1k18
5179Im52J79J21J66J84J30k30l21q6K81K73J23j24m43j01p0K67L6J75J02n14K60
5201c5m12N1J35L55p5N6m88K71J28L3M8J18l46M2r8LJ74j87K42j43j14J44j4N4
5225e8m6N1J75m4j26L44k72kJ98l09J45K32k24R4j24k86L17R1L4o8q2q6J67k9
5249I2J45J45l58L9m0k03L76o2J11m50l8k37K53L88L09p4k29k17l58O49k3L8l04
5272d8P3n00L42j60L25K23j90k35j46K61JL11L7j13l32p3J6L08J78K16j43k47
5294A04k61K3J08L70J45k36k14j9l71L88L8j13j50J73n2j7j58L28k46N9M2p0k09
$$ y = [-33, -139, 217, 115, -205, 200, 49, -72, -58, -255, 112, 11, -7, -192, -150, -30, 80, -70, -133, -188, -63, -312, 81, 2, 214, -102, -127, 44, 68, 104, 270, 21, -149, -430, -388, -68, 278, 151, 209, -134, -350, -419, -64, 136, 227, 9, -443, -264, -143, 23, 207, 337, 107, -214, -300, -19, 254, 377, 253, -190, -291, -361, -94, -58, 117, 219, -295, -35, -447, -396, -261, 94, 19, 75, -413, -142, -14, 19, 67, 185, -161, -119, -217, -214, -40, -227, 15, -128, -242, -98, -112, -58, -104, -53, 122, 78, -48, 296, 24, 22, 220, -89, 56, 288, 64, 158, 34, -252, 65, 156, 190, 122, 40, -46, 121, 92, 237, 382, 24, 63, 23, -180, 196, 134, 245, -205, -243, -480, -227, 161, 470, 396, 167, -50, -408, 241, 218, 256, -48, 25, -475, -133, -293, 32, 255, 65, -170, -316, -55, -54, 257, 294, 181, -151, -224, -208, 100, 278, 494, 351, 104, -157, -134, -26, 344, 489, 253, 39, 20, -351, 37, 75, -38, -188, -15, -67, -84, -242, 86, -160, -101, -59, -129, -338]
5317c38K54r6K15M6l54L78O5j94m1l25J21J51L01k79OQl37M22J78K09m06Jq3J24
5341B6K8J93l9j28J09l98N0J77K92k1k58k17n1j71M65R1L97l93j31m1l96N60q1
5364F3M41k18n61K00K38j92J44l22N91o47k37L27L34l26O9K83n88n9P17j66K85
5385C76j00o4k69n36M10QN32j32J9j03l00k6J69K63R3k68K9o3OK42k47J12j31
5408B0k50R4L27l11R7k5K50j11k35jj36J11L03l33L19Kj89q1K72k16J47J10j59
5431Ej0k4j24j36N85k86m1K01q6l76q0L97M37l17j38k96Q1K52P0K54m8k65p4m71
5455d90N92J66j32m8k55j07n2O1M39J8l0k58l13K01P1K00J11M1m93M1o8J73J70
5478C8l4J55j92j49p8j6L48K20j17n27M62m5O7J3p6N4k26J11K3l8j32K17j80j39
$$ y = [-338, -84, -180, 35, 81, -273, 105, 170, -24, -65, -390, -269, -118, 183, -96, -90, -82, -419, 3, 181, 390, -16, -15, -98, 26, 54, 247, 208, 80, 189, -209, -159, 18, 310, 289, 31, -186, -237, -408, 57, 148, 545, 152, 21, -20, -416, 144, 63, 504, 286, -275, -75, 163, -29, 115, -207, 384, -263, -500, -173, 161, -165, -96, 187, -401, -460, 257, 91, 376, 276, 212, -57, -593, -183, -175, 357, 225, 244, 141, -159, -185, -16, 247, 340, 72, 101, 38, 44, 286, 39, 151, 20, -230, -136, 191, -120, -23, -48, 202, 91, -144, -145, -281, -170, 133, -200, 119, 121, -68, -149, 123, -93, 54, 164, 5, -5, -29, -153, -289, 296, 10, -31, 170, 84, -292, -372, 25, 462, 145, 7, -289, -208, 44, 114, 368, 320, 55, -19, -490, 102, 268, 136, 88, -167, -274, -326, -265, 174, 192, 162, -96, -409, -208, -137, 63, 174, 215, -278, -237, -305, -132, 38, 4, 159, -33, -182, -260, -276, 72, 292, 175, -352, 110, 65, 132, 145, 69, 123, -103, 8, 31, -7, -139, 78, -102, -241]
5502b41K86P2Jo5m24K58r5M42k57J52j8m89N99j48K76l30J99m48J70l03J77L18
5524A32j65K11m33n1M15m84O86l58p0O6k96K41K56k2J17m31o3k89M87K76R5N7
5546C77n91M27n97J65K32J09P6r0l01M7q0N69j00p7l77j22L49k31N48k6p1l00
5568f4k37L14l4L4l39P3J87k45J59K21l7N6l36L52j26q6K99l77M77l04J7q0n5
5591a31ml8J49J0m5j78K74m8J14J44l54J07R5k31J58l52p5M44n3QM59o28P9M1
5615e5L54J00n91K52l45K21j40L49pO4k5l55o8k1K83K60L36p07ql41K16l9N06
5638B39k4k49j15l88N73q7L71k67L30m95J15L4q4K71l2j13m09L63j26j4M92j86
5660A99N6o5l32J59R1N4J28m27J95L07k58k86K92R2j3l1k02K09J9N3k44L96n64
$$ y = [-241, 45, 117, 118, 53, -371, -113, -208, 234, -23, 129, 111, -378, 221, 73, 349, 19, 218, -230, -60, -363, -186, 132, -33, 178, -255, -306, 109, -375, 311, -47, -117, -51, -347, -106, 150, 128, 245, -186, -249, -538, -51, 225, 320, 377, -214, 213, -384, -219, 13, 122, 198, 108, -193, -146, -226, 343, 243, 166, -211, -333, 16, -215, 333, 307, 236, -64, -301, 13, -21, 13, -326, -253, -66, -311, -152, 69, 32, 88, -248, 104, -22, -108, 191, -186, 291, -13, 4, -76, -131, -135, -173, -24, -14, -59, -237, 37, -11, 103, 247, -107, 0, 95, -136, 22, -330, -405, 39, -14, -6, 453, -175, -96, -55, 299, 399, -192, 60, -285, -64, -204, 145, 138, 202, 177, -178, -246, -267, 16, 276, 612, -95, -103, -444, -228, -267, 239, 215, -34, -149, -537, 36, -51, 320, 53, 383, -112, 3, 37, -47, 224, 192, 79, -330, 33, -93, -107, 385, 199, 255, 190, -142, 17, 108, 162, 290, -137, 58, 365, 107, -179, 113, 205, 192, 161, -41, 168, 187, 240, -4, 392, -172]
5683a72LL50j96j48j32L10K74q1k1k64j7N8J9K59L7o9l21K97l27LK39l3R8j4m33
5708b81K4J80M09L28n86j66K7l8L37L27l97j9m3r7J64j03q9L40k55m92j7L25K13
5731I1J30o9n4m20j25M46j1J90L4k47Q2j24j22K17L7pL5k72j3J13K72J54j88k6
5755A23p0J28m22N36j93l34K17Q8q9j92J51J63P9k79P8J31l51M12M2l11K24k19
5777h8J59N5L22o52M96k27K06m32K79k04J21l2K99k4k32o9J8m16L69K66j44j24
5799e4j36m8KJ72L92m16N7Q8j57j80J85K81J1Rl61j9j22K80J01q0n3L6j07R8M6
5824B5J52r3o2j79q7k55P63K92l28o2p6p1Nj5%J00K3m07K4J94K30j10k16L18k11
5849d6l41L61L6j04M39n55o3J12R4R2j83N5M8P3j9J26j02J07k64K58j79K59l19
$$ y = [-172, -169, 181, -15, -163, -295, 15, 289, 208, 187, -77, -94, -36, -17, 242, 279, 210, -111, 186, -141, -138, 101, 68, 166, 152, -281, -257, -77, 332, 660, 74, -92, -65, -103, 234, 561, 164, 145, 102, 5, 169, 66, -23, 317, 62, -430, -447, -122, 91, 221, 152, 98, -322, -447, -1, -12, 178, 212, -35, 47, -77, -199, 18, 55, 48, 83, -189, -202, -89, 183, 337, 149, 123, 53, 181, -241, 295, 102, -232, -15, 73, -16, -208, -57, 106, 185, -94, -16, 115, -236, 176, 218, -93, 131, -88, 71, 126, 448, -204, 292, 65, 271, -161, 118, -86, 35, 3, 302, 278, 46, -23, -5, -421, -52, 214, 70, -54, -190, -238, -236, -64, 328, -88, -31, 57, -100, -280, -95, 186, 197, 206, -155, -174, -296, -16, 85, 5, -48, -12, -119, -21, 25, 177, 84, 22, -157, -244, -499, 264, 556, 228, 166, 90, 19, 24, 9, 9, 109, 132, -275, -251, -57, 173, 63, -153, 165, -46, -387, -26, 10, -94, 345, -210, -273, -161, -67, 25, -158, -103, -55, 18, -1, 125, 23, 130, -134, 124, -55, 204, -115]
5872a15RP8L9J3j3o4j04J67O7P9r2N6j88L45m00K15k36J21j55K82j58K93m11J17
5896e5k1J98J00l11K17k64k11N18j19n6K36r3q7j72O1pM29p6n23K52j52L64L06
5919E34m40o4K49k75n34N7M16K75j19j49j03k74M27q3K05j22m67M93j25K26k13
5940h6J19k78K53J2J60J7M4l42j04J41M7j74jJ21L89j45k92J82q1p4p5J56J46
5963A35J34k70j68O9J36l82L93kN9k11L9k11j01Q4J58J86j1j17j95nK09R4K47
5986B70m29J02j71j26K30J57K98n32p2K62j81L77l19K83j65k94J81q2L01K52j5
6007C27l19q1j30J07J94J16j50j15j47J74l41N03K6k69R0k59K93k15K5L69Lr0
6029A11j71m1j49M04j55l45M02k09Q1L5j09K17n3J2J16k93M72l08J22k87J83J45
$$ y = [-115, -106, -28, 11, 24, 11, -53, -157, 10, 77, 156, 64, 120, -68, 277, -123, 92, -144, -23, -178, 104, -54, 239, -172, -55, -76, 122, 222, -89, 128, -136, -347, 171, 52, -4, 232, 139, 52, -120, -59, -66, 363, 287, -236, 16, -136, 228, 534, 94, 30, 279, 4, -530, -473, -57, 218, 99, -50, -153, -427, 0, -83, 122, 0, -467, 26, -99, 127, -86, 33, -245, 8, 20, 180, 197, 241, -101, -205, -64, -17, -191, -192, -71, 318, 173, -119, 63, -18, -92, -167, -11, 135, 269, -1, -169, -100, 36, -346, 47, 45, 104, -107, -68, -279, -380, -296, -138, 48, 37, -80, -275, -280, -71, 23, 270, -159, -57, -228, -354, -124, 33, 331, -201, -273, -11, -192, 185, -134, 149, -16, -310, -129, -211, 90, 342, 327, 8, -73, -203, -96, 98, 214, 64, -51, -198, -24, -365, 138, 164, -105, -15, -274, 19, -196, -171, 198, 201, 111, -60, -101, -250, 154, -1, -346, 56, -153, -72, -37, -146, 71, 18, 30, 146, -147, 325, 17, 139, -148, 35, 180]
6051A80j35j18j34j94M58r6NP9l27l5M46k66j2R9J37K4n98M39K09j01N0K38l51
6074cp2r9j0K66M6l83L90l12K18l83K26O0J37J4j62j15q0L52J44k67P2o11L55
6097b17j17L69J61j15j04m2j15K70k2k68J62K76k83R2J54l04K54J4m99J91J32
6118a1M06m23k6J59L8r9J23K2j17K21l15K2l1j18k2J24J10P4j20M4j11R4j21J7
6142f0N2N5J85p5n05M73K0j30N5j0j0m3Q9k29o7K72J35n90M60p3L05k21P4K6K17
6167D05n37K65Qk27K61pK5k69j32q8M40P0j57k1m9m4J28Q4m9J4L44m07j83j56
6191b82K52K75l7j51l5l57O5M73m1m0J2J09m36L85R9l94L4J29j00l45M11K6L3
6214H5J31j87K53l73p0L3J02R1k95K4J37j64K30J65o9J57j49k75J53J90m74N61
$$ y = [180, 45, -73, -207, -401, 57, -39, -34, 45, -282, -317, 129, -137, -149, -50, 87, 111, -487, -48, 161, 60, 110, 348, -3, -75, -174, -184, 82, 128, -255, 135, -177, 41, -342, -116, -56, 81, 95, -67, -182, -262, 90, 234, -33, 39, -572, -217, -334, 35, 196, 81, -23, -65, -180, 90, 68, -200, -38, 238, -45, 47, 201, -103, 151, 165, -334, -143, -11, 395, -28, -54, 105, 143, 44, 167, 189, 72, 293, -22, 0, -31, -149, -171, -47, 63, 137, 17, 61, -50, 44, -77, -60, -8, 47, 232, 157, -348, 125, 145, 15, 70, 60, 50, 7, 96, -133, -200, 72, 207, -383, 77, 4, 309, 88, 162, 188, 405, -132, 133, 141, -86, 175, 168, 193, -76, -208, -296, 144, 214, 57, 36, -13, -57, 71, 155, 106, 120, 464, 57, -126, -282, -30, 245, 208, 57, 22, -335, -270, 203, 162, 122, 134, 243, -193, 192, 291, -103, -69, 60, -40, -385, 26, 52, 85, 216, 29, 282, -91, -161, -128, -26, 65, -230, -206, -69, -233, -3, 162, 93, 250, 101, -174, -21, 169, -305, 256]
6236B56O0m80R7P5j34m8J54K98n4k24L74k03j86k48L90r3O6k39P6L2j06p7L13
6259I9K85k39m29R0j97M44p0L8nk06L81k70K6K8J01k30j01K77p3J83Q4j38j24
6282d6m6j0L29o2L9J54j65l51J80J16k99L02n3r9j62k09J18K32n2N01n98K3J72
6305A4m0K94k67j3j02j1K24j25j66J5J83k27KR1M61n8j79k63p3N4J85r4K20j96
6329g1m2K65k95M68m64K31m03N6M31j24Q8j94J2J34J15l04K45j81m4L99n78J40
6351a16K40NK6K1j68m2l25K73M3J00j17p3R0j37J51K78%l82L1J03j92O20Kl41
6375I0l3j01R7O9j73R0K25j54l21QL43P1p9k41N2k80K03J90L0R5om26Q4J19J35
6400H7J21j63J21k40mJ1m9M1j78J93Q0J03nl72L81j0K9k01q5J91J12j61J08J67
$$ y = [256, 316, -164, -67, 8, -126, -174, -20, 278, 224, 0, 374, 171, -15, -263, 127, 34, 100, -139, -63, -31, -137, -214, 99, 384, 145, -284, -194, -391, 53, -17, 21, 16, -190, 191, -79, -53, -25, 76, -154, -255, 22, -51, 132, 216, 78, -46, -92, -102, 227, 165, 204, 358, 193, -158, 22, 138, -161, 141, 88, -11, -173, -382, -264, -32, -84, 417, -181, -158, 14, -26, 268, 1, -12, -114, -125, 99, -26, -192, -177, 6, -221, -219, -128, 333, 275, 96, -167, -240, -186, -1, -95, 125, -71, -113, 152, -143, 325, -139, 92, -311, -255, 176, 52, 140, -54, -42, 92, 207, -97, 148, -33, -77, 322, -256, -116, 124, 129, 155, 176, 8, -34, -359, -86, -43, 57, -60, -133, -43, -180, -29, 249, 249, -133, -102, 1, -191, 429, 431, 90, 57, -44, 53, 122, -51, 39, 264, 110, -211, -203, 140, 211, 132, -109, -57, -337, -134, 56, 86, 181, 175, -251, -167, -48, 87, 208, 45, 166, -74, -78, -67, -116, -75, -253, -60, 20, 123, 118, -254, 127, 117, 146, -55, -140, 51, 163, 2, 110, 277]
6424B77j68j39K81l71J00k48J80J20n5R2m7k9l86N59l48M57k6k31p4k2J18J19
6446A59j6j3l1j07J28m0L38k16j21N8k42k2K02p6j03J79m61J51p2L74j83J69O3
6469A18l65K11l63M64r1L25l05k8m9j04K70J68p1j35j47N4J2j10M73j06m57j9
6491b55M13j1l46K81M8l25K23j67K42j49O3rJ72k92J58L6r0Qk57L36J00m53J80
6514i4N7J12j41j83J63O7q7J5J28j07R4j02Q3J27k47m0K84p6J24KM0m00J74JR1
6539H5m2m9K04m9k73O0O2K87pl08rK0J40j73J4J13LL2j91j05J58j12L99l19n1
6564a11k26L99j24K15j95r0J68J33j41jJ42k00Q7l24L99L9j92m3K87j36j10n9
6586h3J44q1j09L18m2k14k5J92m1j14j48K2J80m4r2J66P9k63K57l43L19k5k71
$$ y = [277, 109, -30, 251, -120, -20, -268, -88, 32, -23, 69, 22, -7, -393, 166, -182, 275, 249, 18, -56, -78, 40, 159, 143, 130, 99, -8, 120, 80, 418, 202, 81, 139, -103, -125, 77, 1, -102, 77, -384, -233, -305, 69, -114, 55, 118, -247, -36, -399, 65, -26, 299, -6, -34, -83, -187, 83, 251, 180, 45, -102, -48, -36, -146, 327, 221, -236, -255, 158, 147, -199, 82, 130, -195, 28, -139, 103, -46, 17, 8, 180, -112, 46, 82, -8, 0, -257, 79, 179, -274, -94, -37, 75, -66, -249, -86, -19, -106, -91, 37, -70, 24, -78, 5, 132, -115, -155, 129, 53, 177, 179, 219, -181, -7, -6, 85, 43, -6, 198, 149, -124, -64, -2, 285, 278, -30, -39, -19, 121, -52, -38, 75, 78, 110, -81, -186, -28, -140, 259, -60, -111, -337, 62, -62, 153, -42, -132, 36, 169, 28, 27, 169, -31, 56, -268, 131, 170, -22, -65, 222, 86, -24, -83, 61, -20, -129, 189, 147, -67, -92, 100, 59, -55, -203, -181, -1, -45, -137, 29, 108, -155, 102, -241, 78, 53, -218]
6609b18L52m8j21j5P1O5j63K19n70L23K63J05l60r6O4j45L38k41J79L03l82m5
6631a22J0L58k01j02J27j16J39O0l62J68K04K9r8r3o0K2K95n0l58K50n1j57k87
6654c95L61q0J04J70k82J2J95K09k27J07j65j2l73O58p5r0o8r7J46o0j72n6L10
6677A20R4k07qp2J07j0J2L29k25Pr7j87n2J58l9J41j29J19j50m9o5K54l3p5N5
6702bQ3j52j05J75J71q4J62l85J71Q1j58M5j6l03M24q8K4J4N5m6l85J20l28O66
6726A39n4O7n1j67p8J21J36j36L49k49j55J71l34M05K1l44J90J96n45N56r6j63
6748b1l8O5j6o0N5k46L65l8n2k58K23n7K07j50P6Pk69Q3J94l%J18k59K81r1m25
6774c09M51l61jK99p8L12m26M40m66J48o9J27M1j7J82j63k6R2k34K46k97P9J38
$$ y = [-218, 134, 86, -35, -50, 21, 86, -77, 142, -428, -105, 158, 263, -97, -193, -129, -274, 64, -177, 2, 305, -77, -122, -112, 246, 45, -57, 70, -46, 93, 153, -209, -41, 163, 192, 94, 1, -59, -37, 258, 208, -150, 100, 49, -108, -395, -34, -114, -10, 160, -122, -110, 85, 294, 67, 174, 9, -3, -376, 282, 207, 117, 49, -48, 98, 38, -134, -190, 120, 214, 7, -1, -73, 34, 24, 36, 365, 140, 147, 50, -137, -189, -31, -70, 71, -58, 61, -89, -138, -203, 51, 18, -57, -2, 81, -71, -176, -1, 170, 86, 248, -137, 34, 115, -43, 2, -14, -317, 107, 19, 43, 57, 112, 66, -319, -199, -527, 139, 85, 152, 101, -66, -144, -23, 113, -23, 326, 77, -78, 93, -241, 164, 185, -159, 31, 227, -318, 238, 142, -21, -59, 6, -10, -70, -15, -261, 104, 66, 14, -244, -21, -78, 129, -21, 55, 62, -207, -124, 70, 67, 67, 185, -74, 207, 116, -309, 142, -219, -220, 79, 1, 313, -113, 327, -139, 9, -60, 67, 108, 91, 273, 110, 84, 176, -58, 188, -109, -30, 108]
6797A08k3%j33L22j57J47k48K3j48K51Nj80J2j40J35L27j40n2j03K6m4j87M91
6820B92q5j28j52J57L1k74M27j58j33R2l9O2k49J66K12j6m2N2n70K35L42L9m02
6843a41J86J09k61M8o4L64j58j55k77J55P9J96K34l37J44pn44J55M31q9k07J29
6865a0j98r7L93p9K32q6%R6k49l30O23k70j2K07n87L73J21J2K4m08J5K98J54l19
6889i7j55K71l8M0k69J12P1Q2k23J33k28K75K00n4k54pJ23K64k13J15k97j00Q7
6912a62J93K71k49O7l15K66l71J96J64J38j47J80m43J3J81J60O2l22K70l60J91
6933a7j79L19J5q1N6O1k29K07k84K73J16k43n1K8q4L55j55n6k9O5N7K10l93J38
6957I9K7j38k70K21M31l02j36N5P6K2j3j95J39l5r9J4o1K62j92K40j97J15l9K12
$$ y = [108, 85, 85, -48, 274, 117, 264, 16, 39, -109, 142, 147, -33, -21, -161, -26, 301, 161, 109, 6, 32, -12, -199, 292, 207, 79, -73, 84, 115, -159, 268, 110, -23, 69, 30, 92, -157, 9, 221, 205, 163, 215, -355, -120, 222, 261, -141, 45, 154, -107, -59, -123, 241, 83, -72, -349, -194, -115, 81, 315, -22, 122, 115, -429, -274, 157, 68, -139, -10, -208, -305, 88, 9, 241, 155, 155, 251, 2, -328, 295, 25, 13, 220, -367, 6, 127, 139, 163, -245, -230, 68, 222, -97, -252, 19, -19, 21, -248, -136, -65, 17, -206, -73, -301, -26, 174, 120, -134, -141, -18, 246, 33, 148, -149, -249, -162, 31, 302, 53, 120, -195, 71, -300, -104, 60, 198, 51, 231, -212, -199, -18, 142, 204, -118, 152, -208, -17, -196, 123, 138, 57, 113, 174, -55, 152, -132, 141, 257, 14, -37, -9, -93, 262, 107, 51, 22, 87, 144, 354, -39, 99, 126, -12, -282, -61, 370, 68, -68, -13, 63, 85, 72, -123, 16, -19, -118, -104, -165, 97, -95, 145, -52, 63, 24, 236]
6981B36j6k62l8j84K95Q7m2K70l25l09L55N6q6L0L29m56J94N5k66N9n2L58l82
7004i4r1m6j5K63J17q6j12l60L82O9J00Jm8j09k9p5j80K93l44L21q1K35l32K14
7028gK46l51Q7m4K27m28K98P8j66M6K20k86M38n14J42K55l52K7J88j62J96L76
7050E14k90l73J17J66M5k57Q1j09J89K5r0K00j08q6M0J07n0j0j03j09o2j04K79
7073A2J29J45k18R5k2O5j86j1J41L8k45p7O3N7q4j15L36k04O9l02M16K11j04l36
7097a27M2r8L24j22J09j7l28J24q4L53p9N5R2k98j30j2K17j5o9K1j62j75M07L79
7121D07l48j10o0j24n5K04N6LK54l48K14q3j34N2j01L42j29r0N9J41k97J01K05
7144A59k44J9j47M24l16Q3J69k95J10k9j94M52j8k21K2j74M2N6K3j5k2J65Q7J53
$$ y = [236, 220, -42, -80, -264, 31, 118, 76, 346, 21, -288, 67, 123, 37, 67, 396, -60, 134, 189, -77, -18, -70, 288, -94, -185, -231, -246, 17, 134, 48, -64, -424, -42, 27, 127, 128, 80, -29, -58, -133, -313, -20, -364, -43, -124, 111, -221, -7, 239, -112, -25, -69, 158, -270, 28, 106, -60, -14, 206, -80, 358, -156, -14, 241, -111, -84, 104, -58, 138, 514, 224, -149, -32, 134, 179, -78, 3, -106, 83, 108, 18, 218, 110, 24, 64, 171, 121, 111, 8, -101, -163, -267, 12, 141, 286, 68, 163, 141, 206, 20, 9, 150, 188, -57, -134, -71, -14, -98, -213, 123, -81, -12, -314, 102, 313, 209, -127, -85, -183, 141, 19, 128, 111, -217, -93, -177, 176, 97, 152, 244, -54, -184, -196, 21, 6, -63, -42, -204, -379, 28, 407, 59, -51, -111, -235, -290, -86, -30, -27, 227, -121, 93, 10, -124, -72, -173, 169, 40, -50, 9, 150, -147, -46, 159, -85, -66, -213, 211, -105, -22, 147, -148, -38, -67, -261, 191, 173, -48, -26, -200, -158, -102, -79, -94, -116, 49, 136, 289]
7168B89j81J58j80RQj81J47L4n0r8J21p3J84m1j11P2j91K06q4J38j7m70L24q1
7192f8j34J44O3k07M30j60j56J43J94j91K61m12J57j31k4M34l13L56l3m56P4o1
7214i0J64k39J24J89q3m36L2L64p4J07J15l67l1K18K23q1q8j8K7k22M3J01k5L59
7238C12k24k49K67n4j27K35j95j5R7Lk0j7k04J05P3J6p5nR9r2l9R2J59k9k46Q6
7264d7k9o7L4K37q3Kj67k17J84K54r5rM21o23J92k61L58j11J55k22j38J90k33
7287b75M3K42P5q9k33q4K51KK12l7P9R5k80k90K80L15m91L24m37M21j04n1J64
7310A32o5J30m03N4j29J39j14K84M3k88L24k79mK80j06j0j12J0j56K44K0J7o3
7333e2k7J09K60k25k70N2J94l22K18J61j81lj46K04K16p1p3l75M38l90K79O5P0
$$ y = [289, 108, 266, 86, 95, 103, -78, 69, 103, 53, -45, 76, 3, 187, 146, 35, 107, -84, 122, 38, 176, 159, -311, 13, -68, -202, -58, 5, -202, 228, 68, -88, 55, 249, 58, 319, -93, 64, -67, -91, 343, 30, 386, 353, -103, -29, -90, 74, -165, -41, 148, 65, -371, -339, 25, -49, 58, 173, -194, -225, -7, 216, 135, 47, 29, 56, -166, -123, -22, -47, 312, 88, -161, 106, 52, -75, 160, -35, -50, 47, 50, 30, 13, -191, -86, -13, 3, -72, -77, 22, -70, -109, -17, 142, 113, -133, -47, -76, -143, -109, 128, 45, 47, -120, -337, -153, 101, 6, -3, 418, -205, -13, -274, 84, -27, 128, -94, -232, -42, -275, -232, 10, 85, -4, -237, -321, -70, -68, 144, 107, 186, 281, 1, -289, -9, 306, -185, 139, -298, 123, 19, -32, 132, 67, 197, -206, -152, -281, -142, -256, 28, 71, -217, 107, -172, -176, 104, -2, -12, -124, -114, -270, -26, -6, 11, -52, -79, 30, 290, 65, -205, -153, 41, -281, -63, 98, -83, -86, -232, -28, 188, 117, 44, -331, 107, -283, -4, 61, 131]
7356A31R8l77J30j08k29L76J92m4n77R3K16j15K98j29K38j63j15J30j08k3J05
7377A9l7m2P6k11j34K36J13R7p8l92K95J8J4m8J68k33j95K46K27j9l6L5j96j43
7401b20O5j37J38l5J5M06k92J30J65m8j47L9k75j31K65R0j49J1K65k95J93K2p1
7424DJ06j88P8j55L02R3j38K12k08k05K82K68m66J31l9j92O4NJ27K14m02K4J70
7447H7k53K91j19l36J42K09j58K11j33R6n4l9Q8j28J8K93O5j74N3l6l16q8L12
7470C1J81j80r6l3nl37M66J84j58O2N9q6o2O8L4j09o5j23j81J97K51P1l37J61
7494gj61K83k34J97l37K84j1M23n47P6L0j10R6j69L77j02r8j66K00j49J90k12
7516a47pPJ42N3O2J72l48l0j17J84j6o0J35J39j24J61j35r8R8j68L7j44K36L1
$$ y = [131, 229, -148, -18, -126, -355, 21, 213, 169, -408, -315, -99, -214, 84, -45, 193, 30, -85, 45, -63, -86, 19, -18, -60, 16, -195, -329, -93, 20, 117, 39, -353, -58, -40, -26, -74, 94, -139, -334, -88, 139, 120, 84, 119, -77, -220, -155, -292, -154, -189, -174, 232, -60, 70, 235, 187, 40, 79, -196, -327, -62, 28, -121, -110, 155, -140, 53, 75, 4, 110, -78, 0, -155, 147, 240, 102, 314, 106, -99, 183, 451, -15, 116, 77, -115, -51, -46, 81, 295, -107, -83, 87, -166, 125, 6, -330, -188, 21, -137, 74, -59, 37, -17, -56, 32, -96, -78, 215, 280, 106, 159, 123, -193, -281, 31, 212, 32, -64, -97, -102, -439, 27, 211, 53, 115, 174, 88, 26, 94, 128, 19, -46, -169, -350, -153, 98, 169, -168, -7, -168, 115, -119, 78, -259, 25, 14, 437, -110, -34, -4, -114, -18, -187, 190, 88, -10, -176, 24, -125, 65, -147, -154, -147, -5, 48, 110, 282, -66, -96, -213, -29, -45, -105, 30, 169, 45, 206, 71, -27, 71, -97, -60, -204, 32, 63]
7540F3K99l98R8o6j84N1K00k29M11j27J00j21k44k7L63j95K85k99l8l57N35j95
7562g5N0l27L80J68m94L72q9P0Mk19M1N0L22N8k12%j06J11k03j93J60R0L07r8
7586A67q9r1k3J49k02Q9Q5p0k47J06o8J11L29r7l06J5j15K39J77l18R1j84J96
7609e6K36k18K07k86N97l18k86K33P4o4k22N2%J70l3l17R0P9Q1p1K48k96k52K64
7633h8LK1K71k33n1oP1j12J55k06L04k70j4J99l26J68J20K31k21N9r6m7j52M03
7657A83R4m03J47Nq5n1O6N1K78k74l50K54J45J82J18n55K6j4J62L22m01L52l23
7680g1%%j33M39k91J02J7k28J79k20L63O3m3j24j13l0L03k11N8m1K34Q7l69J32
7704A03k11M22l62R0J59j80j7j89L36o9p6J27O0j16n3k23R1o8K75l7N1j40J76
$$ y = [63, 362, -36, 62, -4, -188, -137, 63, -166, 245, 118, 218, 97, -147, -174, 189, -6, 279, -20, -58, -415, 120, -75, -25, -352, 28, 196, -298, 74, -15, 55, 59, -160, -119, -69, 253, 311, 99, 99, -7, 104, -99, -292, -132, -42, 265, 167, 78, -13, -36, 113, -89, 0, 85, 15, -232, -126, -194, -83, 246, 149, -157, -142, -257, -18, 159, -159, -68, -252, -56, 180, -38, 169, -117, 480, 162, -124, 109, 183, 119, -103, -51, -51, 119, 86, -231, -141, -62, 19, -52, 196, -100, -352, -88, -85, -64, 207, -26, -77, -83, -12, -124, 31, -175, 129, -141, -155, 44, -282, -114, 6, 237, 16, 75, -21, -68, -220, 183, 277, -126, 21, 26, -59, -110, -44, 7, 285, 11, -339, -85, 60, 242, 360, -195, -169, -183, -21, 301, -100, 252, -71, -71, -71, -204, 235, -56, 46, 63, -165, 14, -206, 157, 220, 177, 53, -60, -90, 213, 2, 60, 19, 253, 340, -29, 103, -108, 314, -48, 42, 201, 21, 4, -185, 151, 82, 6, 133, 193, 77, 24, -199, -108, -176, 99, 62, 113, -27, 149]
7727A49m4k13L20k90P9j67M92j74k21J48Q9q0j91J42l28K84J27Lk75k00K01R1
7749e8p3M08j55j63L00l17R5p0RJ84l0j45k55L5J35L62k25l62L55j55l5J67K19
7772B26j79j21J85j83j8J47lj32m7J53J28l09K00k74L73j62k26k8K38RJ85l67
7794b05K04j22K60l42J15K65m46M06q9Nj88J22pk03L32o6Q6Ol10J79l38M55K7
7817A46Jk06Lk9J42J01L7N3m30J4r6K84J28r7l5J9J64l73R7qK72j7k85K99k32
7842d8R9j1J9K5l39K04J7n2K04k39J35j87M00k50J65Q1k56r9j30K84L42m11K74
7865B27k44K98m26K56N0k39j50K8J74K1N75k21k76J64l60j22J50j25K84O0j71
7886d7M30m17J82L4J28m04J03N2m9M3J15j69k39J5J82K5j42K18j78J60k83J07
$$ y = [149, 105, -108, 212, -78, 1, -166, 326, 152, -69, 79, 168, 88, -103, 39, -289, -5, 122, 125, -150, -350, -149, -58, -131, 277, 122, -41, 259, -58, 37, -33, -24, 160, 130, -15, -270, -235, -100, 262, 37, -325, 30, -125, -160, 7, 226, 47, -74, 111, -72, -90, 57, 54, -78, -125, 28, 156, -153, 47, -227, 146, -16, -242, -270, -32, -23, 162, -205, -1, -123, 137, -205, -90, 175, -271, 135, 46, 51, -137, -15, -22, -225, 107, 41, 127, 133, -177, 2, -336, 119, 146, 147, -59, -56, -85, 57, 158, 195, 248, -182, -168, -264, 20, 148, 51, 16, 35, 199, -174, -77, -85, 187, 170, -115, 184, -48, 51, 40, 59, 84, -255, -51, -34, -86, 118, -121, 14, -173, 227, -23, 142, 223, -33, -132, -262, 22, 364, -47, 227, -17, 281, -145, 111, 161, -78, -228, -200, -26, -5, 570, 349, 73, 237, -123, -245, -95, -220, 64, 124, -47, 383, -34, 148, 182, 310, -94, 9, 61, 12, 55, 170, 1, -238, -223, -41, -16, -158, 60, -118, 42, -241, -134]
7908a34l7L10K6jq8p5k73K19R0j41N2m5m8J86k18L37l26O7j26K37K07j72m8k19
7932b20R3L89l76M25j68q7j60J58jj92nO0J81p8K24l16R3k64K04j7J7m2J20L14
7956C52m22o6K01j44L60j32J35k72j00K84k5k69r6J40n0KJ9J94J70N6k08J07j16
7979A20k08K87l2R4l87j4J71p3M3j20J19P6j62K39m36K00M94m22K49o70N69m04
8001b67K30K88k66l6L36j19j32k22J4m0RJ08k8jj56K87J48k52J7o9m0o5J11N35
8025C90l20j33k6P9K79n16K46Q8k96J23l5L5NL73k77J1J3m8k8l39R5K58O9l45
8049b99J65J77J75N0r7L7j62j0j76J89L4m02O68m01M1l23K59K64j90N3j69M22
8071C05o14J23M65o05M08r6N0m9Q7mk99K59r8r4k07K27P2q7K33oP7J36m55m8J66
$$ y = [-134, -171, 139, 165, 164, 76, 1, -272, -53, 37, -104, -52, -97, -145, 41, -177, 160, -166, -99, -225, 12, 219, 47, -1, -220, -127, 262, -114, 311, 143, 56, -104, 54, 53, -139, -144, -84, 97, 19, 243, -73, 20, -244, -40, -57, -40, -82, 38, 352, -70, -136, 65, -79, 281, 149, 284, 12, -88, 196, 171, -98, -194, -54, -104, -102, -83, 111, 281, 337, 129, 236, 120, -88, 199, 167, 261, -126, -140, 31, -42, 1, -119, 0, 76, -86, 153, -283, -83, 411, -11, 238, -432, 137, -267, -37, 251, -15, -51, 285, 166, 34, -188, -174, -214, -205, -97, -125, -126, -282, 5, 153, -99, -82, -151, -191, -256, -145, 390, 70, -63, -89, -10, 269, -247, -1, 87, -209, -86, -121, -86, -81, 292, 15, 26, 39, -9, -37, -376, -281, -23, 46, -299, -134, 43, 218, 268, 171, 208, 46, 36, -140, 49, 83, -319, 349, -52, -11, -334, -75, 189, -1, 52, -117, 305, -309, -186, 279, -326, 82, -14, 36, -13, 74, 70, -229, 30, -68, -162, -369, -142, -70, -157, 76, 70, 147, 283, -172, -220, -54]
8096e4K40j91j63R1L47n16L52j75J44J39m7j63rJ32J27j72o4j9K70m12J06L1Q9
8119H3k6P1m1m02J38L26p4p6j37Nj26J64J90N2k62K32k59L17k09K5L4L48l84K32
8143B21l98L59j76P2j27M0N3j90K17J57l83J64K40k68J76l9k89J60k22K01K70
8164B38m94N52n32K41j09n7L62k77P1M8J93n30J63K23J28j71k08k3J13N4P2J85
8186B42l5k03J62k58j3
$$ y = [-54, 186, -5, -168, -77, 270, -246, 106, -69, 75, 214, 167, 4, -5, 127, 254, 82, 18, -1, 269, -143, -37, -6, 83, 57, 128, 87, -315, -177, 149, 75, -1, -138, -133, -259, -95, 95, 147, -115, 117, -142, 175, -34, -9, 25, 373, -11, 221, -177, 182, 6, 78, -49, -9, 44, -146, 71, 228, -155, 9, 249, -19, 157, 118, -171, -11, -233, -32, 238, -256, 296, -236, 5, -104, -161, 201, -76, -5, 43, 236, -294, -131, 92, 220, 49, -159, -182, -69, -15, 57, 242, 207, 4, 166, -92, -105]
8191a05
$$ Imaginary data points
##PAGE= N=2
##DATA TABLE= (X++(I..I)), XYDATA
0@%%%%%%Qj6J6j6K0k8L3m1N0n8P2q8J04j21J45j71J96k26K61l00L43l90M41n00
30b66N65o33P12p98Q89r91J103j226J362j508J669j851K049k269K514k787L095
47A629l445L846m310M855n504O296p288Q567j0295J2772j6644K3615m0081J48519
61A22532J42743k21419q0419L1580O3048L735N4257K3652p1687j13404K582O9956
73B7156M7642M581Q79m2570o1520r277N5201K9036K603J7942L0p4497n8361N3443
87g712R0365k385n3069j2259r66m1464o699P4418N4160n2417p2606K677M0872
100A2915J3034L923J1317j4695k8808Q283L2334k03j9909P771J2790j8949j2781
113G022K7558J1448m0905k3421L7393K3431m1595l1973L0772K5566l6229l5082
$$ y = [0, 0, 0, 0, 0, 0, 0, 8, -8, 8, -8, 12, -16, 17, -24, 26, -32, 40, -48, 56, -65, 80, -91, 105, -121, 140, -160, 183, -207, 234, -266, 299, -334, 378, -420, 469, -522, 581, -645, 717, -791, 878, -973, 1076, -1193, 1321, -1466, 1629, -1816, 2030, -2280, 2575, -2929, 3367, -3921, 4646, -5649, 7123, -9521, 14094, -25987, 122532, 265275, 43856, -36563, -4983, 58065, 61800, 116057, 139709, 68022, -45382, -42800, 27156, 74798, 79379, 80258, 37688, -23832, -33109, 22092, 51128, 53731, 71673, 71703, -2794, -61155, -7712, 82653, 80268, 27199, 14940, 13974, -27490, -34189, 40229, 94389, 41972, -30634, -27957, 12915, 25949, 29872, 41189, 26494, -2314, 5969, 38303, 38100, 18191, 25962, 38752, 19803, 7022, 34580, 46028, 5123, -18298, 19095, 42526, 931, -31042, -270, 25296, -10933, -46015]
125d6015K2152L2332m994j4362n65j4169k3298J4400M8093J7948l0050l4235j2928
138d5691M301K9527M3750L634n4091m4648J6808L6008O603R84J6884r464m7953
151d3348j9158M1954M1220o729j7516L269n539k4374J634M1035K8516j0693k2790
164G481j6649j5168J834L6034L3639j6578m3858j7655R792J0232J3418J8767q325
177A2964l8132j6837K6619K3294j1338r574J4616N731j8535o264J8241O593j3144
190e766J508J7882k339k2106m725J4728M363m771L506Q98j2576m369J5474L821
204E528j8881l067K9190J6463k3237k3625O684J3903M830J3279J5954j6240l8583
217a7802j1003K8440K8689O556p347k1695l3434j0116L3369L7212j526k5113j7053
$$ y = [-46015, -23863, 8469, 3475, -10887, -11452, -25621, -48919, -34519, 13574, 31522, 1472, -32763, -45691, -41390, -11863, 31887, 35521, -18570, -63218, -46410, -10402, -3799, -2815, 14069, 4605, -43348, -62506, -20552, 20668, 13939, -3577, -308, -5847, -30221, -28587, 12448, 40964, 30271, 7481, -9168, -24336, -22502, 13532, 47171, 30593, -13265, -30920, -21128, -10896, 2522, 21289, 12964, -25168, -42005, -15386, 7908, -3430, -13004, 1612, 7343, -11192, -17456, 785, 7378, -5766, -4258, 13624, 11285, -10821, -15546, -818, 3545, -1226, 2280, 3178, -9398, -13767, 1707, 5528, -13353, -16420, 12770, 29233, 5996, -17629, -10945, 2958, 7788, 21067, 37021, 20781, -17802, -28805, -365, 28324, 34880, 27533, 5838, -27596, -37712, -4343, 32869, 31343, 6230, -10823]
230a0823j0735q509J5556L6182J4895k2562k6044p042l2O335K7472K8829r841
243C3681m1435k3579J1473K1365J7868J4392n359l4009l0399P588L1005J9701
255B2292J477q302k0051k2203J596K8101K1311l657j1481p494j0887p246J3756
268b788K4185N011j6220j3311l094k583J443J4881J1621j0178j8738m556O842
281g485M584J961L899j726p077p13P140J025p359p02Q158M871j437Q9r49q745
297d466o289R722J6527L413j1990j2815p210N08J1026J7612N802j2735j7705q136
311a6736K442J2044J8297J2029j1004k7009j6748Q457K3849J9727M018j5026k5811
324a1471j5407P730K3312J8582K671j4606k4848j7800O465K9212K4048k464k3717
$$ y = [-10823, -21558, -30067, -14511, 21671, 36566, 14004, -12040, -19082, -19114, -12779, 14693, 43522, 33681, -7754, -31333, -19860, 1505, 19373, 33765, 28406, -5603, -36002, -28414, 2591, 22292, 23769, 15467, -4584, -26787, -25191, 2910, 24221, 20564, 9083, 1589, -9298, -16544, -2788, 21397, 26408, 10188, -3123, -6217, -8800, -7357, 7524, 19145, 8967, -9771, -14327, -7485, -2901, -940, 2959, 1233, -5844, -6557, 583, 1608, -5751, -6453, 1705, 6576, 5139, 5228, 4279, -4466, -10755, -1033, 15494, 18907, 6917, -5898, -13108, -12600, -1574, 16038, 21840, 9105, -8600, -16736, -14294, -2250, 16047, 28076, 17072, -9937, -26685, -18228, 5621, 25348, 29366, 14340, -11471, -26878, -19148, 4164, 22746, 25417, 10811, -14037, -31837, -25372, 3840, 27888, 25424, 1707]
337A707k2918p716R706K1015J8896K489j6998k2031j0396Q273K1031J8939J289
350B3286j8507k2632n859J2785J9327J0973k528j3917j5775o541R239J6762R871
363A6484m203j3407j1670j428R085J0956L583n273p621m422P92M135M131J358
377B500k989n425j273L471L861j051n685l828K653O957M481k823q137o546N80
392a3254P683R056L618n462j0574p971K178J1251J1799L589q002j4133r985L451
406a6756J5480J6168M003j0466j7705j0893N348J7714J6209K768j3199j8571j0354
419b0254N228J7599J8146L945j4867k2697j2397Q362K1672J7767L49j6662k0606
432a4415p702J0002J9569J3978n29j3793j7980r800Q694K0342J4976l441j7349
$$ y = [1707, -21211, -28927, -19221, 1794, 20690, 23179, 6181, -15850, -26246, -17973, 3058, 21997, 23286, 4779, -17853, -23712, -10927, 8400, 19373, 16845, 2928, -12847, -19388, -10149, 6613, 16484, 12281, -1126, -12796, -14224, -5139, 5817, 9400, 4127, -3494, -7916, -7124, -2989, 1142, 2500, -489, -5914, -7187, -3716, 145, -906, -6591, -10419, -7766, -809, 3672, 849, -7288, -13834, -13254, -5571, 3485, 7103, 1641, -8933, -16904, -14726, -3475, 8324, 11913, 3911, -10222, -20207, -16756, -1276, 14892, 18895, 8429, -9276, -20169, -14821, 2893, 19102, 21870, 8671, -9900, -20254, -15026, 2573, 20719, 24664, 9797, -12900, -25297, -16935, 4737, 22504, 22853, 6191, -14415, -22117, -12115, 7454, 21432, 20903, 7110, -10870, -20670, -11976, 8366, 23342, 19901, 2552]
445B552j4999l698R345J4411Q691l157j1269r977k220O314J0233P669j647r010
459C238o789K060N941L498J601R46j85k709k431P2P77R24J646J457j033j726m58
476F829k738n090m84Q775Q881l146j1047p838k99N828R692Q489k284j2501j0763
491g696j248P328J0607J0347L86j5920j8717k308J4406J5017M482m057j1712j6198
505a5283o364J1743K0254R862m652j3486j6319q218J2649K6229J5006j0320k0406
518F95j3907o58J1486K0978J4777j0393k6380j5078O079J4790J2977O525o165
531A5726j8367j5340L478J5445J0409L010k343j0007j4111k383J5145J4286J463
544A6411n893p046j0129n731R383J6472K375j2395j0027K45J740J018O397L481
$$ y = [2552, -12447, -16145, -6800, 7611, 16302, 13145, 1876, -8101, -10321, -4007, 6226, 13895, 12248, 3238, -3551, -1491, 4450, 7948, 9549, 10495, 10310, 7601, 5170, 5242, 6019, 6943, 8589, 10046, 9013, 7287, 6829, 4091, -999, -1483, 7292, 16173, 13027, 1980, -5858, -6157, -329, 9363, 17852, 15568, 3067, -7696, -8944, -1616, 8991, 19338, 19724, 3804, -14913, -17221, -2815, 12202, 16684, 12627, 915, -15283, -21647, -9904, 10350, 20212, 15560, 2074, -14245, -22463, -9814, 16415, 31421, 21101, 695, -13212, -13870, -2384, 18594, 33371, 22978, -3402, -18480, -12401, 2389, 15366, 21891, 15726, -2641, -17981, -14503, 942, 11351, 14361, 12018, 2011, -12100, -14483, 662, 14948, 16411, 10518, 3472, -6657, -12388, -3005, 13467, 15842, 3447, -6580, -6335, -4595, -3577, 2820, 6301]
558F301o730p530L604O333k309m399L844N716j221M64L287k733r490J107J1629
573G873O382o364n301j59m851m361P526J0416l145j0618j301K023p431m179J4843
588A353J6735n772j9599r253M146Q413J3406J2766n436k2285j4509P681J5096
601B742R980O604m924k3002j9536J1006K6490O726j1475o524k886j1701n909J7314
615e095K0441l216j4473m591j709n569N846K1158Q742j6744j7537r91N217M720
629c801J1012P071j3938k0852J58J5353L206m816L444K90j3101n737J6118J1822
643F229j2395j0257J2549J1199r446r643Q000P760n030j981P800j83r296J91N893
658A390l529n947P613Q283q123r469N139L396r085K177K1453O392k4464j8885
$$ y = [6301, -429, -7959, -4355, 1978, -331, -4730, -886, 4830, 3609, 4073, 7360, 4627, -4863, -3756, 7873, 14255, 7891, 2590, 2431, -2420, -6781, 745, 11161, 8016, -2602, -3903, -1880, -9311, -13490, 1353, 18088, 12316, -7283, -16536, -12390, -3977, 9429, 22195, 16759, -5526, -20035, -12354, 2742, 12722, 19326, 14402, -8600, -28136, -17130, 9360, 16086, 4611, -1913, -4799, -16500, -22409, -5095, 15346, 12130, -2343, -6934, -8643, -14212, -8366, 12792, 21534, 4790, -12747, -13738, -8521, -3801, 7211, 14282, 344, -20508, -20350, -4997, -1791, -6607, -3163, -2873, -15974, -21711, -5593, 6229, -6166, -16423, -3874, 7325, -2121, -11764, -3764, 3996, -1034, -3015, 4785, 4602, -4694, -4503, 1390, -2139, -8086, -473, 7810, -313, -9782, -4643, -1247, -10332, -8155, 13298, 19690, -4774, -23659]
672b3659J3005J9046J653o55M098j1153k3515p05K6953J6871r400j4877q634p935
686a8907M58J7342J4620p366j3448k619l136q786Q233K7659R683k0757j8694M206
700a1512O335J293J5355K0987r332l4229j2510K1272K0422K895j765m603j8614
713d006j4943J2163K3653N259r898p258o025q648M222J8062P310j0432n763M444
727H140n958j3546Q781K3975J649k2968j1082Q555K681o258N725J1017q090j9268
741a6647j782J2753M599m360P0q68n528K637J0969j179j3716L62J7016O220j1408
756h62m205N589l183p454J0392J7470n799k1556l215J1879J620m120P675Q371
770A2602j1268j6411K060J1848M164J736N667m952j7301o463J3453J1436J416
$$ y = [-23659, -10654, 8392, 10045, 9390, 13488, 2335, -21180, -21885, 5068, 21939, 12539, -2338, -10972, -18907, -18449, -1107, 13513, 6147, -7301, -9920, -13056, -21842, -13609, 14050, 23733, 2976, -15718, -11512, -5177, -3884, 11471, 32458, 23126, -11103, -23613, -2341, 18081, 20976, 19211, 14608, -4006, -18949, -6786, 16867, 22126, 12228, 4970, -1055, -9703, -5481, 12581, 19891, 9459, 3696, 8140, 2182, -11364, -2583, 21392, 23041, 73, -11009, -2454, 227, -6031, -306, 10711, 2621, -16647, -18429, -5676, -1077, -5437, -5367, -6235, -11763, -9126, 1843, 664, -13052, -12690, 4326, 10546, -862, -5067, 522, -2661, -10115, 277, 17747, 11948, -9608, -12823, -944, 676, -3444, 4231, 12602, 1334, -15077, -13017, -1169, 2995, 4731, 10398, 5446, -11855, -18318, -4865, 6571, 7987]
783G987J046l242j8736j5095J3789K5603J820j7629p918m88p459k263J8451J5948
797A1814j0819k0195l166P301K871N548J2297J965j4584j0514L995P349M803J0385
811I050O382j3502j8901K319J7428P310l652k30k846j2905n610J5221J5261o047
825I278j3175K64N187k272o0P431J250q462k137P063J919o622m76N254k779o417
841d754L991P266o024j0238J679O867j083k085N474J748j0907p648Q374J0476
855C136j17j159K044n464j1737K397J8414J0061p323j1196m874k323K660J3860
869H379J1609o608j6065o881K001M106P929J2467l8j7507j4153N384J2503N867
883H993L323J479r375j5621l017J3909J3341J490m568p853j2227n382J1317J7017
$$ y = [7987, 9033, 5791, -12945, -28040, -14251, 11352, 13172, -4457, -12375, -12863, -20322, -22585, -4134, 11814, 995, -19200, -22366, -15065, -12194, -6646, 5651, 7616, -6968, -17482, -13487, -6138, -1335, 9050, 15432, 1930, -16971, -14652, 2776, 10086, 6434, 6204, 3358, -9547, -15157, 64, 15325, 9278, -3897, -3633, 1554, -718, -778, 6653, 7903, -559, -2696, 4367, 6286, -336, -812, 4442, 1663, -4754, -763, 6503, 479, -9759, -8080, -1213, -2296, -4381, 1093, 2841, -8066, -15714, -7340, 3136, 3019, 1860, 3904, -1560, -13297, -10900, 7514, 17575, 10252, -944, -5818, -8141, -5481, 8379, 19988, 13380, -2685, -9566, -7565, -3459, 4470, 16937, 16899, -608, -14761, -9377, 3126, 8993, 12316, 13795, 4420, -11201, -14218, -309, 13032, 14522, 9954, 2101, -10126, -15508, -4191, 12826]
897A2826J232j1556p798l156k182L969J2611P371q356j2209k646M401M204O318
911E029O001l866j0265k137O645L986j508Q39K546l313n598J979M696j109l447
926D78J968L245k099l921N36L84k199K188O780K037o943n687P68K576J799M477
942F387M287m254r397l113M379M614L301L150k122r936q103K997R664P163K189
957A1206l228r427r481R30J2621J1456N16p919r226o377N44J1390J3610K286j0738
972H163j2531n089L253R793J1277K885r731j3364n175M641R490R429K875p820
986H096j4712p051P493J2857P165k439q081r690l986N331J0750O057l484p658
1000F48o482j719M478P594L672l844p022k087J913K155J497J292N60k147k693
$$ y = [12826, 14058, 2502, -5296, -8452, -10634, -6665, 5946, 13317, 4961, -7248, -9894, -5493, -1289, 5029, 11030, 7164, -3101, -5238, 1407, 5393, 3885, 4724, 7270, 3957, -1641, 338, 5034, 3925, 478, 2446, 5691, 3592, -329, 207, 591, -1608, 580, 7360, 9397, 2454, -3233, -2465, 111, 1910, 6387, 10674, 6420, -2977, -6090, -1711, 2903, 6204, 9354, 7232, -2704, -10807, -7810, 1854, 9017, 11206, 7978, -1449, -10930, -10000, 2621, 14077, 14593, 6674, -2552, -8929, -8385, 3005, 16615, 18901, 8163, -4368, -9457, -6204, 3589, 14866, 17751, 8020, -5344, -10519, -5878, 3612, 13041, 15916, 8096, -6616, -13667, -6174, 6683, 13848, 11409, 3328, -6362, -10348, -5017, 5733, 11790, 8306, 648, -5834, -7553, -3075, 4519, 8191, 4347, -2675, -4762, -2849, -694, 803, 2095, 2655, 508, -2185]
1015b185n80R99K407J384k84j641j571J593K174o11l365j031K362K731M07j144
1031A645k431l368l08L262M959K204l308o579m684N88O849P591M27o353p521k629
1047i656K476O212N717J249m902q613m225K641Q333P441K024o837r652n860M266
1062i386R863Q260J076p359j1180n731N117J2424Q826k182r967r974j871P157
1076d927J0671N338l200q621o613L6N678O796L829j835o095n910r4L189N125K785
1092F152m91m706n019j513K945M615J922j562l176k780m52J969K567M32j70j139
1108d06r00j42O45R13o13r76J41K428J698k147l467j603J803M015L273p69m411
1125e18l928j156K892M538M194P49l809p005l963M136Q543N651j317p705p816
$$ y = [-2185, -2765, -1766, 641, 2025, 1741, 100, -1471, 122, 2296, 1685, -1680, -2711, -349, 2382, 2789, 1645, -786, -4154, -4462, -1200, 3759, 5963, 2655, -3924, -8608, -8020, -1171, 6420, 6847, 494, -7027, -9656, -7180, -968, 4749, 5998, 1096, -7517, -11742, -9101, -768, 6673, 8697, 1860, -7792, -13652, -9386, 477, 8737, 9813, 2454, -8726, -14457, -9340, 3084, 11910, 9728, -239, -10213, -12084, -4927, 5744, 11082, 7882, -739, -7352, -7316, -1638, 5158, 8987, 7152, 1057, -4853, -4947, -1758, 3367, 6152, 5661, 955, -4064, -5577, -2632, 1983, 3905, 2343, -833, -3613, -4065, -2096, 471, 903, 733, -406, -1306, -1448, -803, 110, -503, -1479, -1338, 1090, 2788, 641, -2826, -4429, -2626, 1389, 4662, 3893, -518, -4446, -5602, -2710, 1828, 6022, 6771, 2962, -4043, -8006, -3870, 4673, 10324, 9007, 1302, -6514]
1140f514k533N510R638N417l292r095q442k742N550J0916O435m563j1630q266
1154a3611J069P235Q169M406k367q971q142k76P479Q978M970l101r497q368M95
1169a1532Q669Q170J109l939n703n646j453N557Q082L295m159n986l626J42M905
1184b115O629K715l900n018j165Q87J778K552L553r4n227l184N65K323P60Q39
1200A898L63k953k915P68K723j249j501O88K071j29j548L52j035k342J124O069
1216B384L335l565n013j602Q32J856M135M028k432p563m340K968M076L628L850
1231F577o85q122p047K023Q525N782J261j777n825p418o16J0014R158j60o511
1246E179o001n001j32P332J0097K35r615p586r35J190L291P621L338o921j0234
$$ y = [-6514, -9047, -3537, 6101, 11518, 8226, -869, -9311, -12053, -6503, 4413, 10848, 6285, -5345, -13611, -12542, -5307, 2862, 7268, 4901, -4070, -12212, -12488, -5009, 3969, 8939, 5838, -3659, -12027, -11532, -2863, 5307, 6416, 2477, -3226, -8872, -10325, -4768, 3314, 6609, 2450, -3536, -7162, -7020, -2115, 4514, 7229, 3329, -1689, -2854, -1967, -189, 2363, 5916, 5822, 595, -2589, -2024, 299, 1059, 1898, 2261, -692, -3607, -2839, -116, -1365, -2866, -2178, -107, -236, -1784, -1432, -2467, -4809, -3685, 2384, 5719, 2154, -2859, -4461, -3629, -1773, 2362, 6390, 3958, -3605, -7945, -4977, -901, 2727, 6577, 5892, -2230, -9277, -7254, 1271, 7053, 8314, 6537, 712, -6706, -7322, 2692, 11850, 11690, 5179, -822, -5823, -5955, 1377, 11474, 11709, 2094, -5492, -6427, -5237, -1946, 5675, 9013, 2092, -8142]
1261h142j472N625L901K509K491j174p635n050L644O087L352J057r36p367p396
1276a0506L038J0803K833n900m160N9r61r29M536M561l296n715J714M157o53j914
1292b333K620J263k792o8M713Q60n478k755M295K030k185R81K165l867n689J638
1308d602O002K27k364J770k29p556l379Q714R303j834o152k095j642k720L735
1323b822J0959L295q652r094o89L134M427O716K538q437j0618K79P216K665J057
1338A974L687n89j0337o376O672R221J463j344Q86m651q849K49J1757P806l501
1353H068o319l214l483o32P495Q732k953q897k910J471K54J907P220J829p829
1368G39n401M015M428j721J53N002O70o716k289M886J979l036K81L566k020n275
$$ y = [-8142, -9614, -3989, -88, 2421, 4912, 3738, -3897, -8947, -5303, 784, 4136, 5193, 4257, -3110, -10506, -7468, 3335, 6168, 268, -3892, -3833, -4794, -5723, -1187, 3374, 78, -5637, -3923, 234, -419, -2333, 287, 1550, -1242, -1310, 3403, 4263, -1215, -3970, 325, 2355, 170, 1151, 3316, -551, -6240, -4602, 1400, 1627, -737, 1033, 804, -6752, -10131, -1417, 7886, 6052, -100, -2195, -3837, -6557, -2822, 8137, 11432, 2780, -6314, -7003, -3869, 558, 7274, 9812, 1375, -9243, -8964, -1748, 917, 1974, 5661, 5072, -5265, -11641, -4969, 4252, 5715, 4371, 5257, 606, -8243, -7994, 3763, 11569, 8068, 1749, -1465, -4948, -5580, 1915, 10647, 7694, -1203, -4113, -2642, -2388, -481, 6739, 8568, 739, -4662, -647, 3781, 2060, 2213, 7215, 7885, 1169, -1120, 3766, 5745, 2709, 2990, 6556, 4536, -739]
1384g39Q4M020r28l177J281K712k096l293J299J76k896J960O890Q46p979m656
1400f496L165L630j02K986M655n514j1288q31R520O557j977l105k323n145l080
1415i348N739Q929J368m343l080l407l379L625J0774N363o164p193j849L38J331
1430a296O322Q468k536j1879o542L772N276L328M546j75r952r821L135J0104L789
1445F539k189j429l225o257j624P871P589j669m819j900k080k522L598Q375M71
1460F729p338l826K697M29j328M259M111l701p062R28O007N69k063J473J408l339
1476d7r13M765K638m042j927L557J807k720M25L088k529n234J368O293M51m689
1492B291p54J263l265k575N364N484l508n621m22Q59j370K093P251Q83q289n778
$$ y = [-739, -655, 3365, 2437, -740, 541, 3253, 1157, -2136, -837, -661, -3557, -1597, 5293, 6139, -1840, -6496, -3331, 299, 197, 3183, 7838, 2324, -8964, -9795, -275, 6282, 4305, 1200, -1123, -6268, -9348, -3609, 5320, 6688, 2345, -735, -4142, -7521, -3896, 6878, 12241, 6077, -1116, -2965, -2627, -1296, 5026, 13494, 10958, -921, -7463, -3691, 1585, 4913, 9459, 9284, -668, -10489, -7354, 2750, 6539, 4350, 2921, -304, -6561, -8185, -314, 7275, 5606, 787, -1113, -3193, -5715, -2117, 6258, 6729, -609, -4435, -1738, -1309, -2637, 1622, 5733, 2032, -5030, -4102, 1905, 2474, 411, 1884, 3292, -47, -960, 3805, 6443, 2401, 474, 4031, 5838, 3118, 3543, 6631, 4102, -1132, 236, 6529, 6980, 2291, 1537, 2800, -465, -3040, 2324, 7808, 4300, -1321, -1743, -884, -2254, -161, 7090, 7973, -316, -6094]
1508f094K415L343R82L185L561n824r313l81P173M897K47p29k871p409l009P487
1524b340Q253J49l398k410l229l899M047R346L480o436o528K70J042O27M692M502
1540H168k897p280k354K129J667J603L560K93o216m894K031M926N92n62R80j516
1556B30m208p56L825K407j379j005J014j542k413J388K869q97k381J729K823k219
1572e15m080P92K610P66K49J469n15l340k096K391L497J601Q7o15l550l697K628
1589b318N670J995j878j731j696l415j308M363O346O75m435n220k416K32M751
1604c85P035J329n991p315j684L330M871M746J923n334p813k431M646N879K767
1619E573l8l455n940l414L296O925L280j270l793l855l045J805O246M642j158
$$ y = [-6094, -3679, -336, 646, 3831, 7392, 1568, -7745, -8126, -953, 3944, 4191, 3462, 591, -6818, -9827, -2340, 5913, 6062, 2664, 254, -2975, -6874, -2827, 6519, 9999, 3563, -2965, -2695, -1653, -1026, 3666, 8168, 5271, -2009, -4363, -2234, -567, 1036, 4596, 4889, -1327, -6221, -4190, 736, 1328, 766, 1746, 230, -3978, -4734, -909, 1498, 119, -886, 128, -1414, -3827, -2439, 430, -467, -2848, -1119, 1704, -515, -4595, -3803, -1193, -427, -178, 1291, 776, -2564, -4660, -2269, 1228, 2829, 2916, 2301, -1249, -4946, -2318, 3352, 5347, 3469, 1738, 42, -3373, -4681, -318, 6028, 6703, 2268, -2952, -5368, -5136, -385, 6650, 7979, 1988, -5327, -7011, -3681, 1190, 5936, 7859, 2525, -5288, -7719, -3073, 2806, 5573, 5535, 2080, -3860, -7274, -3978, 2947, 6227, 4957, 1164, -2691, -5736, -3931, 2315, 6957, 5799]
1634E799m942l920j026J764M276M427p12n075m080L56L019L035J229p79l339k494
1650b462Q03K531P26l51q8o87j622q59J082J512p15r01O2N47k47l24O51q17m71
1669a630p7K012R31q36j297j717p76J452L775K400k627m849k582J932M451L036
1685C598M53l433m974j530K601N179K852o01l775m974k112L588N429K903j885
1700C319l922l174j195J540M009L798j05l949n013j570K262N124M305r60n240
1715g71n390l99L590M427K718j120l886l961p81L502M406J731j973k937k483L8
1731c289K709K453J122q73j918j522o78J090K577J349q84k386n33K73Q64Q39K7
1748A220m41p44l93J049M51m20p93k77P31Q96J303j080k645j663J102L037K329
$$ y = [5799, 857, -3063, -4089, -2325, 1951, 6378, 5666, 591, -3489, -3133, -114, 2921, 4150, 3371, 32, -2462, -1659, 872, 1598, 1247, 1159, 472, -1150, -2009, -927, 585, -130, -1031, -969, -422, -669, -993, -342, -1159, -1630, -1707, 305, 1236, 400, -897, -2614, -3390, -1938, 1837, 4237, 1610, -3239, -5821, -3889, 562, 3598, 4051, 618, -4356, -5886, -3285, 1894, 4746, 4145, 370, -4604, -6716, -3128, 2301, 5204, 3319, -603, -3777, -4972, -3432, 577, 4375, 4270, 321, -4692, -6262, -4000, 1124, 5429, 4469, -771, -6161, -6560, -2970, 1457, 4175, 3055, -831, -4792, -5573, -2071, 2335, 4066, 2093, -844, -3327, -3289, -580, 1873, 2995, 2122, 204, -1318, -1996, -906, 1671, 3020, 2136, -250, -783, -510, 354, 1193, 1220, 779, 35, -358, 691, 1142, 722, -71, -348, 383, 1279, 2582, 1502, -1143, -2806, -1704, 1333, 3662]
1765C662j021k678l043j310J946L748K076q68l542l130r78K852M348K639j340
1780C361m564l650p63L273M605L220q82n136m859m40M067N318K435k309n240m134
1796e698M2M414M695J858j814m604m602m88M334N496J887k949n010k830J35L442
1812a692M645J718k368m604l341p0L858M503J265k876n117k408K260L468K115
1827A356k58j490k492j027R65K960J182l53q46j207k92P90J401M86p33r4O62N68
1845A578j227p03O63k14K13N29J377j06j606j456k10J129K183J879p86l319k293
1862b369R92K961K093M21j536k920k948P6L882L600J23k582l192k953K26L627
1878d99M377O97l084m040j635K77L492M654K337l654n341k116K090L781L766K029
$$ y = [3662, 2641, -37, -3080, -4390, -2444, 1304, 3380, 2512, -1030, -4160, -5138, -2286, 2062, 4701, 3361, -1203, -4853, -5616, -2343, 2262, 5482, 4600, -536, -5395, -5835, -1768, 3550, 5985, 3676, -1564, -5698, -5656, -1242, 3453, 5311, 3497, -1107, -5709, -6197, -1863, 3633, 5520, 2571, -2439, -5269, -5134, -1692, 2953, 4671, 2303, -2301, -5642, -5712, -1854, 2649, 3914, 1038, -4079, -6487, -4227, -759, 1356, 1098, -392, -2884, -3911, -2946, 14, 1196, 843, -3, -1210, -1502, -712, 689, 1175, 442, 348, 1010, 1578, 351, -352, 311, 97, 310, 839, 2216, 2110, 504, -952, -1162, -33, 2150, 4029, 3243, -76, -2369, -1377, 1584, 3677, 4098, 2562, -358, -3306, -3230, 652, 4252, 4375, 1793, -1399, -4352, -4126, -499, 3878, 4575, 1491, -2549, -4184, -3907, -415, 4239, 6576, 2922, -2419, -4535, -2445, 1336, 5102, 7131]
1894G131k972n979k649K959M885K460l80k305m373k947K822N499J583j471k368
1909A895j791k138N51L983K934r32l006j727n50J23J985L070m69m371j944J511
1925h76R41j46M26R17j934k203P04L143n54k526R9J582N34k55P56q70k129K57
1943b134L384J582j928q51l29q47j339K777L474m07l883j782J540oK62K848K322
1960D683k766l801m58J696J380K310K876j968n719k819K971M731J583l12j939
1975B448m216l423K015N997J667k000k316k440k188K16N244L872k063m419j486
1990c092M93R3J996L695J409l768l998R5K014J852K119M61k830l755N09L160R79
2007A432k71N33K3k955j479K550K835j140j987J318R59j219j760J368J632n35
$$ y = [7131, 4159, -1820, -4469, -1510, 3375, 5835, 5455, 3150, -1223, -4170, -1348, 4151, 5734, 4263, 1895, 104, -2034, -1483, 2500, 5434, 4502, 1496, -231, -781, -658, 1327, 4397, 3928, -443, -2387, -876, 65, -81, 345, 1262, -672, -2875, -2171, 972, 418, -2108, -2009, -427, 107, -148, 608, -262, -2391, -2134, 1250, 2832, 904, 53, -276, -1123, -2462, 315, 3789, 3382, -501, -2283, -743, -749, -487, 2361, 4683, 1917, -1884, -2342, -646, 734, 3044, 5920, 3952, -1767, -4586, -1615, 3116, 4699, 4387, 2448, -1768, -5191, -3176, 2821, 4488, 2488, 172, -2268, -4456, -4240, 1004, 4876, 2813, -1606, -3092, -2599, -2506, -510, 3185, 4594, 826, -3172, -3077, -1063, 789, 2908, 3369, 539, -3216, -2707, 453, 1432, 1161, 1694, 1717, -1238, -2717, -167, 2668, 1528, -459, 859, 1818, 599, -1161, 207, 1839, 1304]
2023A304n4J038l80k530l40J832O72p77L38N36j659k639J193J808J98n67J358
2040A331j05l696k072K789M019J30j157j299k284k572J315N892K966l569m341
2055b653j249l80J054M402L458k073n869k525J477K327K657L277l32n532m282
2070f243J785M114K169J095P73l278o022l95N993N115n92l367k560k321q94M040
2086e88N180p3m030k726l35r4J786M287J332m235l413J194J961k85N06K764n76
2103B655m438j269K644J937j161M47J025k183k358J396K951o52k114P46R50r34
2119c58j344J798J261j825j406K288J862j121j034N55p24j466K263L299o36l863
2135d51j156J558J099p5J988J572l373m113R18L820R99L42K99j687m382p32M335
$$ y = [1304, 1250, 2288, 1908, -622, -962, 870, 1542, 765, 1103, 1639, -20, -2659, -1466, 342, 540, -27, 1331, 1226, -2470, -4542, -1753, 2266, 2396, 1239, -60, -2344, -4916, -3601, 2291, 5257, 1688, -2653, -3902, -4282, -3228, 1174, 4632, 2559, -3310, -5835, -4358, -2031, 626, 3903, 3571, -1961, -6243, -4458, -344, 1825, 2920, 3693, 415, -5607, -6002, -9, 5106, 4514, 1147, -1413, -3734, -4628, -588, 4592, 4519, 489, -2237, -2572, -2666, -880, 3407, 4739, 504, -2909, -1715, 246, -39, 467, 3231, 2655, -1783, -3052, -408, 1529, 368, 815, 1840, -343, -2701, -1305, 1646, 994, -1120, -374, 576, -358, -1702, 96, 1357, -468, -1874, 414, 2276, 1155, 121, 676, -48, -1514, 749, 4048, 3412, -451, -1607, -49, 1050, 975, 2963, 4535, 1162, -2951, -2033, 1787, 2786, 3128, 3427, 1740, -2642, -3374, 961]
2152I61L464l42j892j603k102k064L210M976L61l754l381m52O1R71M006K074k887
2169A607n172k82J640J725J470K279j209m569k203K792L098NK31q2j931k955L40
2186c216L870J926j576q55m39j654n37K481K297r76j986K4J29n81j77K201Q93
2203A824k127r32J209P34j390m64J297K41j157P23J034j133k160L32J805R06m90
2220B52J90r40k315r41K990L083l79k076j692q37m45K717L299M51k890k712m95
2237b740P79J840K910J724k924m497j205K530K992J694K87j837l672k245K338
2252b026L906K278n11j952l481j934J495M607K250j636k631j796j162M65K886
2267G58L486m95l248k667M8Q02J776K470J31k289l132j47J519J828J324P45j593
$$ y = [961, 4425, 4083, 2191, 588, -1514, -3578, -368, 4608, 4969, 1215, -2166, -2618, -2557, -1586, 2420, 4494, 1607, -3565, -3847, -2207, -482, 988, 3267, 2058, -2511, -4714, -1922, 1176, 1181, 1412, 1330, -601, -3556, -3216, 654, 2580, 1004, 149, -290, -1944, -2481, 0, 2297, 1321, -665, -641, -512, -1093, -1270, 931, 1824, -303, -1235, -26, 708, -682, -1146, 151, 392, -765, -42, 992, -141, -2301, -1969, -164, 742, 252, 442, -498, -2813, -3754, -764, 2319, 1940, -136, -1828, -2665, -3110, -393, 2906, 3357, 467, -2245, -2740, -1961, -121, 2789, 4513, 1589, -2908, -4113, -1583, 1409, 3103, 3390, 1553, -2119, -4364, -2026, 1880, 4158, 3647, 1695, -1786, -3720, -2225, 2382, 4632, 2996, 365, -1431, -2593, -2128, 758, 4244, 3749, 501, -2166, -2118, -1316, 460, 2930, 3061, 772, -2360, -2507, -988, 840, 2164, 2909, 1316]
2284A316l087q54K073K184K15o44p64r89p47O37J651M31j228R4K90n76l58L47
2302iQ14q40l3O19L15j519o89L35R50M12L34J47m75j749q46J396J571K50l6r99
2322e2j925j115J634K697N80j058j420j388j442J230K829K259r41l198j699q1
2338c090J821K261J923j182k747j917K65J761J640J618j45k564k642lK302K675
2354A976O05p78k194j785m82J940K629P76j313j612k213q9J981K599O05k236j442
2371a033k59J92R37J411N91p85j672l01P80P79N31n1m25q30o1J057L17o01n08
2390F9O83K68m7l37K78j68o36J5J169P95J84j148j309l94P85J640J330p56j473
2409I48j592l65J213J496J655o09k430k378J81J987J893J270n07k660k322k53
$$ y = [1316, -1771, -2625, -552, 1632, 1847, 1203, 439, -550, -1297, -660, 991, 1422, 194, 288, 578, 2, -356, -9, 805, -35, -68, 551, 866, -653, -1342, -1007, -57, 355, 689, 836, 361, -1388, -2234, -838, 733, 983, 947, -52, -1977, -3092, -1458, 1239, 1819, 761, -659, -2047, -3489, -2259, 570, 2829, 1888, -1310, -3009, -3090, -1269, 992, 2915, 1733, -1014, -2931, -2666, -905, 735, 2353, 2208, -356, -2998, -3001, -699, 1976, 2581, 1803, -391, -2176, -2658, -718, 1911, 2687, 1374, -238, -2451, -2540, -559, 2040, 2645, 409, -1033, -1292, -1100, -163, 1248, 1839, 1054, -618, -919, -139, 640, 1171, 1120, 695, -135, -196, 861, 1178, 577, 69, 752, 1020, 973, 636, 914, 746, 110, 125, 1294, 2089, 2273, 1125, -184, -578, 207, 1847, 3177, 2421, 948, -644, -1009, 204, 1700, 3355, 2746, 316, -2062, -1881, 106, 1999, 3269, 2762, 102, -2220, -2473]
2425b473J986K523J632q06k927k012q83K530L324J218j681k866j793l58K448K934
2441B796J253j196l358j941M22K131K591J354j954k869j805R97K120J740R88j195
2457B074k434j766J27K402K012L65j447k194r36O67J447J164j49r85j207k94N9
2474a095Q37J039k41o75p39L73L04k49k19P57P1k85M37k95m16M7J24K43M42M44
2494I04p1q09j315O1J765J197j8n42j465j005K97J353J672Q18j645j702j226L6
2512a695J890K136J172k360k858q18R70J748K017N02j436k894j463J175K120K080
2528B286N79j803l041j586R23L000J502L06j535k414k134O70L764K016l02l031
2544h00j832j24Q35K243J786p46j917j260KO99O81K080j2j557j776J37Q27J098
$$ y = [-2473, -487, 2036, 3668, 2862, -65, -2077, -2960, -430, 2894, 4112, 2431, -435, -2228, -2586, -138, 2796, 4049, 2853, -505, -2446, -2024, 107, 2698, 4052, 2098, -771, -2576, -1579, 541, 2281, 3269, 2074, -360, -2126, -1999, 403, 2415, 2780, 1333, -861, -1797, -1130, 317, 1481, 1332, 347, -860, -1154, -1095, -258, 781, 540, -135, -874, -501, -197, -446, -665, 92, 163, -122, 315, 20, -396, -349, -225, 18, 460, 904, 833, 24, -1291, -1230, 535, 1732, 1714, 1172, -293, -1298, -1001, 352, 2024, 2842, 1197, -505, -1731, -1695, 195, 2331, 3503, 1143, -1715, -2533, -1563, 185, 2202, 2704, 1268, -1626, -3089, -1914, 206, 2286, 2865, 1062, -1979, -3565, -2642, 358, 1860, 2166, 631, -1783, -3917, -3247, 517, 2533, 2231, -800, -2632, -2756, -1921, 322, 2108, 1362, -555, -1815, -1813, -1114, -433, 1647, 1635, 78, -1698, -1561, -734, 364]
2562C64O78N8n78j740n31J041J323K44j67o64r96k74O38Q60K6p73p14P41K67o19
2582h16K8p6m41r9J021R53p59j476l50L70O72J018Q95j376j672o93J423R56M83
2601F1M29l86j258j594K48K643J476L4r77j938j631R27K406K494k49k399j593
2618a307o00K99K645K661m14l451j954O12J528J321J373K13k504k083k63J889
2634c5J394L48P7r53k312o78J617J788O5m24l93j189j207N15K452N88j080j370
2652g97K2j01K04Q33J081q53j580P92J106k48j262O73Q42k87m46M57K88p90k67
2671c33Q64O78Q4j07r4j280p57O99J986M44r93p90j33j484l63K528K436j120k503
2690b38j513K09Q95J267K266m04l066k744P01J965J860J183m48k890l202Q59K765
$$ y = [364, 1042, 1100, 522, -1218, -1749, -708, 615, 859, 692, 28, -968, -1242, -604, 256, 282, -491, -1205, -464, -197, -816, -788, -864, -1305, -1404, -383, 570, -189, -1665, -2015, -1645, -973, 45, 940, -436, -2108, -2801, -1378, -422, 61, 490, 104, -1154, -2748, -2500, 143, 1619, 1653, 676, -1262, -2893, -1966, 440, 2934, 2685, 286, -1307, -1907, -1608, 1037, 3698, 3284, -167, -2121, -1509, 19, 1340, 2713, 2926, 422, -1661, -1924, -35, 1359, 1707, 1784, 831, -1481, -2159, -542, 1246, 1311, 887, 494, -695, -1902, -1387, 1065, 1653, 573, -797, -775, -876, -672, 161, 1242, 389, -1191, -399, 707, 459, -803, -130, 712, 425, -21, 436, 724, -66, -333, 531, 1209, 1293, 1186, 1092, -188, -945, -246, 1740, 2184, 1191, 401, 268, -1216, -1579, 949, 3385, 2265, -238, -1751, -1542, -647, 620, 2886, 2482, -584, -3328, -2627, -662, 1198, 2381, 1933, -957, -4159, -3300, -535]
2707e35K086k35p01j211k544p63K455L291L6j728j149j443q18J316L445J090j808
2724G84k652j053O56J299K312J598j656k805j242J376J752Q84R25q81j989j558
2740b250J346K086K80p34Q5l97k040J93K010R82j375q87M13M39q29J68J323m69
2758C44p56q1O89j69j076P58M99q76j70J519O56j765j188M21J724L8r1L01p59
2777A8j867M4K354J422p88n77o07j297n30J739K474O6j750j443k53L6O72K505
2795B218P75j864k506m67J236Q32J887Q25j556l010o89J275J639P90J63j81k188
2812h21k080J344K666R93o42j033j314j189J76K503J415j066j763k28m31mJ048
2829d26J909r1k334j115J172M89J86L54M87j227r81L73J464R6o31N17m30o14K83
$$ y = [-535, 1551, 1316, 615, -596, -3140, -3903, -1448, 1843, 1879, 151, -998, -2441, -3259, -1943, 1502, 2592, 784, -1868, -2921, -2265, -966, 1346, 2944, 1288, -1517, -2759, -1383, 369, 1253, 2178, 1297, -692, -2250, -904, 1182, 1462, 728, 813, 416, -1624, -1431, 579, 1561, 186, -701, -288, 151, -678, -510, 813, 344, -412, -493, 196, 27, -1049, -291, 208, -668, -838, 681, 1337, -428, -1616, -1195, 529, 567, 476, 777, 18, -1849, -1805, 549, 1971, 1183, 606, -1, -1298, -1828, -89, 2385, 2451, 701, -742, -995, -959, -287, 2218, 2993, 1129, -1377, -1844, -608, 224, 2111, 2936, 1380, -1630, -2319, -1044, 595, 1385, 1548, 1367, -821, -2901, -1557, 1109, 2102, 1460, 427, -887, -2076, -1900, 603, 2018, 952, -811, -1039, -1470, -1474, -426, 1483, 1392, -942, -2057, -885, -396, -210, 144, 631, -596, -1577, -1204, 260, 356, -275, 242, -188, -802, -519]
2848e19J117k8j027q82R34R44j30n66l8o2q41M87J599P83j374r95l80m26J049
2867c55J627M18j001j743o75Q91O00J337R33n36k513j635J103J895J377R9n84
2884A238j723j849M90K152J989l68q73j695j266K4K462K490r2k417j551p41R94
2901g36J631K091j93j805k334J80Q80J334J575K45j847k574L04J519J608k25k42
2918A411l75j361o58N25J772O74o00p29o24p46L35J291N53r17l01k87Q7o01P32
2937A81N44Kn70k09P76l60o40K61P38j14Ok26k28r79M1J204O57l15k66o42m39
2958e78l66M55J633M39q01j305n96K77M13J193O79m97j394o30n79R07J327J064
2976A641k04j959j750J46J695J619N10r07j512j649J11J876J840J38j098j398
$$ y = [-519, 598, 570, -457, -1339, -405, 539, 409, -157, -195, -257, -1098, -611, 988, 1771, 397, -598, -978, -1404, -355, 1272, 1690, 689, -1054, -1729, -838, -238, 1099, 2032, 1496, -1017, -2652, -1549, 346, 1723, 1822, 1238, -485, -2334, -1844, 308, 2297, 1929, 1056, -639, -1905, -1881, 581, 3071, 2979, 562, -989, -1730, -736, 895, 2986, 2793, 988, -1346, -1166, -286, 1048, 2623, 2868, 1021, -1553, -1249, 270, 1878, 1653, 1411, 1036, -325, -983, -458, 1314, 1988, 1388, 659, 35, -711, -376, 915, 1468, 551, 250, -37, 50, -551, 181, 725, 727, 157, -52, 724, 364, -276, -15, 723, 609, 615, 389, 161, -818, -777, 427, 1084, 769, 503, -139, -578, -944, -489, 1144, 1583, 782, -523, -1119, -842, -429, 764, 1443, 946, -448, -1078, -1657, -750, 577, 1641, 1437, -522, -2272, -2126, -431, 1188, 1698, 791, -721, -2370, -2259, -383, 1457, 1595, 497, -901]
2992i01j506K08J837K015j29j148j434k71J19N97J743L70q85j846l71O15J405
3009D18N22M4q34j015k75N14J078K64J47o82n70j27K56Q54l82m40l24L25M02l18
3029a43O4K44m10m4M87J06p4j55m04j11o5L44R32K30p67j203M73J46M65R93L15
3050A423j075j172n04J275J300J03k09q74j653j89J167J638N96o75j300j027n82
3067a758J164K001R72j188k031j026j0J588J923K87j440j354j254N20J264J585
3083A243Q64j413j469j455N22J851J439M0j004j664n20O73J039J214j46q33q04
3100d23n66j41J241P89r1o51r59k47P39J81O96K72n11j90q73L80N83M14l80o9
3120A94l01NM0j51l5M8L53k18J65k10m01J39k88K03O64L71k51r08m27q3Q44J255
$$ y = [-901, -2407, -2199, -362, 1653, 1524, 376, -1058, -1329, -1210, -613, 1130, 1500, 615, -1231, -1602, -987, 418, 940, 984, 150, -865, -1140, -626, 452, 716, 863, 181, -389, -516, -260, 594, 212, -228, -552, -227, 175, -143, -79, 165, -245, -289, 198, 304, 230, 75, -329, -440, -505, -161, 771, 1001, 234, -969, -496, -350, 115, 1108, 1423, 348, -824, -1328, -53, 1247, 1350, 1141, 267, -1386, -1575, -408, 1230, 1826, 1151, -149, -1176, -1758, -594, 1407, 2379, 1191, -840, -1866, -1876, -288, 1635, 1922, 482, -872, -2126, -1606, -342, 1243, 2107, 694, -775, -2230, -1708, 143, 1582, 1622, 618, -1046, -1566, -893, 146, 1360, 1214, 381, -423, -989, -1130, 111, 900, 809, 158, -801, -1048, -309, -128, 568, 840, 329, 139, -734, -354, 229, 643, 263, 194, -107, -102, -62, -213, -248, -200, 153, -65, 100, -110, -511, -372, -660, -457, 207, 578, 327, -581, -1008, -1091, -247, 1008]
3142A008N32j368q61m64j5J061J000R33r87j469j267Q49J576J021L32j148j487
3159g54p48J179J216J320l46r78j562j262J290J707J012n11j248j339m54Q81J176
3176E79J405n59j377j338j26M93J217R24j85j356j489J06J295Q80M10m61p56n79
3194i17k15O54R10K99m21m78o15j96Q50O28j49l17j15o0o22K89M87N65m47k41
3214a11m07L95k7J92R9l17j20M99j98M34p48l15K97L24L60N08n68r69m78M26J029
3235C05L22k44n68j040m15N01J101Q03n65n22j204n8L91J166J123l80j303p13
3253a300j46N99P68R77j82j323q98J63R72Q72N67j54r41j437k59J561J108L68
3271A315n82o09r48Q1O69J025Q22q46j112k50k29P34P37K17l33p52o0k02j34N50
$$ y = [1008, 1540, 172, -689, -1153, -1168, -107, 893, 1826, 839, -630, -1897, -1048, 528, 1549, 1881, 733, -754, -1502, -323, 893, 2213, 1867, 889, -673, -1935, -645, 1062, 2074, 1563, 315, -1024, -1478, -597, 579, 1984, 1425, 48, -1290, -1416, -923, 294, 1218, 1033, -323, -1812, -1706, -411, 469, 879, 418, -338, -917, -1132, -478, 432, 731, 310, -168, -783, -979, -129, 499, 350, 33, -82, -142, -764, -475, 12, 577, 130, -111, -518, -123, -150, 42, 141, -176, -296, 203, 5, 439, -309, -624, -327, -3, 357, 865, 297, -672, -1150, -724, 305, 627, 383, -185, -1225, -1640, -1139, -38, 765, 200, -322, -1526, -1584, -1193, -27, 1096, 716, -587, -1300, -1446, -847, -79, 898, 716, -607, -1505, -1342, -370, 502, 1069, 915, -26, -1463, -1722, -161, 947, 1315, 733, 124, -824, -743, -74, 951, 1773, 927, -185, -435, -664, 70, 807, 1024, 691, -61, -121, -323, -457, 93]
3291I3J016l20j123j42Q3P48j36m6K87o36R2J61N9j65j46K36K71P2l03J32n9n16
3313c42j88Q72K52l4r46n60J47Q16N70O19l15j119q85L97P35Q68M36j70j088j208
3333a143K70J070Q27J72j50r44j052o14J045J656M37n61j211j057k36J115J657
3350A281K89r47j277m88K33O98Q31Q82r02j390q69N03O36P79N52P2j851p29N0
3369a647J441O49p0k28j140n15J03J636P76o25m32l33m48P2P82O42L7q38l40L61
3389a17J86k28M56M77j187J23L12M11o22P3l6N16l14j80L64J4l35R7M81J24j68
3410D47K35n90m29l52R84P59l04m72o24k22m07J64J768O67j357j328OM75O19J020
3430A059j9o53j529L4P05Q59O72M27o74j402j321J379J318M83l88m45o41j013
$$ y = [93, 1109, 789, -334, -476, -393, 355, 219, 173, 460, -176, -84, 77, 136, -29, -175, 61, 332, 404, 101, 233, 174, -342, -530, 342, 594, 560, -386, -946, -799, 17, 587, 1206, 891, -228, -1113, -716, 19, 887, 1323, 1153, 65, -1143, -873, 197, 1024, 1196, 1046, 102, -950, -1564, -519, 1137, 1574, 1013, -198, -1255, -1491, -376, 1281, 1570, 623, -654, -1142, -909, -211, 620, 1502, 600, -790, -1659, -1156, -520, 259, 811, 883, -968, -1697, -1647, -206, 443, 373, 145, -995, -1510, -1407, 229, 1005, 380, -52, -385, -833, -761, 21, 663, 700, -138, -478, -117, 69, -159, 297, 774, -413, -290, 22, 433, -189, -116, -152, 364, 50, -130, 234, 248, -87, 10, 491, 615, 447, 682, 92, -337, -689, 295, 1054, 750, 278, -346, -568, -975, -811, 957, 1624, 267, -1061, -1055, -580, 39, 1059, 1040, 387, -1142, -1108, -403, 456, 1128, 1555, 881, -521, -1842, -463, 855, 1338, 950, 505, -136, -1149]
3448a149L06J300R24j98j096m52k87K38J191Q37k41j670o61K62O34L68Q74l32
3466H48r90r04K79Q32L96K4O0l78q96k94N04J133n13r6k73l92n2J11R04r1p56
3487e44J79K2N72o02K64L9k20m40O64L90r9m23l00K20K0M7P64Oj191m74N28Q75
3509B97J18K92L4j047o71M67P40N76l0l60r44n30o0J406J109m24j095n69k67n0
3529a008R92J018L42j284j182J76J99R89P35L85j137j334J22O95R29M56Ln49j141
3548e94p41J080J506M32r80p08o6o40P56N92K20j74o71J85p30O24N51N27j31j384
3568c46J02M19J48k84M00L11l70k37o4L68n05L49L61l42l29J97n9n9l22K10O07
3589E55N9n12l36k13l33M82R40L15k49j169j50n6M05Q02M37n4j298m98K90N79
$$ y = [-1149, -843, 457, 1381, 1183, 87, -365, -652, -414, 777, 1614, 1373, -297, -958, -696, -62, 306, 1180, 848, -142, -1046, -767, 65, 461, 485, 545, 167, -729, -1023, -519, 614, 101, 5, -268, -660, -712, -601, 303, 212, -544, -365, -343, 229, -373, -109, -70, -290, -730, -66, 324, 225, -198, -498, -278, -258, -211, 553, 559, -632, -1106, -578, 297, 415, 707, 741, -306, -977, -510, 230, 806, 776, 416, -528, -1058, -1118, 288, 1397, 973, -122, -691, -958, -1008, -16, 1002, 1344, 60, -1122, -946, -747, 242, 977, 1362, 225, -1109, -987, -292, 637, 1093, 1096, 547, -594, -1335, -255, 1251, 1683, 703, -5, -71, -711, 45, 637, 857, 683, 12, 197, -533, 91, 642, 1169, 1038, -346, -244, 175, 323, 39, 439, 750, 380, 143, 79, 447, -58, 291, 652, 310, -19, 178, 119, 60, -262, -52, 555, 614, 102, -234, -447, -780, -298, 642, 957, 708, -461, -611, -667, -262, 540, 977, 923, -375, -873, -583, -4]
3609dM88K15R3q34r02m24J379O84K56k85j305o08p5J125Q59M02p12q40o76k01
3629a365J095J155J31m21j174m61J31R95O13J02o44r99j72J51O49P77J88l78j191
3648h18l92O06R53L15j15n88m99O7j04Q64M32l01n13j48m44N45K42Q9M0n74K8
3669c15K96M2J31l48M27l89l33N02M63l59n26q1L34P5M90J74o21n45j93M56Q02
3690D82j90L9m72n32l31P09Q60K25k34r67l94j73Q67N49O22p43p86m99L26Q72
3710B30M57J38l05j109m70L31J094N02R3p72p93l77kJ150K75L0n17m25n38K14
3730g94O63R81n20n15n30j8L86K81N58m5m59q36q2L36N32N0J23k50o36rL11J79
3752b94L93j88j86j51q8M28K04j93m01L57J87J10Q7n07k08M30j29P02l83R8m42
$$ y = [-4, 484, 699, 792, -42, -944, -1368, 11, 695, 951, 666, -639, -1247, -1322, -197, 662, 1064, 352, -488, -1164, -1365, -270, 885, 1016, 595, -579, -1040, -909, 86, 699, 801, 157, -842, -1014, -863, -214, 563, 751, 373, -818, -1210, -604, 349, 664, 549, -39, -538, -471, -575, 289, 721, 420, -93, -241, -685, -140, 102, 191, 231, -343, -315, -19, 23, 154, -194, 233, -156, -489, 13, 476, 117, -409, -490, -156, -81, 409, 583, -38, -583, -776, -320, 482, 292, 331, -141, -673, -1004, -295, 565, 790, 556, -411, -805, -978, -111, 438, 1060, 317, -469, -968, -642, 230, 687, 825, 520, -589, -1059, -728, 366, 868, 961, 189, -604, -981, -983, 167, 442, 472, -45, -470, -1008, -794, -131, 850, 330, -185, -715, -733, -347, -66, 492, 447, -12, -848, -930, -594, -62, -12, 111, -139, -775, -784, -473, -294, 99, -89, -275, -426, -514, -86, 118, -75, -476, -119, 68, 178, 265, -242, -450, -20, -149, 553, 170, 268, -174]
3773a74n16K61M54L86L9k87p05m16M05O48M53j7k86q23l28K16J130J54Q2j91j261
3794g76j07M89M89J006n68n71q42m9O3Q47J085j17r25q54k69O52P20J035m52p90
3814F6q50j66P33J006N31Pj035q31l04R77O95O55o86m20j030j12O75P26K83m20
3834E00m89o49J93L81P91j59l12m94k95K08L38L24k7n35q0Q1O4j17J21o1k89M13
3856i3j57L13l21l05J91K22J02M17j22m28J62k26J86M13K99J6o17k20j69J07O94
3877D64K74j37p69m38j16N32L13O74k8p14q96O4N85N71N06m02n76p74r3Q03N58
3898D01K20j20o09p87l94O48J164l6k86q41o06J11O77P03J82Nj072l62M52L54
3918a96Q70L01o68l94n26M74O72K70j49l75K34p54J88M90J52j84k14K45m82n5
$$ y = [-174, -690, -429, 25, 411, 450, 163, -542, -958, -553, 95, 548, 531, 245, -578, -906, -690, 440, 594, 676, 485, -776, -883, -394, 95, 1101, 533, -38, -880, -929, -866, -19, 1066, 949, 24, -830, -1099, -447, 273, 1308, 856, 66, -784, -950, -217, 789, 1320, 1327, 292, -539, -843, 134, 829, 1484, 798, 378, -652, -764, -89, 637, 920, 500, 11, -638, -445, -64, 727, 568, 256, -238, -533, -325, 13, 337, 310, -225, -305, -224, -160, -277, -156, -217, -506, -93, -250, 63, -258, -563, -372, -150, -48, 369, 247, -181, -19, -245, -59, 354, 653, 669, 52, -168, -337, -230, 464, 738, 601, -168, -606, -722, -190, 123, 797, 769, 55, -841, -777, -192, 379, 885, 483, -93, -867, -960, -157, 401, 621, 501, -108, -895, -1289, -641, 523, 487, 201, -640, -1246, -1135, -458, 245, 427, 432, -640, -1002, -550, -196, 674, 975, 307, -87, -613, -139, 533, 803, 654, 279, 513, -241, -53, 437, 589, 405, 191, 436, -46, -101]
3938a01K73N79p01j99J17J68K41k2j93K87l48mL27p2j21n41OL17J03J25J15p52
3960c96o8p7M24L01K53j38k54p50J77N38O06J19j46m58p23K85M80M34J53m47k40
3981G3l32l88P29L39O72n64j074m47L36O30P21R7j87r15q25P22M47N47N5j46j062
4002e72m51N70M90Q17k15p80j67n45M09L11N91O1o70k31J9j16O3O86J8n30j49
4023c91J46K06n3K97J4j23l94K41K14k12k41J29L57j65J30N7l35k46L1J93O05
4044D60p12r0J90P9o1J76K59J42l75l49K06o2K60M90K20o42n52R4N4L75N24K23
4066I09n29r46K0M24O10L55j50l97l63m14J95R06O62p39Q7q27n40K97R23P21n56
4087F48q59m61K53K13O93L44k91m15q02L6P77L31L71q9o98p06K47J63P14N2N2
$$ y = [-101, 172, 751, 50, -149, -32, 136, 377, 355, 162, 449, 101, 97, 424, 352, 231, -310, -304, 13, 116, 241, 356, -396, -464, -541, -117, 184, 437, 299, 45, -705, -528, 10, 616, 735, 589, 131, -592, -307, 173, 607, 760, 313, 73, -259, -647, 82, 421, 1093, 529, -545, -992, -656, -26, 695, 792, 605, -310, -1135, -413, 34, 581, 636, 490, -572, -1023, -453, 37, 854, 639, -141, -308, -853, -444, -133, 458, 519, -151, -382, -363, -479, -416, 270, 288, -242, -391, -245, -39, -92, 205, 219, 96, -298, -57, 157, -55, -296, -167, 190, 25, 155, 212, -123, -369, -338, -145, 460, -252, -342, -152, -73, -134, 42, 301, 443, 68, -281, -75, -137, 123, 613, 833, 191, -361, -267, -213, 162, 686, 909, 380, -566, -546, -122, 488, 843, 693, 296, -67, -481, -286, 620, 1282, 543, 630, -197, -737, -440, 483, 1204, 648, -211, -672, -419, -206, 487, 831, 540, 125, -677, -641, 136, 467, 838, 749, 51, -655, -408, -245, 469, 521, 573]
4108E73l66m96k83M32Q83j23n23q1k71L5P0N2L08k19N8j47M08m51m0L47k32j29
4130a95k1M14j7m17P8J13o9m5N94l07m86n16M69M06qL30k87l32n95L16N35L17
4152B77L3l51l55K2n04O94P87k14l19p38N86k83L47O86k2q71k59q8K54N11J00
4173B93J97n16o41l40N22Q83L6j31l64n00l02N66N12L34m01l65q1l60K91O16M00
4194F49m32o93K82l72L95K25K02K73p06k80M5K37K31Q1K28m32q9J77K9J22m02
4215b30L83Lk20N4J30l9J04m84K58K44J64n62K28k48J94nK03l37o8j49K32M5J74
4238G4L22J3j71q82J08N70K93K7l74Q2o67m72J023K03K65m22m14j31j53L98R00
4259E92K32n78q21o5J82L25N30J47o4q99l57J6O02N91K34o37l61n72N00N43L56
$$ y = [573, 207, -289, -572, -140, 743, 620, 97, 16, -255, -220, -150, -98, 210, -9, 49, -98, 310, -141, -181, 166, -66, -195, -216, 198, 181, -236, -158, -45, -114, -159, 435, 128, -358, -874, -405, 1, -7, 323, 36, -296, -891, -575, -40, 277, 310, -41, -396, -374, -878, -184, 603, 389, 70, -668, -82, -365, -18, 668, 646, -225, -484, -572, -318, 193, 293, 490, -26, -667, -1007, -485, 398, 434, 303, -61, -561, -863, -297, 215, 549, 148, -217, -298, -658, -367, 249, 649, 217, -476, -194, -566, -171, 54, 256, 529, -177, -457, -412, -175, 56, 137, 365, -67, -156, 21, 50, 172, -230, 153, 156, -64, -10, 120, 81, 185, -299, -41, 203, 367, -195, 33, -215, -21, -26, 177, -160, -228, -377, -145, -100, 74, 396, 409, 238, -644, -536, 34, 327, 354, -20, 62, -605, -1077, -54, 149, 414, -8, -422, -553, -706, -308, 592, 824, 246, -575, -640, -458, -133, 397, 544, 480, -419, -776, -760, -158, 433, 667, 30, -331, -903, -403, 140, 496]
4280D96J55j78q03j79J73M97M34P2l97n93l76K17L68M88O6l76k24j55L30K85K1
4301C21J66k62n12J91L94n5qk03j30n0J47L53m62K07m9j9J2J67q6p4J87m14K08
4324B9M43l12J51j10l96P2K98K63J08m39j19j87J32pM52K12k89n00m13K02N75
4345A65L55Rk9p63l04K03L64P59j01l71l93l67mP86J25M1j41l70l68P8L13N96
4367E83j12m13k24k63K88L70J99O3o02k71j65K29L21J57L33m35o81K90J90N41
4387C98l24K32n34J54j35k06L65K07l2l10j37j2L34J47k8l72j33J56M29j89r6
4408h6N1j13O2l9J92L37o66k6R4M24jj47j56j52l45N0O31K76l39j35k95L8j42
4431d87P44M00l66J08j095L84J25O81j01K55m92l98j85J23L61O28J40p15o45m21
$$ y = [496, 651, 473, -330, -509, -336, 161, 595, 667, 270, -323, -699, -482, -114, 374, 440, 64, -160, -315, 15, 300, 321, 487, 225, -287, -96, 298, 243, 235, 32, -98, -148, -1, 352, -110, 97, 48, 29, 41, 208, 122, 48, 235, -179, 29, 472, 160, 311, 201, -195, -123, 175, 438, 546, 107, -12, -199, -67, -74, 378, 590, 301, -199, -612, -410, 165, 520, 529, 500, -263, -567, -364, 0, 759, 658, 287, -106, -473, -477, 309, 434, 475, 334, -36, -404, -326, -13, 583, 471, 58, -166, -429, -141, 229, 428, 491, -111, -382, -547, -318, 3, 160, 493, 58, -623, -333, -143, 398, 74, 306, -228, -74, -209, -415, -50, 157, 125, -185, -322, -334, 0, 147, 119, -253, -386, -230, 199, 10, -86, -35, -148, -86, -125, 67, 404, -262, -288, -194, 230, 229, 82, -74, -226, -571, -521, 110, 386, 47, -88, -383, -345, -487, 257, 657, 291, 399, -696, -312, -187, 494, 393, 648, 156, -242, -427, -304, 57, 685, 825, 110, -535, -956]
4451i56N69P60M99k74p65m03j4L26P80K84j55q94j08k4L3P21M09l84m27k20R4
4472a49K4N59j37k34j41k82J10N76p7J40k93k4l67K64J18K97Q0O6k05j96L7L23
4494D89P3n81l03M06o1K80n04l6J97l39J76N97l27n00J15J30RJ07N37o32j36k77
4516e80K59J60M75k60K81n07m91L84k57N23N12l77k28o60K65M10J74M84m14j59
4536fn23K09M17L68Q6k21k62l15j16M12N18j08p6n29n68N40J89j02J61K44n46
4557b28m62J64K58M83l9l36j64m46M94L92J64k88j33L8k26J26J21J18K68n72K18
4578e0j04J83l13M32MJ52n94K69L07k57mp6M44m18O3N62k11j79Rj8J29K84Lo72
4602e5l1m47N50K72r5n6j95k38l35L75N26K84k88q44J8K36J0O81N4l00k69n43
$$ y = [-956, -387, 373, 872, 598, -167, -570, -584, -258, 522, 806, 651, -243, -351, -375, -342, 379, 788, 404, -23, -243, -149, -125, 434, 297, 63, -78, -360, -250, 326, 249, 389, 96, 72, -295, -31, 87, 384, 464, 530, 325, 129, 166, 489, 562, -19, -322, 84, 23, 303, -201, -237, -40, -379, -203, 394, 67, -433, -318, -188, -179, -72, 465, -167, -303, -580, -321, -161, 314, 54, 335, -172, -663, -279, -536, -13, 499, 122, -106, -766, -501, -91, 83, 567, 153, -6, -529, -320, 97, 465, 551, 330, 68, -247, -363, 49, 567, 459, 383, -146, -714, -174, 15, -87, 74, 318, -228, -690, -526, -268, 215, 176, -160, -324, -770, -276, 116, 280, -8, -141, -103, -329, -203, -82, 36, 304, -268, -50, -154, 29, -284, 148, 152, 304, -290, -21, 286, 29, 25, -51, 393, -25, 38, 600, 389, 210, 219, 201, 330, 614, 617, -55, -86, -533, 17, 289, 194, 138, -57, -295, -630, -255, 271, 555, 267, -577, -559, -323, -313, 368, 422, 122, -147, -690]
4624f90L4M08O64l3l68m15k77L36R8O61j53l59k90k23K91r4R91l99m3m67k98M15
4646b11N45J13l32K5m91L9Q6J94M98l3k41o29j14K72l8L38q4L00o05jo6M40m1
4669c6k08n5j8Q2l4R5Q5j25j50L99J54k30j53j12J47K79O5J18k97m08K52K27k43
4692a66n1N59m54k41O5L40N35k91K9l23j03k20J84M56L56m88k27j37j86j2O81
4713C06M25k20n35m53N0K36M16M65k22m83n31JL82P61J04l46k93k72R4L45oM5
4735B69J11j60m70j07M14J15K70j64m18L1k43J40M10L28k89l00m00P4L40M20L06
4756F77o08l69Jj4M46k56N7j36M0pk6K23m30K74l25J83J97J46p8l56K62r8M45
4779B48L6l77Q2j11j23rL31L4J36m13j59m2K14J88J51K60n76l16j05O59K49j89
$$ y = [-690, -656, -248, 416, 383, 15, -400, -677, -341, -243, 418, 265, -94, -384, -607, -316, -410, 581, 182, 139, -328, -626, -211, 334, 447, 115, 140, -351, -312, -226, -32, 466, 433, 192, -437, -551, -279, -317, 21, -63, 237, -368, -369, -435, 5, -36, -244, -299, -317, -235, -269, -174, -89, -214, -364, 35, 189, -41, -194, -306, -159, 120, 185, 303, 6, -402, -150, 77, -166, -217, 342, -112, -353, -288, 52, 587, 296, 325, 2, -101, -321, -137, 319, 675, 187, -40, -177, -363, -375, 306, 731, 511, -24, -477, -427, -191, 225, 690, 468, -15, -546, -545, -163, 598, 702, 356, 63, -209, -115, 230, 224, 269, 380, 220, -250, -357, 57, 172, 442, 278, -140, -109, -352, -212, 198, 526, 237, -63, -463, -389, -49, 371, 677, 69, -300, -299, -313, 133, -123, -66, -202, -162, -169, -195, 28, -402, -128, -453, -270, -73, 73, -5, -361, -99, -197, 248, 284, -93, -11, -122, -245, -254, 77, 111, 247, -166, -325, -367, -153, 35, 186, 446, -130, -446, -551, 108, 357, 168]
4801A68J01k55m11J7K48O31l08k93j16r5j53K61N76J62j92m43o60M34J44L43L12
4822D71k83l83o6m3K15K34J95k7m02k60p3M37K36O3l94K3n3Q9L36J97j85l48L35
4845C14l20j82L74K89k17o42J84J56J36N9J88l37k34K4N83j11rl79R1q6O1M01
4867C43l06rk79J04J61K25L2m86K39n53L19M10q0j2J72p4l98k11K71K40J5k03
4889h0kl59K38J52K00K06k61l15k12K90k30P79M9j24n72l93L57K84L52K42k68
4910C33n26k97N9J96N41L5m06j45k52J94J45M41k61K5j89k52p1L45K90lJ35n56
4932b19l61L91k2K84n3L89q65k2J34K87j6P6J58k31j07J35j68M17j83j50p8j7
4954b21Q2o9K16K07l45J38L27n81q5L09N8j0R1J33p4l25J4J20J22k40K31qk63
$$ y = [168, 269, 14, -397, -380, -132, 499, 191, -102, -218, -313, -466, -205, 371, 533, 341, -102, -762, -328, -184, 159, 471, 188, -195, -261, -304, -89, 145, 340, 313, -89, -349, -422, 15, 251, 314, -80, -57, -110, -21, 315, 512, 327, -21, 314, -6, -188, 186, 475, 258, -384, -200, -44, 92, 151, 339, 2, -232, -208, 375, 264, 255, -124, -33, -119, -58, 343, 37, 28, -251, -147, 14, 239, 271, -215, 24, -529, -210, 200, 120, 108, 280, 206, -192, -403, -132, 108, 123, -80, -82, -441, -203, -51, 149, 355, 94, -221, -433, -143, -373, 406, 455, 331, -241, -634, -277, 7, 359, 601, 333, -193, -490, -431, -235, 306, 341, -65, -210, -462, -268, -123, 318, 57, 82, -107, -359, -430, -85, 205, 202, 337, -219, -580, -189, -211, 73, 20, 409, -456, -478, -344, -57, -73, 3, 161, -70, -177, -42, -210, 207, 24, -126, -204, -221, -139, -208, 8, 215, -130, 8, 335, -246, -331, -22, 36, 26, 117, 250, 176, -149, -135, -15, 107, -133, 98, 90, -173]
$$ [...]
8191E6
##END NTUPLES=NMR FID
##END=
