##TITLE=1H_SA_4.175
 D2O, 8 sc, 
 20.12.2019
##JCAMPDX= 6.0         $$ Bruker NMR JCAMP-DX V2.0
##DATA TYPE= NMR FID
##DATA CLASS= NTUPLES
##ORIGIN= UXNMR, Bruker Analytische Messtechnik GmbH
##OWNER= root
$$ XWIN-NMR		Version 3.5
$$ Fri Dec 20 13:47:55 2019 Russian Standard Time (UT+4h)  she@DPX200
##.OBSERVE FREQUENCY= 200.1315
##.OBSERVE NUCLEUS= ^1H
##.DELAY= (6, 6)
##.ACQUISITION MODE= SIMULTANEOUS
##.ACQUISITION SCHEME= undefined
##.AVERAGES= 8
##.DIGITISER RES= 18
##SPECTROMETER/DATA SYSTEM= spect
##.PULSE SEQUENCE= zg30
##.SOLVENT NAME= D2O
##.SHIFT REFERENCE= (INTERNAL, D2O, 0, 15.7039)
##AUDIT TRAIL= $$ (NUMBER, WHEN, WHO, WHERE, WHAT)
$$ ##TITLE= Audit trail, XWIN-NMR		Version 3.5
$$ ##JCAMPDX= 5.01
$$ ##ORIGIN= Bruker BioSpin GmbH
$$ ##OWNER= she
$$ F:/spectra/data/she/nmr/H-F/1/audita.txt
$$ ##AUDIT TRAIL=  $$ (NUMBER, WHEN, WHO, WHERE, WHAT)
(   1,<2019-12-20 13:46:46.85 +0400>,<she>,<DPX200>,
      <created by zg, POWCHK disabled, PULCHK disabled
       configuration hash MD5:
       00 E9 B6 7A A2 85 ED C7 34 08 36 98 17 FE 4E 26
       data hash MD5: 16K
       24 76 8A 5E 1B 2E 4B BD DB 94 96 EB 42 68 20 E8>)
$$ ##END=
$$ 
$$ hash MD5
$$ 61 DA 60 C4 E7 71 BD E5 1E A9 97 F2 BA 34 98 D2
##$RELAX= 
##$RELAX= 
##$RELAX= 
##$RELAX= 
##$RELAX= 
##$RELAX= 
$$ Bruker specific parameters
$$ --------------------------
##$DU= <F:/spectra>
##$EXPNO= 1
##$NAME= <H-F>
##$PROCNO= 1
##$TYPE= <nmr>
##$USER= <she>
##$AMP= (0..31)
100 100 100 100 100 100 100 100 100 100 100 100 100 100 100 100 100 100 
100 100 100 100 100 100 100 100 100 100 100 100 100 100 
##$AQSEQ= 0
##$AQ_mod= 1
##$AUNM= <au_zg>
##$AUTOPOS= <>
##$BF1= 200.13
##$BF2= 200.13
##$BF3= 200.13
##$BF4= 200.13
##$BF5= 200.13
##$BF6= 200.13
##$BF7= 200.13
##$BF8= 200.13
##$BYTORDA= 1
##$CFDGTYP= 0
##$CFRGTYP= 5
##$CHEMSTR= <none>
##$CNST= (0..31)
1 1 145 1 1 1 1 1 1 1 1 1 1 1 1 1 1 1 1 1 1 1 1 1 1 1 1 1 1 1 1 1 
##$CPDPRG= <>
##$CPDPRG1= <>
##$CPDPRG2= <>
##$CPDPRG3= <>
##$CPDPRG4= <mlev>
##$CPDPRG5= <mlev>
##$CPDPRG6= <mlev>
##$CPDPRG7= <mlev>
##$CPDPRG8= <mlev>
##$CPDPRGB= <>
##$CPDPRGT= <>
##$D= (0..31)
0 1.2 0 0 0 0 0 0 0 0.06 0 0.03 0 0 0 0 0.0002 0 0 0 0 0 0 0 0 0 0 0 0 
0 0 0 
##$DATE= 1576835206
##$DBL= (0..7)
120 120 120 120 120 120 120 120 
##$DBP= (0..7)
150 150 150 150 150 150 150 150 
##$DBP07= 0
##$DBPNAM0= <>
##$DBPNAM1= <>
##$DBPNAM2= <>
##$DBPNAM3= <>
##$DBPNAM4= <>
##$DBPNAM5= <>
##$DBPNAM6= <>
##$DBPNAM7= <>
##$DBPOAL= (0..7)
0.5 0.5 0.5 0.5 0.5 0.5 0.5 0.5 
##$DBPOFFS= (0..7)
0 0 0 0 0 0 0 0 
##$DE= 6
##$DECBNUC= <off>
##$DECIM= 24
##$DECNUC= <off>
##$DECSTAT= 4
##$DIGMOD= 1
##$DIGTYP= 9
##$DL= (0..7)
0 120 120 120 120 120 120 120 
##$DP= (0..7)
150 150 150 150 150 150 150 150 
##$DP07= 0
##$DPNAME0= <>
##$DPNAME1= <>
##$DPNAME2= <>
##$DPNAME3= <>
##$DPNAME4= <>
##$DPNAME5= <>
##$DPNAME6= <>
##$DPNAME7= <>
##$DPOAL= (0..7)
0.5 0.5 0.5 0.5 0.5 0.5 0.5 0.5 
##$DPOFFS= (0..7)
0 0 0 0 0 0 0 0 
##$DQDMODE= 0
##$DR= 18
##$DS= 0
##$DSLIST= <SSSSSSSSSSSSSSS>
##$DSPFIRM= 0
$$ [...]
##$SUBNAM2= <"">
##$SUBNAM3= <"">
##$SUBNAM4= <"">
##$SUBNAM5= <"">
##$SUBNAM6= <"">
##$SUBNAM7= <"">
##$SUBNAM8= <"">
##$SUBNAM9= <"">
##$SW= 24.9337058887773
##$SWIBOX= (0..15)
0 0 2 0 0 0 0 0 0 0 0 0 0 0 0 0 
##$SW_h= 4990.01996007984
##$TD= 16384
##$TD0= 1
##$TE= 0
##$TE2= 300
##$TE3= 300
##$TEG= 300
##$TL= (0..7)
0 120 120 120 120 120 120 120 
##$TP= (0..7)
150 150 150 150 150 150 150 150 
##$TP07= 0
##$TPNAME0= <>
##$TPNAME1= <>
##$TPNAME2= <>
##$TPNAME3= <>
##$TPNAME4= <>
##$TPNAME5= <>
##$TPNAME6= <>
##$TPNAME7= <>
##$TPOAL= (0..7)
0.5 0.5 0.5 0.5 0.5 0.5 0.5 0.5 
##$TPOFFS= (0..7)
0 0 0 0 0 0 0 0 
##$TUNHIN= 0
##$TUNHOUT= 0
##$TUNXOUT= 0
##$USERA1= <user>
##$USERA2= <user>
##$USERA3= <user>
##$USERA4= <user>
##$USERA5= <user>
##$V9= 5
##$VALIST= <valist>
##$VCLIST= <CCCCCCCCCCCCCCC>
##$VD= 0
##$VDLIST= <DDDDDDDDDDDDDDD>
##$VPLIST= <PPPPPPPPPPPPPPP>
##$VTLIST= <TTTTTTTTTTTTTTT>
##$WBST= 1024
##$WBSW= 4
##$XGAIN= (0..3)
0 0 0 0 
##$XL= 0
##$YL= 0
##$YMAX_a= 231537
##$YMIN_a= -173222
##$ZGOPTNS= <>
##$ZL1= 120
##$ZL2= 120
##$ZL3= 120
##$ZL4= 120
##$ABSF1= 10
##$ABSF2= 0
##$ABSG= 5
##$ABSL= 3
##$ALPHA= 0
##$AQORDER= 0
##$ASSFAC= 0
##$ASSFACI= 0
##$ASSFACX= 0
##$ASSWID= 0
##$AUNMP= <proc_1d>
##$AZFE= 0.1
##$AZFW= 0.1
##$BCFW= 1
##$BC_mod= 2
##$BYTORDP= 1
##$COROFFS= 0
##$CY= 11.3945322036743
##$DATMOD= 1
##$DC= 2
##$DFILT= <>
##$DTYPP= 0
##$F1P= 16.9975609425685
##$F2P= -3.02152046262296
##$FCOR= 0.5
##$FTSIZE= 0
##$FT_mod= 4
##$GAMMA= 1
##$GB= 0.15
##$INTBC= 1
##$INTSCL= 1
##$ISEN= 128
##$LB= 0.24
##$LEV0= 0
##$LPBIN= 0
##$MAXI= 10000
##$MC2= 0
##$MEAN= 0
##$ME_mod= 0
##$MI= 1.114404
##$NCOEF= 0
##$NC_proc= 0
##$NLEV= 6
##$NOISF1= 3.799351
##$NOISF2= 2.8
##$NSP= 1
##$NTH_PI= 0
##$NZP= 0
##$OFFSET= 15.70392
##$PC= 1
##$PHC0= -10151.51
##$PHC1= 19.2008
##$PH_mod= 1
##$PKNL= yes
##$PPARMOD= 0
##$PSCAL= 0
##$PSIGN= 0
##$REVERSE= no
##$SF= 200.130013532006
##$SI= 16384
##$SIGF1= 3
##$SIGF2= 2
##$SINO= 400
##$SIOLD= 16384
##$SREGLST= <1H.CDCl3>
##$SSB= 0
##$STSI= 0
##$STSR= 0
##$SW_p= 3612.71676300578
##$SYMM= 0
##$S_DEV= 0
##$TDeff= 0
##$TDoff= 0
##$TI= <>
##$TILT= no
##$TM1= 0
##$TM2= 0
##$TOPLEV= 0
##$USERP1= <user>
##$USERP2= <user>
##$USERP3= <user>
##$USERP4= <user>
##$USERP5= <user>
##$WDW= 1
##$XDIM= 8192
##$YMAX_p= 0
##$YMIN_p= 0
$$ End of Bruker specific parameters
$$ ---------------------------------
##NTUPLES= NMR FID
##VAR_NAME=  TIME,          FID/REAL,        FID/IMAG
##SYMBOL=    X,             R,               I
##VAR_TYPE=  INDEPENDENT,   DEPENDENT,       DEPENDENT
##VAR_FORM=  AFFN,          ASDF,            ASDF
##VAR_DIM=   8192,          8192,            8192
##UNITS=     SECONDS,       ARBITRARY UNITS, ARBITRARY UNITS
##FACTOR=    0.0002004,     1,               1
##FIRST=     0,             0,               0
##LAST=      1.6414764,     0,               0
##MIN=       0,             -173222,         0
##MAX=       1.6414764,     231537,          0
$$ Real data points
##PAGE= N=1
##DATA TABLE= (X++(R..R)), XYDATA
0@%%%%%%%%qJ6j6J6j8K6l2L4m2N5o3P2q8J03j18J37j57J80k05K33k66L00l39L82
32B02m32M85n40O02o71P47q30R20j020J131j250J384j534J700j886K097k336K612
50A381k934L315l778M351n076O031p368R381j2792K0091o4180P6422O5935j42988
64e2209j5498P1460l2979j43996K376J17523L8409l5805O9223P8361r3005j56948
76a53088L1501J23794j9035q6603Q3464J53278l6632j68318l7218P0182j2833
87e1508n2241P8315J16603k7372q5846K7984L9248j02662r4642J13034J66226
98A27139j9964j03974L2305P3479q1281j30245K9094J10108P736k9283N9000L3309
110A07423j16350j10891N4152P4265o1319m6990J20953J11566r2268j44745J1559
$$ plain form
0 0 0 0 0 0 0 0 0 0 -8 8 -8 8 -10 16 -16 18 -24 31 -32 40 -48 55 -63 74 -83 97 -108 125 -141 159 -180 202
32 202 -230 255 -285 317 -354 393 -437 483 -537 594 -656 728 -806 894 -992 1105 -1231 1381
50 1381 -1553 1762 -2016 2335 -2741 3290 -4078 5303 -7489 12602 -51578 24844 90779 -52209
64 -52209 -67707 3753 -29226 -173222 -170846 -53323 -14914 -50719 18504 96865 3860 -153088
76 -153088 -121587 2207 -16828 -103431 -19967 133311 96679 -71639 -108857 -38675 -51508
87 -51508 -103749 -25434 91169 63797 -22049 5935 45183 -57479 -152121 -39087 127139
98 127139 107175 3201 35506 108985 27704 -102541 -73447 36661 44397 15114 74114 107423
110 107423 -8927 -119818 -65666 8599 -52720 -99710 21243 132809 40541 -104204 -92645
121i2645O7957l9698m3224Q8298R2569m3531o5043K9642r47j12338m3792J32416
133c0336J07496o5704o8690P1425M6875j13910j02617P0403J05612p498j6769
144c713O5971J6309j04781o2807O5964L7153o5270N085J37038N8490j21928j01381
156g3870N1646M7217o4379k6169J02528P4665n2833m8242K5551k2972r6010n92
168h3460J23474N2146p6228k3995Q0485j839j34776o6316R1417P5902l2265r864
180e319O3010j927r7646l9123N5271Q146n0655M4187J24812Q239j24332n1767
192f7104O9123J3623p9512R0J13362N1896o3106l7553K2601l4167p6582K6024
204f1305J06586J6549o3675J9446P8288l9777j31671j6687J10298M7473m7175
$$ plain form
121 -92645 -24688 -64386 -107610 -19312 73257 29726 -35317 -5675 -6622 -118960 -162752 -30336
133 -30336 77160 11456 -57234 14191 61066 -52844 -155461 -85058 20554 13056 -3713
144 -3713 62258 78567 -26214 -89021 -23057 14096 -51174 -46089 90949 149439 27511 -73870
156 -73870 -22224 24993 -39386 -65555 36973 111638 58805 10563 36114 13142 -82868 -83460
168 -83460 40014 92160 15932 -8063 72422 70583 -64193 -130509 -39092 36810 4545 -5319
180 -5319 57691 55764 -41882 -81005 -25734 -17588 -68243 -24056 100756 108995 -15337 -67104
192 -67104 2019 15642 -63870 -63780 49582 101478 38372 819 23420 -10747 -87329 -61305
204 -61305 45281 61830 -1845 17601 95889 56112 -75559 -92246 18052 65525 18350
215A8350Q357O9148j5034r4881k5767M3314j0372l5721O2782R4785l6210j13825
227c5074j0295O3457k6836q1764L3806J18423K3158p2060k1381K5892l8379o0290
239h1343L9356Q4363m316m1331M1707N0092p6283j11780K3421R9652P340n0762
251a9884L1561O7750l3643r0278j0161M0874j1991j2283P3555O8628n2011q0654
263b8537K1899M5069n5679o1392O7772J07124j1473p4349m160K3106m8454n2459
275g1533M3568O5113j3907k1136M9390J9066r3788p8359N5245P9645k4394l8919
287c0009N8246N9531n7495q7058N339L7053j7969m088P0981M0896o2444n3909
299d0926L4001J5191p2964l1814R4106Q4626m0884o2400K2171K1371n8649m1697
$$ plain form
215 18350 26707 95855 80821 -14060 -39827 3487 -6885 -42606 20176 114961 78751 -35074
227 -35074 -45369 18088 -8748 -90512 -56706 61717 84875 12815 -8566 17326 -21053 -81343
239 -81343 -41987 42376 38060 -3271 38436 88528 12245 -99535 -76114 23538 30878 -19884
251 -19884 11677 79427 45784 -44494 -54655 -13781 -25772 -38055 35500 104128 52117 -28537
263 -28537 -6638 38431 -17248 -78640 -10868 96256 84783 10434 6274 29380 -19074 -71533
275 -71533 -27965 37148 23241 2105 51495 70561 -23227 -101586 -46341 33304 8910 -30009
287 -30009 28237 87768 30273 -56785 -51446 -14393 -32362 -36450 34531 75427 12983 -40926
299 -40926 -6925 8266 -64698 -96512 -2406 82220 41336 -21064 1107 22478 -36171 -77868
311g7868N4151N6059j4483n252M6034p694r3654m2991O7994M6740m2349j3252
323b6565P7023L6501p8759p1405K4918L2533k2363N990O8209K3917n7146l0687
335a7834L1272j2478p1100K864J01224M8267o0868m0432L7543L722p1381k9128
347g8329O1422M6248j6949L275L6673k5795q2337j2679O6155J6971m4660J7664
359a2341Q4057N561r3371m8225M2087K0705l1346J3865O6400J0866n4258j6307
371a2307K2324l0840n7967L3983R5668J3560o4486j0037M7079j8827p9199p791
383f8840P2304L4193k2625Q561K9232l6988o8737N857N2500n939l2720M4415P2397
396H3610k7918r2313j7553M9763K555l5293K7236O6783n76n0443r096J2654l8194
$$ plain form
311 -77868 -23717 32342 17859 12607 58641 50947 -42707 -85698 -17704 29036 -13313 -26565
323 -26565 50458 86959 8200 -63205 -38287 -5754 -28117 -22127 46082 69999 12853 -17834
335 -17834 13438 960 -70140 -67276 33948 82215 21347 -19085 18458 22180 -49201 -78329
347 -78329 -16907 29341 12392 15667 52340 26545 -55792 -68471 -2316 14655 -30005 -12341
359 -12341 71716 77277 -16094 -64319 -22232 -1527 -32873 -19008 47392 58258 4000 -12307
371 -12307 10017 -20823 -78790 -44807 50861 64421 -65 -10102 36977 18150 -61049 -68840
383 -68840 3464 37657 15032 23593 52825 15837 -52900 -47043 5457 -482 -33202 11213 83610
396 83610 55692 -36621 -54174 -4411 -1856 -37149 -9913 56870 56294 5851 -3245 9409 -28785
409b8785l7109N0995P5585j3336n2913J5487L7787m5301p4730J7419P4933J6234
421C6266k6194J4551K3238m1906n5576J5307L7161j6581j3331N9767M9640n3774
433B8568p8368J0265M4927k0387l3881M4066O3199j4901n0443k956N757l9988
445d4142j9210N9058N2947k8204l2615L4030J9484o6085n8283M4411O9684m596
457B6479k6262K6198K0165m7931m6843K1067K6789j8072N518O2713K3857o6737
469F941n3981L0123K7801l8293j9649O1206N3205l1348m6546M366J439l8533o322
482d9591N7216L3279l0704j2735L5995o061p5301l2808O0265N0085k3205j7782
494a1347L5775J0506n5404l8787K3244J9350j3991J8626N5776J015o5627k7253
$$ plain form
409 -28785 -65894 -14899 60686 47350 -5563 9924 47711 2410 -72320 -54901 20032 36266
421 36266 10072 24623 47861 5955 -49621 -34314 2847 -13734 -27065 32702 82342 28568
433 28568 -49800 -39535 5392 -14995 -48876 -4810 58389 43488 -6955 -9911 -4154 -44142
445 -44142 -63352 -4294 48653 20449 -12166 21864 41348 -24737 -83020 -38609 31075 26479
457 26479 217 26415 46580 -1351 -48194 -27127 -338 -18410 -12892 49821 73678 6941
469 6941 -47040 -16917 10884 -27409 -47058 14148 67353 36005 -10541 -6175 -4736 -43269 -49591
482 -49591 7625 40904 10200 -2535 33460 27399 -47902 -80710 -20445 29640 6435 -11347
494 -11347 24428 34934 -20470 -59257 -36013 -16663 -30654 -12028 43748 44763 -20864 -48117
506d8117L7147O557m5142K995P4431L5677m5117l6614J4568k142l7833L455N4547
519A4412K0125k6346L288K9537k7248p1074m407O6544K7054l3044n1M5347k003
532D2134o2646k7531L0542J4898j2006K5293M5599j5135n7951r124L0436j5677
544a1168m3226K5181P3231J0330n5406k2251K1088j2199l9599J1147N1750J2284
556B1162k0540J1079J8479m0467n6006J8261N9878M931l0628J9890M5161k0846
568C0354o4183j3127L4956Q422r441K8838L6036k1900m4862L374J9274k7903k7604
581d7766M5563O4577j1015n2110k647K3197k2845l8428K1323M9498N733j6657
593A8423J2704N500m6451m0630L0004M4372j3133k1137L5736L5058m0842o1801
$$ plain form
506 -48117 -10970 -4413 -49555 -46560 27871 63548 18431 -18183 -3615 -5757 -43590 -40135 14412
519 14412 34537 8191 11479 41016 13768 -57306 -61713 4831 31885 -1159 -1210 44137 42134
532 42134 -20512 -48043 -17501 -2603 -14609 10684 56283 41148 -16803 -25927 4509 -11168
544 -11168 -54394 -29213 44018 54348 -1058 -23309 -2221 -14420 -54019 -42872 8878 21162
556 21162 622 11701 30180 -10287 -66293 -48032 11846 16777 -13851 6039 51200 30354
568 30354 -33829 -46956 -12000 -3578 -13019 15819 51855 29955 -14907 -11533 7741 -20162 -47766
581 -47766 -2203 62374 51359 -751 -3398 19799 -3046 -41474 -20151 29347 35080 18423
593 18423 31127 36627 -9824 -50454 -20450 23922 10789 -10348 25388 60446 19604 -42197
605d2197L426L6068j670j0695L2257K9399k6992l6632P449O598l2733j0417N6579
618A0440M6729k8576m0775J4406J7944l6874l2036L3890M8108j590j4685J4201
630C1182j615m5746k4743L4290K8080j9449m101M4846J7677n5152m7924K0628
642b2027L1093j2210n897L7804K4340k9800k9130P514k535k9867O059N6134K5427
655E6905l7926k5408K2458J571m8525k2055M3521L9053j2375j3593J4582q055
667A0153m3049j3285L3491J5498j6780J2960M5898j261n9110k8684L3061J9657
679H549k1689K056M4300J6614l6086k5139P570p768k5541J7255N1263Q438l6019
692C803p405K5296j3078n0510k772N4187K8337j9300o146J8614j2002m1287p016
$$ plain form
605 -42197 -38771 -2703 -4373 -15068 17189 46588 19596 -17036 -9587 -2989 -35722 -46139 10440
618 10440 57169 28593 -12182 2224 20168 -16706 -48742 -14852 33256 31666 16981 31182
630 31182 29567 -16179 -40922 -6632 21448 1999 -2102 42744 60421 5269 -42655 -22027
642 -22027 9066 -3144 -9041 28763 53103 23303 -5827 1687 -848 -30715 -24656 31478 56905
655 56905 18979 -6429 16029 17600 -30925 -52980 -9459 29594 17219 3626 18208 10153
667 10153 -32896 -46181 -12690 2808 -13972 -1012 44886 43625 -15485 -44169 -11108 8549
679 8549 -13140 -11084 33216 49830 13744 -11395 -3825 -11593 -37134 -19879 31384 39822 3803
692 3803 -3602 21694 8616 -41894 -44666 9521 37858 18558 12412 31026 19024 -22263 -29279
705b9279K9278O448j2867K1594L5001k1470n7938j1344L2699K088k6723J3547
717a8966M6981N067l9866j8929R652j0101j7609K4016M3227j644k8295N815J8323
730A7671k9063m4614J4492N3312J2206k4403K144J9792j9011l9659p70K7446M208
743f249l678K8631K5524l0505m5004O540K8998j0768k0900K9892M6233q796m1823
756a905j0182J1034j3791j4895K7174L3822q500k0743J1298N968l9485l3169K9934
769b3440M5759m045k3071J3502J8457k8804l9236O738K5612O18l70K8061J3174
782C2955l6029l3375J4731J7084k1557j0486M1736L7721k2812l8464J531J1399
794e566j7779j1019L0641K9357r846j2576J2411m813m0798j7397L8372L3443j4465
$$ plain form
705 -29279 -1 6447 -6420 15174 50175 28705 -29233 -40577 -7878 -5790 -32513 -18966
717 -18966 28015 33082 -6784 -25713 -16061 -26162 -43771 -19755 23472 21828 -6467 -652 17671
730 17671 -11392 -56006 -41514 11798 24004 -399 1745 21537 2526 -37133 -37903 -10457 -6249
743 -6249 -9927 18704 44228 13723 -31281 -24741 4257 -6511 -27411 2481 48714 39918 -1905
756 -1905 -12087 -1053 -14844 -29739 -2565 31257 22757 2014 13312 19280 -20205 -53374 -23440
769 -23440 22319 18274 -4797 8705 27162 -1642 -40878 -34140 -8528 -7910 -8280 19781 32955
782 32955 -3074 -36449 -21718 -4634 -26191 -36677 5059 42780 19968 -18496 -16965 -5566
794 -5566 -23345 -34364 -3723 25634 15788 3212 15623 10810 -29988 -47385 -9013 24430 9965
807I965j3637K4427J2121l6950l3170J5532K5531j408L827K6842M837l4365k1588
820a8036J5851M524k3918K702M6815K2397l4499l1168J0117N867k5007p480L3769
833A934K4328j2417q166J0138j2834l8121l017M0166J9126j9255j491L0040o83
846B9748m5329k4253K3648K0097p665N624K6006j935l3530j3726J4375m675k0032
859c1647J7397M7180P633l7805j6363J8365j896k8580J197L8969J8767j4527n808
872A2882O879j8897l2140O449L4102O019j7388J0745K7608j4875m6818j1372K9641
885g165J2930j0624J0145K6599n758l0755q520R623r430j3018K6544L8115p547
898C1139l5508m276J6773j4277k9749J1028M0136J1287j7665k487O104k0557k5558
$$ plain form
807 9965 -3672 20755 32876 -4074 -37244 -21712 3819 2411 6238 33080 37917 3552 -18036
820 -18036 -2185 2339 -21579 -18877 27938 50335 15836 -15332 -5215 652 -24355 -31835 1934
833 1934 26262 13845 5679 15817 2983 -35138 -38155 2011 21137 1882 391 30431 29748
846 29748 -15581 -39834 -16186 3911 -3754 1870 27876 25941 -7589 -21315 -6940 -11615 -31647
859 -31647 -14250 32930 40563 2758 -13605 4760 2864 -25716 -24519 14450 33217 18690 12882
872 12882 19761 864 -31276 -24827 9275 15294 -2094 8651 36259 21384 -25434 -36806 -7165
885 -7165 5765 -4859 5286 31885 26127 -4628 -13148 -3525 -12955 -25973 571 38686 31139
898 31139 -4369 -8645 8128 -6149 -35898 -24870 15266 26553 8888 6401 12505 -8052 -33610
911c3610J2995K8774q50r709K0393K0323k7289m2381K805K9800K017j2651J6867
924G484K5347j1912l0730n465P411j1261n237L1022K8754j5811k7258P388J1221
937A0953k4476k4405K3930L8870L26j8823K251M622k3132k1434J4493K2138l901
950A412k987K4027R044l5228l1885J4648K4585p937q761K4994K3421j8536k9047
963a2250q80N973j1529Q07L0643J8651j9792j7652J1139J288l0788j4217L3040
976e567L1724r115j6724Q900K993k5761j6617J8087J7999m210M376K2303j478
989B6910l7154j9928K0681J4260j5055j465L1753J5636k6673k5900M757M435j1872
1002a9615N357K9952J1493j9486q732J2195q682l1352j534L7719K1112j7157r732
$$ plain form
911 -33610 -20615 8159 7309 -2400 17993 38316 11027 -31354 -28549 1251 3268 -9383 7484
924 7484 32831 20919 -9811 -15276 -7865 -19126 -24363 6659 35413 19602 -7656 -268 10953
937 10953 -13523 -37928 -13998 24872 25198 6375 8626 13248 -9884 -31318 -16825 5313 1412
950 1412 -1575 22452 31496 -3732 -35617 -20969 3616 -4321 -13082 11912 35333 16797 -12250
963 -12250 -13130 -7157 -18686 -17879 12764 31415 11623 -6029 5110 6398 -24390 -38607 -5567
976 -5567 26157 17042 318 9218 12211 -13550 -30167 -12080 5919 1709 6085 28388 26910
989 26910 -10244 -30172 -9491 4769 -10286 -11751 20002 35638 8965 -16935 -12178 -7743 -19615
1002 -19615 -14258 15694 27187 7701 -1031 11164 2482 -28870 -30404 7315 28427 11270 1538
1015A538J3937k454k9685j2914K0565J4469m238Q047J8667j0589l4100q297K1239
1028c815L852j5915R410L4824N126l1441j8962R711J524j2652Q246K7682N756
1041B3346j7301l325O679j6344k6686J0575L6401Q446j8711k49J6870j0055l1696
1054b2050n638K3960J1411m358J0395J4454j5063k8960q25J7076n111j2460J9557
1067B388L1381o685l3029r501J2908l978j3809J2753K7216K146j5633l70K395
1080H182k0571j8914J8033L0781j797j6367Q418J4676j9715l1550K805K4906O127
1093E014n149J1777J1051j7404k4099M079J1096r532m796K7331K4321j6583k9567
1106a2461P94J2140j0947j2677J7942K6279k394j4661P42j003k1337j1351K2043
$$ plain form
1015 1538 15475 13021 -16664 -29578 -9013 5456 1218 9265 27932 17343 -16757 -25054 -3815
1028 -3815 37 -15878 -6468 28356 33482 2041 -16921 -7210 -5686 -18338 -10092 17590 23346
1041 23346 6045 2720 9399 -6945 -33631 -23056 13345 21791 3080 2831 19701 9646 -22050
1054 -22050 -27688 -3728 7683 3325 13720 28174 13111 -15849 -16674 402 -4709 -17169 2388
1067 2388 33769 27084 -5945 -15446 -2538 -6516 -20325 -7572 19644 21790 6157 5787 8182
1080 8182 -12389 -31303 -13270 17511 15714 -653 7765 22441 2726 -28824 -26019 -1113 5014
1093 5014 -135 11642 22693 5289 -18810 -14731 -3635 -13167 -17963 9368 33689 17106 -12461
1106 -12461 -11667 473 -10474 -23151 -5209 21070 18676 4015 4757 3754 -17583 -28934 -6891
1119f891K2834q021q863J4811Q236k7444k6067J2482K3026J63m234J4406P987
1132B2425j9661j9448N416N782r768K621K8534J4289k2818k2238Q044O986j7225
1145a7061q781K4682K3011p874j3771K908m207k0338n576K3081J4722r307j971
1158d82J8196j579l1769j7165J9421J8916o390j437J8079N258k2007j6108O837
1171a0230K793q318R551K7446M973k4991j2239J1714r55k1231m43K9543J6869
1184B4482j3024j0917M576n925j9951j07K1351R006p598M964J5363j0759l1710
1197b0249o847K2416J0484j0466L592K0726O1k5113j2520P253Q74n953J3163K3249
1211B0670k434k1881m078J0450r095j9704R172L1051R126j6514o197P113q671
$$ plain form
1119 -6891 15943 7922 -941 13870 22106 -5338 -31405 -18923 4103 4266 32 14438 22425
1132 22425 2764 -16684 -11268 -5486 -15254 -12633 15901 30190 7372 -14866 -6822 164 -17061
1145 -17061 -25842 -1160 21851 13977 206 3114 -1093 -21431 -27007 -3926 10796 1489 -482
1158 -482 17714 16135 -15634 -32799 -13378 5538 -852 -2289 15790 21048 -959 -17067 -10230
1171 -10230 -7437 -15755 -6204 21242 26215 1224 -11015 699 -256 -21487 -21930 7613 24482
1184 24482 11458 541 5117 -808 -20759 -20866 485 9491 1893 6857 22220 11461 -20249
1197 -20249 -27096 -4680 5804 -4662 -1070 19656 19717 -5396 -17916 -10663 -9789 -15742 -2579 20670
1211 20670 18236 -3645 -7723 2727 -6368 -26072 -16900 14151 23277 6763 566 7679 -992
1224i92j9102K983K1021N399n209Q497J0194j7198k7438K658K1376K056j0186
1237e941J0895K1062o889k6014p813R518j299m243J5672J9468p435j7887Q71N975
1251E940j5829j5291J7510K8845p14j8030j4P360j3611j8791O804J9699K977l016
1265C839J0062M898k0951k0810R185J6632m230o612J8480J7403j4529k4687j722
1278a3042R944l587k637J6692J5822r700j3831L085J31j7848p729K3136K2103
1291B2539p793j3870O091M919j8005j6267J1431J8932N43j398J0338N3k1897j4193
1305a8577J1648J0048q200j18K1811J1020k1546k0879M292P938p537j314J9125
1318G711J2110j0816j1142L785m278j7952l3K5401J4383j2183p774J0695K3k2496
$$ plain form
1224 -992 -20094 -17111 3910 9309 4100 12597 22791 5593 -21845 -19187 2189 4245 -5941
1237 -5941 4954 26016 19127 -6887 -14700 -5182 -6481 -10724 4948 24416 16981 -906 -35 5940
1251 5940 -9889 -25180 -7670 21175 20461 2431 2417 9777 -3834 -22625 -15821 3878 6855 3839
1265 3839 13901 18799 -2152 -22962 -13777 2855 -1375 -7987 10493 27896 13367 -11320 -13042
1278 -13042 -3098 -6685 -9322 7370 23192 13492 -339 2746 2877 -14971 -22700 436 22539
1291 22539 14746 876 6967 11886 -6119 -22386 -10955 7977 8520 7122 17460 17513 -4384 -18577
1305 -18577 -6929 3119 -5081 -5199 16612 27632 6086 -14793 -10501 -2563 -10100 -11414 7711
1318 7711 19821 9005 -2137 1648 -2630 -20582 -20615 4786 19169 6986 -788 9907 9930 -12566
1332a2566j1854J7068J6080k574k94R989l465k1374q550J2016M652q360O910K3416
1346B1094K459k4699j3936R138M662j0609K042K1330R366j2365q622K404p253
1359d989j5178N819K3376O585j2793j412J1474p551k4395n257K0290J1721n606
1372B084K154R682n860k0038m589J0586O65n536J2682K0207n498k4386o536J1671
1386b712j931j1650P736K2337M602j4532n656K311r426j1646R941K0570J040j0043
1400I41M382R303j4100k3047L279K1444O005p232N233J0177r207j9232j517R016
1414d555j387k100J5896J4956j1447k0799M89Q776p545j0349J3645K2166j391
1427A6355j5271l208K126j0819q737J2122J6673k083o354Q017L763j9075j7768
$$ plain form
1332 -12566 -24420 -7352 8728 6154 5860 15849 12384 -8990 -17540 -5524 -872 -9232 -2322 21094
1346 21094 23553 -1146 -15082 -5944 -1282 -11891 -9849 11481 20847 8482 -140 2264 -4989
1359 -4989 -20167 -14348 9028 15613 2820 1408 12882 5331 -19064 -24321 -4031 7690 2084
1372 2084 4238 13920 8060 -11978 -16567 -5981 -5316 -10852 1830 22037 16539 -7847 -14383 -2712
1386 -2712 -4643 -16293 -8557 13780 18382 3850 -1806 505 -8921 -20567 -10626 9944 10984 941
1400 941 5323 14626 526 -22521 -19242 2202 8207 975 6208 16385 7178 -12054 -13571 -4555
1414 -4555 -5942 -8042 7854 22810 11363 -9436 -8947 -171 -7716 -18065 -4420 17746 16355
1427 16355 1084 -2124 2 -10817 -19554 -7432 9241 7158 804 8821 12584 -6491 -24259
1440b4259J0325J8880j70n925R017R563j3239j7863J095Q035j918J129J6693R244
1454B0607j4309j5448M457M808j1907n318J8983J8765p213j3777N80J389j2193
1467a0576o648J4481J3183l291k540Q402k110k1018j1359J4366J4092n126l271
1480a415J3357N828j7172j5699M374P178k731L439J6086M722j5416j0206O184
1493a471k73j3274M72K2209J3003j2001j0905M319r15j3932l820J4891J0944l887
1507E360LP021o316k0639m185J5925Q097p266K099J5477R21k0009j2158P740N549
1522b381l867N512J5246R87j4581o315N283n026j1948O826K2590N816j4176n811
1536a845O410m388j5097o07J7001Q208m608J906N436r937j7834J345J4035K681
$$ plain form
1440 -24259 -13934 4946 4776 -1149 7868 17431 4192 -13671 -12576 -4541 -6459 -5330 11363 20607
1454 20607 6298 -9150 -4693 115 -11792 -17110 1873 20638 13425 -352 228 1617 -10576
1467 -10576 -17224 -2743 10440 7149 4609 13011 10901 -10117 -21476 -7110 6982 1856 -1415
1480 -1415 11942 17770 598 -15101 -10727 -3549 -6280 -2841 13245 17967 2551 -7655 -1471
1493 -1471 -1744 -15018 -14546 7663 20666 8665 -2240 2079 1164 -12768 -16588 -1697 9247 5360
1507 5360 5363 12384 6068 -14571 -18756 -2831 5266 -2000 99 15576 16497 -3512 -15670 -7930 -2381
1522 -2381 -6248 -736 14510 15497 916 -5399 -116 -5142 -17090 -10264 12326 18142 3966 -1845
1536 -1845 4565 177 -14920 -15527 1474 9682 5074 6980 12416 2479 -15355 -14010 25 2706
1550B706o910P853J4772n480k1667o555J0244K032m724Q003J4210j917j3663l104
1564d200L347q446q389J2016J9746p18j3474l59O652r340j5283M268J7546N085
1578H451m634L091L696j2008j4469M273J1605p66l787J2170J1916j1858j9282
1591a1602k83R512j187m294J0457J3620m664j2662j646R81q715m300J4502J5610
1605A5329n550r969L580L976j3431j2704R477J6332J174m639M422K335j3559j1084
1619a4311N677Q574k837K19J4176O297j5433j5695M459Q074n481l028J3869J1906
1633A6466p571j1761K4m89r084o02J6222J0135p056n639N728k20j6530q125J3829
1648d673J4110k713l256O483Q1j4077q782P270N949k650M031J4107P02j7107j0061
$$ plain form
1550 2706 -4204 3649 18421 12941 -8726 -15281 -5037 -3005 -7729 274 14484 12567 -1096 -4200
1564 -4200 -853 -9299 -17688 -5672 14074 13356 -118 -477 6175 -3165 -18448 -14180 3366 8451
1578 8451 3817 6908 10604 -1404 -15873 -11600 5 -761 -4548 7622 19538 7680 -11602
1591 -11602 -11885 -2373 -3560 -7854 2603 16223 11559 -1103 -2749 -1768 -10483 -14783 -281 15329
1605 15329 9779 -190 3390 7366 -6065 -18769 -9292 7040 8214 3575 7997 10332 -3227 -14311
1619 -14311 -8634 -60 -2897 -2678 11498 17795 2362 -13333 -8874 -800 -6281 -9309 4560 16466
1633 16466 8895 -2866 -2842 -3331 -12415 -13017 3205 13340 6284 645 6373 6153 -10377 -18502 -4673
1648 -4673 9437 6724 3468 9951 10032 -4045 -12827 -5557 392 -2258 1773 15880 16582 -525 -10586
1663a0586P389M063q121Q12J6362Q466j0880r924J616j412r152K220J5003O209
1677A2065p309k381O109n232j7241k212J5652R459n817o80Q131k331j5185o736
1691a3708Q392M251k345O514J2166l556j5807n405P387K2q224N815J7328L500
1705A6330j2716o646L157l199q364M904J4284L670o835J028M333r724j5042K958
1719a1862J6006M238o462K918Q433o060j5891l195Q622K757j682P850R488o637
1733H523j4096j376N719m362o412J0231J5986j999j3155l149L373n132q025O738
1747g136J3181J079m747K163J557j1938j1040P026J3922l84m913O697P147r702
1761B912j4928N51Q813J322q33R107O927q350j0924O91L849p114k523J3577J2749
$$ plain form
1663 -10586 -3197 866 -7255 -6443 9919 18385 7505 -2419 -803 -2215 -11367 -9147 5856 12065
1677 12065 4756 2375 8484 3252 -13989 -16201 -549 8910 3093 2413 10544 8213 -6972 -13708
1691 -13708 -5316 -1065 -3410 3104 15270 11714 -4093 -9498 -2111 -2089 -10313 -4498 12830 16330
1705 16330 3614 -3032 125 -3074 -11438 -6534 7750 11420 4585 5613 9946 222 -14820 -11862
1719 -11862 4144 8382 1920 4838 13271 7211 -8680 -11875 -3253 -496 -2178 5672 15160 8523
1733 8523 -5573 -6949 -1230 -5592 -12004 -1773 14213 12214 -941 -4090 -717 -5849 -13874 -7136
1747 -7136 6045 7124 2377 4540 6097 -5841 -16881 -9855 4067 3683 -1230 5467 12614 2912
1761 2912 -12016 -11465 -2652 -1330 -2163 6944 13871 5521 -5403 -4712 -863 -7977 -10500 3077 15826
1776A5826o089j1616N89K470q000o560R297J2152o49m480L069j400j2883p460
1790a5734R601R713k908k273R436L954j3665j2950M169P944j301J21R937M958
1804A1002r643q575J993N92p013J121J5478Q400q824q652L973M48j0534l585J1771
1819b048J0680k790l029L286l224j2115m032J0244O852l759J383J0367m36j5275
1833c896q780P076O032l218J958J0351K991j0564p223K554j554o068M304J4502
1847H465L762j0069m777M575k785j1874l67J3814P639m296k074L243m452j1651
1861a0847j163R587L938l473M734R360m805j5481m096Q457K729l768M234J1554
1875A0960P3j1207m817K425k492m511P303J2794L10r029r87M097o501j0731M258
$$ plain form
1776 15826 9737 -1879 -1290 1180 -6820 -13380 -4083 8069 7420 2940 6009 4609 -8274 -15734
1790 -15734 -6133 3580 672 -1601 7835 11789 -1876 -14826 -10657 -2713 -4014 -3893 6044 11002
1804 11002 1359 -7216 -5223 -4631 -11644 -10523 4955 13355 4531 -4121 -148 300 -10234 -13819 -2048
1819 -2048 8632 5842 2813 6099 2875 -9240 -13272 -3028 3824 65 1448 11815 11379 -3896
1833 -3896 -12676 -5600 432 -2786 -828 9523 12514 1950 -5273 -2719 -4273 -10341 -6037 8465
1847 8465 12227 2158 -2619 1956 -829 -12703 -13070 744 8383 4087 2013 5256 804 -10847
1861 -10847 -12010 -2423 1515 -1958 2776 12136 7331 -8150 -12246 -3789 -1060 -4828 -594 10960
1875 10960 11033 -174 -4991 -2566 -5058 -9569 -2266 10528 10838 1809 822 4919 -1582 -12313 -8055
1890h055J3960M031n189n1L073o408j0796R03R156J824j872O350O404q296j3696
1905h662L0P687n64l889P380J0376l036j1240l090K612l824k834Q661J0489k611
1920G485p207J408K204r304q318P701J2803N65n310K136L028q225r651L514P912
1935G41N11l14P669L479r723j0857L303N585l017j996J0019R100o304j0529o61
1950b994K210m943j413R486Q368l898n266K199o16j1028m420R798J0129k358m305
1965I49M680J068j0256p505M280P528p03J050P795J137j1462p286M099L642m694
1980e678Q62J1806N802q595r011J466J024n220OJ0400O673m790l303K203l293
1995C52j0236j031J1301O796m097j414N688j254j1506n328O355N774j231J997
$$ plain form
1890 -8055 5905 9936 4747 4696 7769 1361 -9435 -8532 624 2448 576 6926 13330 5034 -8662
1905 -8662 -8632 -945 -1509 -5398 1982 12358 9322 -1918 -5008 -2396 -6220 -9054 -393 10096 7485
1920 7485 278 1686 3890 -5414 -13732 -6031 6772 7337 2027 4163 7191 -1034 -10685 -7171 741
1935 741 1252 938 8607 12086 2363 -8494 -5191 394 -2623 -4619 5400 14500 8196 -2333 -2994
1950 -2994 -784 -5727 -7140 2346 10714 6816 1550 3749 3133 -7895 -12315 -2517 7612 5254 949
1965 949 5629 6697 -3559 -11064 -6784 744 41 1091 8886 10023 -1439 -8725 -4626 -984 -5678
1980 -5678 -4816 6990 12792 4197 -4814 -3348 -2324 -7544 -7538 2862 9535 4745 1442 3645 352
1995 352 -9884 -10915 386 7182 3085 1671 7359 6105 -5401 -10729 -4374 1400 169 2166
2009B166P417j745j0413m940M563M28m573M570J1553K094r920n704K853o91o283
2024h625K115J1013L838m638k170J815n453q675J836J0787L243m543J906N880
2038H329m696j1919k670P934L964j920L679O602l763r305k734L988j454k970O858
2053g7J0839j402r896l014L511l081o034M308J0806K195n260p52J209o502p550
2068a0700M346R436J193l703L756M452o842j1277N71Q147J660j958N341N219m553
2083E088r133q78K649k133j025Q000Q519m492q572J64K605n515m925O625R984
2098F961j46m930K73N11p389n315N803P459p20j364N255K072r495q724L331O859
2114D41n68j128O249M888o695q289R66J627k957O16R465N523o219n853J695Q39
$$ plain form
2009 2166 9583 7838 -2575 -7515 -2952 -2524 -7097 -2527 9026 11120 1200 -4504 -1651 -2342 -8625
2024 -8625 -6510 4503 8341 3703 1533 3348 -2105 -10780 -8944 1843 5086 543 2449 8329
2038 8329 3633 -8286 -10956 -3022 942 -978 2701 9303 5540 -3765 -6499 -2511 -3965 -6935 -77
2053 -77 10762 9360 -536 -3550 -39 -3120 -9154 -4846 5960 8155 2895 2143 3352 -3150 -10700
2068 -10700 -6354 3082 4275 572 4328 8780 1938 -9339 -8768 -621 1039 -919 4422 9641 5088
2083 5088 -4045 -4923 -2274 -4407 -5432 2568 11087 6595 -1977 -1813 792 -4723 -9648 -3023 6961
2098 6961 6815 1885 2158 2669 -4720 -10035 -4232 3227 2507 1143 6398 8470 -1025 -9749 -6418 441
2114 441 -127 -1255 4994 9882 3187 -5102 -4136 -2509 -5466 -4850 4615 10138 3919 -1934 -239 600
2130F00o976k884R526Q321k778l906J330p39p698l735O289O106j569L70N282m82
2146G057j0153o239N191M832k004M91P319K991p786p051J578J002l200K613Q882
2161E523L352o845l995K613j759p513l04J0490N707l736l036K364j814q417j738
2176i108O799M694j442J522N165l260j0116l162N900K734k895K770Q173K84q650
2191e92n343K913j88k463L496Q560J223n875k499K009l576o799K897J0247L312
2206G322n100o09K483l696q056o13P462K857j462K734L901n227q985o89N594M19
2222a665k362M636P780k559q977k699K951j246k468M877P555j88n241p65O62n210
2238d919n292N479R552J75m270J124K545n517p973K290P417J783j193L694K640
$$ plain form
2130 600 -6376 -9260 266 8587 5809 1903 3233 2494 -5204 -8939 -2650 3456 1887 2257 7539 7057
2146 7057 -3096 -9335 -4144 688 -1316 -825 6494 9485 1699 -5352 -3774 -2772 -5972 -3359 5523
2161 5523 8875 2030 -1965 648 -1111 -8624 -8928 1562 7269 3533 497 2861 1047 -7370 -9108
2176 -9108 -2309 2385 943 2465 7630 4370 -5746 -8908 -3008 -274 -3169 -399 7774 8058 -592
2191 -592 -5935 -3022 -3210 -5673 -2177 6383 7606 1731 -768 1241 -2335 -9134 -6237 4010 7322
2206 7322 2222 1613 4096 400 -7656 -8269 -807 2050 588 3322 7223 1996 -6989 -7678 -2084 -1665
2222 -1665 -4027 609 8389 5830 -3147 -5846 -2895 -4141 -6609 -1732 5823 5635 394 -371 291 -4919
2238 -4919 -10211 -4732 4820 4995 725 1849 4394 -1123 -9096 -6806 611 2394 1201 4895 7535
2253G535n965p592J474M397j238j242O550O446m969q594n67K733k694j582N884
2268E76P085j858m981N1l87o052k998O532P536j643l157K549J257p324o548L236
2284f126P071M14n81M018J185o790o151K581K937j967J158P396M458o850o291
2299c538R55J987l574q91P777N851l126m104M11j377n786r63P163N371k431j504
2315B221L804j162q262m220N448N476j132N20M328o8p368m911K916J751k015K346
2331c28P304J603p186m762J907J19m470J246P940M189m036l213R66k625n736P80
2347f302P755L562l027K35L463l065q607j763O254L632j252J160N068j681p597
2362b165k667K688O23j312M386O667o55p257k373K315j511m670L514Q082K362
$$ plain form
2253 7535 1570 -6022 -4548 -151 -1389 -2631 3919 10365 5396 -3198 -3765 -1032 -3726 -5308 576
2268 576 7661 5803 822 873 486 -5566 -8564 -2032 5504 3861 704 3253 4510 -2814 -9362 -6126
2284 -6126 945 1359 778 4796 5981 -809 -6960 -4379 -1442 -3409 -2251 5145 9603 2753 -3538
2299 -3538 -2583 -596 -4170 -5061 2716 8567 5441 1337 1748 371 -5415 -6378 785 6156 3725 2221
2315 2221 6025 4863 -3399 -7619 -2171 3305 2173 2693 7021 6953 -415 -5326 -2410 -659 -2674 -328
2331 -328 6976 8579 1393 -3369 -1462 -1343 -5813 -4567 3373 7562 3526 313 1279 -1346 -7082 -6302
2347 -6302 1453 5015 1988 2223 5686 2621 -5986 -7749 -1495 2137 885 2045 7113 5432 -2165
2362 -2165 -4832 -2144 -1521 -2833 1553 8220 7565 308 -2065 250 -1261 -5931 -2417 5665 8027
2377H027m937k233J121l493n071J941O968J712k018J098K413m957p411J64O221
2392d55J872k000K780M394k938p339k061K771j97n51M949N323k215o371q59J838
2408a059l247l361N172P887M26m604r71Q47m000m472L352O390R18j841K226J382
2424E045o085o186K217N469k17j054M343L321l877o928m41K651o96l09N613M156
2440G022l037n735N59O32m395j805O032O506j798m179O05K6n221l519M510N349
2456A552k92o27K631J00o750m247L464L798q00n8N526K331n899o099J338K193
2472a839j917J249N624L195m024l927J028p29m662K81P398M677l224k431J506
2487B205o32n810k364N312M504o27j31K739j833o916k699L835K367j564J381N909
$$ plain form
2377 8027 3090 857 1978 -1515 -6586 -4645 2323 4035 2017 3115 5528 571 -6840 -6676 -455
2392 -455 1417 -583 2197 6591 3653 -3686 -5747 -2976 -3173 -3724 1225 6548 4333 -2038 -2897 -1059
2408 -1059 -4306 -7667 -2495 5392 5818 1214 243 1090 -2910 -7382 -4030 2360 3278 1437 3663 5045
2424 5045 -1040 -7226 -5009 460 243 -811 3532 6853 2976 -3952 -4393 -1742 -2438 -2747 2866 7022
2440 7022 3985 -1750 -1191 -559 -4954 -6759 -727 5779 3981 -198 407 433 -4788 -8307 -3797 1552
2456 1552 1260 633 3264 3364 -3386 -7633 -4169 -371 -1171 -1229 4297 6628 729 -5370 -4032 -1839
2472 -1839 -3756 -2507 3117 6312 2288 -1639 -611 -1340 -6002 -5721 1677 6354 3130 699 2205
2487 2205 1573 -4237 -6601 -1289 3215 2588 2457 5196 3363 -3553 -6252 -2417 -50 -1614 -233 5676
2503E676R8o968m283K292J026j705J573O172K083m445l045J083j710m240J896
2518d497P178K805l850j192K239k536o132o65N897L371j452Q74K894k815o399
2533d280j426M288J251j027K948N155j062p068k595K661j15k020K804O255L75
2548F144m438j840N26k819l368L167O671R37l484j6J757l431o272J115O108J977
2564B734j734J518K445l597o053m2L367K98l19L819M402l217o481o91K540j345
2580b356j629L917N751q54m635r00K59k957k700M282N708l91k411J082Q18m860
2596a876m895K944N500P12r26K141J634m239n425Q48L100k80K80M530K571m400
2612B219n343N28J796k319r29N613M540k121m137l41J84l889j301M672M915j257
$$ plain form
2503 5676 5774 -1194 -5477 -3185 -2159 -3864 -2291 3881 5964 1519 -1526 -443 -2153 -6393 -4497
2518 -4497 2681 5486 1636 444 2683 147 -5985 -6650 -753 2618 1166 2040 4934 2119 -4280
2533 -4280 -5706 -1418 -167 -1194 1754 6909 5847 -1221 -3816 -1155 -1270 -3290 -486 5769 6144
2548 6144 1706 -134 392 -2427 -5795 -2628 4043 4980 1496 1480 3237 -194 -6466 -5351 757 2734
2564 2734 1000 2518 4963 1366 -4687 -4729 -1362 -1064 -1383 2436 6838 3621 -2860 -3551 -1011 -2356
2580 -2356 -3985 -68 5683 4829 194 -706 -447 -3404 -6104 -1822 3886 3495 1084 2166 2984 -1876
2596 -1876 -6771 -3827 1673 2385 1459 3600 5234 995 -4430 -3582 -482 -762 -482 4048 6619 2219
2612 2219 -3124 -2596 -800 -3119 -4048 1565 6105 3984 -153 -494 -310 -4199 -5500 -828 4087 2830
2628B830j498J816k26n951l306L585M856r76j78K577R80n435m283J191K577o00
2644b041J026N151J443m944m080J397J193l045M73O202L308l358l143P02p34l896
2660d346m41N248L390j740n43J885k088o041j676M578L431j087M36L561n15o109
2676b057l009K217K206r38K289M773j92n089k482J220m53k758J796O420J768l974
2692A737k392J010j503l965P63N292K630j434j19J360l238n036m46M794J930j217
2708A66J589L663k220o117j939K947R95p68K655M235r98m720j550J237j673k321
2724d819L446N968N73m008j315J374k985l467K494N004J206j582N60J152l921
2739c20m926J320M541P57j334L016K513l194n874n24K811O8o96L618L747j943
$$ plain form
2628 2830 1332 3148 2922 -3029 -6335 -2750 2106 1130 952 3529 4509 -926 -5209 -4018 -1441 -2041
2644 -2041 -1015 4136 5579 635 -3445 -2048 -855 -3900 -3427 2775 6083 2725 -418 284 -450 -4346
2660 -4346 -4787 461 3851 2111 1568 3453 1365 -4676 -6352 -1774 1657 570 1006 4567 4052 -2057
2676 -2057 -5066 -2849 -643 -1581 708 5481 5289 200 -2282 -1062 -1515 -4273 -2477 3943 5711 1737
2692 1737 -655 355 -1148 -5113 -4350 942 3572 2138 2019 3379 141 -4895 -5341 -547 1383 166
2708 166 1755 5418 3198 -2919 -4858 -1911 -916 -1684 971 5206 4208 -512 -2062 -825 -2498 -4819
2724 -4819 -1373 4595 5168 1160 -155 1219 -1766 -5233 -2739 2265 3471 1889 2449 3601 -320
2739 -320 -5246 -3926 615 1372 38 3054 5567 2373 -3501 -4025 -1214 -1146 -1842 1776 5523 3580
2755C580m944l26R32k813j074M750N066j239l733K42L41l306l098L518M712L17
2771B925j482R51J56m326l335J652L993m07L0L478J903m942m619Q68K615q50j71
2788a561M517K391k467m415J75L24k480J0M830L554j760k739P89k27m250j962
2804e271L997M365o27j138J569l42m966k800L048K484p87Q08M095j97n013l598
2820d373J588J676j768J136M806J637l380l274N23m08k772J147N322K390k483
2835A767j512R81j277m491p69M895K940j193nJ616j394m723j630K751J945k84
2851c83J721L503r54n446k102J787J103j845J749N213N93m013k624J086j315k484
2867d411K010M755J554k646q12R06k413m368J026M668J977j488P59J694k618m684
$$ plain form
2755 3580 -1364 -1690 -758 -3571 -4645 105 5171 3932 199 441 782 -2524 -5622 -2104 2608 2925
2771 2925 1443 2394 2550 -1776 -5111 -3459 534 127 157 3635 5538 596 -4023 -3155 -540 -1390 -1561
2788 -1561 2956 5347 2880 -1535 -1360 -1036 -3516 -3506 1324 4878 3118 379 1168 941 -3309 -5271
2804 -5271 -1274 3091 2464 1326 2895 2553 -2413 -5213 -2165 319 -468 340 4435 4238 -775 -4373
2820 -4373 -2785 -1109 -2877 -1741 3065 4702 1322 -1952 -1429 -1837 -4609 -3462 1860 4250 1767
2835 1767 255 1236 -41 -4532 -5301 -406 2534 1341 1336 2952 1558 -3165 -4795 -2044 -99 -383
2851 -383 1338 4841 3887 -1559 -3661 -1874 -771 -2616 -867 4346 4939 926 -1698 -612 -1927 -4411
2867 -4411 -2401 2354 3908 1262 450 1356 -1057 -5425 -4399 269 2246 758 1517 3211 593 -4091
2883d091q30L499J054o02K686L001k612m812j015K276l84j529L012M583k23m487
2899d74q03M75j681j791K728M871J13k369P18m3l364l194J752M764N82j159J378
2916B503J029l085m711P47K713J134l33K473K516l159m358P4J453j111m93L928
2932A320L218j210l958n00M77k603p98L208M230q04j778Q53n64l775k572L101
2948b155M094m53k14J584K75l647l701J402K877k76L39L332J391l412l891P29
2964a726Q80j462M69M203K909k569k999K33k71k584o48M398L333j156j610R22
2980B322j161m024j516L266K961q65N00K246m79m763l000K244K021l26J103L176
2996C705L18l598l054J279L1j859J795M733J158l253j866M53o81k677J64M683
$$ plain form
2883 -4091 -4921 -1422 -368 -970 1716 4717 2105 -2707 -3722 -1446 -1830 -3359 -347 4236 4013 -474
2899 -474 -1277 -802 -2483 -4274 -1546 3325 3438 1069 1787 1744 -1620 -4814 -3062 1702 2284 1125 2503
2916 2503 3532 447 -4264 -3517 -804 330 -3 2470 4986 1827 -2531 -2457 -1004 -2115 -2608 1320
2932 1320 4538 3328 -630 -1130 -653 -3256 -4054 -846 3384 2580 802 1655 1091 -2684 -5256 -2155
2948 -2155 1939 1486 1272 2856 3131 -516 -4217 -2815 62 -214 125 3457 4848 1436 -2455 -1726
2964 -1726 -846 -2308 -1839 2364 5273 2704 -295 -62 -333 -2917 -3565 833 4166 3010 1400 2322
2980 2322 1161 -2863 -4379 -1113 1848 983 1483 3729 3250 -1513 -4513 -2269 -248 -574 529 3705
2996 3705 4023 425 -2629 -1350 -1319 -3178 -1383 3350 4508 1255 -611 -158 -839 -3516 -3352 1331
3012A331K480j400j002O88j669l954l46L762J958r31N89K798j752m566j897K563
3028a348J257l29J437L038j71l953k277J245n48j116K021M678J90l311j143P89
3044D59j966k678J163M665J505j657j57P29k778l531L75L668J205j003J929J825
3060C753k533m853J8K576M30n04K139L231j574l642j147R44j163n30K607M094
3076C846m06k985n24L72k477k110K258M235P83j558L37J0k712k991J132L348O37
3093A195n49K157J080l652m000N39K505l89k10L295J961k335l274n40L05p25o17
3110c254L911K803j168k412J07j78k825j340L436L888j039r07N36j91l345k463
3126d441J950K777K13L8K390J25l545l227J272J594k91L62L480J652k864k974
$$ plain form
3012 1331 3811 2411 1409 2097 428 -3526 -3872 -110 1848 917 1506 4304 2552 -2014 -3911 -1348
3028 -1348 -91 -420 1017 4055 3884 -69 -2346 -1101 -1649 -2765 -744 3934 4124 813 -330 459
3044 459 -1507 -4185 -3022 1643 3148 1491 1334 2063 -715 -4246 -3871 -203 1002 -1 1928 3753
3060 3753 1220 -3633 -3615 -1039 -609 -1113 1026 4257 2683 -959 -2106 -1162 -2325 -2855 -248 3846
3076 3846 3440 455 -69 303 -2174 -4284 -2026 2209 2992 1434 1771 1781 -931 -3922 -2790 558 1195
3093 1195 646 2803 3883 231 -3769 -3230 -725 -1114 -1324 1971 3932 1597 -1677 -2217 -1912 -2637 -3254
3110 -3254 657 3460 2292 -120 -13 -191 -3016 -4356 -920 2968 1929 1022 1558 1367 -1978 -4441
3126 -4441 -2491 286 499 537 2927 3052 -493 -3720 -2448 -854 -1145 -783 2697 4349 1485 -1489
3142a489K82q6j327N16L756K095j834j645M22q69l036m97L634K660q94p03R38
3159A923q31l729j604K189K275J85N34K624o92m183k004J550P03o44J579L681
3175C556N85l302k527M11j4j485P70M298J294k015j007K29j934k809P02L944J679
3192B375q97k38J412j653l952m26K524J596k97J393K116j609l784j020J425J68
3208h67q52K180L498n12l356j701M70q38j353K083L606R14k050p83o6j936k615
3225d178J538L818J044j049L19J279k879l130J42K731P91k13J875J487k012l736
3241b173l92J307j70k96L196K459j207l322m24M77j566j101K942L666m85j975
3257I36j53j14k499j837J801L373Q4n40R69M15l419k724J027K237O29j5K228Q82
$$ plain form
3142 -1489 -1207 -1293 -2620 -2104 1652 3747 1913 268 690 -179 -3215 -3712 -78 2582 1688 985 1923
3159 1923 1092 -2637 -4241 -2052 223 408 942 3566 2874 -1309 -3313 -1763 -1060 -1704 -125 3556
3175 3556 4141 839 -1688 -1277 -1291 -2776 -2006 2292 3586 1571 564 793 -1141 -3950 -3248 696 2375
3192 2375 1478 1240 2652 999 -2953 -3379 -855 741 444 1837 3953 2344 -1440 -2460 -1035 -867
3208 -867 -1719 461 3959 3447 91 -1610 -1140 -1978 -3331 -1248 2358 3272 1222 439 373 -1563 -4178
3225 -4178 -2640 1178 2222 1173 1492 2771 -108 -3238 -3096 -365 426 213 2088 3575 1563 -2173
3241 -2173 -2565 -1258 -1428 -1724 1472 3931 2724 -598 -1022 -545 -2111 -3212 -270 3396 2911 936
3257 936 783 669 -1830 -3667 -1866 1507 1591 1051 2020 2435 -984 -3708 -2681 -444 185 170 2398 3280
3275C280k655k839J67P98k40L47L389J903j861l220M7L76j763p53L132L242j200
3292B150j503J73r20k509j326K619K599p5l11J579n46l497k242J791J969J64M40
3309E55K553L4l005k302N83L55o79Q99L323J488k927j736M21q02j941Q00L677
3326A296J755j315j319M66o77l518M2K798K177m28J33J211r84l898j179K135J351
3343D6o04J469K572l53l610j806O75N15r17J562L344K7k468j108K88r42j864J256
3361a918L474J736j647j064N25j481k980N06K804J512l54M16J263k160k970q28
3377c166J988R85n7J497K366j366l394r98R21l98l07K254K959l37k829l97L42
3394F3j597j519K069L213M24j473l6K64k371k150R20K817P97l95R18Q34k697k914
$$ plain form
3275 3280 625 -2214 -2047 -1249 -1489 -1142 2247 4150 2289 -931 -884 -508 -2271 -3024 108 3350 2150
3292 2150 647 820 -100 -2609 -3935 -1316 1283 1208 897 2476 1930 -1567 -3809 -2018 -49 115 555
3309 555 3108 3142 137 -2165 -1582 -1227 -1906 -1007 2316 3804 877 -859 -438 -1240 -3181 -2381 1296
3326 1296 3051 1736 417 883 206 -3312 -3270 -472 1705 1277 1410 2621 1637 -2261 -3440 -1305 46
3343 46 -558 911 3483 3130 -480 -2286 -1611 -1096 -2013 -451 2893 2920 452 -656 -368 -1310 -3174 -1918
3361 -1918 1556 3292 1645 581 1106 -375 -3355 -2849 -45 1467 1113 1529 2792 632 -2338 -3166
3377 -3166 -1178 -193 -250 1247 3613 2247 -1147 -2145 -1224 -1622 -1929 325 3284 2947 118 -279 63
3394 63 -1534 -3053 -984 2229 2653 1180 1144 1408 -963 -3113 -2193 624 1421 1026 1944 2778 81 -2833
3412b833L92J818J69L78J953J368j348l525o5O48o20j94K835K207j085k302j52
3429c56j24j579p42K348K808j76j622N99j36k527j977J647L081k28l98J839n3
3446B404k730k702R88J850k93M43K469J060k753k152j01P42j094O34K357K115
3462C237j644j868K69o96j841j50K642K125l76q47N44r59k746j268K330K053j80
3479F25M35J334o94k888j765J293J063l49J130K269N15k856j936N41K2r53J044
3496a170K961J318j967j271L30j377j853N54K998J848j039m03O98j651k778n58
3512c360K568J611M0L47J414j316k804j242J511N50j37J726K136l64k980j543
3528a843M59K5q95J166L425M47j813j184K03j575j743J291L187Q80j048K85N52
$$ plain form
3412 -2833 -2441 -623 -454 -76 1877 3245 1897 -1628 -1693 -1045 -1665 -1859 976 3183 2098 -204 -356
3429 -356 -480 -2059 -2801 -453 2355 2179 557 1156 1020 -1507 -3484 -1837 1244 1016 618 2457 2404
3446 2404 -326 -3028 -2040 -190 -483 -40 2429 3489 736 -1416 -1517 -775 -1869 -1235 1122 3237
3462 3237 1593 -275 -6 -702 -2543 -2693 -51 2074 1698 851 1395 436 -2310 -3578 -1248 805 625
3479 625 1060 2394 1700 -1188 -2953 -1660 -597 -946 184 2453 2968 112 -1824 -1283 -1261 -2214 -1170
3496 -1170 1791 3109 1142 -129 201 -1176 -3029 -2475 523 2371 1332 929 1627 -24 -2802 -3360
3512 -3360 -792 819 859 1206 2620 1304 -1500 -2742 -1231 -681 -818 908 3044 2680 -300 -1843
3528 -1843 -1384 -1359 -2254 -1088 2337 2784 971 -213 -10 -1585 -3328 -2037 1150 2030 982 1267 1819
3545A819k208k458n9K755O32j41J405R63j726k974l48J107M74k47K164K276j679
3562A755k448p05M97q31r5K218K444k01k106o58J26j448j572J837K701M42r12
3579A044K28N72k620k431Q82K563M05k02J568P23k275k930J24J911l45K34K372
3596A823J272j662k297nJ63j397j45K780K029k55k309K04m44j942q72K150K408
3613A501k5m65N68o8k844j574J655J917k92L27J623Rk212k233M90J107n54J041
3631b9K169J057k165j946M27j51j417J61K816J965j246j340J13o89k111l62K442
3648c06K166o01k56Q33q44k519j260J730J402oO42J676o02k330k086J092N36k60
3666i93J202K063N09j922j895N51q46q60Q04L202R54j686o99J87r80k235K85K651
$$ plain form
3545 1819 -389 -2847 -2906 -151 481 340 1745 2708 982 -1992 -2340 -1233 -759 -1006 1158 3434 1755
3562 1755 -693 -1398 -901 -1732 -1827 391 2835 2634 528 -130 -4 -1452 -3024 -1187 1514 1956 1044
3579 1044 1272 1844 -776 -3207 -2325 238 643 441 2009 2732 457 -2473 -2349 -438 -783 -549 1823
3596 1823 3095 1433 -864 -869 -706 -2103 -2248 532 2561 2306 -3 201 -243 -2185 -3057 -907 1501
3613 1501 1476 1011 1579 1511 -1333 -2907 -1252 665 373 700 2323 2332 120 -2113 -1623 -516 -1070 -29
3631 -29 2140 3197 1032 -914 -487 -638 -2055 -1894 922 2887 1641 301 414 -275 -2386 -2748 -306
3648 -306 1860 1259 1003 1836 992 -1527 -2787 -1057 345 339 981 2657 2055 -275 -2361 -1269 -733 -993
3666 -993 209 2272 2781 859 -1036 -485 -1331 -2191 -1387 1815 2769 1083 384 571 -409 -2644 -2359 292
3684B92J311n73L60L56j533k498j62J890Q01o8Q78J623j148k523r32R93j55k13
3702a301J514K687m83k455o35r3p78j235K046K817nj582m2j42j396k046J163K647
3720F81Q20o92O25Q5j700k365M16J894M03k67J669J114j485k449m34O52K1L0J928
3739I46J817o88k245m81K16j406j48K214J901l52r13j72j52k218j303J555K258
3756H29N92n84P26J21k382j986Q20J405MP84J452N52k136j821K1P77o24N15K277
3775A342J584j436j762l92o4j544J14K536J820o75p54j51j54k216j150K271J811
3792A180K08m52Q48l25k715j320J553O35L02R27J454L83k489j612M72L37r75J285
3810c04K287N00j373j394j13m25j163K78K412J386q67j66j67j086k103j57K414
$$ plain form
3684 292 1603 1030 1390 1746 213 -2285 -2447 -557 244 176 1054 2677 1529 -994 -1926 -933 -1088 -1301
3702 -1301 213 2900 2417 -38 -673 -766 -1544 -2779 -733 2084 2079 497 455 313 -1083 -3129 -1966 681
3720 681 1501 809 1434 1519 -181 -2546 -2130 -236 167 -100 1569 2683 1198 -1251 -1685 -1033 -1012 -982 946
3739 946 2763 2075 -170 -651 -435 -1841 -1989 225 2126 1774 861 689 537 -1681 -2984 -1429 829
3756 829 1421 837 1563 1684 -698 -2684 -1864 -459 -455 329 1781 2333 197 -1624 -1603 -826 -1450 -935 1342
3775 1342 2926 1490 -272 -664 -728 -2272 -2158 378 2198 1523 769 618 464 -1752 -2902 -631 1180
3792 1180 1388 936 1784 1459 -1256 -2576 -1023 -388 -86 841 2295 2678 189 -1423 -951 -614 -1589 -304
3810 -304 1983 2483 1110 -284 -397 -822 -1985 -1707 705 2091 1224 1058 891 -195 -2298 -2455 -41
3827d1J368k99J25P96r08k416q13J147J002l82J180J471m46j954j161L46k6l51
3845a362R53K722j46j698o61j30p86j351J218K319J137j129k39q2j227k004M03
3862b063J967J306n72N92N44p90k520m90R60J054k88J428J314r39j987j190P75
3879h99q5n50J908J791n9j814o14N8j245o59J006K858m3q08j49K70k094j178O66
3898a640J854P98k13O12M92j771k062K29J059J44L03J737P60j441j722l48L11
3915h98j87j75J950J915r66j688j15j38j230p86J915K038l71m59J06l12k025j093
3933b519J321J587P05l09J228l00k199j526N49R75P3L68J649P20j815j650J02
3950a041J18o18N71K064J322r57j494p8n51j335j8K228J472o54n33P90j060k056
$$ plain form
3827 -41 1327 1028 1153 1949 1041 -1375 -2188 -1041 -39 -421 759 2230 1784 -170 -1331 -985 -1011 -1362
3845 -1362 -409 2313 2167 469 -192 -322 -1108 -2459 -1241 1078 2215 1086 847 765 -462 -2466 -2063
3862 -2063 -96 1210 638 1230 1774 984 -1536 -2026 -1066 -12 -300 1128 2442 1503 -484 -1674 -899
3879 -899 -984 -1534 374 2165 2106 292 -322 -264 -1509 -2168 -1162 1696 1653 845 696 966 -1128 -2306 -1640
3898 -1640 214 1012 799 1411 1903 132 -1930 -1701 -642 -498 -195 1542 2302 861 -861 -1209 -898
3915 -898 -1085 -1260 690 2605 1639 -49 -164 -302 -1532 -2318 -403 1635 1264 805 911 599 -1426 -2519
3933 -2519 -1198 389 1094 785 2013 1713 -486 -2012 -1463 -488 -415 -47 1602 2322 507 -1143 -1041
3950 -1041 -923 -1541 -970 1094 2416 1459 -35 -113 -664 -1999 -2017 211 1683 1029 496 1286 226 -1830
3968a830j59J259J440r4Q2J082m07k405j076Q31O48J92O63J697j42j366j570L79
3986g76k58m99R59K171O01j116r09j34j072j201O98J891J208l88j72j66p24k085
4004a972J12J361J199p7M17J123r24k532o77J084L03l14J331J808m81j884j291
4021a414Q20l83p13J444J859J83r86n72j94r58j400J061K024P39o48J26M62j825
4039c75j765K95J625N46J17P69R16j279k292j9R88m6J70J313J599r85j995l61
4057g79k0n03q6J537J616p4j333J63n97j450n12J028J965K82p23N58j07j717j315
4076b067O71J265K43L20R89L83j942j665N03O14l59N06J692Q56r02j563k22j93
4094h71n77l4K195J271k21j182k14o53j302k40J454J809o1l54J22j31j859j193
$$ plain form
3968 -1830 -1989 -730 710 616 698 1780 1373 -1032 -2108 -1277 -629 -437 226 1923 1781 415 -1155 -776
3986 -776 -1034 -1533 -574 1597 2198 1082 173 39 -1033 -2234 -1536 355 1563 1175 1003 837 113 -1972
4004 -1972 -1860 -499 700 623 1040 2163 1239 -1293 -1970 -886 -583 -897 434 2242 1761 -123 -1414
4021 -1414 -594 -977 -1690 -246 1613 1796 810 238 44 -914 -2314 -1253 771 1510 862 988 1450 -375
4039 -375 -2140 -1845 -220 326 443 1212 2128 849 -1443 -1462 -474 -520 -350 963 2562 1577 -418 -779
4057 -779 -799 -1302 -1388 149 1765 1691 358 521 -76 -1526 -2038 -1010 955 1237 514 1072 965 -752 -2067
4076 -2067 -1396 -131 112 432 1421 1804 -138 -1803 -1300 -686 -1045 -539 1153 2009 1107 -456 -678 -871
4094 -871 -1448 -1482 713 1984 1763 581 367 -286 -1588 -1828 -374 1435 1374 1020 1142 1011 -848 -2041
4112b041J110J201O3J62J376p7k005j225K29N10k4O58J537P27j410j507j90j55
4130a061p39L87K489R37j121q61J48n26j512l13K102J196l36K45J66j088j750
4147a637m19J338J088m03Q07J252o61j972r29N35K66j56O60J779J14j570p60K2
4165f46k31q91Q93K127N97o83o26k51q86j393L2J973J226o55L77L12j241j843
4183a809%J129Q54%R57Q22j005j906o91P53R0r9J317J888o73j265q98l14m31n59
4203a840J446K055J24j141m29J04j262j052P68J820M11n90O00K3j214j763L78
4220a562Q17J023j95J073N32q14j965k45N14l3K42J381J168o55j442m95J04p57
4238a309k81J810J416j45p52L5q42j136r32J600J570k56j38N88q5j570j469N93
$$ plain form
4112 -2041 -931 270 333 495 1871 1794 -211 -1436 -1207 -697 -721 -63 1474 2201 791 -716 -906 -1061
4130 -1061 -1800 -1413 1076 2013 892 31 179 -347 -1859 -2172 -70 1126 790 1035 1201 113 -1637
4147 -1637 -2056 -718 370 -33 774 2026 1365 -607 -1536 -1001 -735 -891 -231 1548 1662 92 -668 -646
4165 -646 -877 -1768 -875 1252 1849 1166 540 289 -597 -1990 -1958 15 1241 586 963 1275 34 -1809
4183 -1809 -1809 -680 174 174 1131 1953 948 -958 -1649 -896 -806 -905 412 2300 1627 362 -536 -850 -1281 -1840
4203 -1840 -394 1661 1785 644 215 319 -943 -1995 -1227 593 1004 414 1014 1037 -177 -1940 -1562
4220 -1562 -745 278 83 1156 1688 874 -1091 -1336 -822 -855 -613 768 1936 1281 -161 -656 -552 -1309
4238 -1309 -1590 220 1636 1491 739 774 -68 -1204 -2136 -536 1034 778 640 1228 1143 -427 -1896 -1303
4256a303R83J15J86J595K43j444j741O4N52m21Q02J132J318j184j251K65k81j149
4274a519Q4J862J032n34o08K01m81j415l37J424J018J13M9L14m72j352j087P72
4292i36P98j97O07J484k77j568j186K35K42j14O25J750J14r98j025L43o99j058
4310a860N42J826P64l29l79j61p79j451j52J742J128j26ON72q12j677n89R07P23
4329a05j66P81J306r85j223n79K14n8M2P94J601n5j326m88k28l37q50O33K105
4348A076J32l44j27j16j115j249J98J854J30QO65K03j013j680J43P10M7K86Q44
4367F52J082m74j889k19N7o4k38J467J320k84j081n56j34p89l78R22J899J69j021
4386D41J26l97r41q67N24J254M82L0O95o1j355j488J83R08K85J76J298L43q60
$$ plain form
4256 -1303 -320 -205 -19 1576 1819 375 -1366 -1302 -750 -1171 -369 763 2081 897 -354 -89 -370 -1519
4274 -1519 -1435 427 1459 925 317 518 37 -1378 -1715 -291 727 840 889 1203 731 -621 -1708 -936
4292 -936 -138 -335 272 1756 1479 -89 -1275 -1040 -798 -912 -287 1463 1577 579 -446 -103 -802 -1860
4310 -1860 -1318 508 1272 943 564 403 -376 -1827 -1979 -237 891 765 771 1343 531 -1146 -1735 -828 -105
4329 -105 -271 510 1816 831 -392 -971 -757 -815 -773 21 1622 1567 241 -247 -475 -812 -1662 -1029 1076
4348 1076 1208 864 737 621 -494 -1743 -1545 309 439 447 1112 1315 302 -1378 -1235 -525 -478 -192 652
4367 652 1734 1260 -629 -848 -791 -855 -1093 374 1694 1410 329 -227 -361 -1150 -1528 -606 1293 1462 441
4386 441 567 170 -771 -1638 -1114 140 622 652 1347 1286 -69 -1557 -1374 -466 -181 -5 1293 1636 776
4405G76j758J64m9k62K01J462J499q47j039l42l69p75L4J104J452K4o55j09l7
4424D74j603n73J099J013N9l2Q98k29j219j072J47O28J65L95J534J87j491j314
4442i34J67J74m19K73J545J083j235m26m78n09j029O89J303J123k06n22M08q24
4460A83j402l56J296O94Q7M39N43o06j640o61J53Q45K81P25J054k20r25j269R7
4479f82j43j2O29J528L14q06q18J01q63o96N82J243P22k98J00j74q25j582M53
4498a227Q69J030j47J25J006j272j340o30P26N81j54P58J352m51j492m27n5k26
4516i74m67J119J851m24o62l30j69o61r63J035J265O11o40J32O6j219q29q6J275
4535g0M52J53O16K81j271j631K03N10N61J64O12J210r59j105n05R3m26R8J258
$$ plain form
4405 776 -982 -818 -867 -1129 -928 534 2033 1186 147 -195 -564 -1339 -1305 -201 1251 1275 620 511 474
4424 474 -1129 -1702 -603 410 469 437 1335 1106 -113 -1185 -1038 -410 -245 150 1684 1871 380 -934
4442 -934 -767 -593 -1012 -739 806 1889 654 228 -250 -759 -1788 -1099 204 1327 1121 599 1007 183
4460 183 -1219 -1575 -279 415 502 941 1484 878 -762 -1423 -1270 -425 -144 581 1635 1415 490 -779 -682
4479 -682 -825 -837 -208 1320 1634 828 10 111 -752 -1448 -866 377 1099 801 901 727 -98 -1680 -1227
4498 -1227 -358 672 525 650 1656 384 -956 -1586 -860 -279 -433 325 1677 1226 -266 -693 -748 -974
4516 -974 -1441 -322 1529 1105 443 113 -56 -717 -1680 -645 620 1231 591 723 789 -430 -1259 -1345 -70
4535 -70 382 535 1151 1432 161 -1470 -1267 -757 -196 -32 580 1790 831 -274 -779 -686 -1112 -1014 244
4554B44J325m33o92k79m79j157j52Q43J438K14n95N69j67j393j054J048P32K28
4572B40l0R21N4j147j371K95L77K06J38J053R36j093j132k38K79n15M4J857L81
4591A255m08m00l4o69j042j26J364Q68nj04K56n35j372m68O94P56J80M13O56R
4611A288j544r48M80J05P4L48J340M9o09j178Mp8n87P53J350N98o36p32l1p69
4631g23k35n13J499Q70J2j32M20j322j027l89P88R99l30J169L48p02j396o60N87
4650g37L13L7P65R45o7r50r10K62n89l30J007J384L04p39j63k55j044p13N10J390
4670D20N16q9j47J01o70j591M08O51M71O1O46O46o61j406l20K61K24Q3O18J092
4690A314j57r24o39j42J71q98R32J425r5m04l53n76m92q05R30J103N85l67M02
$$ plain form
4554 244 1569 1136 444 165 -314 -1471 -1623 -780 658 872 277 846 679 -714 -1768 -720 12 240
4572 240 210 1131 1185 38 -1333 -1038 -661 -455 -317 736 1672 579 -553 -791 -512 -1027 -983 874 1255
4591 1255 847 447 413 -256 -1298 -1424 -60 808 803 699 955 420 -952 -1420 -726 30 210 623 1279 1288
4611 1288 -256 -1204 -724 -619 -545 -197 1143 1192 583 -595 -591 -669 -1256 -503 847 1445 809 77 46 -723
4631 -723 -958 -1471 28 898 910 778 1198 -124 -1151 -1540 -752 247 -83 1086 1434 732 -664 -1324 -737
4650 -737 -424 -387 378 1323 1256 306 -604 -342 -931 -1261 -254 1130 1434 695 532 277 -767 -1480 -970 420
4670 420 936 847 700 801 131 -1460 -1052 -401 70 131 777 1423 762 -644 -964 -703 -479 -396 222 1314
4690 1314 1157 233 -406 -548 -377 -1275 -343 1082 987 583 230 -346 -838 -1643 -713 390 975 608 1010
4709A010k64j276r92N80P85r1O40P89q3p68j056R3K39k84L39J147O22l17r54n45
4729c86J74q76K53J041Q66j39p73K62j69j376m05R10R93M39j50K16k37r72q37
4748a166L19P86L7L82J062m35j067p98j77P34l65L26J103Q57r69j044L49o30l47
4767a043J59J372N16J08r53J51m96r52j16R49J071l60L29K14l63j421o11O40J028
4786B22k06R4J074m11r82q23K89J43K6R71N12M47q25q74j36J44q66M53J432M89
4806A173n05p3o09n87p17L4J302J17L65J94M37o37j698o4R75K14M1P95P14o96
4826G75j060p35N98pm32J123Q92J93j216k85j45n88k26P41J084L27l66n1n38o36
4846e52q25M36Q71N47j21O34J77j593o93j10Q24K51K49N44O05n57j083j38K1k39
$$ plain form
4709 1010 746 -530 -1522 -942 -157 -248 392 1181 1098 330 -726 -633 -394 -678 -339 808 1430 1113 159 -386
4729 -386 -212 -1088 -835 206 1072 933 160 422 253 -1123 -1528 -618 375 814 664 880 643 -329 -1166
4748 -1166 -847 -61 -24 358 1420 985 -82 -880 -1057 -323 -688 -362 741 1598 629 -415 -66 -696 -1043
4767 -1043 -884 488 1004 1112 159 310 -186 -1138 -1254 -305 766 406 735 949 586 -835 -1446 -806 222
4786 222 16 110 1184 773 -209 -1032 -743 -600 -574 397 909 1356 531 -343 -479 -335 -1201 -748 684 1173
4806 1173 668 595 -14 -601 -1318 -1284 18 135 500 694 1131 494 -1204 -1268 -293 -79 -38 757 1471 775
4826 775 -285 -1020 -422 -429 -861 262 1154 1347 131 -154 -299 -887 -1113 -372 712 1039 673 622 84 -552
4846 -552 -1377 -941 -70 477 356 990 1167 -426 -1119 -1229 -405 -154 95 639 1244 687 -396 -534 -513 -752
4866g52J11Q51J229m15q76k84l10n76k66J091R14N56p58N0k74j248n24R06P27
4885A52K50J86L41j00j352n60K98N52J2L27R14J99j017q08j01R4l06P09R73L22
4905A085n52o18q3j88n41j39R01J012j68l03K27o10r37m34P84R67R3J96J65k41
4925F16j306m20O07L19J41K44J027k46j092m29J23J24n58P44Q81M36o96o92j63
4944c40j81p73L39J413K66j13j46k57k27j121P9Q09N64J51K91K58l65j432r1L56
4964e20P2K80L39J025j94j179k73J75l92k15Q42R41M3o72l2l46j035r7L59J536
4984F57M6j04j00Q6n55j252K68P95N43l7J91N39r68j066k58N48K77L16N43Q26
5004A295p42p81m56n4J17j85R08J193l90n08j99m37l87n26Q17J205Q0o20J86j8
$$ plain form
4866 -752 -641 210 1439 1024 148 -136 -446 -1022 -1288 -197 717 1273 515 565 291 -957 -1481 -575 152
4885 152 402 588 929 829 -523 -1083 -785 -233 -221 106 1020 1219 202 -606 -707 -613 -919 -210 763 1085
4905 1085 533 -85 -168 -356 -897 -1036 -135 877 709 406 633 23 -914 -1348 -564 403 496 692 857 616
4925 616 -690 -1110 -503 -184 -43 201 1228 982 -110 -539 -416 -292 -850 -106 775 1211 515 -177 -340
4944 -340 -521 -1294 -955 458 724 611 465 208 -19 -1140 -1061 -252 312 463 754 1012 647 -785 -876 -520
4964 -520 -448 -168 171 1196 1002 -177 -450 -275 -667 -882 -40 901 944 272 240 -106 -1141 -1238 -879 657
4984 657 703 599 499 585 30 -1222 -954 -159 384 347 538 1077 109 -957 -1215 -667 -390 -74 469 1295
5004 1295 553 -228 -684 -738 -621 -806 102 1295 905 397 198 -239 -626 -1152 -335 870 950 330 516 498
5024D98r36r98N18R19M27L5M08K00j104p26j59M19K07j75R66O14o85o78j59P5
5044c34l92QJ114P63k10q58m49q3n39J5Q21O86K97n71N94o78j038l54O30Q05K3
5065B50L61M53k60r19o91J55M77j45K88Q59K48o03r96K46k69j52J53J412K35l31
5085G71l98j29n99l38K2P58R69l39n29M91k93r44l92L36J108k47K94O46l07j424
5105e44l33nL53J49N51P25l1o14q07J9pm02K32J649J37n64k44l21k86o57L68R05
5127B73N34j19K05k9j036q67N00L86O43j65L26N75n67j535l2O82j36R5R39O49
5147A321m86r21k62J72o52Q5L19J243j34n8n02Q8p93l95O56P71N1k60L74L64j105
5168a24j113M98P06j27K70N29M18j007o82lk48N56J4R58O00o21p64k22j69j7l93
$$ plain form
5024 498 -438 -1436 -918 1 428 463 871 1071 -33 -759 -918 -499 -292 -467 499 1113 428 -250 -409 -334
5044 -334 -726 -718 396 1159 949 91 -358 -441 -980 -965 -144 542 839 268 862 184 -854 -1208 -578 227 250
5065 250 611 1064 804 -115 -806 -651 -174 -319 -31 828 1076 473 -523 -277 -546 -698 -545 867 1102 771
5085 771 373 244 -355 -693 -671 87 1056 717 188 679 386 -558 -950 -614 494 247 541 1187 880 -544
5105 -544 -877 -882 -529 -380 171 896 865 251 -556 -537 -544 -946 -714 935 1072 508 264 -57 -343 -1000 -632 273
5127 273 807 688 893 864 -172 -1039 -539 -153 490 325 651 1226 659 -876 -908 -226 -362 -267 672 1321
5147 1321 835 -86 -348 -176 -828 -743 -424 819 685 627 125 213 -580 -975 -319 452 503 243 617 981 -124
5168 -124 -1237 -739 -33 -160 110 639 1057 50 -632 -635 -883 -327 -313 645 1245 624 -140 -362 -531 -548 -941
5189i41R63J076j94l92j91J01j115l65O64Q78L5j11L85l09q49o92L81P36K39j18
5209A81M64J28n90o16l98M86k09N12P61K13j43r72j01j50n25J15J132N61j51j87
5229E11n30l98o07l27J095O69p8J29N85q46m75r26N03N55K22L93J84J45p91p41
5249g28j28M82J6M49Q31q6m95m22m72K45o41O40R90J89m07L5Q4r02p12Q7P57N98
5271D10J8j0J21l13j085j4N06L63j39N30P18m87p60o20K08j41q8Q90P63P6m46
5292E00n22r5l32m32M79J052m3m04K65l18k64q16J00R40L23q5L36J7p90n91j41
5313h21P61j48L36L01P44j022p21p4K47J52k0P64O05k59j033J06o2j36n00N33
5333b47R80R1m08J32k92p28j93j03O57N26Q6K15o2j027j33m35N23N25j57O98M42
$$ plain form
5189 -941 22 1098 904 512 321 422 -693 -1058 -394 484 519 408 793 484 -365 -1057 -676 60 299 181
5209 181 645 773 183 -433 -831 -345 -554 -42 719 932 789 -183 -284 -434 -959 -844 288 849 698 511
5229 511 -19 -417 -1024 -1351 -256 413 335 464 1049 203 -272 -1198 -695 -140 82 475 659 804 13 -728
5249 -728 -856 -374 -358 91 922 836 341 -81 -553 -308 -949 -309 681 870 463 498 582 -320 -1032 -945 -188 410
5271 410 428 418 539 226 -859 -873 -367 -4 -143 387 1105 618 -142 -762 -554 -695 -783 107 870 946 500
5292 500 -22 -117 -449 -881 -402 650 607 203 468 150 -114 -930 -830 110 433 348 684 701 -89 -680 -821
5313 -821 -60 -208 128 429 1173 151 -570 -644 -397 -245 -265 499 1104 845 -188 -82 -144 -280 -780 -247
5333 -247 733 824 416 548 256 -472 -665 -768 -111 415 501 716 654 -373 -506 -941 -418 107 -50 648 1090
5354A090p07p89n06M96j53K18P94L88N6m93n64j45m62k0P34O83J04k27l70j96
5374f9m33m87O49O02J01k32P34l81q46l23J22L21L05J34L35M11r40n13J32Pj89
5395e60L37N96M57n21k34j01m11n79N92N21M44o1j79k0j70q04n7L36P73j49L45
5416E55L48o40p24n9J16J78m1L35J062n26o08n55N4l44L67L02Q90j43k08m10p
5437e8m68j46K07J044K3m25K5L24p52p35L11Q47j85M7M38K77n86q68k81M91K95
5458a75m0L60N38l51o81j40k5n8o3M81Q78p8k59m43p1l69o50R31N49K76m74K42
5480C78K00q25o38L05Q90j2J17KK65n72q29J81J02K40M25L07N58n75r71J67p0
5501c55n5k00R13N27r1n61l79j68j84m13P62P93R8j36k28M6r67r1J06P18L8L93
$$ plain form
5354 1090 383 -406 -912 -416 -569 -351 443 831 887 394 -170 -315 -777 -797 -63 620 724 497 127 -69
5374 -69 -502 -989 -340 262 363 131 865 484 -362 -685 -563 -242 63 197 532 943 3 -510 -378 -371 -560
5395 -560 -223 373 830 309 75 -26 -437 -1016 -424 97 541 480 301 281 111 -693 -750 -414 359 210 555
5416 555 903 263 -461 -520 -404 -226 -267 68 1130 604 -4 -559 -505 -849 -482 -180 710 567 359 -51 -58
5437 -58 -526 -672 -465 579 602 177 202 526 -226 -961 -650 197 12 59 497 774 188 -680 -961 -470 -175
5458 -175 -215 145 683 332 -349 -489 -514 -572 -635 -154 724 646 387 -56 -127 -496 -1146 -215 334 610 136 378
5480 378 578 -247 -885 -580 310 298 415 417 682 110 -719 -538 -436 -196 229 536 1094 519 -452 -285 -355
5501 -355 -410 -610 303 830 739 178 -201 -369 -553 -966 -204 589 687 551 323 369 -598 -689 -583 135 173 566
5523E66l8L68r14q65J45M51k94Q78K85K64m19q30J94j17P4k55Q14L30m76J64m51
5544a26R2m79k65O84P46rn19M89k74q43l42N98M83J08k15N23Nq76k87r8N95k24
5566b34M71N93l10k94o47j76J98k74K52Q72J49m09q6N8m24m89R6R52O4K04j60
5587D06k64K1r68J25M72K74p1N98K49m42q34k44J19j9K76L41P04j94m44n27K42
5608a80j92l47N81M68K94j2m31r2o87n42R31M95NJ59m8l60j78n45p6P75j94M28
5630B52J25M14o57p38l22O74k79O2J073M70o22k40m34m01J30K9M40P22n1m26j17
5651A04l54j26k79J21O38J79K49J44k64r73l24K22Q63k75K65P98j59o06p40l5
5671e52N5p2M09N40M59l71o71j43k05L9j15Q15K03R6k23p1r7m68l82K98P14r6
$$ plain form
5523 566 528 896 -18 -883 -738 -287 -581 297 582 846 427 -403 -209 -326 -252 -507 307 637 161 325 -126
5544 -126 -34 -513 -778 -94 652 643 124 613 339 -504 -846 -248 235 343 128 651 656 -220 -507 -605 -10 -234
5566 -234 237 830 520 226 -421 -597 -399 -673 -421 451 600 191 105 163 -261 -750 -654 298 362 566 406
5587 406 142 163 -805 -680 -208 66 -5 593 842 400 -434 -678 -559 -578 -302 39 743 549 105 -422 -180
5608 -180 -372 -719 -138 330 624 612 181 89 -598 -1140 -209 286 291 450 402 42 -136 -681 -757 18 -176 252
5630 252 377 791 134 -604 -926 -252 -531 -469 604 1074 452 212 -222 -623 -493 -464 -24 698 647 221 104
5651 104 -250 -376 -655 -534 104 283 532 676 412 -561 -885 -663 200 -75 190 988 829 223 -517 -552
5671 -552 -497 -569 -160 380 839 468 -203 -346 -551 -512 -627 188 391 487 264 193 96 -372 -754 -456 258 162
5693A62J66L40m49n98o11N46L80K41J5M23o7l45o17r3K50l61P39J10M78k31m44
5714C4l66k37R5J58O06M43k76m45L3n6o68K64K53O98k65J35rl59n07k68K64O14
5736A41MM12L93l67m63q08L85j71J24M67R72m79n25l94J8k84j02J71Q93K89l48
5757C28l95K06m85n27M40L10N28j79K93po97o17K93J31M19m9J98K69k78n12m5
5778c76J85r7o2N26L93N1m10j52q1q21M05J69O25k2lJ03m15n63l39M28O43n5L43
5801D75j7Q4p91k30L1J24K91J38N54J50m37n45l31J59p2J84M53P1Kk28j85k20
5823c40l04J53L47M64K76l45K00m30n89j58N6P94j6oL94j46m19l41J02j0q6M10
5845FM02L78r57l3j30J12l33L29L06P03l18k84k93j47j50R8M97N50j78l01L14
$$ plain form
5693 162 328 668 219 -379 -990 -444 -64 177 192 615 548 203 -414 -507 -257 -618 121 231 709 478 34
5714 34 -332 -569 -474 -316 290 733 457 12 45 -11 -679 -415 -162 536 271 406 397 38 -469 -737 -473 141
5736 141 145 557 950 583 120 -688 -303 -474 -350 117 1089 610 85 -309 -291 -575 -677 -506 387 676 328
5757 328 -67 139 -346 -873 -433 -123 405 226 519 512 -185 -802 -509 -378 41 -8 190 459 181 -331 -376
5778 -376 -191 -288 -350 176 569 620 210 58 -23 -844 -439 -270 355 333 330 433 18 -545 -884 -456 187 132 475
5801 475 458 542 -249 -479 -448 -324 -33 105 659 809 372 -173 -504 -345 -417 -233 220 291 293 65 -120 -340
5823 -340 -644 -491 -144 320 596 251 451 21 -568 -726 -670 124 108 102 496 350 -69 -410 -308 -318 -404 6
5845 6 408 786 -171 -204 -334 -222 -555 -226 80 783 465 181 -112 -259 -409 -311 186 736 558 257 571
5866E71m79n62k66M69M54n2M41Rk38q24j71K09L45j06N71J02O7n59j32p0k91L67
5888a45j93O18K30k86j16k57J4l02q5N76M83j18j6j26n08j00j45K33M02J19R1
5909C69K09k94q89j77L88L44L3L25J98j94k75m30R8m6k85M14R86k45l11j29m51
5930c62k8j14j74R15L64l58N0j4l93n43K36M23kL32L9K5m78Ll03L2K58j20P08
5953D96J43k38n30m05M89n12J87N32M26j14k50n55Q8l34k15P72M59P1j43J43m08
5974A02l63m62J79M72J97k29M11J47m74o18K81l1K91K15K85J73k53m25r9O4j58
5995b95L23L34K61Qq26N6M2p99K66M24N34J92j67O2n71j21l78M47L55j8J69J30
6017D28k10j58m31k31K45r0N17O16m5n46m13L20j63nj11N05K65q6l23k20J47n57
$$ plain form
5866 571 92 -470 -736 -267 187 135 576 585 347 -477 -648 -439 -94 -200 371 473 540 -19 -151 -221 -512 -145
5888 -145 -338 280 510 224 108 -149 -135 -437 -522 54 537 419 403 277 -231 -331 -476 -243 159 278 369
5909 369 578 284 -605 -782 -394 -50 -17 308 506 312 37 -393 -295 -341 -626 -212 774 529 218 89 -362
5930 -362 -390 -504 -678 237 601 243 293 279 -114 -657 -421 2 0 332 371 396 -82 -79 -382 -350 -92 -212 496
5953 496 639 401 -129 -534 -45 -557 -370 162 588 474 224 -331 -243 -577 -792 -20 439 510 367 510 102
5974 102 -261 -723 -544 -72 125 -104 307 454 -20 -638 -357 -388 -97 118 403 576 323 -102 -201 -137 -295
5995 -295 28 362 623 631 -195 -139 -97 -896 -630 -206 328 520 353 415 -156 -277 -655 -208 147 129 298 428
6017 428 218 60 -371 -602 -357 -447 70 686 641 95 -318 2 -161 -166 -277 228 493 407 84 -136 11 -546
6039e46j40Q55K37K88m63L41m29m91n1l9O86K7J26K16k84o52k50J83k9K41K14
6060D0L72J84o94p7m8J25l45K05M68O27p10O1k71k42j08k94R79J22K05k06k27
6081A66k00m26rL52J81J30O9L3k79l7j52j13j13M80K0N95j77l00m53l5J96m10
6103d82M38M30K0k11M9l54n2k56K44L10p9M25l12j0k15o31%O76K37N8p2M06n32
6126H7l26j07L62j73j5P33M69p16k34m06L27m70j0M90M51n5m54N7k63m30O7L05
6148c11L59J65J51K35n30m72j78J66L58N34l11K98j7l12o27K10k2R0k0M66J62
6169C94j4o37J49J9k81p0N53M30%l56J60k62p33k0O63L89o4n7K55k40l76m57J83
6192c72J13K98L56J94q5m85n45N30j26j95P7P19pl40j25l4k21j65L87L83j24J46
$$ plain form
6039 -546 -686 169 406 694 231 572 143 -348 -399 -438 248 275 401 617 333 -319 -569 -386 -415 -174 40
6060 40 412 596 -98 -175 -223 -98 -443 -238 230 857 147 208 -63 -305 -413 -707 272 394 599 393 166
6081 166 -34 -460 -469 -117 64 194 263 296 17 -20 -172 -285 -398 82 102 697 520 220 -233 -268 -72 -482
6103 -482 -44 386 406 195 244 -110 -162 -418 -174 136 57 482 170 160 -55 -686 -686 -10 227 285 213 619 87
6126 87 -239 -346 16 -157 -172 561 1030 314 80 -326 1 -469 -479 11 462 407 -47 10 -253 -683 -616 -311
6148 -311 48 213 364 599 69 -403 -581 -415 -57 477 166 464 447 135 -492 -282 -304 -214 -234 232 394
6169 394 380 -257 -108 -89 -370 -440 113 543 543 187 347 85 -648 -668 -5 384 320 263 518 278 -98 -555 -372
6192 -372 -259 39 395 589 504 19 -526 4 -122 -317 -240 479 472 132 7 -27 -248 -413 -26 357 233 379
6214C79n42M68n11k89l7K18O51j14L4JJ35o60n25K39P67j4Q5J22l9p06m38M03
6236c73N1K6J74P26J55o27q4m81p8J22J71M53J40j28k25M9m02m57L41L42L14m7
6258A62J28L43p57p47P81q4K13K77j38N50j83o46l70L09j87J94K83q5M66o95P8
6279a08k59P1l26N64K16K88K0l63Q0m79Q7q1L20M8M38o4L2o53k18l2L13K41j60
6302b5L32K75k30n92j14Q9K15k44P24L29l17k30m38k22J94j19M31N56p5j63ll43
6324C0n56K08j99P16j13L11P7j99q99L14J11LJ2L14M02k17K9o76J01R9k65K26
6346a71M96J42m72L3j03k79j57j33O78L85Ol55Q5l51k54L19l7K39R3P6M95l31
6368D04p79J7k27N67J29K69k92K29j56k13j32l3j43M27N68l3m35n6m9n55L3K33
$$ plain form
6214 379 -163 305 -206 -495 -532 -314 337 223 257 258 393 -267 -792 -553 214 200 285 407 368 -338 -776 -373
6236 -373 -322 -296 -122 604 759 132 48 -433 -511 -389 -218 235 375 247 22 71 -331 -788 -447 -105 209 162
6258 162 290 633 -124 -871 -90 -174 39 316 178 728 545 -101 -471 -162 -349 -155 128 43 509 -186 -108
6279 -108 -367 -296 -622 -58 158 446 466 103 183 -296 -209 -290 30 78 516 452 484 -169 -387 -419 -106 135 -25
6302 -25 307 582 352 -240 -354 -265 -50 -294 430 759 442 212 -226 -448 -254 -373 58 614 539 376 373 30
6324 30 -526 -318 -517 199 86 397 474 275 -624 -310 -199 -196 -184 130 532 315 344 -332 -231 -132 -397 -171
6346 -171 325 467 -5 28 -75 -354 -511 -644 34 419 425 70 155 -196 -450 -131 -168 71 164 240 735 404
6368 404 -375 -358 -585 -18 111 380 88 317 161 -52 -184 -217 -360 67 635 602 167 111 62 -493 -460 -227
6390b27L49J49Q1l2j56m69k04j83N70L18m4R6K42m88n12k8L74j5K77L04j02k09
6412I1J0k03l9j97J4K55N21J34n87j74l2k60o9L78L77J82N9j96j36o08l7L06J60
6435e1K88J12L42l78j00r61O22j36M0K97R7P7J56k92l21j59l79N33K77J90J11
6456C65l01J50k87k00m10M80M20M71l01m31J09l06k25j64M72J35J46K44j29j55
6476H3m99L7L0N92j09J97J51j32n21p5Q4k18K29K21M28kn62J66k74l89J89L72
6498bO3J68j73P1k28j47k97L13K03K71P9N1k24r6m97K64j45j47O00K70k17k92
6520a12k73P0k49K65J37K48L17j58j62j23J20p29M12J66M31J40m9j48n76j47l11
6541g31M21K21K86J7J89k08n84o3M00j97K13L16K32L20q52m09J06j19J40L88J96
$$ plain form
6390 -227 122 271 352 320 164 -305 -509 -692 -122 196 152 248 490 2 -510 -538 -164 -179 98 402 300 91
6412 91 101 -102 -141 -338 -324 -69 452 586 -1 -175 -207 -467 -536 -158 219 401 460 264 128 -480 -517 -211 -51
6435 -51 237 349 691 313 213 -748 -126 -262 -222 75 172 249 405 113 -208 -367 -746 -213 64 254 365
6456 365 64 214 -73 -273 -683 -203 217 688 387 -44 65 -241 -466 -630 -158 -23 123 367 238 83
6476 83 -416 -379 -349 243 134 331 482 350 -171 -246 -162 -380 -151 70 498 496 -66 100 -174 -563 -374 -2
6498 -2 61 229 56 127 -101 -248 -545 -232 -29 242 321 372 148 52 -445 -181 -326 -473 127 397 180 -112
6520 -112 -385 -315 -564 -299 -162 86 403 245 83 -40 80 -649 -237 -71 360 500 451 303 -273 -420 -731
6541 -731 -310 -89 197 214 403 195 -389 -452 -52 -249 -36 280 512 832 -20 -429 -323 -442 -302 86 282
6562B82R4j52j69k68M1l26M21K88l3J86j94J80k41l90k71N56K69j32j44N73n26
6583D4k00j76K83j60K73K88J63n70j7k46J38L6J23l0N61J26l85k78M4m95n0M00
6605a28P5O94o76N57l19j58m77J23N74m46L94J95K16m60m44j46L53j75K41K81
6625B74L83l51m53m8J13k17k73O18L70o5l67K96j32p78P4M09M88l55K31l9O4l42
6647a00m77P4L00L46O9J84r9k54l67l41N59mK02K28n9J40m99m10L27j01K96N4
6669F8J26K87l43Ol88m87L65J65L01K6J56k14J02l93l47N91p9r9L76K41p2j56
6691B32m59l38K47r4M72K72L33n35j14j00l78L05J34M6M38j21l80L23n31j28J10
6712b66M56O2L1j4j5n05l65J34K52K36r4N35N6j31m77j66q2o1J9M66L92k85j3
$$ plain form
6562 282 376 224 55 -213 -172 -498 -77 211 178 364 170 350 109 -281 -552 4 273 141 -3 570 44
6583 44 -156 -332 -49 -209 64 352 515 -55 -72 -318 -180 -144 -21 -51 510 636 251 -27 17 -478 -528 -128
6605 -128 -53 641 -35 522 203 45 -432 -309 265 -181 213 408 624 164 -280 -426 -73 -248 -7 274
6625 274 657 306 -147 -195 -82 -299 -572 46 416 351 -16 280 148 -630 -556 -147 341 -14 217 178 242 -100
6647 -100 -577 -503 -203 143 212 396 297 43 -324 -665 -106 -110 92 320 261 401 -98 -508 -181 -282 14 68
6669 68 194 481 138 144 -244 -731 -366 -201 100 126 282 68 170 -223 -570 21 -58 -157 219 460 388 232
6691 232 -227 -565 -318 -412 60 332 665 130 16 -84 -462 -157 -23 23 461 340 -40 283 -248 -376 -266
6712 -266 190 252 283 269 254 -251 -616 -482 -230 6 -88 447 503 372 -105 -271 -353 -414 -395 71 463 178 165
6735A65l94m5m3j19M78J89K97k10j31k85M6m20q1P60L1R6j7j81j78o45N99K49
6757A61j84J41M30J94m94o47O9m2K06k47P25N3j57j93j56k19J21r1K37M23j74
6778A56K07o0l69l73oR1P02j93K39p8R4k28l46j64K54M16j55R8K79m34l04o5j04
6801c43L95M1J37K36j54o12r7L98o00M41L98K54l88K70l37j92j90j38O30j26L36
6822C59l05M42k94n05m7k4K24R5J53J68k6j13n77M92k14j94K43N57j45N9l21k76
6844b49M4L6j19K38O5L17Q3l92k49j16l37L51L87K81J2K45n65j83k45K88Jl4K70
6867A29N83n41k22j34j92J79j0J31N23K2o01N9k50o4J20L42J03J16k76J1j64j7
6889a53m50K72L45MK59j05Q4l24J04j31k77O5L90J51j42L31m42k44J87lm64L91
$$ plain form
6735 165 -229 -274 -317 -436 42 231 528 318 187 -98 -52 -472 -553 207 238 334 317 136 -42 -687 -88 161
6757 161 -23 118 548 742 248 -399 -330 -372 -166 -413 312 365 208 15 -141 -360 -239 -330 -93 330 156
6778 156 363 303 -66 -439 -445 -354 348 155 394 316 410 182 -164 -328 -74 342 187 285 564 130 -174 -239 -343
6801 -343 52 93 230 466 312 -300 -397 1 -599 -158 240 494 106 376 39 -153 -343 -481 149 23 359
6822 359 54 496 202 -303 -350 -374 -150 -55 98 266 240 127 -450 42 -172 -366 -123 434 289 348 27 -249
6844 -249 -205 -169 -288 -50 15 332 415 23 -226 -342 -679 -328 59 340 352 597 32 -151 -396 -108 -107 -141 129
6867 129 712 171 -51 -185 -377 -198 -208 -77 446 468 -133 -74 -324 -388 -268 74 177 293 17 28 -136 -153
6889 -153 -603 -331 14 18 277 172 256 -68 36 -95 -372 -307 83 234 92 423 -19 -263 -76 -79 -543 -152
6911a52Q22j75m83l39L54o5o69N68K72K56mn6o8l77k14k22L15N35R6j10j60l85
6933b61q2J2J99kp8L88J13o79K90j17j72Mj98O15M71N0o65K06j08j74k00N97k1
6956A88rK69k10k11k29R3QK60q3j2K72K9m49m9l04L48O0K1K82p1r6j89kj12k59
6981d55K38K36M65l60p9J16l14k51K98L90J58j84j81K08n12Mn26M88J66K70o7
7002A08K12k08l07m09K20K30J82j63O85j45m26o8m0J7M8J10J79kl08L4J54j95
7024i2m1j20N02L8k9l6j03l15k10K46j81N16pP6K26j94k75k97J28J49k37M77P5
7047B96o4l22J60k72r8LL55K08R0j85j12k00j60m50O39K83J89p4P6J69n44m61
7069d74J03L13J12%L26Q0m79k90K51k58K85J49R1k9K02l52l13J49k14m1K88M70
$$ plain form
6911 -152 670 495 12 -327 27 -38 -707 -139 133 389 385 329 261 -116 -330 -552 -237 298 394 284 124 -261
6933 -261 -343 -331 -132 -134 -212 176 289 -390 -100 -217 -389 -385 -583 32 503 553 -112 94 -14 -188 -388 209 188
6956 188 179 448 238 27 -202 -109 -101 159 76 64 336 365 -84 -133 -437 -89 -29 -8 274 203 107 -82 -84 -196 -455
6981 -455 -217 19 484 124 45 161 -153 -404 -106 284 442 258 77 285 -227 -223 -749 -261 -95 175 108
7002 108 320 112 -195 -604 -384 -154 28 -135 550 405 -21 -89 -129 -112 -64 46 225 223 -85 -51 103 -92
7024 -92 -133 -253 249 287 258 222 119 -196 -406 -160 -341 175 168 244 470 276 1 -296 -168 -19 -256 221 296
7047 296 232 -90 70 -202 -300 -297 58 266 356 171 59 -141 -301 -751 -112 171 360 286 362 531 -13 -474
7069 -474 -371 -58 54 54 380 460 -19 -309 -58 -316 -31 118 209 180 382 30 -283 -134 -348 -389 -101 369
7091C69m2m09L93m45l03Q1L28P9K99k41j35K60m24j41j35L05J32R8K21j01m9m24
7113b84j54J29J72Q8K43j66L62k50l18J15l70L68R7L21l31J51Kk92k13k1L29p1
7135i3N02j97L18l17l61l62K36N43j72L28k74L81n54k46K72j33k64M55L49k47
7155A64l2l84K00j68k99K98K26L58N7%n09l9l15K66J00J94Q8p0J77j57k6n84J32
7178c23L61K7M26q4m2n81q5J11Q0J84O1L29j01l13k61j22K30r0r2N64m1O4p3O0
7202B89m14j69j05K90J48K73j33P3j77m77l0L45J1k5J15N12j91m70k30K28m24
7223e61L30L37Q9q8k01k0J71k46J64N9L01L11k35k73j01m18J27j52M62j8J60k72
7245g4L1O9m46K18O4K23M5p7M15m16j19k98O4J55k38M63K47J65n66J28p5j62k71
$$ plain form
7091 369 327 -82 311 -134 -437 -356 -28 51 350 109 -26 234 -190 -331 -466 -161 -29 69 290 189 140 -284
7113 -284 -438 -309 -137 -49 194 28 390 140 -178 -63 -433 -65 32 353 22 173 175 -117 -330 -351 -22 -93
7135 -93 409 212 530 213 -148 -510 -274 269 97 425 151 532 -22 -268 4 -129 -393 62 411 164
7155 164 132 -252 -52 -220 -519 -221 5 363 420 420 -89 -128 -443 -177 -77 117 205 135 312 155 129 -455 -323
7178 -323 38 65 491 407 365 -216 -301 -190 -110 74 135 464 363 50 -211 -333 -103 -193 -285 279 238 302 229 289
7202 289 -125 -294 -399 -109 39 312 179 252 75 -402 -432 -87 -76 -101 14 526 335 -135 -365 -137 -561
7223 -561 -231 106 195 107 -94 -114 57 -189 -25 34 335 646 411 138 37 -381 -254 -406 56 38 198 -74
7245 -74 -43 26 -420 -202 -138 85 130 53 468 52 -67 -365 -301 -146 -384 79 326 491 -75 53 -22 -184 -455
7268d55N75L49j50K3l67q2j46j75K68K48j58o0K09K47n40R4j59L82Nj20M92J44
7290F24o06k37O7j4nj01N46j62J34k08j68k93J68j06L13L38k67R6k5k44m3k67
7312d60L53j20L25qn1K51m63j82J47J47j40L60Q3j52mq3l79L96j10K02K86j51
7334B47l75l8J8K26l71J85J88J85q2J61k57j32l22q0N04K37n6K11j1l46l35m10
7356f53L80j13L93J48Q2J49l50n3k36k20R5J69K12M55l14k70K01J6m47O1J24M29
7378B58j15j12m7l07k9O8L61j47K77P8j1q5n09QJ94j23M35j8L2J72n90K15m75
7401d70J23L03j1L14j04j2l33O5q1Kk06L84M10N8j72m48O0l9P3lL42L4Qj6l5n79
7427c33J88m3j20M86J98l00q0P6l36R9j01L13k01O23p8k74M53o79p6l00L75K58
$$ plain form
7268 -455 120 469 319 342 -25 -107 -253 -428 -160 88 -70 -130 79 326 -214 -120 -279 103 108 -12 480 624
7290 624 18 -219 -152 -166 -171 -272 274 112 246 38 -130 -423 -255 -361 -48 290 23 119 94 -150 -193 -460
7312 -460 -107 -227 98 90 39 290 -173 -355 -208 -61 -201 159 242 90 86 3 -376 20 -90 112 398 247
7334 247 -128 -166 -148 78 -293 -108 80 265 183 344 87 -45 -367 -447 57 294 238 449 438 92 -243 -653
7356 -653 -273 -386 7 155 237 386 36 -17 -253 -473 -378 -209 3 458 144 -126 75 91 -356 -295 -171 258
7378 258 143 31 -16 -323 -352 -284 77 -70 207 285 274 189 -320 -312 -118 -241 194 176 208 380 -210 5 -470
7401 -470 -347 -44 -55 259 155 143 -190 -125 -206 -204 -410 -26 384 442 270 -178 -118 -157 -84 -87 255 289 297 281 246 -333
7427 -333 -145 -188 -308 178 376 76 -4 72 -264 -165 -266 47 -154 469 391 117 570 -109 -185 -485 -110 148
7449A48K29rj44J88m53n67K96L50j2K53p5J23r3n15o6K47J78k07R99p83M8j02
7471C3O4l44N6K08M83j33o9k00J08m97K1J06j60L97rM48k85l31j03j70K75J96
7493I4l26L89l17K47l05O1N5l06L16J53K05L46n00q7l1j61j20K04M14l71K79l23
7515h4J47m33mK7M39j94J86J24R6l23k28P0L05q8Q7M12l06K73p40j0q8L1l26P87
7539A60M76p9o26J73m45M75o88N19M90l60P5j11K0l18L24l89M67J97l10L19j63
7560B06m79j13K85l31K41L69P6J40l94k70P1j6j8K92K68j46K08j31n02R6j91J47
7582a92L30QK81o91N85n30r4j89L19M22j97L59k15O0m50l3R5Q0K32J67m3j27j54
7605B3l0j56j02P7L13o2K31j0j25k67l51j43L62K56K54j16J1j0j90Om46M99O3
$$ plain form
7449 148 377 368 224 412 -41 -608 -312 38 26 279 204 327 234 -281 -347 -100 78 -129 870 87 135 33
7471 33 97 -247 -191 17 500 367 298 98 206 -291 -270 -164 -324 73 64 512 227 -104 -207 -377 -102 94
7493 94 -232 157 -160 87 -218 -157 -102 -408 -92 61 266 612 112 25 -6 -167 -287 -83 331 -40 239 -84
7515 -84 63 -370 -374 -347 92 -102 84 208 304 -19 -247 -177 128 40 127 539 233 506 -234 -244 -332 -301 -627 160
7539 160 636 557 -69 104 -341 134 -554 -35 455 95 170 59 79 -239 85 -304 163 360 50 369 206
7560 206 -273 -386 -101 -432 -191 178 254 394 0 -270 -199 -215 -233 59 327 181 389 258 -244 -148 -339 -192
7582 -192 138 146 427 -264 321 -209 -303 -492 -173 249 52 411 196 256 -194 -227 -132 -52 180 347 304 177 23
7605 23 -7 -163 -265 -188 125 63 294 284 159 -108 -459 -602 -240 16 270 154 165 155 -35 -29 -475 24 87
7628H7qM2K15L7k94l96J97j4J16J14n0J19j99q2P6N3k45J36M87j57l26K45q0k41
7652a68p9k5M43j34l3K58k24l39J03o0l8N47j96K82j02r1n67L93p5O9J41r9N01
7675E07m78m6j30N7j54L31P7N53k92n50L80l63j10k06L24l1L71R3j21j38L3l39
7697b32o4L27N6P6N06l37n9n61P7M20m09L59j66K70k05l9l69K50K6k10M06J79
7719C01l19N02l90P9m73k1K03J94R0j62J56l25j42J95j62M29j87O9J78j38n22
7740d45L37j00J79j21K90l4K17n2l15l78L9K38n9J99N02l24R4k32M6n24l4L05
7762a72J09L49l07K15l3m04j05L93j34L74LK0k44J09l45P8LM72o00O78rl21n49
7785d20L9J44m4K06K32m1j21Q5l0m76l5K50K55J79J1k4j65j23l20n8L49L04j84
$$ plain form
7628 87 79 121 336 373 79 -317 -120 -134 -18 96 46 165 -34 -116 -40 13 -232 -96 391 234 -92 153 73 -168
7652 -168 -247 -272 171 37 4 262 38 -301 -198 -258 -296 251 55 337 235 144 -423 -30 -105 -36 105 6 507
7675 507 29 -17 -147 -90 -244 87 164 717 425 -125 255 -108 -218 -424 -100 -131 240 333 212 74 107 -232
7697 -232 -296 31 87 163 669 332 273 -288 -211 209 -200 159 -7 263 58 19 -350 -100 -74 -284 122 301
7719 301 -18 484 94 173 -300 -321 -118 76 166 4 160 -165 -307 -112 -274 155 -32 37 215 77 -445
7740 -445 -108 -208 -29 -150 140 106 323 271 -44 -422 -383 -145 -204 -5 497 173 267 35 81 -443 -477 -172
7762 -172 -63 286 -21 194 161 -243 -348 45 -89 285 288 308 64 173 -172 -94 -91 381 -219 459 450 129 -420
7785 -420 -381 -237 -281 -75 157 116 -5 80 50 -426 -461 -211 44 223 234 210 45 -78 -398 -456 -107 197 13
7808A3J0K07j06j58j0j27j20K23K56k76K50k37J59l22J8o9L95K32k75M26j41m75
7830a27j09J37l11M82J50J47j70l67K03m12R7K64J09j34K60p9j28j32p7KL30K7
7852A62K40P0j94k65M9l75J64k80L69M18K1P4p80L45m36J26J14L60j23j23M24
7873C60j38j92l14mQ3K62j23N64m69j71J06k89Q7M74l01J76R5k21K0j07q2R6k59
7896c47J37N25j21j57k8j75k43j20N03M2K30j46J13r4m84N6P5J64N8J42J5k40
7918i5K17k45j47J58K37K9O1K43j55m73Q5j79j77M58K46m7j42J14l11j77RNJ28
7941a58LK82J89j36k63j87N5n3N41m40L77J08k35j80j22M0N5O4J92K06j93J99
7963C44l36K22k57j63J19J73N32k11m24J21q7m93K00L16J85l9J65j83j90k75J2
$$ plain form
7808 13 23 230 124 -34 -44 -171 -291 -68 188 -88 162 -75 84 -238 -220 -289 106 338 63 489 348 -127
7830 -127 -236 -99 -410 72 222 369 199 -168 35 -377 -280 -16 93 -41 219 140 12 -120 -197 -195 135 162
7852 162 402 472 278 13 62 -313 -149 -429 -60 358 379 453 -327 18 -418 -292 -178 182 59 -64 360
7873 360 222 30 -284 -288 -205 57 -66 498 29 -142 -36 -325 -238 236 -65 111 206 -15 5 -102 -184 -88 -347
7896 -347 -210 315 194 37 9 -166 -409 -529 -26 16 246 100 213 119 -365 -309 -234 -70 -12 130 145 -95
7918 -95 122 -123 -270 -112 125 154 215 458 303 -170 -85 -264 -441 17 263 216 74 188 -123 -300 -291 -286 -158
7941 -158 -155 127 316 180 -83 -270 -215 -268 273 -167 210 318 83 -97 -219 -179 -124 -60 132 338 145 344
7963 344 8 230 -27 -190 -71 102 634 423 -1 120 33 -460 -260 56 241 202 367 184 -6 -281 -269
7984b69J49K92j08K96j32q2j31l13J60m9O8R4L98O9n27RJ86l92J28K49O4M3l81
8007a79M96l10l73K32n33Q36J36jj54o5k49j10n6L77m4K44k27K57l27j10Q0J09
8029B9l03J48L52Q2k31k61L7M67o22J34j41R65m29j46L13m14j9p44O82L15j94
8050B0n3M22k87j25k61K62j93J03J24K38Om2o46m5L31k07J99M82k65P8k99J05
8072e3j21k85K55L47K07r0L5o1m9m9l72J21M02j61q6J16L71l69k16j74j9K30j70
8095a91N07k00o1k35k16J04L87j25L61Qn0m05J23k88j29K32L02l1o8L85l34n39
8117d63K11ML60j93J56J23J81k84J6l34n9K87Q0O9K82m38J51k13j88L6J80j72
8139b08K52K62k72Q6j99k64J99M7J32n8K8p5L38l44m12J01K98J09J13n9K53j86
$$ plain form
7984 -269 -120 172 64 360 228 146 15 -298 -138 -187 -119 -25 373 442 -85 -76 110 -282 -154 95 159 202 -179
8007 -179 317 7 -366 -134 -667 169 305 304 150 85 -164 -274 -330 47 3 247 20 277 -50 -160 -80 29
8029 29 -274 -126 226 308 77 -184 -147 320 -302 -168 -309 656 227 81 394 -20 -39 -783 -101 214 20
8050 20 -33 389 102 -23 -284 -22 -215 -112 12 250 256 214 -432 -477 -146 -353 -154 328 63 141 -158 -53
8072 -53 -174 -459 -204 143 350 260 295 234 185 136 -236 -115 287 126 40 156 527 158 -58 -232 -251 -21 -191
8095 -191 316 116 55 -180 -396 -292 95 -30 331 339 289 -116 7 -281 -410 -178 124 93 25 410 76 -463
8117 -463 -252 -248 112 -81 75 198 379 95 111 -223 -282 5 85 154 436 -2 149 -64 -252 -216 -36 -208
8139 -208 44 306 34 120 -79 -343 -144 -97 35 -23 5 -70 268 -76 -488 -387 -89 20 133 74 327 141
8161A41j33L2j23K47j29rJ68r1l25L75l94PJ5p4N06N9J16n05J6rj84J22K94L9
8185A61K90k51j54n75J53R4
$$ plain form
8161 141 8 40 -83 164 35 26 194 103 -222 153 -241 -234 -219 -293 213 272 388 -117 -101 -110 -294 -172 122 161
8185 161 451 200 46 -529 -376 -282
8191b82
$$ Imaginary data points
##PAGE= N=2
##DATA TABLE= (X++(I..I)), XYDATA
0@%%%%%%Kj0J6j6J6k4L2l7M5n6P0q1R3j11J32j53J78k07K40k74L11l54M00m52
30b40N10n74O46p22Q06r01J002j113J235j370J519j682J861k060K283k531K810
47A479l127L493l915M408m998N721o624P786r360J1618j5148K1501l6496J35367
61A11705J19832k13216l9911O2660j3933j25397K9173J33165L2758q0938P984
72B3882L1921r7549j30344O9835J53097m675r2130N9216J13102p4121j79840j0425
84a38031J19586K6180m6286N5731Q2181o3699j20014J0563N0863o3535n3221J29177
96a0505J46107o0523j40921J5933Q0430n7041r2977P3109J42896Q147o2772J8811
108F0694J6372j01951p8263Q9784J02965m4969n2136R1168O7345j26115j46847
$$ plain form
0 0 0 0 0 0 0 0 2 -8 8 -8 8 -16 16 -21 24 -32 38 -43 50 -61 71 -82 96 -111 129 -145 166 -188 212 -240
30 -240 270 -304 342 -380 426 -475 527 -586 649 -721 798 -884 977 -1083 1200 -1331 1479
47 1479 -1648 1845 -2070 2338 -2660 3061 -3563 4223 -5137 6481 -8667 12834 -23662 111705
61 111705 231537 18321 -21590 41070 27137 -98260 -69087 64078 96836 15898 23882
72 23882 55803 -41746 -172090 -102255 50842 46167 -45963 13253 126355 52234 -127606 -138031
84 -138031 -18445 7735 -38551 17180 99361 35662 -84352 -73789 -22926 -86461 -139682 -10505
96 -10505 135602 75079 -65842 -49909 30521 -26520 -119497 -46388 96508 104655 41883 60694
108 60694 77066 -24885 -103148 -13364 89601 44632 -7504 83664 151009 24894 -121953
119a21953M2033J09766j3337m2415P2391O7379p5839r3934K1092K2464o8176q996
131h9525J36398Q3980j03232j00668N1796M2856j01484p4368J03031J18127k9006
142C7905o1594K5098J347r6505m3467R1575O3256m9385m400J03978J8801j44057
154e7448r1977Q4322Q2385m4114k2555R2943N1416q4386p3866K7432R758n2657
166g8747K7452J25489L6437j00034m5681O7152R68j12716k7634J25518Q4229n5311
178D7122m7180L4258j2280r3417k4071P8565L2499m1893K5762Q5870k9419j39098
190h3282l9505R5834M0453o1265O180J04851K6585r6530n8082L1909j551m3091
202g7494M2249J01901n60q8059q251N7715m0354j08798J8237J35257M6691p0155
$$ plain form
119 -121953 -79920 29846 16509 -25906 46485 113864 38025 -55909 -34817 -12353 -80529 -89525
131 -89525 46873 130853 27621 -73047 -21251 21605 -79879 -154247 -51216 66911 37905
142 37905 -23689 1409 2756 -93749 -137216 -45641 17615 -31770 -36170 67808 86609 -57448
154 -57448 -149425 -65103 17282 -26832 -49387 43556 94972 10586 -63280 -35848 -26090 -78747
166 -78747 -51295 74194 110631 10597 -35084 32068 33036 -79680 -107314 18204 102433 47122
178 47122 -58 34200 21920 -71497 -95568 -17003 15496 -26397 -635 85235 55816 -83282
190 -83282 -122787 -26953 13500 -47765 -41585 63266 89851 -6679 -64761 -32852 -34403 -77494
202 -77494 -35245 66656 66096 -21963 -30214 27501 -12853 -121651 -103414 31843 78534 8379
214H379k0200N1492j9648q7551m260P7595K2023k4202M5105O3306n9639j17553
226f5153L660Q5999m147o4526L9059J04167r421j07021l7364L8139j0303l5741
238f2652N0284Q3078j5982o3926J5077L4732o7403q1633N7502J18030K284p1483
250b092P533M9011m5152q9164Q141P0477R796j6076M7084L6145p3065q4409L1216
263e0555O3665l0247m0421P4369R1976m0020r9218o640M2712k0542l0146N6506
275A1439O7842k4815m5907K1051P638q0629m9956Q2016R0058l1284n6054L7742
287B9141M0725o8082q0321L0634O9968K52j1112M7548J7100p6469n8555M0869
299a8302L3173m9048j4370R2519O0436p3103q4743J9624L5555l8682k4968O6234
$$ plain form
214 8379 -11821 39671 20023 -67528 -71788 5807 27830 3628 48733 112039 52400 -65153
226 -65153 -61493 24506 20359 -44167 -5108 99059 89638 -17383 -54747 -16608 -26911 -62652
238 -62652 -12368 70710 54728 -9198 5879 40611 -26792 -108425 -50923 67107 69391 -2092
250 -2092 5441 54452 9300 -79864 -71723 -1246 8550 -7526 39558 75703 2638 -81771 -50555
263 -50555 13110 -17137 -57558 16811 108787 68767 -30451 -37091 5621 -14921 -45067 11439
275 11439 79281 54466 8559 29610 37248 -43381 -93337 -11321 78737 47453 -8601 29141
287 29141 69866 1784 -78537 -47903 22065 22317 11205 58753 75853 -616 -59171 -18302
299 -18302 14871 -34177 -48547 43972 104408 31305 -53438 -33814 1741 -36941 -61909 4325
311D325N8214k9698l3384K1188j1778p5297j5825Q9423N5450m7717k7387N5557
323D3071J5907q8457o1272N2306N9811j2815n345M7074M600p1405l5658L9318
335a2865J0124m3422J9362R5423K5416q5792n4260M0094J7194n3227j0297P5060
347B2810M5429l7201k6775J5270k5500o4429Q926Q1643K3858m8441K607O0470
359E8667j4811r7982l2109P0290M3362k6372L132M9631n913o9484k2572L2984
371a1177o300l2475M2437Q3372r673q6357k1093M7479p910o1170J2547Q6006K9149
384F4835m5912j8975J6210l0444n2318K4379O8165K989l6548K6454M7264m5865
396B0234r1885R79P4419J8023l3843J8047N1590j8607o7376j2179K7587j1496
$$ plain form
311 4325 62539 32841 -543 20645 8867 -66430 -82255 7168 62618 14901 -12486 43071
323 43071 58978 -29479 -90751 -38445 21366 8551 3206 50280 54880 -16525 -52183 -12865
335 -12865 -2741 -46163 -26801 68622 94038 8246 -46014 -5920 11274 -41953 -52250 22810
347 22810 68239 31038 4263 19533 -5967 -70396 -61470 20173 44031 -4410 -1803 58667
359 58667 43856 -54126 -86235 -15945 27417 1045 4177 53808 47895 -21589 -44161 -11177
371 -11177 -17477 -49952 -7515 75857 66184 -20173 -41266 6213 -1697 -62867 -50320 35686 64835
384 64835 18923 -52 16158 -14286 -66604 -42225 25940 28929 -7619 18835 66099 20234
396 20234 -71651 -70672 3747 21770 -12073 5974 57564 38957 -28419 -40598 -13011 -24507
408b4507j5857N5567O2529l2671o9536O301L8119l3572n3653L9321Q4639N797
420F2477n0666p657J5105l4625m1773L1905N3845p377j8969L8512K5735o6472
432D0p1845L0061O5594p735l1131L6745M8040l4759o6198k755K4305j5040m035
445b8713N8012L9744m5366m9654K2955J8940n3447l6058O3646P3001j9636m9082
457e658Q513J5281m3423l4391L8145M4513j0349n391M0003K871p3687m4947M7909
470b0611M5608k6897j5544N4393L5982n2404n8203J0654K2564j6471M870N5167
482C9108K3365m5112k8759K5418k940n7184r089P5927M9502l7966l6385K2210
494A8095N862n1670k6739M2147L5470j1804L024L1293j7467o9757k0660N0109
$$ plain form
408 -24507 -40364 15203 77732 45061 -24475 -18174 19945 -13627 -67280 -27959 56680 62477
420 62477 11811 4154 19259 -15366 -57139 -25234 28611 21234 2265 40777 66512 40
432 40 -71805 -41744 23850 16115 -15016 21729 69769 35010 -31188 -33943 -9638 -24678 -28713
445 -28713 29299 69043 23677 -25977 -3022 15918 -37529 -73587 -9941 63060 43424 -5658
457 -5658 2855 18136 -25287 -59678 -21533 22980 12631 7240 47243 50114 -23573 -68520 -20611
470 -20611 24997 -1900 -17444 36949 72931 20527 -37676 -27022 -4458 -20929 -16059 39108
482 39108 62473 17361 -11398 14020 11080 -46104 -55193 20734 70236 32270 -4115 18095
494 18095 23957 -27713 -54452 -12305 23165 11361 14385 45678 28211 -41546 -62206 -12097
506a2097K0552l4787N142O3492J4533o6428m4799K4325J7804k0459J1296N3056
518C1630J1764m1228j4799K0665k1184n1413J7359P7049K2322m7648j6368L3388
530B1537q493n9186j3207N1598L0041j3416R049K6447k6491n8335n49M5073J618
543E686k9046K7464O1362j0249p1632k5269L2834M984k6409J7658N0204J805l9513
556a21q495J0682l1529l8005L4409O5404j199m3541M761L1638k6958n9960M195
569e8719N5008J8790j5531J1718J9559l1775m7326Q389L2925j1041j5812M3638
581I823M8373l1693o4967k315L5193q761k4857K9310N0591m806l5475k563M653
594B506l3203k0918M4336M9956j5841l1245K1944K1831m5418n2525K2797N4615
$$ plain form
506 -12097 8455 -26332 -21190 42302 56835 -9593 -54392 -30067 -12263 -32722 -21426 31630
518 31630 43394 2166 -12633 8032 -13152 -64565 -47206 29843 52165 4517 -11851 21537
530 21537 13044 -46142 -59349 -7751 22290 8874 17923 44370 17879 -40456 -41005 4068 5686
543 5686 -23360 4104 65466 55217 -16415 -41684 -8850 -3866 -30275 -12617 37587 39392 -121
556 -121 -8616 2066 -29463 -67468 -33059 32345 31146 -12395 -7634 24004 -2954 -62914 -58719
569 -58719 -3711 15079 -452 11266 30825 -950 -48276 -39887 -6962 -18003 -33815 9823
581 9823 58196 26503 -38464 -40779 -5586 -14347 -39204 -9894 40697 35891 416 -2147 2506
594 2506 -30697 -51615 -7279 42677 26836 -4409 17535 39366 -6052 -58577 -35780 18835
606A8835M557j8377J7389J5852l6107m0325J3281K1571j5852k016M9849K9016
618E7673m7472n1075J4733K6346k4590j9947M2449M5749j6126l4141J507J42l1788
631c6540q905M6756L3561k1764j4758K9295M455n6484l6161L9478M5427r732j4330
644B98K5282J1818l9814l2251J6246J5771j2200J2472M8787J1313n0507l0681
656b3466K5788J1423l3660o209N2388L5189k8338l1657M892m401l2468j970M1750
669I261J9615k1983k150K6848j4584n8983j5556M9091L0624k0163l823L3643M534
682C6374m5321k5621J9503J1308j0138J9310M1658n417m8658j4616K5112o094
694b600l6332J0774N8355K0022l6147k1905J3751o655l0435P112M1989J4176j5517
$$ plain form
606 18835 23392 5015 22404 38256 2149 -38176 -24895 -3324 -19176 -21192 28657 57673
618 57673 10201 -40874 -26141 205 -24385 -44332 -1883 43866 27740 -6401 -4894 -4752 -36540
631 -36540 -45445 1311 34872 13108 -1650 27645 32100 -24384 -60545 -21067 24360 14628 298
644 298 25580 37398 -2416 -34667 -18421 -2650 -14850 -2378 46409 57722 7215 -23466
656 -23466 2322 13745 -19915 -26124 26264 61453 33115 1458 6350 1949 -30519 -32489 9261
669 9261 28876 6893 4743 31591 17007 -41976 -57532 -8441 22183 2020 -1803 31840 36374
682 36374 -8947 -34568 -15065 -3757 -13895 5415 47073 41656 -7002 -21618 3494 -2600
694 -2600 -38932 -28158 30197 50219 14072 -7833 5918 -737 -31172 -24060 17929 32105 16588
707A6588Q648K0886k7788n1669L837M7789J1460k4631P824L5297r615n1315j9210
720c1899K1856O025q500K2283L2303j4436l9863k090J8180j8722k9178K8187N5701
733C9847J817m0544r834J5939j5713l1500J1172L8411P111j2490J1022Q613l6103
746a2252l9555J7672M0722l293j8597K3869L3821k2540m9229m856K6604K603o345
759a1376K6045K7868j8552l1449M538R085k6824j6471M0608M5382j4802l6171
771b119M245J4743k5096k9705J9886L8033K375j0517J1770J179l8923k7604K4229
784a7504K7777j3644r556L3865K1831l7829m4719P381K5031o283n983K8863K2353
797C1583k1390k5171N712n46k7025k460M5705L0063k4924k5556J4505P621l4595
$$ plain form
707 16588 25236 46122 18334 -33335 -29498 18291 29751 5120 12944 48241 38626 -12689 -31899
720 -31899 -10043 -4018 -12518 9765 42068 27632 -12231 -14321 3859 -14863 -44041 -15854 39847
733 39847 41664 1120 -8714 7225 -8488 -39988 -28816 9595 16706 4216 15238 23851 -12252
746 -12252 -51807 -34135 6587 3294 -15303 8566 42387 19847 -29382 -34238 -7634 -5031 -11376
759 -11376 14669 42537 23985 -7464 -2926 6159 -20665 -37136 3472 48854 34052 -2119
771 -2119 2126 16869 -8227 -37932 -18046 19987 22362 11845 23615 24794 -14129 -41733 -17504
784 -17504 10273 -3371 -12927 20938 42769 4940 -39779 -32398 -7367 -13650 -19633 9230 31583
797 31583 10193 -14978 -9266 -9812 -36837 -39297 6408 36471 11547 -14009 496 8117 -26478
810b6478k3276K9940L4643k767q303J2816l729l5536j5486K6611J7157j3927N107
823c228L8596Q261m5578l1884J9000J9061j4186j976L3092J7000k5340k1769M879
836d072o597k3954Q798M4026J5598k8168j2299K0553m211m0558j1603L8713K7944
849B4170j0792n755J3807q557l5302r382K3581P194j2570J4981L4269p708m8053
862b0117j7227K5149Q568j9374O846L8850J0792k7891j6197O090q950j7790J7300
875a3951L8516M264k5132l1J7489j8078m0694K236M2122J6887j6066j147J5349
888B1764j2073l2858l953K1252L727n383K2361K7144j9327m1963k601K4008l972
901a874k0149J7226L9036M39l2374j2317O187j1674j4664K0627L1895l475j8636
$$ plain form
810 -26478 -49754 -19814 14829 12062 3759 16575 12846 -22690 -38176 -11565 5592 -8335 -3228
823 -3228 35368 43629 -1949 -33833 -14833 4228 -9958 -11934 21158 38158 12818 -8951 -4072
836 -4072 -10669 -34623 -25825 18201 33799 5631 -6668 13885 9674 -30884 -42487 -3774 24170
849 24170 13378 7623 21430 12873 -22429 -31811 -8230 -1036 -13606 1375 35644 27936 -20117
862 -20117 -37344 -12195 -3627 -23001 -16155 22695 33487 5596 -10601 -4511 -13461 -31251 -13951
875 -13951 24565 28829 3697 3666 21155 3077 -37617 -35381 6741 23628 7562 6415 21764
888 21764 9691 -23167 -27120 -5868 -2141 -7524 14837 41981 22654 -19309 -21910 2098 -1874
901 -1874 -22023 -4797 34239 34678 2304 -10013 -3826 -15500 -30164 -9537 22358 18883 247
914B47Q313J1024k8129l3759J7294M0444M791j7524P613J6617j8984l2737R58
927b3832J9936O07j218K4392J6872k6864l2993P245J7774j4350j4092K9203L5427
940C8107j0471l1748m435Q401j4267j1542K3469K6400p005j2005J0687O57l4213
953a7965k2976K6296L2512p058j4020J6430J3214k6419k9830P050J9349o2K448
966a031K3980Q794k8365k2189J1629P717j9950l622L6231K5646k1567k7560L431
979f856N871j8584p953K5430K1714p586o806J0298p893l3339r462L1294K1510
992A7638j3659n367K3177N340l3732k5302J4408J7024m380N112K2658K089k7985
1005b979j4437J2181j084j9654Q361L9565J4016k7968j8872J1644O38k2549l137
$$ plain form
914 247 8560 19584 -8545 -42304 -25010 15434 20225 2701 10314 26931 7947 -24790 -23832
927 -23832 -3896 -3289 -4507 19885 36757 9893 -23100 -15855 1919 -12431 -26523 2680 38107
940 38107 27636 -4112 -8547 -146 -14413 -25955 -2486 23914 16909 4904 15591 16248 -17965
953 -17965 -40941 -14645 17867 10809 -3211 13219 26433 14 -29816 -22766 -3417 -3479 -1031
966 -1031 22949 31743 3378 -18811 -7182 535 -19415 -23037 13194 38840 17273 -10287 -6856
979 -6856 -985 -19569 -27522 -2092 19622 12036 5230 15528 7635 -25704 -35166 -3872 17638
992 17638 3979 -1388 21789 27129 -6603 -31905 -17497 -473 -4853 259 22917 25006 -2979
1005 -2979 -17416 -5235 -6319 -25973 -17612 21953 35969 8001 -10871 773 1411 -21138 -24275
1018b4275K8975J7605r670l952P603j4350l0000M71K9947R512j4988N448K5210
1031B7536n658l7913j5112K0269J2726o923P715K2101j842k5774q826Q641p666
1044a0726j4298J7365L5238P73k9100q045J3321p511k5212M367L1827J2788j1239
1057I548j791N675j6425k4131P309K5237K032j0653J4436K1238j6592l7280m480
1070b5877K3337N109r602J1892K2006o442k4641n342N996j0464p771K4033K8863
1083C1097q861k4515K012J1504j6636k3312J3601L2411N193j4004J331M410j9350
1096e119k0260J0593J9983k846m903J9675J3086k5375l1335O376K1230l145q447
1109a0487J8010K0552j0756k4465k634M116j0320k293K5821J9999j4047j7207
$$ plain form
1018 -24275 4700 22305 12635 8683 16286 1936 -28064 -27593 2354 11866 -3122 2326 27536
1031 27536 21878 -16035 -31147 -10878 1848 -5075 2640 24741 22899 -2875 -11701 -3060 -10726
1044 -10726 -25024 -7659 27579 28352 -748 -8793 4528 -2983 -28195 -23828 7999 20787 9548
1057 9548 7757 13432 -2993 -27124 -19815 5422 7454 -3199 11237 32475 15883 -21397 -25877
1070 -25877 -2540 2569 -7033 4859 26865 20423 -4218 -9560 -3564 -14028 -21799 2234 31097
1083 31097 22236 -2279 -267 11237 -5399 -28711 -15110 17301 22494 8490 9821 14231 -5119
1096 -5119 -25379 -14786 5197 2351 -2552 17123 30209 4834 -26501 -20125 1105 -2040 -10487
1109 -10487 7523 28075 17319 -7146 -9780 -5664 -15984 -18277 7544 27543 13496 -3711
1121c711P809N114k4320j6443K2593K8931k405j3204N609K751k0743j5853J3293
1134a0579J5195l499J802K0587L960l0329k1615J3409J5257j0344l857K3812J6765
1147C0564j7851k2341J073K515j0873K197K5242J3034j6066j0058J0454m079k7261
1160b3450p517K8649K2174j0493r544R717L04k3376j2563J4683J2673l867O485
1173C875J8968m185k9981j1990J6930O632j3737L868K8312R521k3138j8178N290
1186g813R05j0788N243K4055P577j3984l955Q140j1409k5087K755L0611J2363
1199A8613j3709l102J3379n097k6070q467J6847J0061l438Q790J4377j0618k6277
1212a4711m497J4590j356j2571J2189K8134M73k6377j1401Q637j929j1753R024
$$ plain form
1121 -3711 4098 9212 -15108 -31551 -8958 19973 17568 4364 9973 12724 -8019 -23872 -10579
1134 -10579 4616 1117 2919 23506 27466 -2863 -24478 -11069 4188 -6156 -10013 13799 30564
1147 30564 12713 -9628 -8555 -6040 -16913 -14716 10526 23560 7494 -2564 7890 3811 -23450
1160 -23450 -30967 -2318 19856 9363 -181 9536 9840 -13536 -26099 -11416 1257 -2610 3875
1173 3875 22843 18658 -11323 -23313 -6383 249 -13488 -9620 18692 28213 5075 -13103 -7813
1186 -7813 -6908 -17696 -12453 11602 19179 5195 1240 9380 -2029 -27116 -24361 6250 18613
1199 18613 4904 1802 15181 10084 -15986 -24453 -7606 2455 -983 7807 22184 11566 -14711
1212 -14711 -19208 -4618 -5974 -18545 -6356 21778 22251 -4126 -15527 -6890 -8819 -20572 -11548
1225a1548K3318L826j2724j46M426j6564k0210J1422K8021L041j4054M830J3817
1238A7455j2732k6404j744J8850O771l235J0598J1917j3780k1660J404J0788o779
1251h551p705K0328K4534r016k5729l275R721p361j1728J2569K2526jj1736R57
1265E533K96j9186j3555J6697K1336l722r920J1407R358j9565k4141N546J9286
1278f30K368k920J2101Q861j5266j7783L649O234r347n79K3959J7217j6271k0750
1292i157L701P046j2658r254J7847K1198l791j0559K407k711j8412p173J8892
$$ plain form
1225 -11548 11770 15596 2872 2726 7152 -9412 -29622 -18200 9821 12862 -1192 3638 17455
1238 17455 4723 -21681 -23425 -4575 2196 -1039 9559 21476 7696 -13964 -12560 -1772 -8551
1251 -8551 -16256 4072 28606 19590 -6139 -9414 307 -7054 -18782 -6213 16313 16312 4576 5533
1265 5533 5829 -13357 -26912 -10215 11121 7399 -2521 8886 18244 -1321 -25462 -19916 -630
1278 -630 1738 -1182 10919 19780 4514 -13269 -9620 -3386 -12733 -13312 10647 27864 11593 -9157
1292 -9157 -5456 1590 -11068 -20322 -2475 18723 14932 4373 6780 4069 -14343 -21516 -2624
$$ [...]
8191B85
##END NTUPLES=NMR FID
##END=
