##TITLE=1H_SA_4.152
 D2O, 108 sc, 
 11.11.2019
##JCAMPDX= 6.0         $$ Bruker NMR JCAMP-DX V2.0
##DATA TYPE= NMR FID
##DATA CLASS= NTUPLES
##ORIGIN= UXNMR, Bruker Analytische Messtechnik GmbH
##OWNER= root
$$ XWIN-NMR		Version 3.5
$$ Mon Nov 11 14:46:13 2019 Russian Standard Time (UT+4h)  she@DPX200
##.OBSERVE FREQUENCY= 200.1315
##.OBSERVE NUCLEUS= ^1H
##.DELAY= (6, 6)
##.ACQUISITION MODE= SIMULTANEOUS
##.ACQUISITION SCHEME= undefined
##.AVERAGES= 8
##.DIGITISER RES= 18
##SPECTROMETER/DATA SYSTEM= spect
##.PULSE SEQUENCE= zg30
##.SOLVENT NAME= D2O
##.SHIFT REFERENCE= (INTERNAL, D2O, 0, 15.7039)
##AUDIT TRAIL= $$ (NUMBER, WHEN, WHO, WHERE, WHAT)
$$ ##TITLE= Audit trail, XWIN-NMR		Version 3.5
$$ ##JCAMPDX= 5.01
$$ ##ORIGIN= Bruker BioSpin GmbH
$$ ##OWNER= she
$$ F:/spectra/data/she/nmr/H-F/1/audita.txt
$$ ##AUDIT TRAIL=  $$ (NUMBER, WHEN, WHO, WHERE, WHAT)
(   1,<2019-11-11 14:45:15.87 +0400>,<she>,<DPX200>,
      <created by zg, POWCHK disabled, PULCHK disabled
       configuration hash MD5:
       00 E9 B6 7A A2 85 ED C7 34 08 36 98 17 FE 4E 26
       data hash MD5: 16K
       7F 4E B9 3F 4D 77 B0 05 71 ED 6A 31 7E 86 EF C4>)
$$ ##END=
$$ 
$$ hash MD5
$$ A7 03 DE 1F 19 03 76 BC 52 9B 32 EC D4 1C 73 98
##$RELAX= 
##$RELAX= 
##$RELAX= 
##$RELAX= 
##$RELAX= 
##$RELAX= 
$$ Bruker specific parameters
$$ --------------------------
##$DU= <F:/spectra>
##$EXPNO= 1
##$NAME= <H-F>
##$PROCNO= 1
##$TYPE= <nmr>
##$USER= <she>
##$AMP= (0..31)
100 100 100 100 100 100 100 100 100 100 100 100 100 100 100 100 100 100 
100 100 100 100 100 100 100 100 100 100 100 100 100 100 
##$AQSEQ= 0
##$AQ_mod= 1
##$AUNM= <au_zg>
##$AUTOPOS= <>
##$BF1= 200.13
##$BF2= 200.13
##$BF3= 200.13
##$BF4= 200.13
##$BF5= 200.13
##$BF6= 200.13
##$BF7= 200.13
##$BF8= 200.13
##$BYTORDA= 1
##$CFDGTYP= 0
##$CFRGTYP= 5
##$CHEMSTR= <none>
##$CNST= (0..31)
1 1 145 1 1 1 1 1 1 1 1 1 1 1 1 1 1 1 1 1 1 1 1 1 1 1 1 1 1 1 1 1 
##$CPDPRG= <>
##$CPDPRG1= <>
##$CPDPRG2= <>
##$CPDPRG3= <>
##$CPDPRG4= <mlev>
##$CPDPRG5= <mlev>
##$CPDPRG6= <mlev>
##$CPDPRG7= <mlev>
##$CPDPRG8= <mlev>
##$CPDPRGB= <>
##$CPDPRGT= <>
##$D= (0..31)
0 1.2 0 0 0 0 0 0 0 0.06 0 0.03 0 0 0 0 0.0002 0 0 0 0 0 0 0 0 0 0 0 0 
0 0 0 
##$DATE= 1573469115
##$DBL= (0..7)
120 120 120 120 120 120 120 120 
##$DBP= (0..7)
150 150 150 150 150 150 150 150 
##$DBP07= 0
##$DBPNAM0= <>
##$DBPNAM1= <>
##$DBPNAM2= <>
##$DBPNAM3= <>
##$DBPNAM4= <>
##$DBPNAM5= <>
##$DBPNAM6= <>
##$DBPNAM7= <>
##$DBPOAL= (0..7)
0.5 0.5 0.5 0.5 0.5 0.5 0.5 0.5 
##$DBPOFFS= (0..7)
0 0 0 0 0 0 0 0 
##$DE= 6
##$DECBNUC= <off>
##$DECIM= 24
##$DECNUC= <off>
##$DECSTAT= 4
##$DIGMOD= 1
##$DIGTYP= 9
##$DL= (0..7)
0 120 120 120 120 120 120 120 
##$DP= (0..7)
150 150 150 150 150 150 150 150 
##$DP07= 0
##$DPNAME0= <>
##$DPNAME1= <>
##$DPNAME2= <>
##$DPNAME3= <>
##$DPNAME4= <>
##$DPNAME5= <>
##$DPNAME6= <>
##$DPNAME7= <>
##$DPOAL= (0..7)
0.5 0.5 0.5 0.5 0.5 0.5 0.5 0.5 
##$DPOFFS= (0..7)
0 0 0 0 0 0 0 0 
##$DQDMODE= 0
##$DR= 18
##$DS= 0
##$DSLIST= <SSSSSSSSSSSSSSS>
$$ [...]
##$SUBNAM2= <"">
##$SUBNAM3= <"">
##$SUBNAM4= <"">
##$SUBNAM5= <"">
##$SUBNAM6= <"">
##$SUBNAM7= <"">
##$SUBNAM8= <"">
##$SUBNAM9= <"">
##$SW= 24.0689530833862
##$SWIBOX= (0..15)
0 0 2 0 0 0 0 0 0 0 0 0 0 0 0 0 
##$SW_h= 4816.95568400771
##$TD= 16384
##$TD0= 1
##$TE= 0
##$TE2= 300
##$TE3= 300
##$TEG= 300
##$TL= (0..7)
0 120 120 120 120 120 120 120 
##$TP= (0..7)
150 150 150 150 150 150 150 150 
##$TP07= 0
##$TPNAME0= <>
##$TPNAME1= <>
##$TPNAME2= <>
##$TPNAME3= <>
##$TPNAME4= <>
##$TPNAME5= <>
##$TPNAME6= <>
##$TPNAME7= <>
##$TPOAL= (0..7)
0.5 0.5 0.5 0.5 0.5 0.5 0.5 0.5 
##$TPOFFS= (0..7)
0 0 0 0 0 0 0 0 
##$TUNHIN= 0
##$TUNHOUT= 0
##$TUNXOUT= 0
##$USERA1= <user>
##$USERA2= <user>
##$USERA3= <user>
##$USERA4= <user>
##$USERA5= <user>
##$V9= 5
##$VALIST= <valist>
##$VCLIST= <CCCCCCCCCCCCCCC>
##$VD= 0
##$VDLIST= <DDDDDDDDDDDDDDD>
##$VPLIST= <PPPPPPPPPPPPPPP>
##$VTLIST= <TTTTTTTTTTTTTTT>
##$WBST= 1024
##$WBSW= 4
##$XGAIN= (0..3)
0 0 0 0 
##$XL= 0
##$YL= 0
##$YMAX_a= 213151
##$YMIN_a= -218436
##$ZGOPTNS= <>
##$ZL1= 120
##$ZL2= 120
##$ZL3= 120
##$ZL4= 120
##$ABSF1= 10
##$ABSF2= 0
##$ABSG= 5
##$ABSL= 3
##$ALPHA= 0
##$AQORDER= 0
##$ASSFAC= 0
##$ASSFACI= 0
##$ASSFACX= 0
##$ASSWID= 0
##$AUNMP= <proc_1d>
##$AZFE= 0.1
##$AZFW= 0.1
##$BCFW= 1
##$BC_mod= 2
##$BYTORDP= 1
##$COROFFS= 0
##$CY= 11.3945322036743
##$DATMOD= 1
##$DC= 2
##$DFILT= <>
##$DTYPP= 0
##$F1P= 19.5091578491511
##$F2P= -0.509923556040331
##$FCOR= 0.5
##$FTSIZE= 0
##$FT_mod= 4
##$GAMMA= 1
##$GB= 0.15
##$INTBC= 1
##$INTSCL= 1
##$ISEN= 128
##$LB= 0.24
##$LEV0= 0
##$LPBIN= 0
##$MAXI= 10000
##$MC2= 0
##$MEAN= 0
##$ME_mod= 0
##$MI= 1.114404
##$NCOEF= 0
##$NC_proc= 0
##$NLEV= 6
##$NOISF1= 3.799351
##$NOISF2= 2.8
##$NSP= 1
##$NTH_PI= 0
##$NZP= 0
##$OFFSET= 15.70392
##$PC= 1
##$PHC0= -9458.886
##$PHC1= 16.60088
##$PH_mod= 1
##$PKNL= yes
##$PPARMOD= 0
##$PSCAL= 0
##$PSIGN= 0
##$REVERSE= no
##$SF= 200.130013532006
##$SI= 16384
##$SIGF1= 3
##$SIGF2= 2
##$SINO= 400
##$SIOLD= 16384
##$SREGLST= <1H.CDCl3>
##$SSB= 0
##$STSI= 0
##$STSR= 0
##$SW_p= 3612.71676300578
##$SYMM= 0
##$S_DEV= 0
##$TDeff= 0
##$TDoff= 0
##$TI= <>
##$TILT= no
##$TM1= 0
##$TM2= 0
##$TOPLEV= 0
##$USERP1= <user>
##$USERP2= <user>
##$USERP3= <user>
##$USERP4= <user>
##$USERP5= <user>
##$WDW= 1
##$XDIM= 8192
##$YMAX_p= 0
##$YMIN_p= 0
$$ End of Bruker specific parameters
$$ ---------------------------------
##NTUPLES= NMR FID
##VAR_NAME=  TIME,          FID/REAL,        FID/IMAG
##SYMBOL=    X,             R,               I
##VAR_TYPE=  INDEPENDENT,   DEPENDENT,       DEPENDENT
##VAR_FORM=  AFFN,          ASDF,            ASDF
##VAR_DIM=   8192,          8192,            8192
##UNITS=     SECONDS,       ARBITRARY UNITS, ARBITRARY UNITS
##FACTOR=    0.0002076,     1,               1
##FIRST=     0,             0,               0
##LAST=      1.7004516,     0,               0
##MIN=       0,             -218436,         0
##MAX=       1.7004516,     213151,          0
$$ Real data points
##PAGE= N=1
##DATA TABLE= (X++(R..R)), XYDATA
$$ plain form
0 0 0 0 0 0 0 0 0 0 0 0 0 0 0 0 0 0 0 1 -7 3 -7 8 -8 8 -9 11 -15 16 -18 19 -24 28 -30 35 -39 43 -49 52 -60 66
40 66 -74 82 -92 101 -110 122 -138 150 -166 182 -200 221 -242 263 -284 301 -294 225 78 -1487 20351
61 20351 162808 85203 -82595 -34222 18382 -121819 -218436 -89114 14542 -34713 -19626
72 -19626 85215 10979 -186419 -171127 5174 1559 -109390 -14418 160182 76185 -133348
83 -133348 -137338 -34115 -68160 -104205 25397 112208 4723 -66342 8234 -13803 -164366
94 -164366 -131228 99803 163910 15846 -11219 101753 58013 -107077 -88492 67769 92101
105 92101 40176 98862 129052 -23797 -136496 -33720 43246 -55724 -70911 104410 154565
116 154565 -38890 -155003 -59678 -16791 -99280 -67780 75109 75317 -39159 -41179 -4538 -113601
$$ packed form
0@%%%%%%%%%%%%%%%%%JqJ0j0J5j6J6j7K0k6L1l4L7m3N2n8O5p4Q2r2J01j12J26
40F6j40J56j74J93k11K32k60K88l16L48l82M21m63N05n47N85n95N19j47j565K1838
61B0351J42457p7605j67798M8373N2604j40201r6617J29322J03656m9255J5087
72a9626J04841p4236j97398J5292J76301l615j10949R4972J74600q3997k09533
83a33348l990J03223l4045l6045J29602Q6811j07485p1065P4576k2037j50563
94a64366L3138K31031O4107j48064k7065J12972m3740j65090J8585J56261K4332
105I2101n1925N8686L0190j52849j12699J02776P6966r8970j5187J75321N0155
116A54565j93455j16113R5325M2887q2489L1500J42889K08j14476k020L6641j09063
$$ plain form
128 -113601 -197787 -51320 101855 18222 -90211 -7252 47951 -104212 -209853 -85403 34907
139 34907 -4323 -14945 66255 29505 -113812 -114419 -2737 -20534 -90631 20585 168882 76182
151 76182 -105143 -83277 21793 -26918 -90311 22715 134201 67591 -10164 23630 1285
162 1285 -109616 -81750 85942 114656 -2232 2454 104334 35310 -139851 -124980 29950
173 29950 54244 -12300 27249 78655 -19977 -119582 -64089 -12512 -73896 -56286 99016 128805
185 128805 -37629 -114706 -14366 9783 -92285 -73907 79938 111380 6761 -21787 7695
196 7695 -62561 -126819 -24904 86086 28902 -28889 60128 93087 -61848 -153664 -25399
207 -25399 87319 34464 10327 99401 101372 -22393 -59247 9948 4224 -37535 54404 162216
$$ packed form
128a13601q4186J46467J53175q3633j08433Q2959N5203j52163j05641J24450J20310
139C4907l9230j0622Q1200l6750j43317o07J11682j7797p0097J11216J48297r2700
151G6182j81325K1866J05070m8711o3393J13026J11486o6610p7755L3794k2345
162A285j10901K7866J67692K8714j16888M686J01880o9024j75161J4871J54930
173B9950K4294o6544L9549N1406r8632r9605N5493N1577o1384J7610J55302K9789
185A28805j66434p7077J00340K4149j02068J8378J53845L1442j04619k8548K9482
196G695p0256o4258J01915J10990n7184n7791Q9017L2959j54935r1816J28265
207b5399J12718n2855k4137Q9074J971j23765l6854O9195n724m1759R1939J07812
$$ plain form
219 162216 74385 -68919 -37314 39483 -38002 -113185 1822 126582 67374 -24291 -832
230 -832 2211 -83354 -82235 37569 71241 2734 26595 105593 27218 -126903 -99196 42615
242 42615 48880 -25633 21648 100411 27035 -86197 -64964 -12959 -43653 -26731 91211 114811
254 114811 -7953 -54708 27400 21947 -84263 -55868 103828 137409 28156 -4990 38955
265 38955 -6579 -82103 -27209 64908 42495 10265 76407 83293 -56416 -126129 -13210 66904
277 66904 -680 -18281 87613 105101 -23054 -84435 -23263 -8026 -40832 20646 106950 51000
289 51000 -49016 -21541 22060 -63762 -121878 599 116502 51009 -37894 -121 22537
300 22537 -63881 -94966 -616 52372 14976 31203 84187 14853 -106366 -75628 35220 22097
$$ packed form
219A62216q7831j43304L1605P6797p7485p5183J15007J24760n9208r1665K3459
230h32L043q5565J119J19804L3672o8507K3861P8998p8375j54121K7707J41811
242D2615O265p4513M7281P8763p3376j13232K1233N2005l0694J6922J17942K3600
254A14811j22764m6755Q2108n453j06210K8395J59696L3581j09253l3146M3945
265C8955m5534p5524N4894R2117k2413l2230O6142O886j39709o9713J12919Q0114
277F6904o7584j7601J05894J7488j28155o1381O1172J5237l2806O1478Q6304n5950
289E1000j00016K7475M3601q5822n8116J22477J15903o5493q8903L7773K2658
300B2537q6418l1085R4350N2988l7396J6227N2984o9334j21219L0738J10848j3123
$$ plain form
312 22097 -41409 26425 116797 42802 -80251 -65939 -2862 -25130 -30151 58391 92782 9903
324 9903 -28758 19202 -7069 -98384 -58891 84937 101992 -2786 -18683 41266 -1683 -96928
336 -96928 -66136 32236 37359 9364 50677 54980 -50419 -102981 -18371 30074 -30488 -24730
348 -24730 88677 101193 -30020 -90226 -21283 1568 -42932 -7315 78951 59305 -17325 -10799
360 -10799 8397 -65345 -102377 9376 100248 34160 -32285 22202 44303 -56634 -106173 -13915
372 -13915 54466 23292 20970 63654 18704 -75832 -61559 13094 -5221 -45026 33574 114751
384 114751 34792 -80350 -55948 9302 -23279 -48990 32150 89006 31729 -15290 7868 -14740
396 -14740 -82798 -44985 70211 76946 -4537 3463 64271 9219 -95763 -65420 40736 51833
$$ packed form
312B2097o3506O7834R0372p3995j23053J4312O3077k2268n021Q8542L4391q2879
324I903l8661M7960k6271r1315L9493J43828J7055j04778j5897N9949m2949r5245
336i6928L0792R8372N123k7995M1313M303j05399n2562Q4610M8445o0562N758
348b4730J13407J2516j31213o0206O8943K2851m4500L5617Q6266j9646p6630O526
360a0799J9196p3742l7032J11753R0872o6088o6445N4487K2101j00937m9539R2258
372a3915O8381l1174k322M2684m4950r4536J4273P4653j8315l9805P8600Q1177
384A14751p9959j15142K4402O5250l2581k5711Q1140N6856n7277m7019K3158k2608
396a4740o8058L7813J15196O735q1483Q000O0808n5052j04982L0343J06156J1097
$$ plain form
408 51833 13278 42240 62561 -12844 -67900 -18488 13404 -27403 -5591 94481 93922 -27582
420 -27582 -71202 -1640 8608 -53317 -26744 71339 74489 -741 -14413 -453 -51529 -81108
432 -81108 2244 70933 20701 -17528 40094 46762 -62413 -108660 -12342 55819 16199 4899
444 4899 57073 39823 -45565 -55893 -2556 -7935 -27352 44714 108114 34291 -57768 -25638
456 -25638 25018 -25150 -58215 28902 100620 47814 -11663 4418 -2891 -58169 -39765 47174
468 47174 57949 5426 23522 68614 2541 -95319 -59656 39705 37909 -9731 23886 63201
480 63201 -484 -71596 -47320 -14130 -35750 -15667 62785 59172 -36283 -63118 -5438 -14253
492 -14253 -80140 -45237 62671 70476 -8339 -26020 399 -34422 -72679 -17925 44240 20123
$$ packed form
408E1833l8555K8962K0321p5405n5056M9412L1892m0807K1812J00072n59j21504
420b7582m3620O9562J0248o1925K6573R8083L150p5230j3672J3960n1076k9579
432h1108Q3352O8689n0232l8229N7622O668j09175m6247R6318O8161l9620j1300
444D899N2174j7250q5388j0328N3337n379j9417P2066O3400p3823r2059L2130
456b5638N0656n0168l3065Q7117P1718n2806n9477J6081p309n5278J8404Q6939
468D7174J0775n2523J8096M5092o6073r7860L5663R9361j796m7640L3617L9315
480F3201o3685p1112K4276L3190k1620K0083P8452l613r5455k6835N7680q815
492a4253o5887L4903J07908P805p8815j7681K6419l4821l8257N4754O2165k4117
$$ plain form
504 20123 495 45925 38299 -62628 -96188 -5565 45782 -1636 -6673 61468 57158 -33490
516 -33490 -62279 -13031 -3221 -17511 35369 87063 33627 -35671 -10321 17279 -42573 -69851
528 -69851 21900 90004 30960 -31168 -8190 -4232 -64173 -70926 -120 26972 -4394 8522
540 8522 37163 -23383 -102520 -65278 15624 2910 -36379 13716 64365 734 -79571 -59790
552 -59790 -15917 -30122 -23286 39832 48940 -18330 -40186 -4041 -24821 -80921 -37565 64909
564 64909 65947 -10220 -16873 21471 -12404 -66918 -29189 39889 37315 18962 47197 38111 -42119
577 -42119 -67697 2160 32765 -11468 -2615 71805 63538 -34921 -67785 -15919 -2937 -28551
589 -28551 5270 58848 29712 -27422 -18143 -7382 -60006 -74286 13445 69861 13174 -33283
$$ packed form
504B0123j9628M5430p626j00927l3560R0623N1347m7418n037O8141m310r0648
516c3490k8789M9248R810j4290N2880N1694n3436o9298K5350K7600n9852k7278
528f9851R1751O8104n9044o2128K2978L958n9941o753P0806K7092l1366J2916
540H522K8641o0546p9137L7242Q0902j2714l9289N0095N0649o3631q0305J9781
552e9790M3873j4205O836O3118R108o7270k1856L6145k0780n6100M3356J02474
564F4909J038p6167o653L8344l3875n4514L7729O9078k574j8353K8235r086q0230
577d2119k5578O9857L0605m4233Q853P4420q267r8459l2864N1866J2982k5614
589b8551L3821N3578k9136n7134R279J0761n2624j4280Q7731N6416n6687m6457
$$ plain form
601 -33283 4488 11209 -58454 -77969 -5109 37349 12823 14709 38624 -4157 -67934 -43979
613 -43979 13490 -1627 -24893 33999 81045 13255 -64693 -38430 8150 -12164 -19826 41073
625 41073 70723 21548 -8114 10662 -8353 -50086 -9911 73189 67411 4210 10602 46798
637 46798 64 -67980 -35119 38748 39212 10670 28926 31165 -30062 -60625 -16005 6140 -22391
650 -22391 233 69994 56509 -34299 -55787 -1075 5669 -31580 -2081 63598 52430 -4148
662 -4148 -10717 -3218 -41769 -52552 16287 59784 15385 -11288 28979 26487 -50253 -68494 9199
675 9199 55008 25986 22127 54611 31342 -28000 -23868 17939 11166 1027 54738 88844 22448
688 22448 -44336 -16438 17429 -19038 -34989 30054 70160 22588 -18562 -6917 -15971 -50557
$$ packed form
601c3283L7771O721o9663j9515P2860M2458k4526J886K3915m2781o3777K3955
613d3979N7469j5117k3266N8892M7046o7790p7948K6263M6580k0314p662O0899
625D1073K9650m9175k9662J8776j9015m1733M0175Q3100n778o3201O392L6196
637D6798m6734o8044L2861P3867M64k8542J8256K239o1227l0563M4620K2145k8531
650b2391K2624O9761j3485r0808k1488N4712O744l7249K9499O5679j1168n6578
662d148o569P499l8551j0783O8839M3497m4399k6673M0267k492p6740j8241P7693
675I199M5809k9022l859L2484k3269n9342M132M1807o773j0139N3711L4106o6396
688B2448o6784K7898L3867l6467j5951O5043M0106m7572m1150J1645r054l4586
$$ plain form
700 -50557 -24445 40926 40679 -333 14515 41357 -12347 -75963 -37920 34682 28678 -4280 19891
713 19891 37641 -14575 -57769 -30625 -6762 -20290 2178 58045 44054 -29285 -40631 5722
725 5722 -1296 -42092 -6365 69075 62974 2705 -7005 8904 -18922 -37238 11337 51914 26130
738 26130 10595 41796 27022 -47440 -60878 11221 44245 6585 5238 48077 32288 -34842
750 -34842 -46978 -9103 -5142 -12468 28714 56739 5833 -44156 -20097 -1322 -43713 -52732 19591
763 19591 60834 10623 -31289 -12794 -13078 -51947 -43495 12696 25713 550 11203 26657 -24380
776 -24380 -75960 -37441 23208 10352 -16066 21232 49056 -4247 -56177 -32567 598 -7811
788 -7811 4212 49932 45876 -8218 -19802 8384 -9359 -45591 -5360 65284 52933 -7996
$$ packed form
700e0557K6112O5371k47m1012J4848K6842n3704o3616L8043P2602o004l2958K4171
713A9891J7750n2216m3194K7144K3863j3528K2468N5867j3991p3339j1346M6353
725E722p018m0796L5727P5440o101o0269r710J5909k7826j8316M8575M0577k5784
738B6130j5535L1201j4774p4462j3438P2099L3024l7660j347M2839j5789o7130
750c4842j2136L7875L961p326M1182K8025n0906m9989K4059J8775m2391r019P2323
763A9591M1243n0211m1912J8495k84l8869Q452N6191J3017k5163J0653J5454n1037
776b4380n1580L8519O0649j2856k6418L7298K7824n3303n1930K3610L3165q409
788g811J2023M5720m056n4094j1584K8186j7743l6232M0231P0644j2351o0929
$$ plain form
800 -7996 -11892 10567 -19366 -51883 -15766 30956 20842 6701 26242 11304 -49537 -57581 1011
813 1011 21605 -11277 -506 49397 32004 -40467 -55630 -13994 -6212 -20571 9199 41536
825 41536 9370 -32416 -20407 -13322 -50226 -50488 19934 53984 6070 -25030 2821 3638 -44140
838 -44140 -45735 12600 37483 16528 18934 30534 -8971 -51649 -24197 18964 4045 -10929
850 -10929 33245 57071 -1603 -54094 -27654 5900 -9183 -7910 36570 47192 4421 -14585
862 -14585 0 -16777 -42839 -4107 54730 40436 -9036 -2449 19792 -18000 -59689 -24182
874 -24182 29369 24043 4322 18810 12993 -34632 -47441 -6301 8151 -12798 8114 55016
886 55016 33307 -35878 -44340 -1441 790 -22421 5214 47832 29002 -13711 -13885 -9010 -36933
$$ packed form
800g996l896K2459k9933l2517L6117M6722j0114j4141J9541j4938o0841q044N8592
813A011K0594l2882J0771M9903j7393p2471j5163M1636P782j4359K9770L2337
825D1536l2166m1786J2009P085l6904k62P0422L4050m7914l1100K7851Q17m7778
838d4140j595N8335K4883k0955K406J1600l9505m2678K7452M3161j4919j4974
850a0929M4174K3826n8674n2491K6440L3554j5083J273M4480J0622m2771j9006
862a4585J4585j6777k6062L8732N8837j4294m9472O587K2241l7792m1689L5507
874b4182N3551n326j9721J4488n817m7625j2809M1140J4452k0949K0912M6902
886E5016k1709o9185q462M2899K231k3211K7635M2618j8830m2713j74M875k7923
$$ plain form
899 -36933 -34966 22481 48273 9114 -9320 19901 11347 -44154 -47196 14358 40241 15174 12648
912 12648 29789 2970 -39005 -27051 5219 -2096 -6447 35441 52348 -4019 -47475 -18531
924 -18531 7042 -17819 -20039 30839 51694 10385 -16469 -5927 -15165 -36527 -8310 39203
936 39203 30251 -3410 8380 22797 -20985 -60641 -22356 30840 21703 -839 18109 23854 -19072
949 -19072 -42632 -14326 2675 -7880 12453 49827 28167 -29748 -32755 2353 -6398 -32648
961 -32648 -349 49175 32631 -13882 -17694 -8019 -29252 -34406 9612 34984 9871 418 22681
974 22681 6010 -47168 -45362 13405 33203 4347 6165 32964 12370 -35737 -34639 -3395 -2183
987 -2183 -3593 30053 42930 -2262 -35093 -11346 1979 -27630 -24511 31458 52542 8890 -19339
$$ packed form
899c6933J967N7447K5792l9159j8434K9221q554n5501l042O1554K5883k5067k526
912A2648J7141k6819m1975J1954L2270p315m351M1888J6907n6367m3456K8944
924a8531K5573k4861k220N0878K0855m1309k6854J0542r238k1362K8217M7513
936C9203q952l3661J1790J4417m3782l9656L8285N3196r137k2542J8948N745m2926
949a9072k3560K8306J7001j0555K0333L7374k1660n7915l007L5108q751k6250
961c2648L2299M9524j6544m6513l812R675k1233n154M4018K5372k5113r453K2263
974B2681j6671n3178J806N8767J9798k8856J818K6799k0594m8107J098L1244J212
987b183j410L3646J2877m5192l2831K3747J3325k9609L119N5969K1084m3652k8229
$$ plain form
1000 -19339 -4394 -8252 -33993 -18190 24122 26237 3838 12277 17975 -24557 -56567 -18883 24882
1013 24882 10448 -7399 19872 31254 -14277 -46356 -21487 1244 -5673 7615 38717 25252
1025 25252 -18931 -22380 235 -14383 -35525 1842 50682 31961 -13223 -11992 2836 -20263
1037 -20263 -35205 680 32146 19199 9422 23597 6518 -38404 -34642 13935 24895 -245
1049 -245 10756 42509 19611 -33177 -35154 -1517 2296 -4079 21701 38738 6398 -22615 -9156
1062 -9156 -5159 -31112 -23117 31613 46810 4249 -17115 3184 -2198 -35448 -27053 17565 28347
1075 28347 9306 12302 15742 -18421 -44540 -14869 17622 4029 -3741 29573 38189 -10458 -42447
1088 -42447 -15922 7994 -2586 4020 35769 33737 -2648 -12195 363 -13389 -27253 9144
$$ packed form
1000a9339J4945l858k5741J5803M2312K115k2399Q439N698m2532l2010L7684M3765
1013B4882j4434j7847K7271J1382m5531l2079K4869K2731o917J3288L1102j3465
1025B5252m4183l449K2615j4618k1142L7367M8840j8721m5184J231J4828k3099
1037b0263j4942L5885L1466j2947r777J4175j7079m4922L762M8577J0960k5140
1049b45J1001L1753k2898n2788j977L3637L813o375K5780J7037l2340k9013J3459
1062i156L997k5953P995N4730J5197m2561k1364K0299n382l3250Q395M4618J0782
1075B8347j9041K996L440l4163k6119K9671L2491j3593p770L3314Q616m8647l1989
1088d2447K6525K3916j0580O606L1749k032l6385r547J2558j3752j3864L6397
$$ plain form
1100 9144 50167 30389 -6642 1284 14649 -15663 -37053 -2375 34090 23866 10050 19662
1112 19662 8585 -28949 -30498 4772 12359 -4309 12972 42495 16278 -34939 -33474 356
1124 356 -319 -13123 11781 37922 14179 -16534 -12270 -9769 -29409 -20151 25658 37111 2417
1137 2417 -9680 10908 -1087 -39287 -30496 17004 30526 9310 9746 18665 -6626 -33475 -15091
1150 -15091 10736 3596 3407 35001 39287 -8458 -35021 -8045 9018 -9119 -4321 32661 37798
1163 37798 1658 -15612 -6490 -15662 -27115 758 34101 19864 -6351 3817 10790 -24267
1175 -24267 -45662 -8761 27605 15660 -403 13105 9829 -25038 -35366 -9251 1220 -7157
1187 -7157 10624 34859 9083 -34213 -29479 -1431 -9054 -23287 6409 38070 17423 -16179
$$ packed form
1100I144M1023j9778l7031P926J3365l0312k1390L4678L6465j0224j3816R612
1112A9662j1077l7534j549L5270P587j6668J7281K9523k6217n1217J465L3830
1124C56o75j2804K4904K6141k3743l0713M264K501j9640R258M5809J1453l4694
1137B417j2097K0588j1995l8200Q791M7500J3522k1216M36Q919k5291k6849J8384
1150a5091K5827p140j89L1594M286m7745k6563K6976J7063j8137M798L6982N137
1163C7798l6140j7270R122r172j1453K7873L3343j4237k6215J0168O973l5057
1175b4267k1395L6901L6366j1945j6063J3508l276l4867j0328K6115J0471q377
1187g157J7781K4235k5776m3296M734K8048p623j4233K9696L1661k0647l3602
$$ plain form
1199 -16179 -14474 -7974 -23532 -19241 17790 31021 7361 1167 16049 -1397 -38750 -27771 18140
1212 18140 27218 4433 7409 22347 -241 -32481 -23793 1014 -227 1245 26763 28776 -10776
1225 -10776 -31884 -9611 -1126 -21897 -13668 28158 34246 -3028 -20981 -9331 -14555 -29694 -10081
1238 -10081 20948 15441 -2791 4283 4935 -29085 -45867 -10214 20306 6020 -5228 14431 15492
1251 15492 -20939 -36862 -12712 2574 -2069 11799 32013 13819 -20256 -17629 1370 -10596
1263 -10596 -21302 11740 42538 20528 -13358 -9813 -851 -18776 -22958 8530 26977 11659
1275 11659 4805 13752 -4309 -36144 -25154 13841 18496 -979 8906 27222 4161 -32986 -26463
1288 -26463 -259 835 -1117 19648 25407 -4665 -24392 -10293 -8192 -25822 -13103 27668 31660
$$ packed form
1199a6179J705O500j5558M291L7031J3231k3660o194J4882j7446l7353J0979M5911
1212A8140R078k2785K976J4938k2588l2240Q688K4807j241J472K5518K013l9552
1225a0776k1108K2273Q485k0771Q229M1826O088l7274j7953J1650n224j5139J9613
1238a0081L1029n507j8232P074O52l4020j6782L5653L0520j4286j1248J9659J061
1251A5492l6431j5923K4150J5286m643J3868K0214j8194l4075K627J8999j1966
1263a0596j0706L3042L0798k2010l3886L545Q962j7925m182L1488J8447j5318
1275A1659o854Q947j8061l1835J0990L8995M655j9475R885J8316k3061l7147O523
1288b6463K6204J094j952K0765N759l0072j9727J4099K101j7630J2719M0771L992
$$ plain form
1301 31660 -4216 -17046 -1959 -8003 -28736 -13996 20151 22813 6805 9587 9483 -18794 -32702
1314 -32702 -3830 19476 6746 2048 25529 24583 -14721 -33338 -8586 7541 73 8213 29831
1327 29831 20114 -9535 -12416 -1627 -12703 -18490 13574 40239 18568 -9634 -2172 5044 -18186
1340 -18186 -27123 4154 27386 14873 4765 10911 -2426 -29487 -23264 6986 10266 -2330 11830
1353 11830 30027 4015 -32353 -24368 3021 951 -4538 16060 29546 5890 -15473 -8585 -7382
1366 -7382 -20412 -7243 28219 30330 93 -6863 7435 -4420 -29466 -15473 20971 25591 8060
1379 8060 8517 11287 -11843 -27684 -7650 11660 3701 4859 27433 24003 -14971 -30652 -6193
1392 -6193 5816 -6502 1498 27381 23726 -6057 -15159 -6814 -14070 -18666 8182 30319 13431
$$ packed form
1301C1660l5876j2830J5087o044k0733J4740L4147K662j6008K782j04k8277j3908
1314c2702K8872K3306j2730m698K3481r46l9304j8617K4752J6127p468Q140K1618
1327B9831r717k9649k881J0789j1076n787L2064K6665k1671k8202P462P216k3230
1340a8186q937L1277K3232j2513j0108O146j3337k7061O223L0250L280j2596J4160
1353A1830J8197k6012l6368P985K7389k070n489K0598J3486k3656k1363O888J203
1366g382j3030J3169L5462K111l0237o956J4298j1855k5046J3993L6444M620j7531
1379H060M57K770k3130j5841K0034J9310p959J158K2574l430l8974j5681K4459
1392f193J2009j2318Q000K5883l655k9783r102Q345p256m596K6848K2137j6888
$$ plain form
1405 13431 -7463 1337 3881 -22717 -31644 1373 25805 12758 1739 10701 3287 -22876 -23480
1418 -23480 369 6676 240 15465 29156 3992 -27830 -19268 3209 -3385 -10591 13982 32019
1431 32019 9829 -15516 -11547 -7656 -18603 -9678 19985 24634 2464 -1587 8865 -7241 -32397
1444 -32397 -16890 19207 21507 3091 6222 13588 -7385 -28061 -14740 4692 2301 4785 23667
1457 23667 19140 -14645 -26475 -5702 235 -13295 -2535 27858 25553 -5896 -16143 -6121
1469 -6121 -10904 -18315 2506 24355 14549 -1156 5269 3105 -23503 -30130 2119 22924 8466
1482 8466 464 14023 8855 -20193 -26402 -3833 6112 2307 13839 25613 5470 -21207 -14620
1495 -14620 1090 -8488 -12870 15095 33468 10409 -14727 -9261 -3464 -16710 -13419 13602 23196
$$ packed form
1405A3431k0894Q800K544k6598q927L3017K4432j3047j1019Q962p414k6163o04
1418b3480K3849O307o436J5225J3691k5164l1822Q562K2477o594p206K4573J8037
1431C2019k2190k5345L969L891j0947Q925K9663M649k2170m051J0452j6106k5156
1444c2397J5507L6097K300j8416L131P366k0973k0676J3321J9432k391K484J8882
1457B3667m527l3785j1830K0773N937j3530J0760L0393k305l1449j0247J0022
1469f121m783p411K0821K1849r806j5705O425k164k6608o627L2249K0805j4458
1482H466q002J3559n168k9048o209K2569R945l805J1532J1774k0143k6677O587
1495a4620J5710r578m382K7965J8373k3059k5136N466N797j3246L291K7021R594
$$ plain form
1508 23196 7084 2552 8339 -7840 -29639 -14494 17147 16845 1092 9418 20278 -2704 -27999
1521 -27999 -16759 5037 4592 4847 20912 19756 -7664 -19202 -4568 -3434 -15218 -1273 28905
1534 28905 25459 -5659 -13306 -1383 -7998 -20425 -4067 20957 17259 3162 5341 2218 -20715
1547 -20715 -26599 1181 17791 5067 2166 18649 12578 -19064 -27233 -4176 7077 1123 10268
1560 10268 24135 10202 -13794 -12135 -2113 -10849 -12104 15970 31883 9755 -11676 -3558 508
1573 508 -16234 -17443 10046 24568 10491 3144 7270 -5995 -25494 -13985 10997 10780 144
1586 144 12173 21762 -3491 -29233 -17191 3915 1320 -1322 15405 19918 -3366 -18037 -9323
1599 -9323 -8365 -17304 -2827 24358 19897 -6142 -10239 1221 -9717 -25646 -9008 19066 17857
$$ packed form
1508B3196j6112m532N787j6179k1799J5145L1641l02j5753Q326J0860k2982k5295
1521b7999J1240K1796m45K55J6065j156k7420j1538J4634J134j1784J3945L0178
1534B8905l446l1118p647J1923o615j2427J6358K5024l698j4097K179l123k2933
1547b0715n884K7780J6610j2724k901J6483o071l1642q169K3057J1253n954R145
1560A0268J3867j3933k3996J659J0022q736j255K8074J5913k2128k1431Q118M066
1573E08j6742j209K7489J4522j4077p347M126j3265j9499J1509K4982k17j0636
1586A44J2029R589k5253k5742J2042K1106k595k642J6727M513k3284j4671Q714
1599i323R58q939J4477K7185m461k6039m097J1460j0938j5929J6638K8074j209
$$ plain form
1612 17857 2539 3431 2665 -16584 -24471 -3143 11192 2914 4813 20777 12446 -19098 -25642 -3154
1626 -3154 5237 -3380 5474 23243 13784 -10360 -13989 -5485 -11858 -11766 11739 26059 7219 -9339
1640 -9339 -1515 -741 -21473 -23106 6145 21377 7008 -1046 4986 -4715 -24395 -19195 2356 4662
1654 4662 -1062 11318 18163 -6374 -28949 -16619 1448 -4073 -7280 13186 21794 -162 -17368
1667 -17368 -11303 -8284 -15797 -4279 19112 17823 -2034 -4051 3611 -10822 -26167 -8430 19675
1680 19675 17464 1461 4796 7953 -10707 -23260 -7256 8048 4051 6718 20056 11743 -16289
1693 -16289 -21792 -2392 1385 -8364 2552 24102 15614 -10529 -15292 -6378 -11118 -13885 5575
1706 5575 20406 7547 -5498 597 -2506 -23317 -22883 5429 19150 4918 -768 9162 957
$$ packed form
1612A7857j5318Q92p66j9249p887K1328J4335q278J899J5964q331l1544o544K2488
1626c154Q391q617Q854J7769r459k4144l629Q504o373R2K3505J4320j8840j6558
1640i339P824P74k0732j633K9251J5232j4369q054O032r701j9680N200K1551K306
1654D662n724J2380O845k4537k2575J2330J8067n521l207K0466Q608k1956j7206
1667a7368O065L019p513J1518K3391j289j9857k017P662j4433j5345J7737K8105
1680A9675k211j6003L335L157j8660j2553J6004J5304l997K667J3338q313k8032
1693a6289n503J9400L777r749J0916K1550q488k6143m763Q914m740k767J9460
1706E575J4831j2859j3045O095l103k0811M34K8312J3721j4232n686R930q205
$$ plain form
1719 957 -21135 -20541 390 6301 2832 12883 19198 -1066 -20528 -10750 2332 -5208 -5622 17701
1733 17701 27308 4540 -13345 -6355 -2526 -11601 -4899 17724 20603 4983 1796 5598 -8605
1746 -8605 -22852 -5748 19348 15136 1975 8669 13442 -7468 -23474 -9354 7041 4717 5925
1759 5925 18073 12294 -11791 -17756 -3871 -2550 -10809 3564 25471 16663 -9075 -12185 -2335
1772 -2335 -8171 -14276 3238 20962 12998 795 3503 -611 -18896 -17643 7053 17912 5674
1785 5674 4188 15725 7143 -17796 -18824 2474 9232 4739 13099 21075 5252 -13247 -7856 826
1799 826 -5721 -3922 19143 27324 4778 -10950 -2911 -491 -13667 -9383 13745 20340 6200 908
1813 908 3630 -9171 -21816 -7589 12846 9571 794 10416 14062 -8395 -24909 -10294 6406
$$ packed form
1719I57k2092N94K0931N911l469J0051O315k0264j9462R778J3082p540m14K3323
1733A7701R607k2768j7885O990L829r075O702K2623K879j5620l187L802j4203
1746h605j4247J7104K5096m212j3161O694M773k0910j6006J4120J6395k324J208
1759E925J2148n779k4085n965J3885J321q259J4373K1907q808k5738l110R850
1772b335n836o105J7514J7724p964j2203K708m114j8285J253K4696J0859j2238
1785E674j486J1537q582k4939j028K1298O758m493Q360P976j5823j8499N391Q682
1799H26o547J799K3065Q181k2546j5728Q039K420j3176M284K3128O595j4140n292
1813I08K722j2801j2645J4227K0435l275q777R622L646k2457j6514J4615J6700
$$ plain form
1826 6406 2529 2744 15463 14498 -6840 -15447 -5854 -5246 -10577 3724 23789 15351 -7032 -7759 877
1841 877 -8319 -16980 525 20881 14872 2158 3626 1230 -14949 -16856 3259 13154 4462 6127
1855 6127 17219 6036 -18787 -19443 611 5668 -929 7845 18863 5997 -13384 -12224 -4900
1868 -4900 -9689 -6811 13555 20776 2342 -10427 -2284 -3391 -18388 -14528 10415 18613 4209
1881 4209 -1146 2705 -7478 -21614 -11339 6180 6013 1426 10882 13131 -9001 -23978 -10081
1894 -10081 4200 -965 -1158 14812 16779 -3736 -14761 -7156 -5244 -9731 2192 20128 13887
1907 13887 -4162 -4407 1363 -10817 -20033 -1700 18711 12560 -387 2678 2509 -13879 -19355 -2723
1921 -2723 8055 3496 5757 15134 4618 -18324 -18026 -560 1653 -5027 5732 19886 8103
$$ packed form
1826F406l877K15J2719r65k1338q607R593O08n331J4301K0065q438k2383p27Q636
1841H77r196q661J7505K0356o009j2714J468k396j6179j907K0115R895q692J665
1855F127J1092j1183k4823o56K0054N057o597Q774J1018j2866j9381J160P324
1868d900m789K878K0366P221j8434j2769Q143j107j4997L860K4943Q198j4404
1881D209n355L851j0183j4136J0275J7519j67m587R456K249k2132j4977J3897
1894a0081J4281n165j93J5970J967k0515j1025P605J912m487J1923J7936o241
1907A3887j8049k45N770j2180r216J8333K0411o151j2947L065j69j6388n476J6632
1921b723J0778m559K261R377j0516k2942K98J7466K213o680J0759J4154j1783
$$ plain form
1934 8103 -12613 -12924 -5083 -9243 -8382 9390 18282 3841 -6193 -580 -4341 -19269 -14388 10127
1948 10127 17155 3676 12 6196 -2936 -18625 -12785 4685 7338 4247 12125 14129 -5449 -18902
1962 -18902 -7463 2853 -3723 -1888 16124 19124 -1962 -14135 -6210 -4131 -10132 -1112 16633
1975 16633 14447 -94 -1388 1221 -11021 -19028 -1221 17346 10774 -6 6086 6633 -11230
1988 -11230 -19472 -4504 7744 4583 5827 14557 6105 -13633 -14839 -1511 -1150 -6189 6787 21079
2002 21079 10122 -10823 -10618 -2480 -7527 -9288 6960 18450 7762 -2040 1018 -3684 -17446
2015 -17446 -12648 8827 14896 2991 2142 9719 -964 -19070 -14825 3009 6956 2554 10232 13245
2029 13245 -2347 -15355 -7836 -173 -5381 -1483 16813 18864 -1289 -12187 -3852 -3071 -11587 -4353
$$ packed form
1934H103k0716l11P841m160Q61J7772Q892j4441j0034N613l761j4928M881K4515
1948A0127P028j3479l664O184r132j5689N840J7470K653l091P878K004j9578j3453
1962a8902J1439J0316o576J835J8012L000k1086j2173P925K079o001R020J7745
1975A6633k186j4541j294K609j2242q007J7807J8567o572j0780O092N47j7863
1988a1230q242J4968J2248l161J244Q730q452j9738j206J3328L61n039J2976J4292
2002B1079j0957k0945K05Q138n047j761J6248J1490j0688r802L058m702j3762
2015a7446M798K1475O069j1905q49P577j0683j8106M245J7834L947m402P678L013
2029A3245j5592j3008P519P663n208L898J8296K051k0153j0898Q335P81q516P234
$$ plain form
2043 -4353 14339 15392 2203 -1006 474 -10568 -18012 -3279 12780 7795 781 7875 7810 -11248
2057 -11248 -20685 -5446 6723 2778 3607 12941 8039 -10524 -14223 -4714 -4208 -7393 5419 18997
2071 18997 8114 -10133 -9063 -2496 -9407 -13417 3161 16772 8244 -1800 -50 -3464 -15728
2084 -15728 -13273 5244 11079 2951 4415 11314 -346 -18521 -14680 2775 5242 588 8478 14471
2098 14471 904 -13606 -9110 -2647 -6301 -2212 14663 16965 -779 -9113 -2422 -4094 -14328
2111 -14328 -7294 12689 15138 2026 -1741 690 -9079 -17671 -6140 8085 5601 1107 8670 7543
2125 7543 -11497 -20542 -6178 4306 -90 1167 13206 10325 -7906 -13949 -5925 -4798 -7123 4539
2139 4539 17577 8721 -6461 -4983 -646 -9848 -13575 3748 18308 10348 172 2896 813 -11959
$$ packed form
2043d353J8692J053j3189l209J480j1042p444J4733J6059m985p014P094o5j9058
2057a1248r437J5239J2169l945Q29R334m902j8563l699R509N06l185J2812J3578
2071A8997j0883j8247J070O567o911m010J6578J3611q528j0044J750l414j2264
2084a5728K455J8517N835q128J464O899j1660j8175L841J7455K467m654P890N993
2098A4471j3567j4510M496O463l654M089J6875K302j7744q334O691j672j0234
2111a4328P034J9983K449j3112l767K431r769q592J1531J4225k484m494P563j127
2125G543j9040r045J4364J0484m396J257J2039k881j8231o043Q024J127k325J1662
2139D539J3038q856j5182J478M337r202l727J7323J4560p960j0176K724k083j2772
$$ plain form
2153 -11959 -12416 3395 10520 5387 7028 13006 1893 -15883 -12106 3209 3850 -730 8810 16805
2167 16805 3920 -11904 -9378 -2300 -5520 -2687 11751 16144 1569 -5813 -922 -4452 -15181
2180 -15181 -8092 11970 14512 1828 -154 3495 -5974 -16520 -7867 6755 6758 4153 10398 9364
2194 9364 -7267 -15532 -3616 4626 -286 3055 16584 14582 -3626 -10813 -2904 -1346 -5156 4875
2208 4875 17854 12048 -979 -884 1493 -8438 -11910 4546 17912 10329 1787 5603 3973 -10635
2222 -10635 -13702 1218 9579 5671 6495 12232 2471 -13470 -11501 615 77 -3150 8107 17124
2236 17124 4371 -11570 -9007 -2672 -6364 -5298 9112 15506 4277 -3625 -779 -4816 -14204 -7399
2250 -7399 10825 13166 2461 2287 6567 -3170 -15845 -8786 6659 7940 4432 10549 10829 -3940
$$ packed form
2153a1959m57J5811P125n133J641N978j1113j7776L777J5315O41m580R540P995
2167A6805j2885j5824K526P078l220K833J4438M393j4575p382M891l530j0729
2180a5181P089K0062K542j2684j982L649r469j0546Q653J4622Lk605O245j034
2194I364j6631q265J1916Q242m912L341J3529k002j8208p187P909J558l810J0031
2208D875J2979n806j3027R5K377r931l472J6456J3366p583q542L816j630j4608
2222a0635l067J4920Q361l908Q24N737r761j5941J969J2116n38l227J1257R017
2236A7124j2753j5941K563O335l692J066J4410O394j1229p902K846m037r388O805
2250g399J8224K341j0705j74M280r737j2675P059J5445J281l508O117K80j4769
$$ plain form
2264 -3940 -12714 -3916 2806 -1557 2898 16432 14963 -3301 -10093 -2854 -2667 -8140 416 14657
2278 14657 11633 -602 -2284 -1462 -10897 -13940 484 12086 5781 -59 5260 2749 -12845 -17201
2292 -17201 -2854 5950 2246 3222 9279 2077 -13028 -13236 -3272 -3305 -4843 6638 15416 3603 -10872
2307 -10872 -7718 -2437 -8110 -8249 6599 15176 5987 -2668 -325 -4394 -13219 -8153 7755 11004
2321 11004 2701 3893 7753 -3225 -16821 -9909 4200 5102 1677 8174 10331 -3395 -13662 -7736
2335 -7736 -2027 -4894 -346 12690 11207 -4953 -10402 -4395 -5947 -12494 -3928 11386 10249 -1949
2349 -1949 -4117 -2538 -10647 -15368 -3016 8264 4288 536 5970 2625 -13088 -17026 -3421 4784
2363 4784 559 2454 10457 5040 -9776 -12196 -4032 -2709 -3621 7243 15544 5863 -6678 -4394
$$ packed form
2264c940q774Q798O722m363M455J3534j469j8264o792P239J87n473Q556J4241
2278A4657l024j2235j682Q22r435l043J4424J1602o305n840N319k511j5594m356
2292a7201J4347Q804l704R76O057p202j5105k08R964l3j538J1481Q778j1813j4475
2307a0872L154N281n673j39J4848Q577r189q655K343m069q825N066J5908L249
2321A1004q303J192L860j0978j3596O912J4109R02l425O497K157j3726j0267N926
2335g736N709k867M548J3036j483j6160n449O007j552o547Q566J5314j137j2198
2349a949k168J579q109m721J2352J1280l976l752N434l345j5713l938J3605Q205
2363D784m225J895Q003n417j4816k420Q164J323r12J0864Q301r681j2541K284
$$ plain form
2377 -4394 -852 -8250 -8323 6909 15699 6825 -1442 379 -2875 -12687 -9875 4276 8575 3126 4498
2392 4498 7643 -3533 -16390 -10001 2847 2809 -28 7819 11668 -1235 -12477 -8314 -2637 -4798
2406 -4798 -818 11341 11109 -2649 -7641 -3021 -6521 -13036 -4096 11399 10699 -39 -1682 740
2420 740 -7311 -13336 -2963 8820 7300 4324 9087 5809 -8571 -12835 -827 5152 1270 4569
2434 4569 13754 8603 -7088 -10298 -3352 -1914 -3589 6063 14878 7275 -3900 -2609 -971 -8558
2448 -8558 -8446 6331 15186 7050 138 2609 -223 -11043 -10718 2943 8368 3908 5125 8173 -2145
2463 -2145 -13952 -9524 1246 855 -724 8340 12957 568 -11175 -7114 -1441 -4028 -1570 10959
2477 10959 12820 1902 -3956 -1316 -4865 -11190 -2739 11660 11136 1454 1562 3863 -5645 -13462 -4637
$$ packed form
2377d394L542p398p3J5232Q790q874q267J821l254r812K812J4151M299n449J372
2392D498L145j1176j2857O389J2848l8k837P847L849j2903j1242M163N677k161
2406d798L980J2159k32j3758m992M620l500o515Q940J5495p00j0738j643K422
2420G40q051o025J0373J1783j520k976M763l278j4380m264J2008N979l882L299
2434D569R185n151j5691l210O946J438j675R652Q815p603j1175J291J638p587
2448h558J12J4777Q855q136o912K471k832j0820L25J3661N425m460J217L048j0318
2463b145j1807M428J0770l91j579R064M617j2389j1743M061N673k587K458J2529
2477A0959J861j0918n858K640l549o325Q451J4399n24r682J08K301r508p817Q825
$$ plain form
2492 -4637 7207 6641 3796 8217 6019 -7239 -12097 -2488 2500 -410 3821 13818 8951 -5785
2506 -5785 -9363 -2274 -2388 -5252 3791 13735 8347 -2299 -2706 -2425 -9584 -9933 3735 11936 5011
2521 5011 -125 3232 -239 -12206 -12326 1381 7204 3382 4807 8515 343 -11282 -8769 -222
2535 -222 4 -472 9231 13547 922 -10040 -6679 -1998 -6344 -4253 8151 11999 2272 -4201 -2288
2550 -2288 -5821 -11887 -4291 8886 9109 1733 3010 4980 -5585 -13609 -5399 6612 5488 2965
2564 2965 7971 6620 -5348 -11794 -5070 -92 -2276 2796 12391 8244 -5564 -8741 -2906 -4078
2578 -4078 -7644 1617 13200 9289 -1127 -2107 -1258 -8248 -9255 2326 10480 5070 1433 5199 754
2593 754 -11876 -12351 482 5883 1900 3966 8558 1585 -10341 -9523 -1823 -1115 -697 8298 12828
$$ packed form
2492d637J1844n66k845M421k198j3258m858R609M988k910M231R997m867j4736
2506e785l578P089j14k864R043R944n388j0646m07K81p159l49J3668Q201o925
2521E011n136L357l471j1967j20J3707N823l822J425L708q172j1625K513Q547
2535b22K26m76R703M316j2625j0962L361M681m346K091J2404L848r727o473J913
2550b288l533o066P596J3177K23p376J277J970j0565q024Q210J2011j124k523
2564B965N006j351j1968o446O724M978k184N072R595m147j3808l177N835j172
2578d078l566R261J1583l911j0416r80Q49o990j007J1581Q154n410l637L766m445
2593G54j2630m75J2833N401l983K066M592o973j1926Q18P700P08M18Q995M530
$$ plain form
2608 12828 2247 -7152 -4498 -1438 -6474 -4609 8282 13224 3742 -2467 -547 -4005 -10821 -5302
2622 -5302 6839 8242 2935 4016 5233 -4831 -13305 -5772 5314 4301 2264 8441 8776 -3310
2636 -3310 -10740 -5110 -137 -1982 2695 12057 9031 -3227 -6469 -1961 -4659 -8574 732 12249
2650 12249 8704 -1154 -1354 -730 -7857 -10690 -22 8217 5427 2923 6175 1365 -10310 -11281 106
2665 106 4931 1548 4679 10724 4309 -8395 -8867 -1987 -1126 -1329 7388 12507 3898 -5197 -3233 -2230
2681 -2230 -7722 -5210 7681 12671 4109 -1272 923 -2671 -10053 -6676 5086 7934 3570 4369 5512
2696 5512 -4008 -12340 -6097 2807 1767 1003 8205 8792 -3055 -11254 -6533 -1424 -3493 425 9514
2711 9514 8653 -1812 -5867 -2630 -5735 -9366 -511 10676 7929 -321 -492 579 -7521 -11454 -1961
$$ packed form
2608A2828j0581r399K654L060n036J865J2891M942r482o209J920l458o816N519
2622e302J2141J403n307J081J217j0064q474P533J1086j013k037O177L35j2086
2636c310p430N630M973j845M677R362l026j2258l242M508k698l915R306J1517
2650A2249l545r858k00O24p127k833J0668Q239k790k504L252m810j1675r71J1387
2665A06M825l383L131O045o415j2704m72O880Q61k03Q717N119q609r095J964J003
2681b230n492K512J2891M990q562n381K195l594p382L377J1762K848m364P99J143
2696E512r520q332O243Q904j040p64P202N87j1847q199M721N109k069L918R089
2711I514q61j0465m055L237l105l631Q855J1187k747q250j71J071q100l933R493
$$ plain form
2726 -1961 7402 5206 3039 6017 2292 -8984 -10572 -1111 2851 340 4544 10997 4518 -7781
2740 -7781 -8653 -2229 -2097 -3428 5401 11817 4646 -4195 -3586 -3364 -8438 -6732 5597 10442 2804 -1130
2756 -1130 1470 -2920 -11746 -9227 2537 6285 2033 3275 4594 -3920 -12228 -7996 -151 -189 -222 7417
2772 7417 8476 -2837 -10348 -5971 -2179 -4915 -1014 8627 9095 -495 -4506 -2874 -5766 -9086 -1518
2787 -1518 9428 7781 668 1586 1511 -6911 -11796 -2506 6631 4936 2945 6127 3638 -7297 -9911
2802 -9911 -2568 951 -588 4043 10426 4930 -6997 -7861 -2807 -3928 -4973 3542 10904 5120 -3427
2817 -3427 -3557 -3653 -8678 -7484 3337 8751 3318 278 2163 -2293 -11714 -9180 2227 5982 2109
2832 2109 4181 6713 -904 -9898 -7462 71 100 1181 8503 10041 -239 -7340 -3798 -1443 -4549
$$ packed form
2726a961R363k196k167K978l725j1276j588R461L962k511M204O453o479j2299
2740g781q72O424J32j331Q829O416p171q841O09K22n074J706J2329M845p638l934
2756a130K600m390q826K519J1764L748m252J242J319q514q308M232P845l8l3P639
2772G417J059j1313p511M377L792k736L901R641M68r590m011J632k892l320P568
2787a518J0946j647p113R18p5q422m885R290R137j695j991L182k489j0935k614
2802i911P343L519j539M631O383n496j1927q64N054j121j045Q515P362n784q547
2817c427j30r6n025J194J0821N414n433l040J885m456r421K534J1407L755l873
2832B109K072K532p617q994K436P533K9J081P322J538j0280p101L542K355l106
$$ plain form
2847 -4549 -945 9824 11197 2058 -2701 -1011 -4242 -8499 -1703 8502 8009 2525 3311 2938 -6110
2862 -6110 -10921 -2776 5842 4306 2659 6996 5145 -5500 -9800 -3539 361 -690 3789 10298 5631
2877 5631 -5187 -6198 -2551 -4513 -5602 3374 11260 6007 -1856 -2083 -1491 -7397 -7081 3200 9043
2892 9043 5332 2959 4706 -578 -9404 -7653 2466 6100 3108 5649 8722 1327 -8288 -6592 140
2907 140 306 929 8312 10635 1658 -5372 -3212 -1754 -5268 -1510 9252 10972 2379 -1986 -387
2922 -387 -3546 -8804 -3470 6376 7158 2866 3576 2888 -5844 -10928 -3876 3450 2446 1984 7189 5847
2938 5847 -4697 -9551 -4001 -310 -1439 2956 9912 6377 -3142 -5179 -2270 -4777 -5948 2708 10936
2953 10936 6820 -580 -277 -287 -6564 -8102 1745 8189 5119 2873 4612 130 -8981 -8131 1015 3641
$$ packed form
2847d549L604J0769J373r139m759J690l231m257O796J0205m93n484P86l73r048
2862f110m811Q145Q618j536j647M337j851j0645m300O261L900j051M479O509m667
2877E631j0818j011L647j962j089Q976P886n253p863k27N92n906L16J0281N843
2892I043l711k373J747n284q826J751J0119L634k992K541L073p395r615J696O732
2907A40J66O23P383K323q977p030K160J458l514L758J0762J720q593m365J599
2922c87l159n258N334R846P82m292P10o88q732n084P052P326j004m62N205j342
2938E847j0544m854N550L691j129M395O956l535r519k037K909k507j171Q656Q228
2953A0936m116p400L03j0o277j538R847O444l070k246J739m482r111Q50R146K626
$$ plain form
2969 3641 1605 4901 8727 1348 -8409 -7153 -1319 -1203 -593 6168 9437 2067 -5006 -3950 -3269 -6821
2985 -6821 -3526 6869 8511 1502 -1900 -129 -4616 -10306 -5819 4578 5974 2150 3098 2808 -4780
3000 -4780 -10273 -4811 2361 1849 2508 7837 6721 -3177 -8764 -3831 -1158 -2463 1374 9020 6950
3015 6950 -1868 -4866 -3332 -5333 -6986 1172 9179 5468 -273 486 -132 -7207 -9042 -197 6717
3030 6717 4435 2833 4844 941 -8141 -8871 -1330 1502 430 4145 7964 1456 -8475 -7741 -2645
3045 -2645 -3471 -2798 4868 9493 2525 -4171 -3467 -3289 -6685 -4027 5767 8632 2845 128 1566 -3292
3061 -3292 -9508 -5894 4075 5700 2420 3635 4307 -2993 -9778 -5685 836 1107 2121 7905 7212 -2459
3077 -2459 -7560 -3520 -1617 -3602 946 9241 8168 -603 -3634 -2316 -5028 -7174 -123 7984 5844
$$ packed form
2969C641k036L296L826p379r757J256N834J16O10O761L269p370p073J056O81l552
2985f821L295J0395J642p009l402J771m487n690M487J0397J396l824R48k90p588
3000d780n493N462P172n12O59N329j116r898n587M933K673j305L837P646k070
3015F950q818k998J534k001j653Q158Q007l711n741P59o18p075j835Q845O914
3030F717k282j602K011l903r082p30P541K832j072L715L819o508r931P34N096
3045b645q26O73P666M625o968o696P04J78l396K658R794K865n787k717J438m858
3061c292o216L614R969J625l280J215O72p300o785M093O521K71J014N784o93r671
3077b459n101M040J903j985M548Q295j073q771l031J318k712k146P051Q107k140
$$ plain form
3092 5844 542 1086 111 -7618 -9694 -1334 5505 3277 2346 4973 1779 -7185 -8575 -1865 1173 417
3108 417 4728 8803 2978 -5845 -5623 -2238 -3238 -3039 5100 10199 3837 -2739 -2683 -2604 -6808 -4858 4342
3125 4342 8224 3462 1146 2076 -2738 -8792 -5744 3330 5239 2522 5037 5949 -1487 -8359 -5332
3140 -5332 331 906 1926 7412 7554 -1501 -6701 -3733 -2816 -5057 -658 8190 7997 -600 -3033 -1610
3156 -1610 -4968 -7236 -818 6982 6429 1760 2576 1074 -6118 -8715 -1380 4486 3028 2651 5835 2970
3172 2970 -6191 -8821 -2871 155 -629 4025 8253 3766 -4536 -5477 -2348 -4086 -3929 4668 9901 4225
3188 4225 -1574 -1110 -1729 -6621 -5639 3212 7428 3635 1865 2527 -2280 -8917 -6353 1496 3339 1687
3204 1687 4369 6125 -723 -8330 -6043 -509 -375 958 6875 8211 255 -4996 -3397 -2864 -5036
$$ packed form
3092E844n302N44r75p729k076Q360O839k228r31K627l194q964j390O710L038p56
3108D17M311M075n825q823K22L385j000J99Q139N099o362o576N6P9m204J950R200
3125D342L882m762k316R30m814o054L048R074J909k717K515R12p436o872L027
3140e332N663N75J020N486J42r055n200K968R17k241M399Q848j93q597k433J423
3156a610l358k268O418P800n53m669Q16j502p192k597P335N866j458l77L184k865
3172B970r161k630N950L026p84M654M228m487q302r41L129j738J57Q597N233n676
3188D225n799M64o19m892R82Q851M216l793j770O62m807o637K564P849J843j652
3204A687K682J756o848p607K287N534J34J333N917J336p956n251J599N33k172
$$ plain form
3219 -5036 -1046 7642 7304 362 -2073 -954 -4777 -8476 -2849 5270 5408 1910 2519 1431 -5426 -8749
3235 -8749 -2495 2893 2131 2924 6665 3703 -4983 -8046 -2638 -339 -1243 3152 8213 4646 -3113 -4854
3251 -4854 -2554 -4247 -4400 3140 8617 4180 -942 -422 -1459 -6909 -6038 2386 7181 4046 2332 3493
3267 3493 -784 -7810 -6266 452 2831 1857 5001 6647 -23 -7561 -5679 -1111 -1156 -181 6102 7629
3283 7629 794 -4554 -3225 -3015 -5328 -1608 6418 6964 1443 -673 -94 -4277 -8261 -2772 5036 5280
3299 5280 2350 3170 2403 -4479 -8288 -3092 2288 2014 2888 7050 4705 -4199 -6961 -2974 -959 -1992
3315 -1992 2674 8344 5799 -1792 -3612 -1872 -4104 -4305 2470 8248 4998 369 721 -836 -6507
3330 -6507 -6573 1297 6238 3679 2534 3830 136 -7217 -6856 -395 2002 1551 4789 7093 886 -6261
$$ packed form
3219e036L990Q688l38o942k435J119l823l699N627Q119J38l498O09j088o857l323
3235h749O254N388p62P93L741k962q686l063N408K299r04M395N061l567p759j741
3251d854K300j693j53P540N477m437n122N20j037n450Q71Q424M795l135j714J161
3267C493m277p026J544O718K379r74L144J646o670p538J882M568m5R75O283J527
3283G629o835n348J329K10k313L720Q026N46n521k116N79m183l984N489P808K44
3299E280k930Q20p67o882l809N196N380k74Q74M162k345q904k762L987K015j033
3315a992M666N670k545p591j820J740k232k01O775N778l250m629L52j557n671
3330f507o6P870M941k559j145J296l694p353L61O461K397m51L238K304o207p147
$$ plain form
3346 -6261 -5153 -1207 -2354 -1064 5749 8262 1709 -3935 -2849 -3105 -5476 -2237 5469 7043 2178
3361 2178 272 515 -3939 -7994 -3513 4060 4879 2257 3764 3498 -3273 -7935 -3521 1279 1345 2763
3377 2763 6825 5062 -2646 -6180 -2724 -1847 -2586 1889 8020 5847 -1282 -3299 -1855 -4530 -5184 1084
3393 1084 7198 4792 720 792 -925 -6572 -7147 -126 4492 2561 2296 4311 776 -6565 -7180 -1213
3409 -1213 1068 592 4059 6936 1574 -5321 -4933 -2023 -3136 -1726 5261 7978 2187 -2835 -2398 -2984
3425 -2984 -6014 -3566 4419 6688 2520 1117 1180 -3292 -7843 -3943 2897 3994 2446 4298 3930 -2728
3441 -2728 -7977 -4112 159 -31 1682 6215 5373 -1794 -5895 -3453 -2605 -3996 505 7053 5517 -526
3457 -526 -2628 -1959 -4766 -6767 -423 5840 4723 1274 1278 -512 -6369 -7428 -1094 3405 2437 2124 5051
$$ packed form
3346f261J108L946j147J290O813K513o553n644J086k56k371L239P706J574m865
3361B178j906K43m454m055M481P573Q19k622J507k66o771m662M414M800O6J418
3377B763M062j763p708l534L456Q77p39M475O131k173p129k017J444k675o54O268
3393A084O114k406m072P2j717n647n75P021M618j931k65K015l535p341o15N967
3409a213K281m76L467K877n362o895L88K910j113J410O987K717n791n022M37n86
3425b984l030K448P985K269m168j403O3m472m551L900O840J097j548J852l68o658
3441b728n249L865M271j90J713M533q42p167m101K442Q48j391M501O548j536o043
3457e26k102O69k807k001O344O263j117l449Mj790n857j059O334M499r68l13K927
$$ plain form
3474 5051 1524 -6182 -6829 -1812 433 -141 3351 7096 2525 -4007 -4543 -2378 -3310 -2162 4418 7769
3490 7769 2731 -1851 -1137 -2366 -6330 -4046 3149 6297 3073 1407 1711 -2613 -7482 -4708 1840
3505 1840 3007 2126 4515 4362 -2205 -7208 -4728 -313 -457 1128 5824 5661 -1072 -5136 -3070 -2820
3521 -2820 -3991 236 6489 5772 87 -1313 -987 -4431 -6424 -806 5412 4745 1981 2415 1099 -5087
3537 -5087 -6883 -1559 2907 2095 3064 5723 2337 -5078 -6004 -1993 -335 -256 3562 7380 3803 -2936
3553 -2936 -3767 -2361 -3268 -2771 3535 7399 3399 -729 -572 -2355 -6431 -4686 2493 5397 2921 1979
3569 1979 2352 -1822 -7019 -5131 844 1844 1978 4549 5060 -1191 -6239 -4070 -1035 -1195 515 5933
3585 5933 6571 311 -3891 -2768 -2721 -4171 -364 5796 6254 1379 -307 -347 -4204 -6402 -1377 4892
$$ packed form
3474E051l527p706o47N017K245n74L492L745m571o532n36K165r32J148O580L351
3490G769n038m582P14j229l964K284P195L148l224j666L04m324m869K774O548
3505A840J167q81K389j53o567n003K480M415j44J585M696j63o733m064K066K50
3521b820j171M227O253p17n685j400L26l444j993N618O218o67k764M34j316o186
3537e087j796N324M466q12R69K659l386p415r26M011J658P9L818L818l577o739
3553b936q31J406r07M97O306L864m000m128J57j783m076J745P179K904k476r42
3569A979L73m174n197J888N975J000J34K571N11o251n048K169L035j60J710N418
3585E933O38o260m202J123M7j450L807O160M58m875j686m0l857k198N025O269
$$ plain form
3601 4892 4290 2156 3326 1496 -3807 -6718 -1784 2284 1804 3133 5859 3013 -3781 -5742 -2164
3616 -2164 -1138 -1398 3199 7011 3764 -2274 -3445 -2293 -4090 -3503 2523 6531 3611 -23 217 -1622
3632 -1622 -5921 -4822 1801 4845 2406 2491 3352 -1125 -6556 -5312 415 1460 1486 4261 5192 -305
3648 -305 -5429 -4205 -1964 -1876 -113 5674 6547 1017 -3152 -2214 -2515 -4445 -1143 5126 5743 1716 296
3665 296 359 -3954 -6732 -2110 3299 3651 2005 2948 2255 -4206 -7034 -2982 1114 1153 2390 5648 3494
3682 3494 -3146 -5195 -2182 -1616 -1828 2422 7221 4242 -1648 -2664 -2137 -4225 -4411 1339 5872 3666
3698 3666 554 378 -1456 -5895 -5396 478 3996 2489 2648 3813 -300 -5874 -5400 -150 1139 1071
3714 1071 4361 5651 802 -4578 -3972 -1886 -2402 -524 5059 6488 1328 -2490 -1916 -2887 -5056 -2185
$$ packed form
3601D892o02k134J170j830n303k911M934M068m80J329K726k846o794j961L578
3616b164J026k60M597L812l247o038j171J152j797N87O026M008k920l634K40j839
3632a622m299J099O623L044k439Q5Q61m477n431J244N727J045K6K775R31n497
3648c05n124J224K241Q8J763N787Q73n530m169R38l01j930L302O269O17m027j420
3665B96O3m313k778M622N409L52j646R43o93o461k828M052M096L9J237L258k154
3682C494o640k049L013N66k12M250M799k979n890j016N27k088j86N750M533k206
3698C666l112j76j834m439M99N874L518j507J59J165m113n574M74N250J289o8
3714A071L290J290m849n380O06K086n16J878N583J429n160l818N74r71k169K871
$$ plain form
3730 -2185 4355 5389 2093 884 574 -3276 -6174 -2360 2744 3327 2350 3976 3032 -2730 -6346 -3046
3746 -3046 713 264 1820 5373 4125 -2254 -4636 -2471 -2061 -2533 1463 6329 4318 -788 -1757 -1617
3762 -1617 -4096 -4555 874 5597 3954 1346 1353 -515 -5355 -5485 -64 3193 2316 2862 4014 199 -5467
3779 -5467 -5153 -1137 333 702 3797 5999 1259 -3553 -3691 -1700 -2379 -1137 4303 6376 2313 -1335
3795 -1335 -1021 -2377 -5083 -2804 3740 5352 2131 1108 1036 -2683 -6359 -3438 1883 2476 2084 3642
3811 3642 3127 -2261 -5989 -3546 -63 -356 1493 5558 4767 -1300 -4321 -2639 -2349 -2901 696 5466
3827 5466 4551 -80 -1559 -1574 -4549 -5232 -236 4655 3745 1062 1573 -221 -4621 -5545 -874 2805 2365
3844 2365 2875 4751 1079 -4610 -5002 -1518 -319 -188 3682 5879 2067 -3097 -3495 -2175 -3193 -1997
$$ packed form
3730b185O540J034l296j209l10l850k898L814N104N83r77J626r44n762l616L300
3746c046L759m49J556L553j248o379k382K165M10m72L996M866k011n106r69J40
3762a617k479m59N429M723j643k608Pj868m840j30N421L257q77N46J152l815n666
3779e467L14M016J470L69L095K202m740m812j38J991o79J242N440K073m063l648
3795a335L14j356k706K279O544J612l221j023p2l719l676K921N321N93l92J558
3811C642n15n388l728K443L483k93J849M065p91o067l021J682K90n52L597M770
3827E466r15m631j479j5k975o83M996M891r10k683N11j794m400r24M671L679m40
3844B365N10J876l672n689l92L484J199J31L870K197l812n164l98J320j018J196
$$ plain form
3860 -1997 3407 5486 2250 -771 -916 -2676 -5695 -3216 2607 4686 2161 1456 2096 -2444 -6516 -3892
3876 -3892 840 2057 1245 3669 3613 -1973 -5799 -3486 -1055 -1300 909 4886 4769 -664 -3624 -2472
3892 -2472 -2834 -3264 -190 5287 4657 688 -785 -997 -4198 -5190 -124 4245 3416 1988 2355 623 -4370
3909 -4370 -5579 -1433 1826 1519 2821 4544 1460 -3965 -4886 -1937 -1034 -799 3069 5540 2326 -2397
3925 -2397 -3096 -2364 -3496 -2595 2887 5409 2617 -142 -297 -2078 -5392 -3867 1915 3892 2207 2060
3941 2060 2029 -1851 -5607 -3835 481 1475 1688 3958 4026 -521 -4887 -3090 -1251 -1301 545 5237 5276
3958 5276 343 -2639 -1861 -2519 -3632 -63 4591 4669 1435 183 38 -3946 -5307 -1149 3472 3096
3974 3096 1657 2789 1262 -3722 -5617 -1990 1189 981 2482 5166 2420 -3193 -4168 -2053 -1381 -1114
$$ packed form
3860a997N404K079l236l021j45j760l019K479N823K079k525p05O40m540m072K624
3876c892M732J217q12K424n6n586l826K313K431k45K209L977j17n433k960J152
3892b472l62m30L074N477o30l969j473k12l201r92N066M369q29j428L67j732m993
3909d370j209M146L259l07J302J723l084n425r21K949R03K35L868K471l214m723
3925b397o99P32j132R01N482K522k792k759j55j781l314J525N782J977j685j47
3941B060l1l880l756J772M316R94K13K270O8m547m366J797J839n0J846M692L9
3958E276m933k982P78o58j113L569M654P8l234j252j45l984j361M158M621l76
3974C096j439J132j527m984j895L627L179k08J501K684k746n613r75K115O72K67
$$ plain form
3990 -1114 2634 5889 3064 -1421 -2034 -1814 -3621 -3121 2013 5184 2960 614 261 -1769 -5015 -3687
4006 -3687 1450 3359 2244 2543 3059 -955 -4791 -3815 -24 1233 1601 4044 4904 -46 -4208 -3202
4022 -3202 -1448 -1740 218 4732 5289 1106 -1874 -1699 -2587 -4263 -981 4174 4430 1401 400 162
4038 162 -3304 -5446 -1616 2629 2531 1944 3094 1624 -3144 -5381 -2100 267 -22 2209 4822 2787
4054 2787 -2536 -4149 -2009 -1892 -1742 2422 5441 3302 -906 -1528 -1584 -3886 -3337 1716 5031 2949
4070 2949 972 1072 -1187 -4917 -4287 799 3045 2175 2454 3254 -292 -4686 -4029 -567 336 911 3800
4087 3800 4670 376 -3776 -3034 -2021 -2602 -306 4068 4858 1240 -1523 -1279 -2635 -4588 -1792 3213
4103 3213 4205 1871 1142 287 -2618 -5492 -2489 1718 2280 2061 3456 2138 -2869 -4971 -2623 -177
$$ packed form
3990a114L748L255k825m485o13K20j807N00N134L171k224k346l53k030l246J328
4006c687N137J909j115K99N16m014l836R76L791J257L68K443Q60m950m162J006
4022c202J754k92J958M514N57m183k980J75q88j676L282N155K56l029j001k38
4038A62l466k142L830M245r8n87J150j470m768k237L281K367k89K231K613k035
4054B787n323j613K140J17J50M164L019k139m208o22n6k302N49N053L315k082
4070B949j977J00k259l730O30N086K246q70K79Q00l546m394O57L462R03N75K889
4087C800Q70m294m152P42J013n81K296M374P90l618k763K44j356j953K796N005
4103C213R92k334p29q55k905k874L003M207N62k19J395j318n007k102K348K446
$$ plain form
4119 -177 -34 1906 4714 3555 -1540 -3618 -2105 -2021 -2154 1263 4743 3405 -291 -1256 -1233 -3886 -3924
4136 -3924 1217 4232 2946 1239 1270 -770 -4646 -4584 154 2178 1767 2679 3659 341 -4178 -4027 -1111
4153 -1111 -244 438 3378 4932 1212 -2952 -2666 -1982 -2786 -1025 3611 4840 1712 -948 -783 -2583
4169 -2583 -4501 -2057 2603 3748 1771 1318 1039 -2388 -5057 -2885 1360 1890 1920 3520 2666 -1914
4185 -1914 -4389 -2439 -611 -315 1580 4752 3332 -781 -2935 -1908 -2264 -2630 865 4973 3623 298
4201 298 -550 -901 -3766 -4149 301 3558 2771 1948 2128 -237 -4179 -4352 -660 1683 1619 2585 4009 853
4219 853 -3355 -3941 -1570 -759 -330 2951 5104 1567 -2422 -2244 -1915 -3155 -1639 3143 4482 2022
4235 2022 -293 -712 -1805 -4102 -2640 2032 3390 1834 2055 1344 -1808 -5042 -2913 298 940 1529
$$ packed form
4119a77J43J940K808j159n095k078J513Q4j33L417L480j338l696r65K3k653l8
4136c924N141L015j286j707L1k040l876O2M738K024m11R12R80l318m519J51K916
4153a111Q67O82K940J554l720m164K86O84q04J761M636J229l128k660J65j800
4169b583j918K444M660J145j977m53k79l427k669K172M245N30L0J600q54m580
4185a914k475J950J828K96J895L172j420m113k154J027l56l66L495M108j350l325
4201B98q48l51k865l83M450L257p87q23J80k365l942j73L692K343o4R66J424l156
4219H53m208n86K371Q11M29L281K153l537l989J78L29j240J516M782J339k460
4235B022k315m19j093k297J462M672J358j556K21p11l152l234K129L211O42N89
$$ plain form
4251 1529 3636 3249 -1291 -4288 -2831 -941 -824 1206 4487 3865 -207 -2322 -1802 -2290 -3042 509
4267 509 4222 4083 940 -56 -524 -3567 -4253 -384 2933 2245 1447 2329 263 -3849 -4887 -1257 851
4284 851 724 2403 3920 1324 -2926 -3661 -1699 -1485 -715 2449 4519 1966 -1992 -2066 -2369 -3714 -2255
4301 -2255 2061 4219 1640 36 161 -1767 -4630 -3099 1256 2909 1465 2124 2101 -1191 -4606 -2981
4317 -2981 91 1003 1150 3604 3668 -509 -3674 -2475 -1438 -1445 481 3928 3823 -9 -2010 -1452 -2631
4334 -2631 -3269 -322 3310 3416 691 395 -97 -3336 -4556 -1159 2187 2100 1862 2533 994 -3513 -4845
4351 -4845 -1736 218 392 2252 3955 1591 -2625 -3426 -1985 -1623 -1294 2326 5086 2107 -872 -1447
4367 -1447 -1517 -3397 -2459 1868 4535 2566 798 848 -1108 -4325 -3021 863 2626 1790 2383 2397 -629
$$ packed form
4251A529K107l87m540k997J457J890J17K030L281o22m072k115N20m88p52L551
4267E09L713j39l143r96m68l043o86L869L317o88p98Q82k066m112j038L630K108
4284H51j27J679J517k596m250p35J962K14P70L164K070k553l958p4l03j345J459
4301b255M316K158k579j604J25j928k863J531M355J653j444O59k3l292l415J625
4317b981L072R12J47K454O4m177l165J199J037pJ926L447j05l832k001N58j179
4334b631o38K947L632J06k725k96m92l239j220L397L346q7k38O71j539m507j332
4351d845L109J954J74J860J703k364m216q01J441L62L29L620K760k979k979n75
4367a447p0j880R38M327K667j969j768N0j956l217J304L884J763q36N93J4l026
$$ plain form
4384 -629 -4240 -3122 -82 582 843 3306 4000 -269 -3391 -2516 -1437 -1968 232 3695 4098 904 -1391
4401 -1391 -1362 -2328 -3491 -954 3214 3129 1469 770 383 -2849 -4137 -1130 2085 1976 1637 2742 1608
4418 1608 -2466 -3931 -1650 -26 353 2226 4498 2742 -1389 -2766 -1619 -1835 -1235 1867 4580 2906
4434 2906 -151 -956 -1423 -3224 -2509 1268 3644 2520 1330 1045 -705 -3915 -3512 397 1945 1531
4450 1531 2523 2801 -204 -3534 -3104 -900 -171 201 3222 3993 247 -2432 -2498 -1708 -2383 -609 3649
4467 3649 3792 1002 -811 -847 -2373 -3739 -965 2738 3092 1838 1452 651 -2186 -4368 -1658 1373
4483 1373 1691 1635 3236 2057 -2014 -3706 -1699 -301 -123 1994 4521 2732 -1072 -2727 -1665 -1989
4499 -1989 -1879 1279 4284 2823 -152 -389 -1443 -3493 -3371 651 3353 2357 1323 1363 -818 -4378
$$ packed form
4384f29l611J118L040O64K61K463O94m269l122Q75J079n31K200L463M03l194k295
4401a391K9r66j163K537M168q5j660o99l87l232j288L007L215j09l39J105j134
4418A608m074j465K281J624L79J873K272j756m131j377J147k16O00L102K713j674
4434B906l057q05m67j801P15L777K376j124j190k85j750l210M03L909J548m14
4450A531R92K78l005l330M30K204P29L72L021P71l746k679o6P90o75J774M258
4467C649J43k790j813l6j526j366K774L703L54j254l86q01k837k182K710L031
4483A373L18n6J601j179m071j692K007J398J78K117K527j789l804j655J062l24
4499a989J10L158L005j461k975k37j054k050J22M022K702r96j034M0k181l560
$$ plain form
4515 -4378 -3534 -564 1501 1082 2115 3006 224 -3537 -3326 -1158 -706 -41 2698 3832 753 -1955
4531 -1955 -1723 -2062 -2743 -698 3055 3832 1236 -359 -430 -1867 -3823 -1626 2295 3164 1743 1931 1119
4548 1119 -1898 -4266 -2229 811 1535 1673 3181 2119 -1288 -3572 -2166 -1019 -849 1345 3786 3047
4564 3047 -844 -2484 -1592 -2343 -2616 372 3771 2579 310 -403 -937 -3576 -3394 -230 2295 2127 1255
4581 1255 1571 -242 -3665 -3693 -723 508 1073 2163 3363 731 -2728 -2863 -1157 -1471 -260 2790
4597 2790 4179 1308 -1402 -1608 -1799 -2621 -1016 2518 4111 1809 -31 110 -2063 -3907 -2001 1745
4613 1745 2371 1571 2257 1386 -1639 -3868 -2223 380 675 1234 3279 2470 -1210 -3353 -2281 -959 -1377
4630 -1377 772 3984 3101 -196 -1585 -1424 -2351 -2824 243 3390 2783 605 366 -485 -3120 -3311 -378
$$ packed form
4515d378Q44K970K065m19J033Q91k782l761K11K168M52O65K739J134l079k708
4531a955K32l39o81K045L753P77k596j595p1j437j956K197L921Q69j421J88q12
4548A119l017k368K037L040P24J38J508j062l407k284J406J147J70K194K441p39
4564C047l891j640Q92p51k73K988L399j192k269p13n34k639J82L164K525j68q72
4581A255L16j813l423k8K970J231N65J090J200k632l459j35J706l14J211L050
4597B790J389k871k710k06j91q22J605L534J593k302j840J41k173j844J906L746
4613A745O26q00O86q71l025k229J645K603K95N59K045q09l680k143J072J322m18
4630a377K149L212q83l297j389J61r27m73L067L147o07k178k39q51k635j91K933
$$ plain form
4647 -378 2336 1900 1475 2241 456 -3070 -3587 -776 637 420 2190 3606 1180 -2381 -2634 -1500 -1271
4664 -1271 -869 2241 4206 1876 -1050 -1132 -1524 -3003 -1758 1970 3512 1876 599 266 -1797 -3860
4680 -3860 -2136 804 1888 1855 2315 1884 -1336 -3967 -2566 -264 102 1021 2945 2806 -653 -2731 -1970
4697 -1970 -1531 -1570 415 3179 3235 192 -1121 -1102 -2771 -3156 -137 2931 2753 853 328 28 -3049 -3658
4715 -3658 -767 1969 1865 1531 2385 607 -2579 -3512 -1426 184 155 1654 3484 1725 -1871 -2488 -1542
4732 -1542 -1935 -1130 1883 3593 1966 -418 -822 -1586 -2896 -2295 1489 3045 1941 1267 535 -1237 -3620
4749 -3620 -2832 437 1795 1284 2297 2063 -794 -3456 -2652 -586 -450 753 2772 2998 -276 -2490
4765 -2490 -1767 -1767 -1804 -53 3302 3047 720 -904 -957 -2414 -3067 -623 2334 2641 1290 1192 308 -2550
$$ packed form
4647c78K714m36m25P66j785l526n17K811J413k17J770J416k426l561k53J134K29
4664a271M02L110J965k330k926q2l92j479J245L728J542j636j277l33k063k063
4680c860J724K940J084l3M60m31l220k631J401K302L66R19J924j39l459k078P61
4697a970M39l9J985K764N6l043j313J9j669l85L019L068j78j900n25l00l077o09
4715c658K891K736j04l34Q54j778l186r33K086J610k9J499J830j759l596o17R46
4732a542l93Q05L013J710j627k384m04p64j310O01L784J556j104o74p32j772k383
4749c620P88L269J358n11J013k34k857k662Q04K066J36J203K019K26l274k214
4765b490P23%l7J751L355k55k327j624n3j457o53K444K957L07j351r8q84k858
$$ plain form
4783 -2550 -3996 -1189 1436 1335 1702 2552 1057 -2403 -3137 -1515 -289 412 1937 3655 1842 -1394
4799 -1394 -2081 -1288 -1870 -1341 1528 3802 2003 -30 -410 -1431 -2827 -2513 996 3086 1765 920 979
4816 979 -907 -3686 -2654 8 1392 1283 2073 2404 -325 -3064 -2651 -1123 -333 420 2670 3100 479
4833 479 -1828 -1643 -1424 -2060 -294 2717 3021 982 -386 -179 -2266 -3146 -607 2375 2608 1456 1720
4850 1720 676 -2253 -3408 -1629 700 1325 1737 3044 1731 -1504 -2866 -1472 -474 -429 1676 3426
4866 3426 2228 -841 -1770 -1362 -2039 -1756 1249 3174 2327 421 -276 -1305 -3030 -2639 460 2467 1619
4883 1619 1300 1440 -816 -3057 -2933 -117 851 998 2308 2906 414 -2587 -2193 -727 -330 569 2734
4900 2734 3522 498 -1475 -1410 -1687 -1997 -621 2594 3265 1354 226 -148 -1963 -3134 -1322 1449 2255
$$ packed form
4783b550j446K807K625j01L67Q50j495l460p34J622J226P01J525J718j813l236
4799a394o87P93n82N29K869K274j799k033l80j021j396L14L509K090j321q45N9
4816I79j886k779J032K662J384j09P90L31k729k739M13J528P90P53K250M30k621
4833D79k307J85K19o36J766L011L04k039j368K07k087q80K539K982K33j152K64
4850A720j044k929j155J779K329O25M12J307j313l235j362J394R98M5K105J750
4866C426j198l069r29M08o77K83L005J925q47j906o97j029j725L91L099K007q48
4883A619l19J40k256k241J24K816R68J47J310N98k492l001L94J466L97Q99K165
4900B734P88l024j973O5k77l10J376L215O71j911j128l74j815j171J812K771Q06
$$ plain form
4917 2255 1546 1442 923 -1847 -3415 -1837 154 797 1101 2687 1583 -1211 -2858 -1850 -837 -898 825
4934 825 3305 2077 -351 -1576 -1542 -2070 -1923 642 2761 1995 430 251 -683 -2818 -2934 -131 2050
4951 2050 1960 1801 1835 -33 -2731 -2639 -668 426 907 2175 2759 613 -2138 -2260 -1279 -1293 -279 2111
4969 2111 2883 1015 -1106 -1247 -1814 -2436 -1291 1785 2663 1482 555 -124 -1935 -3290 -1614 817 1594
4986 1594 1215 1495 1187 -1254 -3525 -2110 -325 31 930 2617 2078 -1014 -2165 -1826 -1421 -1220 838
5003 838 2931 2584 -100 -1082 -720 -1947 -2186 458 2833 2442 899 421 -345 -2934 -2916 -277 1593
5020 1593 1316 1433 1956 125 -2545 -2635 -1000 424 241 1880 2525 609 -1746 -2187 -1340 -1543 -734 1962
5038 1962 2958 1299 -517 -886 -1731 -2880 -1417 1477 2865 1254 505 202 -1562 -3372 -1795 544
$$ packed form
4917B255p09j04n19k770j568J578J991O43L04J586j104k794j647J008J013o1J723
4934H25K480j228k428j225L4n28J47K565K119p66j565j79r34k135j16K803K181
4951B050r0j59L4j868k698R2J971J094M81J268N84k146k751j22R81j4J014K390
4969B111P72j868k121j41n67o22J145L076Q78j181r27o79j811j355J676K431P77
4986A594l79K80l08k441k271J415J785L56Q99J687n39l092j151L39M05K01K058
5003H38K093l47k684r82L62j227k39K644K375l91j543m78p66k589J8K639J870
5020A593k77J17N23j831k670r0J635J424j83J639O45j916k355m41Q47k03Q09K696
5038A962R96j659j816l69q45j149J463K894J388j611p49l03j764j810J577K339
$$ plain form
5054 544 1344 988 1893 1612 -1154 -2848 -2081 -325 -48 1151 2860 2172 -244 -1951 -1628 -1373 -1153 765
5072 765 2898 2817 275 -667 -789 -2157 -2092 -88 2305 2405 1021 960 -200 -2435 -2991 -434 1147 1193
5090 1193 1709 1980 728 -2313 -2894 -1244 -35 110 1886 2719 1212 -1411 -1723 -1280 -1434 -1028 1642
5107 1642 3006 1343 -299 -704 -1755 -2632 -1667 1251 2369 1753 1044 595 -814 -2870 -1939 389 1349
5124 1349 1304 2156 1956 -563 -2644 -1860 -458 -20 1084 2760 2504 -120 -1568 -1496 -1454 -1569 287 2654
5142 2654 2619 486 -355 -390 -1990 -2522 -488 1954 1752 1035 1227 274 -2187 -2840 -666 593 985 1619
5160 1619 2417 753 -1636 -2555 -1275 -469 146 1255 2749 1707 -1189 -1635 -1419 -1660 -1203 1353 2781
5177 2781 1475 154 -329 -1064 -2609 -1731 420 2152 1372 1362 1184 -904 -2888 -1989 -90 901 1122
$$ packed form
5054E44Q00l56R05k81k766j694P67J756K77J199J709o88k416j707L23K55K20J918
5072G65K133q1k542r42j22j368O5K004K393J00j384o1j160k235n56K557J581M6
5090A193N16K71j252l041n81J650J209J45J776Q33j507k623l12M43j54M06K670
5107A642J364j663j642m05j051q77R65K918J118o16p09m49j409k056R31K328R60
5124A349m5Q52k00k519k081P84J402M38J104J676k56k624j448P2M2j15J856K367
5142B654l5k133q41l5j600n32K034K442k02p17J92r53k461o53K174J259L92O34
5160A619P98j664k389r19J280Q06O15J109J494j042k896m46K16k41M57K556J428
5177B781j306j321m83p35j545Q78K151J732p80j0j78k088j984Q99J899R91K21
$$ plain form
5194 1122 2085 2191 -305 -2329 -1870 -960 -429 703 2522 2644 335 -1253 -1399 -1457 -1804 -78 2077
5211 2077 2247 745 -51 -310 -1833 -2837 -791 1493 1872 1125 1595 227 -2069 -2923 -1081 599 647
5228 647 1437 2220 1295 -1272 -2223 -1583 -878 -517 1496 2788 1523 -357 -1581 -1317 -1870 -1296 835 2342
5246 2342 1908 181 258 -965 -2444 -2088 555 1677 1860 1384 1342 -330 -2836 -2276 -381 520 1099 1945
5264 1945 2265 -154 -2033 -1690 -853 -821 135 1913 2422 850 -990 -1149 -1501 -1572 -675 2232 2407 1032
5282 1032 210 -174 -1620 -2845 -1312 963 1598 1456 1527 702 -1528 -2769 -1375 -8 617 1476 2318
5299 2318 1497 -861 -1987 -1144 -1141 -690 1277 2836 1694 16 -1098 -731 -1794 -1626 525 2378 1892
5316 1892 618 573 -922 -2132 -2338 312 1462 1100 1591 1502 -159 -2382 -2183 -731 115 578 1725
$$ packed form
5194A122R63J06k496k024M59R10N31J132J819J22k309j588j46n8l47J726K155
5211B077J70j502p96k59j523j004K046K284L79p47M70j368k296q54J842J680M8
5228F47P90P83r25k567r51O40P05L61K013J292j265j880j224K64n53N74K131J507
5246B342m34j727P7j223j479L56K643J122J83m76m2j672k506N60J895R01N79Q46
5264A945L20k419j879L43Q37L2R56J778N09j572j840j59l52p1Q97K907J75j375
5282A032q22l84j446j225J533K275O35j42P1q25k230j241J394J367O25Q59Q42
5299B318q21k358j126Q43LM51J967J559j142j678j114L67j063J68K151J853m86
5316A892j274m5j495j210k06K650J150l62M91q9j661k223J99J452Q46M63J147
$$ plain form
5333 1725 2327 240 -1671 -1522 -884 -1148 -119 1874 2495 822 -751 -642 -1502 -2140 -807 1644 2120
5350 2120 1243 564 163 -1475 -2610 -1440 617 1186 1094 1597 1136 -988 -2585 -1515 -80 333 1188
5367 1188 2235 1509 -580 -1951 -1223 -1210 -1015 822 2444 1836 243 -914 -719 -1960 -1632 189 1900
5384 1900 1843 656 706 -523 -2517 -2242 -313 1064 1140 1660 1647 220 -2202 -2344 -730 -96 81 1799
5402 1799 2302 710 -1296 -1689 -1150 -1302 -375 1665 2696 1304 -288 -562 -1404 -2344 -1340 1069 2018
5419 2018 1435 926 128 -1318 -2403 -1714 383 1161 1240 1602 1367 -704 -2383 -1420 -377 -78 953 2228
5437 2228 1933 -95 -1225 -1248 -1273 -1372 361 2341 1980 109 -517 -1057 -1862 -1980 14 1886 1584 850
5455 850 854 -149 -2128 -2370 -270 694 905 1347 1808 499 -1979 -2182 -1115 -191 -27 1638 2564 830
$$ packed form
5333A725O02k087j911J49O38k64J029J993O21j673j573J09q60o38J333K451M76
5350B120q77o79m01j638j135J170K057N69r2N03m61k124j597J070J435M13Q55
5367A188J047p26k089j371P28J3J95J837J622o08j593j157J95j241L28J821J711
5384A900n7j187N0j229j994K75J929J377P6N20j3j427k422j42J614O34J77J718
5402A799N03j592k006l93N39j52R27K040J031j392j592k74q42r40J004K409R49
5419B018n83n09p98j446j085O89K097P78P9L62k35k071j679R63J043K99J031J275
5437B228k95k028j130k3k5r9J733J980l61j871o26n40q05j18J994J872l02p34
5455H50Mj003j979k42K100R64K11M42M61j309k478k03J067R24J64J665R26j734
$$ plain form
5473 830 -842 -1737 -1458 -1415 -635 1251 2405 1215 -3 -396 -1316 -2112 -1127 670 1706 1400 1037 352
5491 352 -894 -2459 -1492 118 465 1045 1861 1706 -485 -2139 -1641 -519 -233 430 2134 2031 -6
5508 -6 -984 -1223 -1455 -1688 -197 2030 2200 382 -273 -474 -2015 -2078 -395 1445 1486 830 1077 -84 -1773
5527 -1773 -2364 -612 671 692 1158 1938 719 -1652 -1738 -1214 -265 -41 1563 2379 899 -972 -1080 -1075 -1498
5546 -1498 -884 1020 2281 1299 384 -345 -850 -2088 -1519 752 1468 1432 1131 923 -695 -2025 -1564 -285
5564 -285 711 848 1900 1623 -286 -1848 -1366 -993 -619 252 1796 2133 226 -829 -1015 -1482 -1732 -279
5582 -279 1802 2030 772 -38 -165 -1666 -2258 -565 1276 1188 1005 1266 489 -1574 -2167 -767 403 438
5600 438 1090 1800 872 -1191 -1640 -1103 -887 -541 1247 2155 1202 -671 -1157 -1065 -2073 -1165 758 1972
$$ packed form
5473H30j672q95K79M3P80J886J154j190j218l93r20p96R85J797J036l06l63o85
5491C52j246j565R67J610L47N80Q16j55k191j654M98J122K86O63J704j03k037
5508fr78k39k32k33J491K227J70j818o55k01j541o3J683J840M1o56K47j161j689
5527a773n91J752J283K1M66P80j219k371q6N24R49K24J604Q16j480j871j08Nm23
5546a498O14J904J261r82r15p29n05j238N69K271P16l6l01k08j618j330M61J279
5564b85R96J37J052k77j909j562M82L73L74Q71J544L37j907j055j86m67k50J453
5582b79K081K28j258q10j27j501n92J693J841q8j83K61p77k063n93J400J170L5
5600D38O52P10r28k063m49N37K16L46J788R08r53j873m86R2j008R08J923J214
$$ plain form
5618 1972 1356 557 -115 -928 -2134 -1606 307 1405 1294 998 1150 -362 -2023 -1758 -645 176 793 1847
5636 1847 1673 124 -1273 -1440 -1142 -554 271 1985 2449 539 -818 -925 -1302 -1610 -254 1389 1884
5653 1884 722 392 6 -1341 -2413 -1056 949 1206 1083 1571 558 -1245 -1963 -967 76 304 975
5670 975 2033 1240 -841 -1561 -1144 -621 -576 921 2117 1407 -224 -738 -1171 -1602 -1640 586 1882 1585
5688 1585 550 238 -806 -1831 -1712 -48 980 941 1287 1166 -477 -2027 -1739 -491 51 452 1618
5705 1618 2042 271 -1402 -1360 -882 -995 -21 1560 2020 547 -451 -654 -1227 -1956 -696 1107 1700 859
5723 859 783 355 -1296 -2057 -785 707 767 864 1264 598 -713 -2011 -1184 -294 317 1023 2165 1000 -425
5742 -425 -1404 -722 -820 -771 346 1958 1494 185 -446 -626 -1705 -1382 378 1517 1361 525 536 -670 -1855
$$ packed form
5618A972o16p99o72q13j206N28J913J098j11k96J52j512j661K65J113Q21O17J054
5636A847j74j549j397j67K98N88Q25J714M64j910j357j07l77l08J356J643M95
5653A884j162l30l86j347j072J357K005K57j23M88j013j803p18R96J043K28O71
5670I75J058p93k081p20M17N23M5J497J196p10j631n14m33m31l8K226J296k97
5688A585j035l12j044j025J19J664J028l9L46j21j643j550K88J248N42M01J166
5705A618M24j771j673M2M78j13R74J581M60j473r98k03n73p29J260J803N93q41
5723H59p6m28j651p61J272J492O0R7M00o66j311j298Q27Q90O11P06J142j165j425
5742d25r79O82r8M9J117J612m64j309o31j80j079L23J760J139j56q36J1j206j185
$$ plain form
5761 -1855 -1834 -142 818 860 1089 1431 176 -1523 -1615 -775 -363 375 1690 2009 448 -863 -1235 -867 -1158
5780 -1158 -203 1286 1818 745 -235 -311 -1249 -1699 -880 1004 1240 1188 897 254 -1160 -2283 -1283 191
5798 191 737 970 1379 690 -737 -1881 -937 -331 -81 619 1771 1292 -120 -1432 -1219 -1372 -1102 563
5816 563 1690 1543 418 -10 -547 -1738 -1573 283 1043 1242 1197 654 -90 -1837 -2016 -489 749 1033
5834 1033 1440 1471 149 -1531 -1531 -1030 -485 47 1331 1814 627 -639 -1078 -888 -1175 -634 1105 1909 956
5853 956 221 -309 -1118 -1843 -860 636 1226 1035 768 548 -1043 -1889 -1485 115 447 756 1535 1032 -395
5872 -395 -1656 -1277 -537 -393 642 1993 1643 -21 -1090 -994 -1242 -1123 173 1538 1672 384 22 -156
5890 -156 -1355 -1753 -197 984 1154 934 856 31 -1492 -1740 -644 435 414 1223 1445 155 -1140 -1384
$$ packed form
5761a855K1J692R60M2K29L42j255j699r2Q40M12P38J315L19j561j311l72L68k91
5780a158R55J489N32j073r80p6r38m50Q19J884K36n2k91o43j414j123J000J474
5798A91N46K33M09o89j427j144R44O06K50P00J152m79j412j312K13j53K70J665
5816E63J127j47j125m28n37j191J65J856P60J99m5n43p44j747j79J527J238K84
5834A033M07L1j322j680%N01N45N32J284M83j187j266m39J90k87N41J739Q04r53
5853I56p35n30q09p25R83J496N90j91k67k20j591q46M04J600L32L09P79n03j427
5872c95j261L79P40J44J035J351l50j664j069R6k48J19J296J365J34j288l62j78
5890a56j199l98J556J181J70k20p8q25j523k48J096J079k1Q09K22j290j295k44
$$ plain form
5908 -1384 -896 -360 -210 1342 1878 748 -555 -589 -845 -1556 -773 852 1743 1078 166 -71 -937 -1650 -1066
5927 -1066 561 830 881 1204 662 -682 -1748 -1043 -99 365 781 1567 1462 -309 -1668 -1096 -728 -271
5945 -271 501 1525 1389 235 -724 -800 -1246 -1381 -220 1448 1160 511 61 -134 -1419 -1742 -215 841
5963 841 918 1136 1189 40 -1170 -1644 -629 221 344 940 1601 838 -632 -1398 -1092 -993 -64 1160 1713
5982 1713 971 -21 -715 -1160 -1393 -698 743 1633 837 258 207 -600 -1577 -1225 347 864 1034 1061 1154 -421
6002 -421 -1330 -1325 -292 352 590 1453 1458 167 -1204 -1345 -718 -487 171 1480 1722 448 -409 -387 -1039 -1135
6022 -1135 -180 1013 1338 766 299 -79 -1419 -1784 -639 901 983 1036 1140 511 -1034 -1536 -866 -93 94
6041 94 1095 1728 898 -563 -951 -799 -981 -348 837 1795 1228 -115 -291 -888 -1258 -1227 501 1389 966
$$ packed form
5908a384M88N36J50J552N36j130j303l4k56p11P83J625Q91o65r12k37q66p13N84
5927a066J627K69N1L23n42j344j066P05R44M64M16P86j05j771j359N72L68M57
5945b71P72J024j36j154r59p6m46j35J161J668k88o49m50j95j285l23J527J056
5963H41P7K18N3j149j210m74J015Q50J23N96O61p63j470p66L06R9R29J224N53
5982A713p42r92o94m45k33O95J441Q90p96n79n1q07r77L52J572N17J70K7R3j575
6002d21r09NJ033O44K38Q63Nj291j371j41O27K31O58J309K42j274q57K2o52r6
6022a135R55J193L25n72m67l78j340l65J145J540Q2N3J04o29j545n02O70P73J87
6041I4J001O33q30j461l88J52j82O33J185R58n67j343j76n97l70L1J728Q88m23
$$ plain form
6060 966 437 598 -697 -1422 -1191 116 900 889 1180 966 -136 -1503 -1338 -675 -414 446 1413 1339 181
6079 181 -989 -1133 -956 -519 -82 1297 1538 583 -91 -448 -1084 -1251 -500 1253 1349 779 283 -119 -1164
6098 -1164 -1791 -871 215 930 853 1187 516 -1131 -1512 -990 -328 307 863 1552 763 -288 -848 -1183 -1086
6117 -1086 -726 629 1746 1115 205 -323 -780 -1772 -1028 257 984 1131 727 620 -397 -1386 -1485 -315
6135 -315 486 745 1123 791 -78 -1503 -1449 -515 -509 107 1272 1454 347 -662 -1006 -1105 -1175 -211 1020 1512
6155 1512 937 35 -418 -1099 -1345 -603 427 1012 837 778 286 -1157 -1443 -646 436 471 774 1173 838
6174 838 -359 -1213 -1082 -207 153 737 1307 1279 42 -801 -579 -983 -857 326 1211 1144 212 -100 -569 -1190
6194 -1190 -1129 41 836 853 894 528 -189 -1084 -1321 -595 251 310 1308 1325 197 -843 -1058 -736 -395 263
$$ packed form
6060I66n29J61j295p25K31J307P84j1K91k14j102j367J65O63K61Q60R67p4j158
6079A81j170j44J77M37M37J379K41r55o74l57o36j67P51J753R6n70m96m02j045
6098a164o27R20J086P15p7L34o71j647l81N22O62O35N56O89p89j051n60l35R7
6117a086L60J355J117o31r10n28m57r92P44J285P27J47m04j07j017r89r9J170
6135c15Q01K59L78l32q69j425N4R34OO16J165J82j107j009l44r9p0R64J231M92
6155A512n75r02m53o81k46P42J030N85j75n9m92j443k86P97J082L5L03L99l35
6174H38j197q54J31Q75L60N84N70k8j237q43K22m04J26J183Q85o7r32l12m69o21
6194a190O1J170P95J7M1l66p17q95k37P26Q46N9R98J7j128j040k15L22L41O58
$$ plain form
6214 263 1028 1387 547 -534 -728 -1165 -763 -170 890 1586 808 198 36 -767 -1400 -513 407 914 1042
6233 1042 497 412 -536 -1336 -1053 26 398 806 1426 1050 -225 -1231 -934 -482 -464 534 1189 1157 87
6252 87 -847 -854 -1135 -862 -143 1378 1205 721 -69 -535 -1263 -1141 88 1003 688 1058 878 -271 -1185 -1366
6272 -1366 -471 154 283 918 1221 369 -930 -1296 -751 -363 84 854 1317 459 -65 -1001 -816 -938 -480
6291 -480 821 1346 693 619 5 -606 -1286 -665 297 731 501 1060 577 -584 -1643 -1017 -21 36 904 1400
6311 1400 1085 -431 -1005 -966 -758 -528 601 1783 1096 294 -526 -478 -858 -846 21 1194 1048 416 168
6330 168 -35 -973 -1317 -249 956 889 714 748 248 -1165 -1267 -276 -27 402 1083 1371 260 -688 -996
6349 -996 -664 -190 -52 775 1424 793 -386 -543 -723 -1161 -298 346 1232 853 731 179 -505 -1493 -661 83
$$ packed form
6214B63P65L59q40j081j94m37M02N93J060O96p78o10j62q03o33Q87R20N07J28
6233A042n45q5r48q00K83J079L72M08O20l76j275j006K97M52J8R98O55l2j070
6252H7r34pk81K73P19J521j73m84p90m66p28J22J229R15l15L70j80j149r14j81
6272a366Q95O25J29O35L03q52j299l66N45L88M47P70M63q58n24r36J85j22M58
6291d80J301N25o53p4o14o11o80O21R62M34k30N59m83j161j059O26R96N7Q68M96
6311A400l15j516n74L9K08K30J129J182o87q02q20M8l80J2Q67J173j46o32k48
6330A68k03r38l44J068J205o7j75L4n00j413j02R91K49M29O81K88j111r48l08
6349i96L32M74J38Q27O49o31j179j57j80m38Q63O44Q86l79j22n52o84r88Q32P44
$$ plain form
6369 83 907 902 850 774 -219 -836 -1075 -330 153 569 1345 1203 305 -572 -596 -806 -315 93 1365 1152 336 -54
6391 -54 -544 -857 -913 -94 908 1057 535 317 -320 -1076 -1176 -558 237 543 819 1110 616 -992 -1246 -946
6411 -946 -347 -36 1102 1408 360 -433 -762 -692 -608 -288 939 1543 830 -7 -40 -471 -1116 -649 711 1239
6431 1239 813 614 40 -652 -1208 -1124 404 693 788 764 885 44 -1022 -1030 -540 51 480 903 971 72 -788
6452 -788 -804 -855 -700 227 1343 1035 248 -47 -414 -816 -839 -171 855 700 647 379 -308 -973 -1517 -580 60
6473 60 594 617 1116 509 -583 -1071 -506 -206 -25 753 1189 678 -344 -678 -726 -722 -509 788 1152 816 -19
6494 -19 63 -716 -1107 -775 334 875 450 468 193 -583 -1538 -974 -70 224 455 993 634 40 -1153 -781
6514 -781 -375 -469 373 689 1035 -35 -627 -910 -789 -603 -134 1041 1188 475 -9 -343 -1205 -1183 -452 585
$$ packed form
6369H3Q24nn2p6r93o17k39P45M83M16P76j42q98q77k4k10M91M08J272k13q16l90
6391e4m90l13n6Q19J002J49n22k18o37p56j00O18P95L06K76K91m94j608k54L00
6411i46N99L11J138L06j048p93l29P0Q4L20J227O04p13q37l3m31o45M67J360N28
6431A239m26j99n74o92n56Q4J528K89R5k4J21q41j066qM90N91M29M23O8q99q60
6452g88j6n1J55R27J116l08p87k95l67m02k3O68J026j55n3k68o87o65n44R37O40
6473F0N34K3M99o07j092m88N65L00J81P78M36n11j022l34m8MK13J297L64l36q35
6494a9Q2p79l91L32J109N41m25J8k75p76r55N64R04K94K31N38l59n94j193L72
6514g81M06r4Q42L16L46j070n92k83J21J86M69J175J47p13m84l34q62K2P31J037
$$ plain form
6534 585 738 819 555 219 -783 -1201 -738 79 361 791 1135 456 -552 -888 -740 -441 21 760 1086 658
6554 658 -152 -584 -515 -807 -708 108 996 844 -6 -160 -383 -966 -620 116 681 613 443 575 -280 -781 -1028
6575 -1028 -303 374 415 1129 1110 -82 -1035 -904 -454 -248 337 790 1182 289 -271 -573 -556 -880 -176 811
6595 811 1324 565 452 -120 -857 -1293 -538 280 909 865 764 553 -711 -1250 -522 124 346 487 566 420
6615 420 -402 -987 -875 -468 -258 521 1343 1112 -365 -442 -548 -755 -773 365 1093 1003 579 152 -519 -1168
6635 -1168 -647 85 874 674 620 789 18 -839 -981 -321 381 606 984 1084 421 -842 -766 -329 -280 282
6655 282 985 778 443 83 -557 -847 -821 -412 910 1099 623 427 136 -1036 -1262 -556 468 523 545 800
6675 800 231 -635 -1081 -758 -520 104 748 1005 828 42 -699 -516 -635 -641 607 1098 859 253 -352 -340 -1019
$$ packed form
6534E85J53Q1k64l36j002m18M63Q17K82M30L44o79j008l36J48K99M62P39L26m28
6554F58q10m32O9k92R9Q16Q88j52q50j54k23n83L46P36N65o8j70J32q55n01k47
6575a028P25O77M1P14j9j192r53J31M50K06N85M53L92q93n60l02J7l24P04R87
6595H11N13p59j13n72p37m36P55Q18O29m4j01k11j264n39P28O46K22J41P9j46
6615D20q22n85J12M07K10P79Q22k31j477p7j06k07j8J138P28r0m24m27o71o49
6635a168N21P32P89k00n4J69p71q57j42O60P02K25L78J00o63j263P6M37M9N62
6655B82P03k07l35l60o40k90K6M09J322J89m76j96k91j172k26P06J024N5K2K55
6675H00n69q66m46L23K38O24O44K57j77p86p41J83j19oJ248M91k39o06o05J2o79
$$ plain form
6696 -1019 -604 301 948 859 549 107 -447 -1011 -814 -283 523 695 732 688 -46 -789 -1140 -474 -69 554 955
6717 955 979 346 -558 -895 -494 -575 -274 809 1195 584 24 -97 -980 -1060 -445 687 947 526 375 260
6737 260 -531 -972 -673 46 757 660 762 377 -289 -1286 -811 -201 207 685 902 908 -75 -928 -956 -369 -287 241
6759 241 1015 702 -72 -109 -409 -935 -1078 -266 968 653 701 95 -181 -1024 -981 -437 410 400 616 663 108
6780 108 -650 -866 -645 186 390 422 975 436 -454 -811 -651 -734 -169 429 1337 659 133 -351 -653 -938 -451
6801 -451 529 792 856 279 344 -613 -1305 -467 -48 620 575 799 498 -323 -1002 -732 -208 -236 288 964 680
6822 680 -188 -827 -581 -659 -378 230 1097 808 370 -390 -499 -835 -886 -117 857 518 656 403 -128 -778 -1172
6843 -1172 -368 35 328 525 733 164 -537 -1078 -619 -163 223 910 1230 363 -76 -642 -492 -640 -226 396
$$ packed form
6696a019M15R05O47q9l10m42n54n64J97N31Q06J72L7m4p34p43l51O66M05O23M01
6717I55K4o33r04l37M01q1L01J083L86o11n60j21q83q0O15J132K60m21j51j15
6737B60p91m41K99P19P11r7J02l85o66r97M75O10M08M78K17Or83q53k8N87Q2N28
6759B41P74l13p74l7l00n26j43Q12J234l15M8o06k76q43M3N44Q47j0K16M7n55
6780A08p58k16K21Q31K04L2N53n39q90l57J60q3N65N98R08o78n26m84l02k85M87
6801d51R80K63O4n77O5r57o92Q38M19O68m5K24l01q21o79K70N24k8N24O76k84
6822F80q68o39K46p8K81O08Q67k89m38p60j09l36n1P69R74l39J38k53n31o50l94
6843a172Q04M03K93J97K08n69p01n41M59M56L86O87L20q67m39n66J50j48M14O22
$$ plain form
6863 396 1243 765 -303 123 -696 -870 -710 90 650 589 526 338 -590 -1073 -684 -294 291 349 992 575 -153
6884 -153 -709 -937 -479 5 596 909 463 -205 -559 -630 -553 -719 237 791 978 299 63 -231 -711 -1220 10
6905 10 438 628 552 380 -81 -912 -710 -496 430 390 813 1207 319 -469 -925 -664 -318 18 619 1001 61
6926 61 -366 -496 -490 -650 -473 525 766 639 62 -202 -821 -1183 -692 128 661 615 655 223 -651 -1090 -716 -123
6948 -123 224 433 891 541 -214 -934 -709 -504 -192 291 867 783 45 -347 -349 -684 -850 55 664 691 472
6969 472 276 -148 -371 -1079 -61 449 761 708 447 230 -919 -1154 -760 313 -61 507 856 336 -385
6988 -385 -792 -400 -152 -192 575 905 877 -240 -637 -497 -691 -270 482 828 595 321 -286 -407 -1249 -775
7008 -775 -151 639 815 717 358 -409 -672 -645 -223 301 498 756 939 60 -697 -800 -667 11 -50 532 991
$$ packed form
6863C96Q47m78j068M26q19j74J60Q00N60o1o3j88r28m83L89L90N85N8O43m17p28
6884a53n56k28M58M84N91L13m46o68l54p1P7j66R56N54J87o79k36k94m80n09J230
6905A0M28J90p6j72m61q31K02K14R26m0M23L94q88p88m56K61L46L36O01L82r40
6926F1m27j30Oj60J77R98K41j27n77k64o19l62M91Q20N33m6M0m32q74m39L74N93
6948a23L47K09M58l50p55p20K25K05L12M83N76q4p38l92kl35j66R05O09K7k19
6969D72j96m24k23p08J018N10L12n3k61k17j149k35L94J073l74N68L49n20p21
6988c85m07L92K48m0P67L30k8j117l97J40j94M21P52L46k33k74o07j21q42M74
7008g75O24P90J76r8l59p67k63K7M22N24J97K58J83q79p57j03J33O78o1N82M59
$$ plain form
7029 991 82 -437 -322 -511 -745 -102 672 856 507 160 -133 -612 -1058 -182 -47 621 758 813 145 -670
7049 -670 -1066 -284 -249 76 599 1034 409 -193 -717 -799 -461 -451 372 966 534 -304 -246 -411 -731 -342 425
7070 425 926 874 629 -7 -580 -616 -520 -31 338 654 837 409 -55 -783 -675 -163 -135 481 862 956 414 -419
7092 -419 -542 -592 -430 238 741 896 466 92 -275 -389 -941 253 432 637 512 421 182 -734 -925 -583
7112 -583 403 556 573 671 254 -655 -654 -695 -342 93 605 645 367 -303 -723 -704 -388 -410 583 993 600 28 -183
7135 -183 -562 -926 -468 193 562 750 518 290 -308 -828 -769 -80 368 638 528 563 -55 -589 -762 -430 -208
7156 -208 -75 819 592 82 -670 -766 -583 -741 -62 636 851 521 -156 -372 -584 -460 -363 280 926 779 596
7177 596 99 -577 -518 -462 -171 82 285 577 131 -294 -720 -770 -186 -114 505 1109 294 11 -315 -728 -477
$$ packed form
7029I91r09n19J15j89k34O43P74J84l49l47k93m79m46Q76J35O68J37N5o68q15
7049f70l96P82L5L25N23M35o25o02n24q2L38J0Q23N94m32q38N8j65l20L89P67
7070D25N01n2k45o36n73l6R6M89L69L16J83m28m64p28J08N12K8O16L81R4n42q33
7092d19j23n0J62O68N03J55m30l74l67j14n52J194J79K05j25r1k39r16j91L42
7112e83R86J53J7R8m17r09Jm1L53M35N12M0k78o70m20J9L16k2R93M10l93n72k11
7135a83l79l64M58O61L69J88k32k28n98n20N9O89M48K70j10L5o18n34j73L32K22
7156b08J33Q94k27n10p52r6J83j58O79O98K15l30o77k16k12J24R7O43O46j47j83
7177E96m97o76N9N6K91K53K03K92m46m25m26n0N84P2O19O04q15k83l26m13K51
$$ plain form
7198 -477 -386 219 622 977 231 -109 -696 -594 -975 162 313 755 708 328 -405 -1010 -605 -53 122 296
7218 296 443 616 87 -420 -452 -453 -443 194 295 884 358 -390 -561 -390 -610 -292 712 854 358 -131 -79
7239 -79 -425 -933 -345 250 641 609 630 168 -598 -977 -448 -271 197 408 813 754 -56 -583 -632 -452 -377 403
7261 403 1045 730 -177 -410 -615 -685 -395 122 729 735 532 4 -279 -783 -744 -49 462 424 501 258 -221 -588
7283 -588 -962 -129 252 235 880 959 242 -578 -719 -583 -469 -5 731 1012 341 -171 -290 -588 -696 -494 518
7304 518 791 568 238 -273 -299 -468 -599 243 614 303 299 341 -433 -843 -572 -216 355 183 731 624 -396
7325 -396 -683 -706 -311 -39 284 887 798 255 -477 -429 -818 -419 101 623 1029 475 233 -157 -522 -695 -182
7346 -182 604 569 321 647 138 -872 -737 -264 -184 470 599 783 363 -640 -813 -504 -372 22 551 1238
$$ packed form
7198d77R1O05M03L55p46l40n87J02l81J137J51M42m7l80p33o05M05N52J75J74
7218B96J47J73n29n07l2jJ0O37J01N89n26p48j71J71k20L18J004J42m96m89N2
7239g9l46n08N88N95L91l2K1m62p66l79N29J77M68K11M05n9q10n27m9J80P5P80
7261D03O42l15r07k33k05p0K90N17O07Ok03n28k83n04L9O95N11l8P7k43m79l67
7283e88l74Q33L81j7O45P9p17q20j41J36J14M64P36K81o71n12j19k98j08K02J012
7304E18K73k23l30n11k6j69j31Q42L71l11mM2p74m10K71L56N71j72N48j07j020
7325c96k87k3L95K72L23O03q9n43p32M8l89L99N20N22M06n54k42l90l65j73N13
7346a82P86l5k48L26n09j010J35M73Q0O54J29J84m20j003j73L09J32L94N29O87
$$ plain form
7366 1238 286 -123 -543 -656 -426 -333 347 707 456 167 -184 -422 -770 -413 -2 305 528 667 168 -82
7386 -82 -716 -422 -12 209 523 690 762 -149 -581 -557 -272 -317 332 625 964 382 -418 -545 -533 -427 12 584
7408 584 640 420 285 -253 -843 -953 -248 448 492 645 556 146 -578 -975 -260 -162 143 589 687 98 -250 -871
7430 -871 -345 -356 -443 375 888 588 128 -322 -754 -530 -370 358 421 431 530 103 -400 -665 -656 75 535 676
7452 676 566 480 -316 -671 -819 -154 91 618 695 976 46 -697 -578 -552 -283 205 490 721 278 57 -378
7473 -378 -762 -708 -381 454 367 592 538 -34 -577 -537 -53 211 371 271 707 396 -556 -824 -542 -340 25
7494 25 435 780 504 -358 -393 -464 -395 20 477 1037 525 149 115 -505 -707 -418 419 313 411 602 329 -363
7516 -363 -890 -814 -10 611 747 467 658 188 -446 -460 -545 -464 227 566 670 -55 -549 -466 -414 -654 333 515
$$ packed form
7366A238r52m09m20j13K30R3O80L60k51k89l51k38l48L57M11L07K23J39m99k50
7386h2o34K94M10K21L14J67P2r11m32K4K85m5O49K93L39n82q00j27J2J06M39N72
7408E84N6k20j35n38n90j10P05O96M4J53q9m10p24l97P15R8L05M46R8n89l48o21
7430h71N26j1q7Q18N13l00m60m50m32K24J60P28O3J0R9m27n03k65RP31M60J41
7452F76j10q6p96l55j48O65K45N27P7K81r30p43J19K6K69M88K85K31m43k21m35
7473c78l84N4L27Q35q7K25n4n72n43M0M84K64J60j00M36l11r52k68K82K02L65
7494B5M10L45k76q62l5p1O9M15M57N60n12l76l4o20k02K89Q37j06R8J91k73o92
7516c63n27P6Q04O21J36k80J91m70o34j4q5Q1O91L39J04p25m94Q3N2k40R87J82
$$ plain form
7538 515 806 369 48 -379 -519 -655 -316 317 419 393 494 390 -503 -732 -282 181 444 677 703 343 -137
7559 -137 -929 -415 -405 55 762 739 352 -276 -372 -580 -538 -182 297 960 629 283 -209 -268 -593 -559 31 526
7581 526 403 447 187 -56 -820 -504 7 324 202 496 681 92 -334 -908 -421 -303 167 716 686 337 -447
7602 -447 -470 -724 -519 -85 477 856 450 60 122 -493 -385 -313 417 559 400 310 164 -656 -879 -578 82
7623 82 498 831 660 205 -340 -588 -422 -128 -185 350 867 81 -182 -572 -439 -675 -710 274 434 574 -15
7644 -15 -1 -417 -493 -723 -39 249 436 704 424 -88 -707 -595 -181 62 370 497 659 153 -613 -350 -410
7665 -410 -44 67 752 694 106 -219 -276 -439 -417 151 514 623 621 29 -220 -622 -711 -177 176 449 696 301
7687 301 74 -320 -652 -535 12 256 394 685 281 -62 -658 -591 -535 -492 188 773 473 -67 -294 -165 -542
$$ packed form
7538E15K91m37l21m27j40j36L39O33J02k6J01j04q93k29M50M63K63K33K6l60m80
7559a37p92N14J0M60P07k3l87o28r6k08M2L56M79O63l31l46m92n9l25L4N90M95
7581E26j23M4k60k43p64L16N11L17j22K94J85n89m26n74M87J18M70N49l0l49p84
7602d47k3k54K05M34N62L79m06l90O2o15J08P2P30J42j59r0j46q20k23L01O60
7623H2M16L33j71m55n45k48J66K94n7N35N17p86k63l90J33k36l5R84J60J40n89
7644a5J4m16p6k30O84K88J87K68k80n12o19J12M14K43L08J27J62n06p66K63o0
7665d10L66J11O85n8n88l25n7j63K2N68L63J09kn92k49m02q9N34L53K73K47l95
7687C01k27l94l32J17N47K44J38K91m04l43n96O7N6M3O80N85l00n40k27J29l77
$$ plain form
7708 -542 -768 275 777 487 292 211 -173 -510 -518 -266 -112 368 544 630 67 -436 -616 -569 -330 256 260 839
7730 839 201 -248 -699 -201 -444 73 768 654 257 -247 -408 -599 -427 -112 579 680 473 317 -211 -443
7750 -443 -865 -495 167 428 567 518 333 -356 -348 -438 -477 -6 487 557 674 -236 -498 -637 -535 -292 347 820
7772 820 613 61 -160 -311 -691 -410 168 749 532 539 53 90 -597 -610 -237 64 722 743 502 77 -731 -319
7794 -319 -354 70 -19 448 643 355 -268 -706 -668 -572 -247 695 981 502 77 -553 -572 -472 -243 -133 494 334
7816 334 217 128 -497 -628 -533 -110 508 384 647 354 -372 -640 -560 -179 -324 140 683 771 53 -508 -588 -826
7838 -826 -176 -85 614 699 355 -150 -446 -637 -1110 -125 533 259 407 303 4 -456 -595 -455 27 531 369
7859 369 707 219 -556 -542 -332 23 53 447 499 269 -95 -345 -499 -666 -198 178 808 405 318 -212 -374
$$ packed form
7708e42k26J043N02k90j95q1l84l37qK52J54M80J76Q6n63n03j80M7K39N86MN79
7730H39o38m49m51M98k43N17O95j14l97n04j61j91J72L15O91J01k07j56n28k32
7750d43m22L70O62K61J39m9j85o89Qr0l9M71M93P0J17r10k62j39J02K43O39M73
7772H20k07n52k21j51l80K81N78N81k17Pm86L7o87j3L73L01O58K1k41m25q08M12
7794c19l5M24q9M67J95k88o23m38L8R6L25R42K86m79m25o30j9J00K29J10O27j60
7816C34j17q9o25j31R5M23O18j24K63k93p26k68Q0L81j45M64N43Q8p18n61q0k38
7838h26O50R1O99Q5l44n05k96j91m73R85O58k74J48j04k99m60j39J40M82N04j62
7859C69L38m88p75J4K10L55L0L94N2k30l64k50j54j67M68L76O30m03q7n30j62
$$ plain form
7880 -374 -581 -384 291 407 195 279 72 -361 -565 -595 -108 240 309 506 493 -174 -886 -436 -290 -90 304
7901 304 644 665 12 -406 -579 -724 -527 -28 694 444 119 -71 -70 -604 -641 -101 233 413 970 261 26
7922 26 -479 -607 -107 278 340 690 536 -55 -149 -574 -549 -177 96 207 842 318 -110 -300 -339 -681 -381 251
7944 251 636 397 -73 -16 -420 -833 -485 -77 239 493 299 153 -366 -722 -376 -302 126 592 699 739 -156
7965 -156 -484 -627 -390 -229 286 604 667 516 -376 -227 -840 -577 -184 624 719 283 -96 -244 -483 -419 -425 241
7987 241 302 443 707 225 -557 -832 -383 -116 269 385 730 267 -367 -418 -527 -582 -135 354 903 529 -70
8008 -70 -219 -260 -460 -509 47 558 286 135 333 -138 -757 -713 56 403 178 580 483 28 -626 -484 -205 -57
8030 -57 401 914 411 -38 -515 -293 -400 -244 14 944 625 139 184 -22 -518 -453 103 550 626 370 376 -187
$$ packed form
7880c74k07J97O75J16k12Q4k07m33k04l0M87L48O9J97j3o67p12M50J46K00L94
7901C04L40K1o53m18j73j45J97M99P22k50l25j90Jn34l7N40L34J80N57p09k35
7922B6n05j28N00L85O2L50j54n91r4m25K5L72K73J11O35n24m28j90l9l42L00O32
7944B51L85k39m70N7m04m13L48M08L16K54j94j46n19l56L46P4M28M66J07M0q95
7965a56l28j43K37J61N15L18O3j51q92J49o13K63L93Q08R5m36l79j48k39O4oO66
7987B41O1J41K64m82p82k75M49K67L85J16L45m63o34n1j09n5M47M89N49l74n99
8008g0j49m1k00m9N56N11k72j51J98m71o19M4P69L47k25M02r7m55o54J42K79J48
8030e7M58N13n03m49m77K22j07J56K58R30l19m86M5k06m96O5N56M47P6k56On63
$$ plain form
8052 -187 -295 -938 -446 191 353 442 517 192 -604 -471 -484 -140 18 194 644 347 -194 -967 -720 -553 -362
8073 -362 187 595 519 -21 -259 -288 -831 -452 237 412 660 77 364 -376 -550 -287 -176 337 358 86 479
8094 479 -193 -719 -759 -213 16 -47 452 737 2 -389 -537 -243 -210 43 494 640 371 -244 -359 -264 -643
8115 -643 -58 225 686 344 466 122 -909 -566 -461 -5 147 480 323 301 -237 -732 -342 -5 -51 537
8135 537 708 397 30 -213 -540 -332 -626 163 771 605 11 -153 -433 -513 -319 -53 441 601 417 386 -284
8156 -284 -820 -544 -366 275 509 448 421 38 -555 -550 -554 -89 237 650 442 440 127 -533 -499 -272 42 556 454
8179 454 432 -96 -50 -334 -1054 -323 331 888 409 487 34 -399
$$ packed form
8052a87j08o43M92O37J62Q9P5l25p96J33j3L44J58J76M50k97n41p73K47J67J91
8073c62N49M08p6n40k38k9n43L79O89J75K48n83K87p40j74K63J11N13K1k72L93
8094D79o72n26m0N46K29o3M99K85p35l91j48K94L3K53M51J46k69o15j15R5l79
8115f43N85K83M61l42J22l44j031L43J05M56J52L33j57k2n38m95L90L37m6N88
8135E37J71l11l67k43l27K08k94P89O08j66n94j64k80q0J94K66M94J60j84l1o70
8156b84n36K76J78O41K34o1k7l83n93NmM65L26M13k08kl13o60L4K27L14N14j02
8179D54k2n28M6k84p20P31O54N57m79P8m53m33
8191c99
$$ Imaginary data points
##PAGE= N=2
##DATA TABLE= (X++(I..I)), XYDATA
$$ plain form
0 0 0 0 0 0 0 0 8 -8 8 -11 16 -17 24 -31 35 -41 51 -63 73 -84 99 -116 133 -156 180 -206 233 -265 302 -341
30 -341 384 -430 484 -540 604 -672 747 -832 922 -1021 1131 -1253 1388 -1536 1701 -1888
46 -1888 2097 -2336 2612 -2931 3307 -3761 4313 -5016 5933 -7188 9022 -11972 17503 -31488
60 -31488 142422 213151 -42731 25004 93385 6989 -79190 74727 171702 86187 17149 73345
72 73345 -2596 -161762 -117318 89909 95570 -32463 15546 151330 40854 -165534 -132233
83 -132233 35761 36973 -16752 67145 118768 -21395 -122925 -50203 -29826 -134300 -88217
94 -88217 117778 136993 -62256 -122652 -2658 -10904 -138213 -84317 103485 127574 29891
105 29891 40905 68053 -47383 -116461 24423 137018 51600 12273 143663 158891 -48057
$$ packed form
0@%%%%%%Qj6J6j9K7l3M1n5O6p6R2j14J36j57J83k15K49k89L36l86M39m98N67o43
30c41P25q14R14j024J144j276J419j579J754j943K152k384K641k924L237l589
46a888L985m433M948n543O238p068Q074r329J0949j3121J6210k0994K9475m8991
60c1488J73910P0729k55882O7735O8381q6396q6179J53917R6975q5515o9038N6196
72G3345p5941j59166M4444K07227N661j28033M8009J35784j10476k06388L3301
83a32233J67994J212n3725Q3897N1623j40163j01530P2722K0377j04474M6083
94h8217K05995J9215j99249o0396J19994q246j27309N3896J87802K4089r7683
105B9891J1014K7148j15436o9078J40884J12595q5418l9327J31390J5228k06948
$$ plain form
116 -48057 -146030 -1530 90028 16983 21651 135312 109201 -36928 -55044 11643 -38211 -84215
128 -84215 60291 186863 65402 -82392 -18873 46946 -78474 -155542 -3997 121549 42381
139 42381 -32884 8295 -24126 -146106 -126743 12397 20119 -57194 11758 112798 -5367
150 -5367 -185188 -131757 19692 514 -67223 23089 109984 10438 -99619 -60818 -33621 -93386
162 -93386 -48249 109050 117471 -28489 -50981 46810 3673 -131819 -76009 107441 125361
173 125361 14394 10031 51137 -34092 -117661 -38828 46648 -287 -10817 92747 83979 -95539
185 -95539 -161433 -28469 32173 -54245 -42830 92144 94133 -47997 -93488 -34561 -53311 -88009
197 -88009 12199 108225 26370 -69836 -12773 17094 -113677 -172149 -16045 102207 20411
$$ packed form
116d8057r7973J44500R1558p3045M668J13661k6111j46129j8116O6687m9854m6004
128h4215J44506J26572j21461j47794O3519O5819j25420p7068J51545J25546p9168
139D2381p5265M1179l2421j21980J9363J39140P722p7313O8952J01040j18165
150e367j79821N3431J51449j9178o7737R0312Q6895r9546j10057L8801K7197n9765
162i3386M5137J57299Q421j45960k2492R7791m3137j35492N5810J83450J7920
173A25361j10967m363M1106q5229q3569P8833Q5476m6935j0530J03564q768j79518
185i5539o5894J32964O0642q6418J1415J34974J989j42130m5491N8927j8750l4698
197h8009J00208R6026q1855r6206N7063K9867j30771n8472J56104J18252q1796
$$ plain form
208 20411 -50284 11422 13792 -98077 -114705 -4378 30807 -6672 51529 123421 21327 -116967
220 -116967 -62768 50269 5285 -58404 46349 145067 46513 -79848 -54183 -12455 -61455
231 -61455 -49554 66099 89376 -6326 -20342 40642 -20065 -136283 -72246 92300 93876 -11896
243 -11896 1583 64535 -10638 -116533 -69796 21592 7621 -1878 70275 62466 -73222 -119636
255 -119636 -20027 7946 -72511 -40162 103392 106918 -36165 -81928 -11495 -13807 -62852 1874
267 1874 98055 63702 -3513 27899 32616 -77959 -114102 24285 112258 29806 -19369 59016
279 59016 64649 -62692 -105356 -4334 49055 16731 46546 102793 32663 -73311 -40254 30626
291 30626 -19778 -59426 54644 143908 41029 -77485 -39669 10006 -49733 -66984 36053
$$ packed form
208B0411p0695O1706K370j11869j6628J10327L5185l7479N8201P1892j02094j38294
220a16967N4199J13037m4984o3689J04753R8718r8554j26361K5665M1728m9000
231f1455J1901J15653K3277r5702j4016O0984o0707j16218O4037J64546J576j05772
243a1896J3479O2952p5173j05895M6737R1388j3971r499P2153p809j35688m6414
255a19636R9609K7973q0457L2349J43554L526j43083m5763P0433k312m9045O4726
267A874R6181l4353o7215L1412M717j10575l6143J38387Q7973q2452m9175P8385
279E9016N633j27341m2664J01022N3389l2324K9815N6247p0130j05974L3057P0880
291C0626n0404l9648J14070Q9264j02879j18514L7816M9675n9739j7251J03037
$$ plain form
302 36053 86801 21328 -4619 27939 -25745 -114353 -55776 73345 63160 -18957 18476 85346
314 85346 1139 -115640 -71806 29886 24435 653 57276 70192 -27141 -74064 -13477 -3420
326 -3420 -61562 -14506 113773 102660 -30820 -59266 14281 -913 -72703 -24763 82889 75012
338 75012 7653 13109 15061 -66764 -94731 9189 70931 6749 -12591 69551 61510 -72613
350 -72613 -113861 -9058 44326 596 14130 78299 42291 -51065 -47428 -2391 -36961 -53666
362 -53666 50222 117970 23610 -66495 -17476 19968 -57581 -85054 23671 92726 33999 -8513
374 -8513 16422 -14671 -87594 -53104 41714 36373 -14575 33373 85250 -7303 -116421 -66022
386 -66022 31211 13755 -22582 37299 74938 -3931 -67478 -34213 -20816 -57362 -14172 86887
$$ packed form
302C6053N0748o5473k5947L2558n3684q8608N8577J29121j0185q2117L7433O6870
314H5346q4207j16779M3834J01692n451k3782N6623J2916r7333m6923O0587J0057
326c420n8142M7056J28279j1113j33480k8446P3547j5194p1790M7940J07652p877
338G5012o7359N456J952q1825k7967J03920O1742o4182j9340Q2142q041j34123
350g2613m1248J04803N3384m3730J3534O4169l6008r3356L637M5037l4570j6705
362e3666J03888O7748r4360r0105M9019L7444p7549k7473J08725O9055n8727m2512
374h513K4935l1093p2923L4490R4818n341n0948M7948N1877r2553j09118N0399
386f6022R7233j7456l6337N9881L7639p8869o3547L3265J3397l6546M3190J01059
$$ plain form
398 86887 72933 -32157 -41731 20361 -14798 -93654 -40802 76959 74769 668 963 19020
410 19020 -40979 -79336 -9649 44357 9673 9562 77610 56008 -66483 -93691 5446 41605
422 41605 -13163 2917 84565 66769 -31137 -50554 -10246 -25213 -36795 40690 94157 24039
434 24039 -38343 4544 17917 -67667 -88799 24821 91980 26566 -18397 17224 4397 -69924
446 -69924 -64578 12987 26049 -1166 39363 73995 -9928 -96779 -45562 31273 -25 -31653
458 -31653 43421 95447 17532 -58800 -31858 -5252 -32784 -8343 71895 71743 -1224 -5904 33862
471 33862 -13477 -82102 -21381 89887 79327 5815 16716 50641 -6753 -65160 -18221 43092
483 43092 29445 26993 73299 50209 -49269 -69205 6109 19860 -33869 -4525 84977 66348
$$ packed form
398H6887j3954j05090r574O2092l5159p8856N2852J17761k190p4101K95J8057
410A9020n9999l8357O9687N4006l4684j11O8048k1602j22491k7208R9137L6159
422D1605n4768J6080Q1648j7796r7906j9417M0308j4967j1582P7485N3467p0118
434B4039o2382M2887J3373q5584k1132J13620O7159o5414m4963L5621j2827p4321
446f9924N346P7565J3062k7215M0529L4632q3923q6851N1217P6835l1298l1628
458c1653P5074N2026p7915p6332K6942K6606k7532K4441Q0238j52p2967m680L9766
471C3862m7339o8625O0721J11268j0560p3512J0901L3925n7394n8407M6939O1313
483D3092j3647k452M6306k3090r9478j9936P5314J3751n3729K9344Q9502j8629
$$ plain form
495 66348 -37864 -61705 -13682 -18896 -42885 12166 69089 30498 -16443 7975 5072 -71030
507 -71030 -78692 26543 78270 13224 -18414 31484 22010 -63871 -76570 781 31094 9787
519 9787 34909 64605 3612 -63872 -26456 26458 -6670 -22344 61727 110708 28428 -46980
531 -46980 -14285 16703 -20530 -18213 54690 74272 19378 2648 20523 -24505 -80069 -24959
543 -24959 63944 45627 -13939 11877 48043 -18556 -89569 -45893 23990 16624 3384 40067
555 40067 33557 -41891 -65954 -17226 -13397 -51866 -10934 72436 47405 -51033 -64323 -12030
567 -12030 -24225 -63436 -17571 52881 36142 -10515 -2814 -5951 -62592 -65917 18918 57603 6652
580 6652 -3827 50532 33572 -60193 -74646 6207 39314 8906 22294 58571 18667 -45452
$$ packed form
495F6348j04212k3841M8023n214k3989N5051N6923l8591m6941K4418k903p6102
507g1030p662J05235N1727o5046l1638M9898r474q5881j2699P7351L0313k1307
519I787K5122K9696o0993o7484L7416N2914l3128j5674Q4071M8981q2280p5408
531d6980L2695L0988l7233K317P2903J9582n4894j6730J7875m5028n5564N5110
543b4959Q8903j8317n9566K5816L6166o6599p1013M3676O9883p366j3240L6683
555D0067o510p5448k4063M8728L829l8469M0932Q3370k5031r8438j3290N2293
567a2030j2195l9211M5865P0452j6739m6657P701l137n6641l325Q4835L8685n0951
580F652j0479N4359j6960r3765j4453Q0853L3107l0408J3388L6277l9904o4119
$$ plain form
592 -45452 -32865 522 -24797 -28925 47483 83015 4043 -58120 -19851 2103 -49383 -56419
604 -56419 23181 59521 9950 -18058 -3649 -33077 -77685 -39112 29700 18024 -19208 15327
616 15327 41951 -30976 -99838 -51840 17217 2059 -18962 22312 36239 -26491 -63458 -32564
628 -32564 -22755 -43285 -2381 68068 45217 -32556 -32543 13268 -12398 -58700 -9167 70754 58291
641 58291 3187 3039 8679 -36969 -53814 4002 36636 4768 4810 47971 20344 -68554 -76039
654 -76039 1132 23975 -13354 3203 54564 29199 -39911 -43331 -11646 -22683 -23711 36916
666 36916 65125 3338 -41140 -8210 -2323 -61422 -64422 20770 59373 6498 -23090 124
678 124 -14786 -60571 -41153 19403 25053 6402 38886 56400 -11031 -65211 -17395 38915 14816
$$ packed form
592d5452J2587L3387k5319m128P6408L5532p8972o2163L8269K1954n1486p036
604e6419P9600L6340m9571k8008J4409k9428m4608L8573O8812j1676l7232L4535
616A5327K6624p2927o8862M7998O9057j5158k1021M1274J3927o2730l6967L0894
628c2564R809k0530M0904P0449k2851p7773J3M5811k5666m6302M9533P9921j2463
641E8291n5104j48N640m5648j6845N7816L2634l1868M2M3161k7627q8898p485
654g6039P7171K2843l7329J6557N1361k5365o9110l420L1685j1037j028O0627
666C6916K8209o1787m4478L2930N887n9099l000Q5192L8603n2875k9588K3214
678A24j4910m5785J9418O0556N650j8651L2484J7514o7431n4180M7816N6310k4099
$$ plain form
691 14816 -3396 49240 72442 7613 -42696 -18830 -2181 -19977 5359 60283 47078 -10776
703 -10776 -10896 16839 -19643 -61197 -6466 70805 52879 -2145 5702 22620 -21686 -54288 -10992
716 -10992 29114 14171 13714 43217 15845 -57934 -61315 -77 8529 -27392 155 59625 35150
729 35150 -39589 -47038 -9243 -12535 -20705 25834 60467 22176 -10745 10481 5839 -47055 -40696
742 -40696 41330 71557 18499 -2125 30963 17561 -41067 -36888 22249 38707 22121 40924
754 40924 52883 -1482 -46795 -11196 25816 -1421 -8901 51091 73526 4376 -46620 -18316
766 -18316 2365 -21985 -10782 41907 45659 772 -8100 5009 -30243 -62423 -11304 52101
778 52101 30252 -15021 4665 24021 -28352 -70756 -28842 21084 12360 5696 30558 16827
$$ packed form
691A4816j8212N2636K3202o4829n0309K3866J6649j7796K5336N4924j3205n7854
703a0776j20K7735l6482m1554N4731P7271j7926n5024P847J6918m4306l2602M3296
716a0992M0106j4943m57K9503k7372p3779l381O1238Q606l5921K7547N9470k4475
729C5150p4739p449L7795l292q170M6539L4633l8291l2921K1226m642n2894O359
742d0696Q2026L0227n3058k0624L3088j3402n8628M179N9137J6458j6586J8803
754D0924J1959n4365m5313L5599L7012k7237p480N9992K2435o9150n0996K8304
766a8316K0681k4350J1203N2689L752m4887q872J3109l5252l2180N1119O3405
778E2101k1849m5273J9686J9356n2373m2404M1914M9926q724o664K4862j3731
$$ plain form
790 16827 -39391 -46038 -3360 320 -23358 13570 70261 41308 -30873 -32908 6888 -3730 -25287
803 -25287 14501 58271 34198 -1352 4706 -2585 -44499 -37301 29491 50289 7192 432 36192
816 36192 15703 -50456 -48852 14640 33981 11412 23009 41669 2766 -41285 -23884 1034
$$ packed form
790A6827n6218o647M2678L680k3678L6928N6691k8953p2181k035L9796j0618k1557
803b5287L9788M3770k4073l5550O058p291m1914P198O6792K0798m3097o760L5760
816C6192k0489o6159J604O3492J9341k2569J1597J8660l8903m4051J7401K4918
$$ [...]
8191d97
##END NTUPLES=NMR FID
##END=
