##TITLE=1H_SA_48.176
 DMSO, 24 sc, 
 9.1.2020
##JCAMPDX= 6.0         $$ Bruker NMR JCAMP-DX V2.0
##DATA TYPE= NMR FID
##DATA CLASS= NTUPLES
##ORIGIN= UXNMR, Bruker Analytische Messtechnik GmbH
##OWNER= root
$$ XWIN-NMR		Version 3.5
$$ Thu Jan  9 13:48:43 2020 Russian Standard Time (UT+4h)  she@DPX200
##.OBSERVE FREQUENCY= 200.1315
##.OBSERVE NUCLEUS= ^1H
##.DELAY= (6, 6)
##.ACQUISITION MODE= SIMULTANEOUS
##.ACQUISITION SCHEME= undefined
##.AVERAGES= 24
##.DIGITISER RES= 18
##SPECTROMETER/DATA SYSTEM= spect
##.PULSE SEQUENCE= zg30
##.SOLVENT NAME= DMSO
##.SHIFT REFERENCE= (INTERNAL, DMSO, 0, 15.7039)
##AUDIT TRAIL= $$ (NUMBER, WHEN, WHO, WHERE, WHAT)
$$ ##TITLE= Audit trail, XWIN-NMR		Version 3.5
$$ ##JCAMPDX= 5.01
$$ ##ORIGIN= Bruker BioSpin GmbH
$$ ##OWNER= she
$$ F:/spectra/data/she/nmr/H-F/1/audita.txt
$$ ##AUDIT TRAIL=  $$ (NUMBER, WHEN, WHO, WHERE, WHAT)
(   1,<2020-01-09 13:47:39.04 +0400>,<she>,<DPX200>,
      <continue with go, POWCHK disabled, PULCHK disabled
       configuration hash MD5:
       00 E9 B6 7A A2 85 ED C7 34 08 36 98 17 FE 4E 26
       data hash MD5: 16K
       17 6F BA 89 86 BC 8E 89 92 2A 97 07 F2 E2 CB 8C>)
$$ ##END=
$$ 
$$ hash MD5
$$ 49 11 5D A1 0E 71 A5 EA 08 30 7E AE 7C 47 D5 A7
##$RELAX= 
##$RELAX= 
##$RELAX= 
##$RELAX= 
##$RELAX= 
##$RELAX= 
$$ Bruker specific parameters
$$ --------------------------
##$DU= <F:/spectra>
##$EXPNO= 1
##$NAME= <H-F>
##$PROCNO= 1
##$TYPE= <nmr>
##$USER= <she>
##$AMP= (0..31)
100 100 100 100 100 100 100 100 100 100 100 100 100 100 100 100 100 100 
100 100 100 100 100 100 100 100 100 100 100 100 100 100 
##$AQSEQ= 0
##$AQ_mod= 1
##$AUNM= <au_zg>
##$AUTOPOS= <>
##$BF1= 200.13
##$BF2= 200.13
##$BF3= 200.13
##$BF4= 200.13
##$BF5= 200.13
##$BF6= 200.13
##$BF7= 200.13
##$BF8= 200.13
##$BYTORDA= 1
##$CFDGTYP= 0
##$CFRGTYP= 5
##$CHEMSTR= <none>
##$CNST= (0..31)
1 1 145 1 1 1 1 1 1 1 1 1 1 1 1 1 1 1 1 1 1 1 1 1 1 1 1 1 1 1 1 1 
##$CPDPRG= <>
##$CPDPRG1= <>
##$CPDPRG2= <>
##$CPDPRG3= <>
##$CPDPRG4= <mlev>
##$CPDPRG5= <mlev>
##$CPDPRG6= <mlev>
##$CPDPRG7= <mlev>
##$CPDPRG8= <mlev>
##$CPDPRGB= <>
##$CPDPRGT= <>
##$D= (0..31)
0 1.2 0 0 0 0 0 0 0 0.06 0 0.03 0 0 0 0 0.0002 0 0 0 0 0 0 0 0 0 0 0 0 
0 0 0 
##$DATE= 1578563150
##$DBL= (0..7)
120 120 120 120 120 120 120 120 
##$DBP= (0..7)
150 150 150 150 150 150 150 150 
##$DBP07= 0
##$DBPNAM0= <>
##$DBPNAM1= <>
##$DBPNAM2= <>
##$DBPNAM3= <>
##$DBPNAM4= <>
##$DBPNAM5= <>
##$DBPNAM6= <>
##$DBPNAM7= <>
##$DBPOAL= (0..7)
0.5 0.5 0.5 0.5 0.5 0.5 0.5 0.5 
##$DBPOFFS= (0..7)
0 0 0 0 0 0 0 0 
##$DE= 6
##$DECBNUC= <off>
##$DECIM= 24
##$DECNUC= <off>
##$DECSTAT= 4
##$DIGMOD= 1
##$DIGTYP= 9
##$DL= (0..7)
0 120 120 120 120 120 120 120 
##$DP= (0..7)
150 150 150 150 150 150 150 150 
##$DP07= 0
##$DPNAME0= <>
##$DPNAME1= <>
##$DPNAME2= <>
##$DPNAME3= <>
##$DPNAME4= <>
##$DPNAME5= <>
##$DPNAME6= <>
##$DPNAME7= <>
##$DPOAL= (0..7)
0.5 0.5 0.5 0.5 0.5 0.5 0.5 0.5 
##$DPOFFS= (0..7)
0 0 0 0 0 0 0 0 
##$DQDMODE= 0
##$DR= 18
##$DS= 0
##$DSLIST= <SSSSSSSSSSSSSSS>
$$ [...]
##$SUBNAM2= <"">
##$SUBNAM3= <"">
##$SUBNAM4= <"">
##$SUBNAM5= <"">
##$SUBNAM6= <"">
##$SUBNAM7= <"">
##$SUBNAM8= <"">
##$SUBNAM9= <"">
##$SW= 24.9337058887773
##$SWIBOX= (0..15)
0 0 2 0 0 0 0 0 0 0 0 0 0 0 0 0 
##$SW_h= 4990.01996007984
##$TD= 16384
##$TD0= 1
##$TE= 0
##$TE2= 300
##$TE3= 300
##$TEG= 300
##$TL= (0..7)
0 120 120 120 120 120 120 120 
##$TP= (0..7)
150 150 150 150 150 150 150 150 
##$TP07= 0
##$TPNAME0= <>
##$TPNAME1= <>
##$TPNAME2= <>
##$TPNAME3= <>
##$TPNAME4= <>
##$TPNAME5= <>
##$TPNAME6= <>
##$TPNAME7= <>
##$TPOAL= (0..7)
0.5 0.5 0.5 0.5 0.5 0.5 0.5 0.5 
##$TPOFFS= (0..7)
0 0 0 0 0 0 0 0 
##$TUNHIN= 0
##$TUNHOUT= 0
##$TUNXOUT= 0
##$USERA1= <user>
##$USERA2= <user>
##$USERA3= <user>
##$USERA4= <user>
##$USERA5= <user>
##$V9= 5
##$VALIST= <valist>
##$VCLIST= <CCCCCCCCCCCCCCC>
##$VD= 0
##$VDLIST= <DDDDDDDDDDDDDDD>
##$VPLIST= <PPPPPPPPPPPPPPP>
##$VTLIST= <TTTTTTTTTTTTTTT>
##$WBST= 1024
##$WBSW= 4
##$XGAIN= (0..3)
0 0 0 0 
##$XL= 0
##$YL= 0
##$YMAX_a= 776862
##$YMIN_a= -260578
##$ZGOPTNS= <>
##$ZL1= 120
##$ZL2= 120
##$ZL3= 120
##$ZL4= 120
##$ABSF1= 10
##$ABSF2= 0
##$ABSG= 5
##$ABSL= 3
##$ALPHA= 0
##$AQORDER= 0
##$ASSFAC= 0
##$ASSFACI= 0
##$ASSFACX= 0
##$ASSWID= 0
##$AUNMP= <proc_1d>
##$AZFE= 0.1
##$AZFW= 0.1
##$BCFW= 1
##$BC_mod= 2
##$BYTORDP= 1
##$COROFFS= 0
##$CY= 11.3945322036743
##$DATMOD= 1
##$DC= 2
##$DFILT= <>
##$DTYPP= 0
##$F1P= 16.9975609425685
##$F2P= -3.02152046262296
##$FCOR= 0.5
##$FTSIZE= 0
##$FT_mod= 4
##$GAMMA= 1
##$GB= 0.15
##$INTBC= 1
##$INTSCL= 1
##$ISEN= 128
##$LB= 0.24
##$LEV0= 0
##$LPBIN= 0
##$MAXI= 10000
##$MC2= 0
##$MEAN= 0
##$ME_mod= 0
##$MI= 1.114404
##$NCOEF= 0
##$NC_proc= 0
##$NLEV= 6
##$NOISF1= 3.799351
##$NOISF2= 2.8
##$NSP= 1
##$NTH_PI= 0
##$NZP= 0
##$OFFSET= 15.70392
##$PC= 1
##$PHC0= -10126.13
##$PHC1= -10.7992
##$PH_mod= 1
##$PKNL= yes
##$PPARMOD= 0
##$PSCAL= 0
##$PSIGN= 0
##$REVERSE= no
##$SF= 200.130013532006
##$SI= 16384
##$SIGF1= 3
##$SIGF2= 2
##$SINO= 400
##$SIOLD= 16384
##$SREGLST= <1H.CDCl3>
##$SSB= 0
##$STSI= 0
##$STSR= 0
##$SW_p= 3612.71676300578
##$SYMM= 0
##$S_DEV= 0
##$TDeff= 0
##$TDoff= 0
##$TI= <>
##$TILT= no
##$TM1= 0
##$TM2= 0
##$TOPLEV= 0
##$USERP1= <user>
##$USERP2= <user>
##$USERP3= <user>
##$USERP4= <user>
##$USERP5= <user>
##$WDW= 1
##$XDIM= 8192
##$YMAX_p= 0
##$YMIN_p= 0
$$ End of Bruker specific parameters
$$ ---------------------------------
##NTUPLES= NMR FID
##VAR_NAME=  TIME,          FID/REAL,        FID/IMAG
##SYMBOL=    X,             R,               I
##VAR_TYPE=  INDEPENDENT,   DEPENDENT,       DEPENDENT
##VAR_FORM=  AFFN,          ASDF,            ASDF
##VAR_DIM=   8192,          8192,            8192
##UNITS=     SECONDS,       ARBITRARY UNITS, ARBITRARY UNITS
##FACTOR=    0.0002004,     1,               1
##FIRST=     0,             0,               0
##LAST=      1.6414764,     0,               0
##MIN=       0,             -260578,         0
##MAX=       1.6414764,     776862,          0
$$ Real data points
##PAGE= N=1
##DATA TABLE= (X++(R..R)), XYDATA
$$ [...]
2289G69j608K21J823l23j843O34J635j312j364J388J827j278k225J359J532n39
2305F96k220L70K612n60k058P62J135n20j317J201R05j443j021J159K350k346
2321b95j548J428J950j264j988J375J088p90o81J092K98p19n62P66P19j414o67
2338a212J482J271j318j947J321J555J57k254P3J264p4n79m2M65p4p55R34M28
2356F95p09r09N58J485k74j632M57J211p73m64p63J296N25r42j9Q81J74j486K81
2375d08J264p70j039Q5K164j68j840n61K164M35k370o74K359K71j454o41J530
2392C47P90j535k0J670q42j962P25K667j019k210L37K585m69k344l73K531k03
2409F75j789K62J303L5j583J023J527j184k371J822K163r95k541N14K749o97k017
$$ y = [769, -839, -618, 1205, 882, -961, -327, 1308, -4, -1368, 20, 1847, 569, -1656, -297, 1235, 696, -1524, -1154, 1458, 898, -1160, -398, 737, 217, -1100, 101, 1006, -437, -1458, -299, 2051, -295, -1843, -415, 1535, 271, -1717, -342, 746, -44, -725, 367, 665, -54, -616, 150, 869, -545, -1212, 270, 1541, 223, -1724, -403, 1152, 1309, -945, -872, 392, 318, -261, -303, 162, 88, -667, 267, 695, -14, -923, -365, 1120, 846, -786, -329, 882, 109, -355, -1118, 178, 703, -239, -258, 623, 797, -689, -408, 856, 86, -953, -868, 1296, 1128, -712, -1273, 891, 1326, -1044, -1718, 641, 912, -542, -1183, 347, 1137, -398, -418, 1252, 410, -1552, -827, 1840, 821, -1389, -1052, 1533, 1064, -1280, -1653, 878, 675, -1114, -852, 451, 486, -1097, -74, 1453, 269, -2102, -280, 1883, 888, -1653, -1139, 1610, 913, -1104]
2426a104l6K437n60k007P37N06j75q08R97J268j247j529R25J721q31j238r3J257
2444B20P95j577l89J315L16j000oQ55q57n2L48J72J33j339O78J077K25j636K52
2463d70Q68K81j265J40K24R08j089L70j52N95R4n98L28n98n95P8J318K94j433
2482g02m17J427O94q01j197O56J213m61j383R57K13Kl30N62J52j318p6J260M04
2501H55j604m42O68J710j224j645J309J460j078p84R72O30j272k45J709m67j694
2518a142M09J233R12j825j012J746J022j524r03Q09Q45p40l93J118k13p85J70
2535b73J605j100j654O04K036j92j922j41J207J171j551m93M16O01m29J74J62
2552B21o80q5N92Q52jk084J101N70L09q46k91L95Q86r11j000Q96L74P1m38L89
$$ y = [-1104, -1140, 1297, 737, -1270, -533, -27, -202, -1010, -13, 1255, 8, -1521, -596, 1125, 294, -944, -1037, 220, 1015, -562, -951, 364, 680, -320, -326, 529, -328, -380, -32, 140, 273, -1066, -388, 689, 914, -722, -470, 398, 679, -586, -446, -222, 686, -403, -33, -185, 410, 504, -94, 234, -364, -959, -881, 437, 731, -702, -1119, 308, 1002, 201, -996, -340, 873, 412, -971, -14, 199, 201, -129, 433, 585, -733, -809, 451, 855, -749, -1191, -523, 1187, -37, -1682, -373, 1087, 9, -775, 197, 827, -445, -690, 1019, 552, -1142, -733, 500, 1412, -413, -1425, 321, 1343, -181, -1084, -275, 570, -170, -563, 555, 342, -443, -273, 1332, 232, -1422, -818, 1218, 1026, -896, -1037, 170, 1341, -210, -703, -287, 314, -115, 59, 221, -459, -544, 48, 900, 899, -1185, -84, 486, 795, -51, -342, 53, 939, 28, -972, -76, 298, 369, -69, 320]
2572C20k96r37J267J25j2r80p13J350P49r51p03M98P82j30j298L08Q19L4j28k36
2592a32J94k01j51M03N74l49j069J017O60o58r68N79J340j80j668n24J529K83
2610F79q90p9R00k70p94J023K13l83j097J135O68r54j307J188J562o94j391m31
2628i22J414q0m92L43l5m07o55Q28O40j051l04R20P45o94j264J015R40n44j321
2647i24L56O92pL5k58oJ12l68J099k38j022k85J424K2j083J94k9K77M15o74J03
2668a65j54M06k25J25m28k73O70O01k40q98M23N19J05m41q71P45M20O2m79J8J84
2689A04N64j34q94j49O56L05j54j58J24m6k26j80K97k27m74J217k01q50P1j24
2709d79O50j55J4p94N32M44l83R42p23j004M40Q19m3o87J21J189n5q61p53O01
$$ y = [320, 24, -913, 354, 479, 467, -513, -1226, 124, 873, -78, -781, -283, 499, 369, -929, -621, 198, 232, 104, -132, 62, -139, -290, 113, 687, 338, -731, 286, 946, 288, -680, -101, 1239, 1059, -609, -1133, 396, 679, -211, -290, 610, 340, -454, 569, 782, 399, -698, 437, 1105, 151, -1156, 32, 1594, 900, -491, -922, 492, 412, -80, 263, 228, -179, -834, -6, 634, -417, -721, 199, 944, 250, -1014, 1, 941, 397, -924, -568, 124, 117, 152, -106, -112, 0, -368, 731, 493, -529, -814, 610, 632, -451, -257, -286, -9, 406, -268, -165, -319, 87, -138, -13, -441, -714, -44, 557, 317, -581, -158, 361, 466, 25, -846, -101, 319, 381, -98, -80, 104, 668, 534, -360, -509, 147, 452, 298, 140, 264, 218, -8, -188, 109, -118, -592, 625, 424, -426, -355, -479, 171, 16, 30, -764, -232, 212, -171, 771, 48, -956, -516, 303, 260, -427, -306, 883, 828, -33, -786, -185]
2729a85Q66p07K66j45j26M18n30J052j631l53J016P19k65r31m82J240M11j121
2747d88M44l38P8L09j15J27k30J06N38J12m59n58R52M99j211K1k31R90k57l65
2767g6J81j21L5L7k73j03j09K74L32J16l07L2J97j34L22p30m47J122l19K29m26
2788a68n91O19O30m31r59P11N34L97k14o21j87N07k87K60n96J59J47M29k38n03
2808d02J09N58j22K96n95k68O85m09O98p25N88k41J59m86O5p03R09N94m19m64
2828a73m0J60O71l78p88O8K7O29L29j86j042R79n8J3m42m50L77R29n65p5n89Q44
2850B40J86k47j75o53J214k35J05p45m39P29R8M22j155O03l27P18l5p3r7k65K28
2871I7K93n07M03p67J041o70l6m27R22j70j59m79J40K30O04o30Q4n3l18O67n3
$$ y = [-185, 681, -26, 240, 95, -31, 387, -143, 909, -722, -1075, -59, 660, 395, -536, -1018, 222, 633, -488, -44, -382, -304, 5, -110, 17, -213, -107, 431, 543, 84, -474, 478, 977, -234, -213, -444, 546, 289, -76, 105, -16, 19, 56, -217, -320, -429, -155, 177, 293, -14, 18, 215, 81, 403, -327, -774, 348, 29, 258, -168, -759, -140, 490, 59, -900, -189, 345, 742, 528, -93, -280, 227, -60, 200, -396, -237, -90, 339, 101, -402, -293, 265, 143, 439, -156, -424, 261, -148, 550, -175, 413, 172, 331, -155, -90, -793, 116, 710, 291, -173, -213, -53, 618, 240, -548, -480, -453, 176, 505, 319, -723, 256, 198, 211, -231, -681, -304, 625, 60, -15, -604, 240, 426, 179, 4, -649, 565, 330, 435, -310, -749, -20, 78, 500, -655, -52, -379, 339, 304, 231, 134, -131, 97, 390, -117, 286, -481, 560, -110, -146, -573, 349, 179, 20, -459, -319, -89, 515, -115, -31, -84, -402, 265, 212]
2892B12l52k29N66K9J90m95k17N35p6n62J61m63Q06M3J15n45K20j92M72LRp19
2914d89L9N94r9m75k7J042l35k40m14M28J42O0m9k95K23j23K52m68o3l2j79R48
2936D40p73L64r75J066L65J7m69m4m14M95j00l58M93l50qN05j19n04K65j19N32
2957C09m63K3K81lp7K24n32K93m82O00Q5m23k55M99Q9q8J2n4L60k7n07l89L31
2980a94J52J23o99L76k27O32P8j84l1k23l3J60J17l67J51L18J23p76K74j49L05
3001g4q0J67k53N73k00J99n8m46n2L30K25q1k22q13J057j6k00m06m95J180Mmn11
3024a76j57L33K45J62j76m76M41l68J67J1j17lj32J51o77L19N62M35n85j37J14
3045f4K28R6k14l80M10n3K14L7n84K2J21M87J52q44J69M69k57O0K5K48m92L77
$$ y = [212, -140, -369, 197, 226, 416, -79, -296, 239, 163, -399, -238, -701, 105, 148, 263, -282, -62, -254, 218, 221, 230, -489, -450, 144, 45, -430, -457, 585, 250, 10, -404, 24, 166, 226, 177, -118, 105, -18, 234, -234, -297, -329, -508, 440, -333, 31, -944, 122, 487, 504, 35, -9, -423, 72, -28, -386, 107, -243, -251, 254, 135, -369, -104, -223, 309, -154, -131, 150, 147, 70, 294, -238, 55, -427, 173, 258, -165, -420, 79, 168, 80, 92, 38, 398, 371, -136, -525, -194, -42, 81, -618, -242, -469, 163, 241, 57, 26, -197, -230, -70, 47, -320, -169, 149, 272, -504, -230, -379, -74, -154, 13, -240, 333, 133, 332, 274, -172, -224, 106, 331, 250, 28, -785, 272, 256, 56, -350, -845, 335, 339, 335, -176, -333, 0, 245, 407, 231, -245, 196, -172, -5, 6, -111, -114, -246, -95, -772, -453, 109, 544, -41, -178, -64, 164, 260, 46, -334, 76, 23, 237, 274, -310, -288, -167, 320, 472, -372, -203, 266, 9, 69, 94, 342, -150, 227]
3067B27J82J80p79l92M84O5l5j23R2J76K73p42K86M51l99k79K17k28k15Q67l63
3088e5L13j2k53K77J75o70j83K27M58J07p51k06M98J63n48K57j6L46J52m65L02
3109A16n0l97K66L52J84j047M04M74n86J35m10M05N51q73O45n71Q16o78k46N62
3129E2j55l31K61L13J6j27r62J531M05j187NQ4o9Q1K19J7L01o62K6M05J29q34
3151d82O45N04p80o76N70O95J44r05k40O70J54l6k60j32l15L7N46o86L35m49L02
3172c59M23K01j068J351m04J54o6o33J015o46l87J24N16k42K53k26O3j031R99
3191C7J97n49M42m76K32K67j78k21l43L53K67k28j52jl74J088m69J6k13Q42m22
3212A15j04K4j91k26K47j03L11k23k34M53K13q04M9R02j26o46J05J41M55n01P10
$$ y = [227, 409, 589, -190, -582, -98, -33, -68, -191, -99, 77, 350, -392, -106, 345, -54, -333, -116, -344, -559, 308, -55, 258, 246, -7, 270, 445, -225, -408, -181, 277, 384, -367, -573, -75, 88, -460, -203, -219, 127, 279, -186, 116, 66, -331, -65, 287, 471, -576, -172, 302, -284, -149, -559, -154, 397, -476, 169, -402, 414, -264, -510, 52, -103, -434, -173, 140, 156, 29, -933, 598, 1003, -184, -179, -95, -164, -83, 136, 153, 454, -208, -182, 223, 352, -482, 163, 667, -113, -789, -219, 476, 620, -285, -525, 145, 299, 263, 3, -129, -444, -407, 139, -547, -212, -661, -359, 64, 265, -803, 548, 144, 298, 232, -401, 614, -32, -419, -295, 221, -21, 232, 6, 69, -962, 37, 234, -315, 127, -349, -117, 150, -28, -249, -592, -239, 28, -200, -352, -353, -727, 361, -108, -92, -305, 537, 115, 11, 35, -156, -382, -135, -238, 73, -150, -384, 69, 282, -522, -473, 429, 303, -343, -238, -97, 358, -143, 567]
3233E67j42r22K3N06L29j42q53N97J62J66n24K87O6J66n69M74N9m54L77L0m22
3254b19N08p00N17L25o57J19l31M28J8l66O41n1K14n83L50j96k09Q1R72o01o28
3275c68N6M05J88p06k6L64K19l49Q8L79k97q6K30K70j95k50M50k84j46P4J2l0
3297bP3l39j63P87p45l9O49l77L54PK22n21j00QP44n14K70n31K37m31Q2N09k66
3320h6j25J97l58O24m93J19K58J00o75L24K25l46k48P82Q7n0K9L4j73j86j1K01
3342B29M69q14J29M22mj042O07R3N60j365L42K09J52m71Q26R5m60m17j3J149o24
3363G2l90%L99j62l61j06P23K32r42P42L58o24m14N28n7l00j04j26L21K1j97O9
3385c18L51r2n11P99L02q36K1L01K13k14N3l7j51N78k45k35j94K84k22P7J06j06
$$ y = [567, 425, -497, -474, 32, 361, 219, -634, -37, 125, 291, -233, 54, 120, 286, -283, 191, 250, -204, 173, 203, -219, 289, -411, 106, 431, -226, -107, -438, -10, 8, -358, 283, 232, 446, -137, 213, 17, -192, -111, 861, 260, -368, -312, 93, 281, -425, -451, -87, 132, -217, -129, 250, -47, -133, 97, 367, 172, -78, 372, 88, -58, 16, 28, -2, 71, -268, -431, 356, -389, -428, 221, -156, 198, 205, 427, -94, -194, -186, 558, 44, 314, -217, 20, -411, -329, 180, -86, -211, -14, -372, 252, -241, -122, 136, 236, -439, -115, 110, -236, -484, 298, 385, 335, 364, 398, 225, 39, 28, 229, 698, -116, 13, 435, 431, -611, -4, 89, 649, -716, -374, -165, -13, -484, 342, 437, -23, -440, -453, 696, 72, -318, -318, 81, -81, -442, -548, 175, 407, -535, 207, 565, -59, -473, 55, -2, -302, -406, -532, -211, -190, -387, -318, 33, -59, -570, 229, 531, -305, -284, 17, 230, 16, 69, 32, -119, 459, 214, -21, -215, 69, -153, -76, 30, -76]
3407g6l28M88J68k85l95j66L31J16N53p29K06M08K25q64K51K49K53o58J42J81
3427G0P9l86N35J8j35l74L95L02o92J89L74O3k17o54M14N37m75Q6J00L69n16n83
3449e01L48P48k71m93M48j99j83n03K28K3M28k83N73N8l81K78Oo19M09k78K65
3470A01l08J08L64n3O7m78K47K29Jn36K0L28J66k60M32l64K8J69m6j67N57p29
3492a24k64N17p4r76R48M17k84m8m27J88k81O99K64m21m42O18n76M11Rj54K02
3513B02m19Q93N1o00M31j41p19M76j46M10o10l86M50L3n6k35K51M97n07P9q2N6
3535g2N2n40Q02j31l66k17K0M03k44n6L05L2M76o23J46K30l30K87L0k82J37K23
3557B82k50N03r31J35P5L57j68k88M14j43k30J26P4M5R8q38J038p28P24m18r6
$$ y = [-76, -404, 84, 252, -33, -428, -594, -263, -147, 406, -323, -117, 291, 516, -348, -97, 152, 405, -253, -111, 70, 149, -237, 298, 316, 181, -193, 202, 504, -188, 1, 375, 438, 221, -433, -19, 518, 43, 129, 229, 598, 82, -501, -153, 595, 324, -169, 279, 80, -103, -606, -378, -355, 73, -210, 363, 421, 40, 318, 324, -295, 114, -164, 101, -207, -99, 265, 212, 279, -199, 48, 277, 278, -258, -238, 90, 256, -4, 428, 64, 92, 261, 215, 48, 605, -124, -388, 129, 55, -921, 27, 444, 160, 112, -315, -127, -408, 291, 555, 134, -308, 310, -266, 145, 154, 0, 202, -217, 676, 727, 127, 558, 417, -302, 174, 28, 438, -172, -558, -108, -75, -131, -366, -115, 382, -125, -46, -128, -72, -20, -560, 242, 111, -255, -472, -452, -49, -293, -349, -44, -12, 464, -159, -13, 217, -113, 174, 204, -78, 59, 282, 32, 535, -396, -261, -186, 171, 3, -285, 129, -14, -244, -118, -44, 1, 99, -739, 299, -429, 295, -123, -219]
3578b19P40k16k37k23J93o94Q40J28J38k04m37q0K98k19J8m6N80m59n77N50M57
3599C31j24j06M18q4o53J9K49k9J80j63p5Q8q0l7K30l70P9M05j88m34P22q98l36
3622h56R42j03k8k21N37l86N96j12l40J21l63l68J96O23n74J77l99L70M76k88
3642@j54L31r5J61j87N8p0l44L96l95M92q8j71n20N16k53K47J59K99n14m31M63
3664a00L28m66J15l46L01K57J84m31N0o1M98n49k78N26n59J20L41n6k9L93n98
3685c60p8J20L98k22L17l08K47r8m0l00k80N63k68j45k5J83k06K59nL63K45m47
3707h7N57n49Q4m9q7k5O3L37K58m7j038Q77J77p53M85k67j52NL8OJ64J60L60m02
3731A15j27K53o9j29R6l72J12L46k07J7j74%L57N0l0L12j016O05k87l9O19n29
$$ y = [-219, 521, 305, 68, -155, 38, -656, 184, 312, 450, 246, -191, -271, 27, -192, -174, -220, 360, -99, -676, -126, 331, 207, 101, 519, 435, -218, -199, 50, 21, 201, 38, -37, 51, -29, -66, 164, -206, -127, 278, 90, -344, 378, -520, -856, 86, -17, -45, -266, 271, -115, 481, 369, 29, 150, -213, -581, -385, 238, -336, -159, -558, -188, 288, 0, -154, 177, 82, 243, 56, 114, 44, -300, 96, -299, 193, 105, -66, -586, -70, -323, -76, 83, 382, -132, -563, -100, 228, -238, -123, -469, -168, 89, 273, -158, -108, -169, 329, -220, -498, 28, -531, -411, -70, -126, -155, 238, -360, -438, -318, 80, -142, 175, -133, 114, 16, -24, -324, -604, -41, -309, -454, -479, -296, -502, -243, -248, 115, 360, -87, 470, -79, 5, -44, -131, -156, -93, 244, 502, 455, -583, 294, 471, -282, 203, -64, -216, -211, -173, -167, -3, 157, 517, 115, -12, 241, 172, 43, 139, -233, -121, 225, 18, 35, -139, -139, 218, 268, 238, 550, -466, 139, -148, -187, 432, -97]
3753i7j81O09n94L40j2k8k52M15J02l12l84L36K36k12N4j81j56P7o9O80j16l20
3775f5Q1n04L31M64p84P23k50j24k5M48j62ll44M46j24m5m82O31L48o34K60J05
3797B91k94k63L80p1N33m99m3J92kq64L65N97m48l31j6O15M30n22j09J72Kmk62
3820a51k00K98M39l57L75m04l15p4P34Ol67k56O08j96j28K51j8O5o35k73M30N67
3842C99k09m05L25j71J75K82j79j62N13m62K75q16K99n23N79Q50j286K81M3O90
3862D98l70m97N54J05K50q64O69n1m55l99M73J97k70J05M99J8o79k25M38L72q15
3883d47K28J21J81n57J90M52ql25n13M25M39j00n8N71l68k61J79n25Q01o46j62
3904c83J15J64N6O12r27L75n7p2R9N00o79j09N26m80J04K14P4J28p1K22oo78J32
$$ y = [-97, -278, 331, -263, 77, 65, 37, -215, 200, 302, -10, -394, -58, 178, -34, 20, -161, -317, -240, -309, 371, 255, -65, 16, -488, -157, 307, -477, 246, -4, -128, -153, 295, 133, 130, -214, 232, 108, 63, -419, 212, 560, -74, 186, 291, -3, -266, 114, 43, 576, 77, 34, 226, 224, -640, -275, 322, -126, -457, -473, 142, 572, 50, -59, 113, 115, 111, -151, -351, -53, 386, 29, 404, 0, -315, -389, 345, 351, -16, -272, 336, 140, 12, 263, 245, 310, -325, -598, -168, 399, 190, -215, 110, -61, 114, 396, 217, 55, 568, 106, 381, -435, -136, -659, -80, 770, -516, -235, -192, 498, 128, -369, 185, 290, 540, -324, 345, 294, -161, -560, -87, 110, -160, -55, 444, 462, -217, -442, -4, 368, -447, -219, -98, 83, -474, -284, 168, 160, -165, -678, -253, 186, 86, 28, 599, 231, -30, 149, -376, 425, -221, -383, -268, -104, -48, 564, -363, 12, -45, -117, -18, 482, -197, -306, 220, -260, -156, 58, 132, 260, 189, 411, 405, -273, -141]
3927a41k28J2L42l94L93Ol45N34l92R9m56O58M58m14k95k26l7Q43M70j046o7K27
3949AL02j56R8J50l13P8l63q4M96n5j87n9M78L6r59K10O23J72n43j75M34O6q5
3972A65n18P29k66l24l27Q58k38m42L95q3L67p37K78M80l20K04j29L6Ol16J42
3993d0L48k10p9R5L43m93n76J32P61L8m25j11j29N09l78L82o00M86n2o8N12m08
4015C7k67L16Q10q06k36l09P97l64L23l45J29j85l84O67k80j08K57l39M73k42
4035e6k42R13l55n15n5J45K34o2k32L31j22L39n01j61J16J06r4L20K56m35K0O
4057d4Q3L07k20j86K0p4j6K88j68L61n61j29P85l05j24p02R47o94L5O55k91l6
4079f9j32R9L0N20k73J21R7m79l40M04J11N8l85j6R5L66j61n03P16j53j29n97
$$ y = [-141, -369, -357, -15, -409, -16, -10, -355, 179, -213, -114, -570, 88, 546, 132, -163, -389, -426, 417, 887, -159, -226, 1, 303, 147, 245, 395, 82, 160, -203, -287, 209, 154, -33, -92, 386, 422, -537, -327, 296, 468, -75, -250, 184, 250, 165, -353, 376, 110, -214, -541, 317, 79, -363, 32, -51, 316, -421, -143, 337, 17, 221, 92, 128, 134, -182, -40, 308, 98, 19, 114, 457, -36, -612, -480, 281, 319, -106, -217, -346, 163, -215, 167, -433, 53, 1, -67, 445, 37, -230, 86, 896, 90, -146, -455, 342, -22, 301, -44, 85, -100, -484, 183, -97, -205, 52, -287, 186, -56, -298, 615, 260, -255, -310, -165, 69, 7, -225, 106, -16, 323, -178, -339, -223, -117, -211, 109, 365, -70, -50, -44, 39, 346, 126, -60, -40, -114, -130, 158, -10, 351, -210, -339, 446, 141, 17, -685, 262, -432, -397, 258, -33, -69, -201, -102, -72, 448, 175, 296, 393, -86, -426, -22, 89, 147, -238, -254, -159, 207, 46, -457, 259, 106, -23, -620]
4101f20R77k37j16m7L93k35k99k22O20l59ro15P50K89m94J07K39j4q62O15R2M81
4123D34r03J59M25m76Q10o87K15Kk64R0mM12n86L47O55j44q99k7R37o25l3J22
4145d0L12n14Nk76Q88j23p77O90Q5p9l67K68k60j60M29j80Jn7K60j13j25j77L4
4168b76N5j24L39j42j60M62q9k55N44k04N16m80m20K96j01m55P17n3K58l19R6
4189B05m31p9j12P64qk5j47j35k49K03M59m99l28K98rj01K63K58r87N97L19k69
4211a3R3j97K22K87l43J71l69M61p32M74J56k54J38q84P49OJ44p57P51R3n66J59
4233b11Q70n34l70l8K99j55k90L30K30Q1R6l31l31N73J11m73L91P6k0m61R4L63
4255C00m53L48j84N8n39L33K21O0j80Q2J1MJ24m95K95k81K56K41J52n78M82j99
$$ y = [-620, 357, 120, 4, -43, 350, 115, -184, -406, 214, -145, -154, -769, -19, 270, -224, -117, 122, 108, -754, -139, -47, 434, -469, -310, 115, -361, 449, -238, -23, -21, -285, -195, -199, 213, -373, -26, 629, 485, -414, -441, 496, -129, -162, -40, 272, -242, -237, -513, 375, 252, -525, 165, 250, 171, -196, 72, -188, -348, 81, -99, -98, -155, 105, -8, -133, -310, -276, -221, -345, -6, -148, -308, 154, 65, -190, 354, 150, 666, 186, -234, 62, -39, -494, 223, 170, 428, 109, 205, -226, -305, -417, 347, 339, 314, 167, 32, -217, -14, 445, -54, -382, -84, -93, -194, 69, 327, -660, -63, 256, -13, 80, -117, 105, 392, 49, 220, -149, 312, -420, 54, 210, -44, 94, -790, -41, -35, 109, -648, 103, 196, -370, -211, 659, 125, -245, -283, 16, -139, -429, -99, 131, 212, 308, -23, -354, 219, 330, -143, 248, 324, 304, -157, -63, 300, -153, 195, 11, 69, -470, -137, 84, 144, -36, 46, 57, 61, 185, -310, -15, -296, -40, 201, 353, -225, 257, 58]
4277E8l82M30p2J57j20J29l2j85j3J20l4N6q2m53Q98k29j007J012r5m79N43j17
4299A03j74O8m1k45M30l71k2K55l07p4O2m22P98k69j07P52m51J18L85m27J21k54
4321g2K96n42J02k15K71N53M30j358L19O37n77J68j33N06q55O10P6k88Nk79J59
4342a87L72j03M9n13J51J34K45l04j49Jj21Q28j47m92P01J10n79L47l48N5J83
4363B33n96l0P22n23L34Q7K91o45K29l33K05j02j50N19l79j64P50l19J98o11L62
4384G8j12M42n39l91R00o78M4P2L32k66J21K78K0Kj07n49N09m20M69k31J79J68
4406C21m13R3k14o7J44j60N95n97K17k6P14r01N47m24m68Q08j11k93P47n54j70
4427b12M22k07J80k80K40J09j95p4J3k71N92k73m36K73r2j7N73p15N07m5O32l01
$$ y = [58, -324, 106, 34, 191, 71, 200, 168, -17, -30, 90, 56, 112, 30, -423, 475, 246, -761, 251, 156, -323, 220, 103, -71, -3, -44, -289, 141, -230, -252, 3, -304, -378, -316, -738, 60, -209, -316, 436, -15, 103, 488, 61, 182, -72, 224, -318, -216, -431, -160, 393, 823, -535, -216, 421, -156, 12, -121, 385, -470, 140, 216, -72, -67, -346, -187, 185, 82, 131, -382, -231, -97, 148, -156, -305, -304, -425, 403, 256, -236, 465, 575, -4, 343, -5, 50, 233, -363, -393, 329, -194, 140, 227, 518, -127, 102, -231, -26, -128, -278, 241, -138, -302, 448, 129, 327, -284, 78, -34, 408, -131, -522, 378, -300, -256, -184, 148, -118, 3, 281, 301, 303, 196, -353, 156, -264, 205, -26, 153, 321, -92, 1, -213, -280, -136, -296, 299, -298, -81, -107, 607, -294, 253, -171, -639, 169, 58, -235, 512, -42, -212, 210, 3, 183, -97, 143, 252, 57, -17, -4, -275, 317, 44, -392, -119, -211, -228, 345, -370, 137, 92, 724, 423]
4449D23l43J16K02n16j36Q96o90M80k81n25L6M91j68l7J37P8j20m20p1L69M78
4470C99l26k8J65l47O00r40K52l48P53K40l64l1lK6O7p7k58N01k89l32N60l00
4492h0r9K95J86P5n92l0K4j59Q47l63j51L75j22M8k80j17k7J93j96J95K74n32
4514b36j57J09O35L34n69n08KR1M29r7K43r07N15J86k45q0M59j67N1L23o32j02
4536c23L38n2K67k82J65k26K43L23o79N15o0J7N1m26L38o76J226r20k02L76j05
4557i2J42l29P24j18k64K01J65l63J40K66j25p72O23m42M79L4J18o82M88l3n89
4578d29O84k51O8N1j85J52k32M29n46o6l77P27m31J53J1L79l32P1K0M03k61n03
4600d65K39N27l24J59q8k03j2K74J73j41l52j19K8N76l60j87L91k71j7K75r1K27
$$ y = [423, 80, 196, 398, -118, -254, 642, -48, 432, 151, -374, -338, 153, -15, -52, 85, 163, 43, -377, -448, -79, 399, 73, 45, 210, -137, 463, -477, -225, -573, 180, 420, 56, 25, 22, 48, 115, 38, -220, 281, -8, -340, 220, -80, -179, 116, 302, 377, -215, -245, -221, -380, 467, 104, -47, 328, 206, 254, -26, -143, -170, 23, -173, 22, 296, -236, -393, -284, 351, 685, 116, -392, -390, -299, 130, 33, 276, -631, -116, 70, -175, -255, 204, 37, 88, 411, -221, -323, 15, -37, 230, -52, 113, -113, 130, 453, -226, 289, 229, 246, 297, -129, 209, -467, 759, -161, -363, 13, -92, 50, -279, 445, 327, 63, 264, 429, 66, 206, 472, 347, -425, 198, -244, 235, 269, 387, -295, 193, 160, -429, 255, 4, 72, 123, -62, 90, -142, 287, -259, -325, -702, 25, -406, -253, -242, 137, -195, -124, -104, 299, 38, -465, -226, 301, -23, 136, 48, -155, -167, 107, 280, 139, -213, -332, -304, 272, -88, -275, 116, -155, -172, 103, 12, 239]
4622B39m45K32K50j92j40p0P9K46n0n24K95J88j53L36n87O18k60o1k81M24k58
4643a14m16N89J63k21n85N54K88o56K07O18n50L88k87l76O60k52M31l72J59l59
4663a31K14J16o9l45L21k21J10o8j22K67K79r70O28L89j89m25l08J001p98K71
4683e0o9J91n73P2L97J9O5K76o62L22P2l97M91k87l07L17k92K11K9K87r3J09l14
4706a86N34l65M06n65l24P94j64j6o41K22k54N37N25q03K60L58k86j78N5L01P8
4727B88l81QO04o38L15N07n37k5l8q9jO12q05K0N35o37J10L71p0M74n06k44j05
4750b32N22k15k75M36Ko87N71j56N6m56N45ql66j28R75q52Q97k35k89j46J28j42
4772e5l25M67j20J54m64O24m4J40l43l98J79M79L25p76N3J52l4L17n47J36K52
$$ y = [239, -206, 26, 276, 84, -56, -126, -47, 199, 149, -375, -80, 108, -45, 291, -296, 322, 62, 1, -280, 144, -114, -530, 59, 222, 1, -584, -30, 258, -398, -191, 427, -123, 265, -22, -398, 262, 10, 441, 69, 228, -131, 83, 199, 130, -215, 106, -115, -5, -73, -195, 72, 351, -619, 9, 398, 209, -216, -524, 477, -321, -50, -119, 72, -501, -429, -32, -13, 52, 328, -334, -12, 60, -337, 154, -133, -440, -123, -415, -204, -175, 112, 19, 128, -186, 348, -17, 389, -176, -500, 294, 130, 114, -527, -305, -559, -22, 503, -300, -40, 318, 32, -146, -91, 210, 288, -93, -85, 519, -119, 196, 703, 166, 141, 103, 14, 13, 625, -180, -160, 375, -262, -152, 219, 149, 623, 117, -127, -232, 290, 75, -200, 236, 238, -449, 122, -34, 22, -434, 111, 103, -263, -391, 584, -268, 629, 394, 105, -41, 87, -55, -380, 87, -33, 121, -343, 281, 237, 377, 34, -364, -185, 294, 619, -157, -104, 48, 14, 331, -216, -80, 172]
4793A72M72m91J7K87l51n72P5P91m51k57K69J01N8K29o36qO35j70l6q29M38N33
4815B76k31J56j66q0N40n51q0K15l86M97j71L56n48M59J77m73N47n60K99l60j33
4836b17J94L03r5m58k6P72q56M76k81L9L61n22J30j68L83K03j073R64K38J0o88
4857c11N6M23l91M25qP1m5l69o8m2L25j57R1m3N9J57j37K21q90K79N39r9K8k98
4881a84K96L71k72M46m82j20j93m0K26M54l19k65k9m26N10j55L04j44J15m5o29
4902e81M44K56m08j6Q02m53L39k23n17P03l30j80L30k83j03N19q6k70p07P71j7
4923a0r6NJ74J64m94L40K52l73j57M89p5j0o21P62n53L73m90L63o20P68m1l36
4945a86J35j41M76n31J62j3Q3K75o09l5N16m72L53l96L2L99k3R4L38k40o24P80
$$ y = [172, 644, 153, 170, 457, 106, -466, -391, 400, -51, -308, -39, 62, 120, 349, -287, -295, 340, 170, 134, -695, -257, 276, 45, 201, 35, -45, 495, -56, -136, 79, -307, 190, 19, 375, -173, 286, 463, -10, 537, -23, 276, -84, -217, -23, 280, 185, -273, -299, 473, -383, 93, -188, -149, 212, -310, -180, -348, 35, 238, -835, 129, 367, 377, -311, -255, 168, -223, 202, 194, 265, 220, -149, -217, -259, 66, -91, 0, -43, 16, 173, 36, 257, -633, -354, 185, 86, 114, -184, 112, 483, 211, 657, 175, 55, -138, -178, 48, 502, 183, -82, -111, -537, -27, -182, 122, -22, 93, 48, -581, -137, 119, -289, -305, 497, 44, 383, 160, -357, 346, 16, -164, 166, -117, -220, 299, 213, -57, -764, 7, -10, -106, -101, 73, 237, -257, 83, 335, -38, -195, 294, 219, 209, -412, 350, -203, 170, -320, 43, -577, 191, 150, -186, -51, -192, 284, -247, -85, -98, -15, 260, -349, -384, 132, -340, 13, -383, -351, 48, 25, 119, 457, 217, -407, 373]
4967C73n18J70p5N13q5q64L17R7j64M53r3j35J60j94K0K7J10l78M30J71o11K73
4989ck7K16K5J73p27K47M76n50j6n5K43O5O66j131L82l25Q36q15L94r2j51K93
5011A24q04P73r5k36p4P19l15m33j48M02J36k71o3L70r7L56j42j14l1K12k55j02
5033h8L36n10J24M81n58n7k43M67R8J52j64N33k46l50L09n39K64j7L64l78K69
5054B47Q0K77n39j63P3J11J18J23o52k00O40n88Q86k34l47J94j13K94k00j88M13
5075B32l07o9O1M88p2l98O17o10j9j8l3M47n65N28m00L01J75k55J3l65L03L42
5097C96k53l67j87K2L12K84K2o53M98j41K74o15j8J51L37m20j56N17k51L71P6
5118A99m7N4O5j06K36j91M6k8K44j35n58O43m22l41K62P8R1J17n15L1L44P1J35
$$ y = [373, -145, 25, -50, 463, 378, -486, -169, -72, -236, 217, 124, -11, 149, -45, -25, 2, 112, -266, 164, 335, -276, -3, -30, 186, 211, 384, -343, -96, 380, -170, -186, -241, 2, 67, 733, -398, -16, -341, 495, -320, 74, -18, -169, 124, -680, 93, -2, -238, -312, 407, 92, -341, -489, -87, 49, -222, -285, 85, -12, 344, 202, 88, 57, 269, 14, -88, 248, -262, -138, 343, -215, -272, -515, -48, 50, 202, 38, 571, 325, -25, 284, -255, 9, -8, 356, -22, 247, 327, 604, 65, -98, -25, 86, 204, 327, -325, -525, 115, -473, 413, 179, -168, 26, -87, 207, 7, -181, 232, -75, -144, -83, 405, 333, -65, 552, -58, -77, -95, -128, 319, -246, 282, -118, 183, 358, 103, 116, -249, 54, 396, 143, -224, -411, -389, -77, 207, 229, -424, 74, -67, 207, -408, -426, -275, 62, -358, -514, 3, -248, 123, 199, 152, 206, 271, 165, 401, 210, 256, 228, 472, 337, -221, 422, 0, -341, -79, -1, 90, 207, -308, -277, 67, 138, 273]
5141B73p49J30j48K88L77j8l11K32m40K06l6m69N93J95l52O78l10j13k54O83o89
5162b34J04M6l55M8J97L9L38n67j31O68J44M03q33M0Q1j16J4M42l13L13o10M66
5184A84l14K99r2n15J98qo0P17k75k79M30q53kO98J13j27o79Q04K93n31j40K01
5206F2l18J16l5o8L90K4K84m63J06K91m22K34o9l54L91m8m9k08m05M30O70j195
5228f36O90k7k05M56r52K37R32j086O19J97m25k58N18m49J014l22J1j95L76p00
5248b05j63L04M47J70k02J40n25O4m26M08L37q70O39k11K6L10M11q99K81L51l41
5269D6nJ4j88J66N5l12O7J4K52q28O64K03r6q9K05l76O88m90L1qN27o26L12m34
5293b08L89m13K39k44k50Q94n94J53l1J73L48j80j10m01J68K95R7m78L03J3n61
$$ y = [273, -476, -346, -494, -206, 171, 153, -158, 74, -366, -160, -196, -665, -72, 123, -229, 449, 139, 26, -228, 455, -234, -130, -84, -439, -391, -194, -155, 183, -384, -515, 153, 297, 700, -133, -93, -12, -128, -114, 328, 15, 328, -282, 184, -130, 169, 77, -438, -240, -248, -308, 409, 134, -145, 285, -568, -570, 128, 241, 114, -565, 239, 532, 1, -139, 62, -256, -140, -175, -243, 147, 171, 455, -8, 98, 389, -33, 201, 132, -222, 169, 121, 72, -136, -541, -111, 559, -636, 54, 27, -178, 278, -674, -437, 495, -591, 28, 225, -200, -458, 60, -389, 625, 303, 314, 119, 495, -205, -368, -64, 383, 553, 351, 491, -34, 30, -396, 12, 349, -521, 118, -93, -67, 243, 654, -245, 36, 387, 46, 41, 55, -133, 33, 88, -224, -157, -143, 109, -719, -55, 148, 52, -37, 168, -208, 480, -10, 21, 13, 540, -86, 226, -208, 181, -232, 7, -237, -487, 407, -187, -34, -65, 108, 456, 276, 166, -235, -67, 228, 325, -153, 150, 163, -398]
5314c98K17L78n48L77J03j37J94j21k23M61l59Nl18J7L81j99M12p75M29j03k09
5335d16K2J63K57L96k21j73P5q0j19M84j11m84L41l59M49k31N66p16N6j81L95
5356A13J01l44L18k9k40M9K86m10L70k90K12K28o45M25m19M13n2L94L12n04J3
5377C01J38m03m0k3K62J14n40L45o79N05M84p80M22k10N35o00M97j77m6k07K6
5398g6Q90p20n28M94K09l28J11o2J79l39l84O89K86J97l58l37l9M4O0p6L17o62
5420d33L15LJ98m68L02r0K86l69N4K85l80m1N71k55j69M22m21K22J93L21p34j71
5442c59N81J00o45L43K63k60m89N02L10n21L60r8J5J15m75M06J7l06N6O1J01r27
5464h50O99J08K57m96J39O9K78l80L73p56N06K49k4R3l63J37j10M65k73J41k01
$$ y = [-398, -181, 197, -351, 26, 129, -8, 186, 65, -158, 303, -56, -51, -369, -352, 29, -170, 242, -533, -104, -207, -416, -394, -231, 26, 422, 201, 28, 103, 23, -96, 388, 277, -207, 134, -225, 224, -7, 559, -157, -101, -282, 113, 214, -130, 188, 159, -81, -32, 254, -156, 214, -76, 136, 364, -281, 144, -275, 138, 86, 480, 792, 288, 301, 439, 36, -4, -27, 235, 349, -191, 154, -525, -20, 464, -316, 106, -104, 431, -169, 328, 151, 105, -102, -76, 814, 94, -434, 60, 269, -59, 52, -10, 169, -170, -554, 135, 421, 618, 260, -77, -116, -72, -12, -88, 229, -433, -118, -115, 83, -385, -83, -173, 113, -256, -202, 83, -297, -338, 233, -22, -191, 231, -190, 32, 225, 546, -188, -359, 222, 322, -323, 20, 283, 23, -466, 36, 346, -175, 185, 87, 102, 217, -258, 148, 165, -141, -85, -24, 77, -850, -151, -43, 214, -282, -143, -74, 204, -176, 197, -559, -53, 196, 172, 265, -98, 39, -71, 394, 121, 262, 61]
5485F1k30Q30o65J02k29O2%K84m41J32L58J5j63o64Q03l91J91K42l29p1Q5N41
5507E23m61j67l63N99k82K0k17M19l9K63p59M57M14k83M15k19k12K98o11M84j36
5528A43m72M66L07p31j68N78k06M44k51l33O72m34k31P54o45J18M8K69J62n45
5548e5K18l47j68K64J95o52L35L17K92l09j40k72m0N59j46k33J69m06J082q43
5568a80Q34l20r17L64k53P01l27k23L01l00j84N56p1j92L78J52k48k62o0L81k00
5589g0Kk41J70p6j33P96l61K99k14K7L45n47l87M56l76K47o93L61L16Q0j00J44
5611D5k43l62N15M08J33n12p0q4R8k72M63k59r0K90mj49j55K70j62M66L1o31L99
5634A25m8p5m2j37N72k46M24n14L65k30l03R9q4L04j56K06j36k16J20K90k01o2
$$ y = [61, -169, 661, -4, 98, -131, -69, -69, 215, -226, -94, 264, 279, 116, -548, 255, -136, 55, 297, -32, -103, -18, 523, 62, -105, -468, 131, -151, -131, -348, 71, 32, 295, -464, -7, 407, 124, 539, 320, 108, 406, -205, 279, 143, -329, 137, 444, -287, -455, 123, -83, 361, 110, -223, 449, 15, -216, 538, -107, 11, 59, 328, 490, -55, 163, -184, -352, -88, 107, -545, -210, 107, 399, 90, -50, -322, -362, 197, 51, -182, -13, -419, 663, -180, 654, 334, -583, -219, -472, 229, -98, -321, -20, -320, -504, 52, -19, -211, 167, 319, 71, -191, -251, 130, -70, -68, -309, -139, -215, -348, 448, 87, 386, 172, 199, 544, -3, -390, 66, -310, -63, -756, -395, -79, 1, -99, 45, -198, -560, -45, 363, 496, -16, -86, -170, -72, -344, 119, -140, -230, 60, 56, -93, -248, 22, -140, 326, 357, -274, 125, 77, 2, -40, -177, 395, 149, 573, 59, 424, 194, -109, -10, -94, 210, 54, 260, 124, -92, 28, 318, 117, 55]
5656E5L20k92k37K22K58q94L76K86M32q77L71n92N33L65k22j94k04J03M1N7l32
5677d25K45PM20j54K56J6k32l23O2K08j55J89k31Q1j10N50n02K09j57r0K69j24
5699Ij16l30L12K28J47K76n43j49M60J02L8p13M17P5l33K49l8k63k15N74j24k13
5721a50k40N41n59N61m31L28J40o35M08n28J054n89J30j61N1j75OL96o0l85J10
5742a88N62p06O38m58r0N31l93K98K0j63J13j01l74q5J85m60M95K1J88J93j52
5763G4J93k67k27J48L74n35p8N32j40q4L8j90L8L88k79j68k89O13K56m06k6P6
5785D1L01o44O85l82l6J77J24n67P34o12l15J219p56l80N86k16N65p68M23j89
5805a0K42r5k03J7p86O49M6K16r8k27N45m34K50k87M57p4o09p6M60m35M35J84
$$ y = [55, 375, 83, -154, 68, 326, -568, -192, 94, 526, -351, 20, -572, -39, 326, 104, -90, -294, -191, -150, -93, -425, -180, -173, 247, 93, 349, 365, 133, -190, -128, 80, -75, 114, -117, -36, -146, 404, -98, 111, -46, -136, 133, 9, -107, -437, -125, 103, 250, 526, -17, -166, 294, 396, 434, -279, 138, 213, -120, 129, 91, -172, -387, 187, 63, -150, -390, 151, -408, 153, -278, 50, 190, -445, -37, -565, 489, -100, 30, -131, -80, -255, -249, 147, 87, -298, -188, 374, -332, 306, -152, -242, 289, -104, 194, 214, 51, 164, 63, -311, -396, -211, -671, -176, -155, 33, 226, 74, 267, 0, -227, -79, 295, -240, -318, 214, 74, -10, 28, -162, -124, 264, -15, -183, -472, 141, 397, -9, -35, 41, 342, -302, 383, 1, -35, 142, 266, -301, 433, -179, -494, 725, -31, -411, 175, -41, 524, -244, 179, -10, 232, 137, -66, -49, -835, -186, -140, 76, -22, -249, 296, -138, 112, -175, 282, 208, -401, -477, -17, -452, -17, 167]
5827A67k2j14p23O95P02o53k20J74P1M24m85J06j9l92N22k31K32m71J05Q7q1l09
5849d35N73K50p46L86K46l32K4L48k74m1J52l01J83l24M57k24J99P0O3m85K06
5870el36K98l25O77n03o61P66J29r8J3o4L55l94L67m50M6K54K11m87J40J45J41
5892B19J0j05l94O35m34k59L55l87O54m45M13p2J3k54KL92m51Q20n57n23L27j12
5914a53J02Q6n36J454r72L95k05l6o17P57o09L96M43k19m06J91o13K88O07k16
5934A37p77O03J08o0l74P5L42j51J38l79M48r68Q72l83M19j06K75J51k03J04n25
5955b54l5M30j10j30L68r04J081q34K51M46j99L20k42K00m86P3K02k73K86m3k48
5976a01K87o44O75L19o41N00o38P97p66P24n05k39N69l19n29M00K29J00n95J43
$$ y = [167, 145, 31, -692, 3, 705, 52, -168, 6, 77, 501, 16, 122, 103, -289, 233, 2, 234, -237, -132, -45, -126, -435, 138, 388, -358, 28, 274, -58, -34, 314, 40, -1, 151, -150, 33, -291, 166, -58, 141, 211, 274, -211, -5, -341, -43, -368, 309, -194, -855, -89, 40, -58, -45, -109, 246, -148, 219, -231, -185, 69, 280, -207, -67, 78, 219, 229, 124, -270, 365, -69, -328, 27, -360, 294, -151, 262, 190, 203, -51, -49, 343, -108, 712, 155, -368, -41, -153, -51, 35, -501, 953, -19, 376, 171, 135, -482, 275, -334, 62, 505, 286, -120, 71, -542, -254, 353, 137, -640, -37, 71, 11, -363, -288, 54, -97, 41, -338, 110, -858, 14, -369, 50, -56, 219, 370, 167, 271, -254, -289, 141, 31, -99, 269, -635, 446, -388, -137, 309, 110, 430, 188, 388, -98, -25, 177, -96, 190, 147, -101, 186, -458, 217, 536, -105, 395, -243, 554, -212, 512, 7, -232, 337, 18, -511, -111, 118, 218, -377, -234]
5996b34J94K11q8m3J80K23j26m02l1QK69o06M45n3J79j6K33k54L10l05R2l73P2
6019a15N08m53J17J63m79R1P64o97rM37p72M61r2m7K20j60k42n6O74p79J173m24
6041B83j0m2l93l75M75r8J7M58j9m70M71m47k20L10j21L37J26p24k38L65L03K7
6063A5J05l90M61l60P7J15l97J09O62m55J55j55R8p0K22k48n20N58J6rj67M16
6085B38l41r3O90m3q84Q45m71m9K12k01J21M0kQ7k16L08J28k3j94k65n75N16k0
6108a92N49j01l71K97k33n6L28k92k2K80l12J43J70K70p03R4K03m80O54k78K52
6129B00j38N33l75m95L08k01K61p0m5m32P27j63k11j7K81k15K97o23O64m95l8
6150b47k1q4M91J09j62p4K45R9l80p2p6m0M69k62l44O45m14j34O55o1k63j48n29
$$ y = [-234, -40, 171, 83, 40, 220, 443, 317, -85, -116, -108, 161, -445, 0, -53, 126, 110, 343, 89, 399, 94, 186, -187, -115, 393, -60, 57, 220, -259, -168, 596, -101, -110, 327, -445, 16, -76, -123, 97, -63, -305, -361, 313, -466, 707, 283, 273, 231, -162, -537, -62, -160, -143, 315, 296, -174, 297, -150, -370, -60, -181, 156, 282, -442, -680, -315, -12, 15, 120, -270, 191, -169, -92, 23, -374, -265, 397, -58, 97, -58, 40, -30, 192, -56, -576, -18, -2, -11, -178, 238, -103, -196, 494, 451, -433, 412, -59, -108, 104, -97, 24, 64, 62, 149, -67, 241, 369, 346, 152, -113, -688, -172, -192, 357, 256, -115, 182, -51, -107, 221, -71, -93, 187, -125, 18, 188, 458, -245, -151, 52, -428, 226, -52, 200, 62, 595, 220, -275, 33, -168, 93, 23, -22, -454, 273, 110, -101, -118, 163, -52, 245, -378, 286, -209, -247, -268, -352, 139, 248, 86, 12, 257, 356, -24, -96, -172, -212, 257, -5, -349, 296, -118, -252, 403, 342, 79, -69, -598]
6173e98L22L79Q0o34k3L79j71O05R9m64o09L28M13m15O02l78M36o2J6j24j25k37
6195a81k42K34J40K67l30j0K1j16J9J03j15J47L3j02K11J01l36j5K49j8J08p61
6217e93N16m88O56j30j7k66L70J41m43M0L15L35o34k64L50j13M50K06q07O98l61
6238c9k63J02J71l50M42O6L71p54mL84J26M6j55Q4l1m33J91l4L12j84j84j06K12
6261c0O40p56k8K4M56K12r30L84J93q4R4k75J56j88O59m57n1l8j60j42o1L50P70
6284G38o45k66O96l70q5l36K57J16n02N98k26K38k19r5J16l70M42l80M19j77J19
6305F8O8q12L22M80L28k43l66L65j82m57O1j31O34J58K03r67K91l3J49l88N08
6326E6N98q51K65j09L80l5n13L48R4n94P55m19J08k33K94l81K69j92K78K5n48
$$ y = [-598, -276, 103, 183, -451, -474, -95, -266, 339, 438, -26, -635, -307, 106, -309, 293, -85, 351, 289, 305, 181, 56, -181, -423, -189, -49, 218, -112, -122, -101, -217, -198, -95, -210, -63, -30, -132, 79, 180, -156, -171, 78, 60, 168, -593, -77, -565, 91, -39, -56, -322, 48, 189, -254, -214, 101, 436, -198, -462, -112, -225, 225, 431, -376, 322, -39, -302, -200, -29, -379, 63, 129, 500, -254, -258, 126, 252, 298, 143, 227, 196, -237, -46, -80, 232, 48, -136, -242, -30, 610, -146, -174, -150, 306, 518, -412, -28, 165, 81, 175, -100, 56, -132, 527, 70, 19, -19, -179, -321, -382, -32, 738, 93, -173, 523, 153, 68, -268, -11, 105, -397, 201, -25, 213, -6, -101, 15, -355, 87, -293, 126, -51, 68, 136, -676, -354, 126, 454, 211, -155, 210, 28, -429, -368, -499, 135, 293, 496, -471, -180, -213, -64, -452, 56, 654, -197, 68, -41, 339, 304, -209, 139, 233, -361, 394, -25, 83, -150, 144, -237, 32, -160, 118, 143, -405]
6347d05L02M25n56q9M03j8k65O23J76p28J94j21M11j99k89K10k85nQ8m38O2O04
6369A00l54K28K54p43M57M32m23K5K92n10K54L31o04N83k38J04j9q3j98l0M03
6390B61m28L61k96J10J94J66m69K1J47l6%N3j6k16M76m39K89k10j7K6k86K29J8
6413f2k57M81L00o81J91k02K48j31J58K03k39M32m77l55L97j12J50K72J83m63
6433C6M1o10P31o18N26l93K88j03J90m82L56l65J71J4K15J62m14R12o29K30j30
6454A28n95L39K02K06p36O21j41M7j17l1K95l17O86n96M80j61m60J91j60M92m11
6475c8Q4r1m4K28L30o95K71M63r97K60N16k73L6p57P57l1j17j45K44K7j20N24
6497D32o7J38m36N2k25L14n26L22J31j28Q7n80K59j85k45J287o20K3J78j99m6
$$ y = [-405, -103, 322, -234, -323, 80, 62, -203, 420, 596, -132, 62, -59, 352, 153, -136, 74, -211, -216, -128, -566, -504, 100, -254, -26, 228, -515, -58, 374, -49, -24, 268, -242, 12, 343, -261, 322, 84, 188, 169, 86, -112, -142, 261, -167, 194, -102, 8, 202, 368, -101, -80, 67, 31, 31, 84, 68, -148, 328, -111, 178, -32, -49, -23, -309, -80, -62, -319, 162, 462, -219, -28, -230, 18, -113, 45, 248, 9, 441, -36, -391, 6, -106, 44, 316, 499, 36, 77, -533, 198, -420, 106, -287, 1, -102, 88, -394, -38, -403, -232, -218, -3, 159, -255, 657, 28, 258, 128, -467, -128, 74, 280, -456, 165, 24, 71, -46, -77, 218, -99, 587, -9, 471, 310, -150, 41, -119, 373, -38, 46, -45, -89, 139, 469, -226, 45, 508, -489, -229, 287, 14, 50, -707, 50, 19, -98, -243, 1, 28, -92, 432, 365, 503, 67, 119, -106, 208, -318, 4, 135, 7, 94, -486, -227, -412, -657, 630, 10, 33, 211, 12, -34]
6518c4l10K24k39L12M0l25M8j69J94N04j30k74L24p1k41j9J79l39M72o89K32j24
6540d35R13n30P0J54m22O71k09k21Pj58K58l59J87J35n37N79K49k8q5l63N26k52
6562A50L22l25R4Q0k00k45k70j4j69K15J80K55K60m52k72M69k48K66j73Q5j1o4
6584f7J47m62P46J48m92j98M18j39l10K20o6q6k46L42K45j11j05N09o55K38n78
6605e02N74j93L89m57J35j56k28L73O7k53j15L92m26K2O33m8m01L18m71K29k57
6626c75O85m30J05J10m28P04n00K78N8m69N64q2j60j48N57p47J31K13k99O27j11
6647B83l66P62p68O95m79L25q41L64m42M1J011o49k38Q40k35q12N00M5O3j93K25
6668A31j75N63q24K61O9J79L1N3Nj73k61N73j39m2o21L69K37p65O27j83N2j09
$$ y = [-34, -344, -120, -359, -47, -7, -332, -284, -453, -259, 245, 115, -159, 165, 94, -147, -166, 13, -326, 146, -543, -311, -435, 478, -52, 18, 172, -250, 421, 212, -9, -2, -160, 98, -261, -74, 61, -476, 103, 352, 324, 239, -124, 402, 150, 472, 147, 241, 321, 121, -124, -394, -408, -577, -362, -182, 73, 333, -119, -391, 78, -170, 96, -77, 8, -3, -67, 80, -382, 364, 512, 20, -178, 240, 101, -209, 11, -55, -141, -387, -45, 200, 89, -16, 493, -162, 76, -502, 72, -121, 268, -189, -54, -210, -438, -65, 2, -251, -366, 26, -400, -378, 255, 207, -194, 124, -347, -118, -375, 310, -120, -15, 95, -333, 371, -129, 149, 207, -262, 302, 220, 60, -88, 469, -278, -147, 66, -233, 394, 283, -83, 679, -89, 606, 127, 452, -389, -25, -467, -426, 585, -64, -302, 538, 303, -509, -9, 36, 99, -94, 131, -44, 519, -305, -44, 25, 204, 235, 288, 293, 120, -141, 432, 293, 251, -370, -1, 236, -529, 98, -85, -33, -142]
6690a42j26M60J46m58K05J97k72P9j25o5k37M40J63m95m54N47k3l68N34P2J88
6711B66L04m97K00m96o5J00j71N80J45m81J73J36m42NK15L39k05L32n07k30K82
6732a7J72RL46m49J92n0j78j00M04j50n49J75N0O4l64N35J42k3J09n06L06R6%
6755B14n18Q6L32M49n82l13R0M6N01p5n11J77K29o5q4n2M30m59Lk45K81l4K2J22
6779D4K74J91p88P5j13L85l92R7K07O3J21n87J84M29j53j26K11k81J28j10J46
6800EJ91L66o05Q7L12l86P0N17j060O16Pm56Q4P8N02j74r41Q18O1kJ36o32mM72
6824F2j61L36k71m02Q9M36K12jm71N10l27M9J22p68N37j81K13l57J6N8K93n85
6846e91P43o41O03k27K06M4k36K26l60M04m63k11Q52L16n42j61M08l45r6K36k91
$$ y = [-142, -268, 192, 338, -120, 85, 282, 10, 89, -36, -101, -338, 102, 265, -230, -684, -137, -160, -528, 6, 78, 266, 570, 73, 273, -223, -288, -188, -359, 221, 366, -115, 58, 194, -248, -243, -28, 311, 106, 438, -69, -299, -17, 155, 164, 510, 61, 253, 203, 25, -75, 329, 179, -370, -195, -145, -81, -445, 90, 232, 209, 318, -188, 118, 214, 214, -304, -218, 114, 563, -19, -332, -242, -196, 305, 230, -281, -104, 125, 60, -24, -76, 354, -105, -102, -347, -66, -100, -78, 44, 318, 509, -279, -204, -317, 68, -324, -227, -20, 43, 164, -423, -239, 190, 37, -89, 122, -159, -31, -141, 5, 196, 562, -43, 44, 356, -30, 40, 557, -503, 113, 120, -336, -252, -174, 328, 154, -787, 31, 92, 90, 226, -406, -410, 62, -99, 237, -34, -436, -347, 89, 301, 300, -171, 339, 12, 61, 183, -585, -48, -229, -16, -373, -357, -299, -6, -591, 152, -489, 114, -113, 93, 137, -99, 127, -233, 171, -292, -503, 349, 665, 123, -38, 370, 25, -71, 165, -126]
6867a26o8k13M62l19P33l13km20M77k58l42J91m97Q26o0k96m28M38K24K29R8k82
6889E4k97L85l5J89l63jk80M4P31j42K31n35l24L75m3K1M8J19n40N27Lr6M50m98
6913B3p0l29O06k53l25M76m86P27m01k55j52m5P70m2k85K78J42J89l62M03o23
6934a4L48n82K14j17N06q92M65K60k21K17l23P17o32N4j7j98l6L34J06k54J75
6955A10R9l04l75P91m06P13m80O5K34m26K88r52O42j76K89J42k25J08j69k09M22
6976A81QK52p66kJ22l9L92J35k31o4M21l89n17N91j43l1R7L85k42q7J33k34J96
6999A68J09n71k50N53j48j50L01N67n79J94l77J98K28l60k28%L62J73p38M43O23
7020E18k01p69L26p5j47N38J06n28O67j09o23L62pP46o51k68M4o7k92M39k19J40
$$ y = [-126, -194, -407, 55, -264, 469, 156, 154, -266, 211, -47, -389, -198, -695, 131, 71, -225, -653, -215, 9, 238, 336, 54, -243, 142, 107, 296, -67, -68, -348, -304, 427, 285, 516, -19, -343, 32, -11, 10, 58, 177, -363, 164, 167, 71, 521, 23, -47, -376, 230, -23, -348, 128, -358, 369, -32, -287, -439, -484, 286, 244, -41, 237, 379, 568, 206, 609, -14, 334, -248, -34, -151, 355, -537, -72, 188, -33, 184, -139, 578, -54, 0, -17, -215, -251, 83, 189, -65, 110, 209, -95, -470, 321, -85, 628, 148, 213, 447, 21, 309, -643, -1, -177, 112, 254, 29, 137, -32, -241, 181, 189, 441, -325, -327, -205, -244, 148, 283, 52, -12, 409, 20, -497, 94, -49, -80, 17, 402, 160, 73, 206, -28, 168, 277, -294, -544, 9, -139, -289, 12, 579, 0, 194, -183, 15, 243, -117, -345, -345, 17, 190, -548, -105, 518, 317, -452, -126, -201, -348, 190, 296, -232, 435, 326, -297, 65, 58, 804, 153, -115, -71, -138, -430, 9, -210, -70]
7042g0J19j87L76Pm91J73R4l02R7P11l0J9n89R6J55o67J23O36k13K43n67K87K0
7065D0j55K5K98J87l33K19q5M2k2m94L96m9j19K03k58m3o6M93k05K54m53k5L75
7088B25q01Q46n51QO09l99N36p44J29m7k36L41n7m51M75J60m03N99m28j31J28
7109a92J29N67k97k20L55J50o28J7M36m10J01p3K23m06J65l8o5j74K94K1N23l11
7131A67l59L85j57M04j74J35n34O03q02K25N3jM87q79J68K22L46m06L60j35K51
7152C59l42P9n2K25jQ9o88M73n71O08k22J90K49m49O19m07J6N9Nm79P00m21p5
7175c6l0J08j91M25o30K14l34O09q3K92Mn54q7L95J49r2m83L00l18L07N8L30p6
7198B77o43P86r1m71lpl06N39L24k49j51p0K49J53j70o3r25J113o15L82J6k91
$$ y = [-70, 49, -138, 238, 245, -246, -73, 21, -281, -184, 527, 497, 516, -73, 23, 178, -489, -366, 270, 57, 300, -267, 20, 40, -115, -90, 208, 395, 62, 281, 196, 238, 216, -278, 118, 69, -50, 153, -105, -148, -214, 279, 74, 328, -125, -150, 225, -576, 270, -281, -273, 336, -63, 473, -271, -142, -189, -425, -84, -141, -592, -117, 43, -360, 239, -189, -320, -192, -63, 504, 207, -13, 342, 492, -136, -119, 317, -93, 8, -65, 158, -248, -83, -121, -186, -360, -66, -45, 478, 167, -192, 193, 36, 440, 266, 401, -133, 470, -332, -107, -54, -55, 432, -447, -279, -57, 289, -117, 243, 108, 359, 17, 96, 44, 269, 268, 357, -331, 142, -429, 179, -43, 147, 396, -53, 566, 159, 175, 234, 239, -240, 460, 39, -36, -66, 42, -149, 276, -354, -140, -474, 135, 52, 344, 348, -206, -293, 102, 251, 159, -324, -24, -342, -35, 23, 353, 277, -366, 420, 329, -142, -145, -152, -458, 81, 405, 156, 5, -65, 184, 337, 167, 104, -821, 292, -323, 59, 75, -216]
7220b16L02k64N23j048P59m70N25j15J83n9p67P74K32m21N45J06l94K26o12K30
7240C9M38j007M45K70j6k68J72J59j92k34j94k3K14k16L60MnJ40J80o75N1L47
7262a1L30k92n54M15N44o93j28K88n94Q71m11M05P0K5q48L66P1J25J02l55K38
7283c6M29o29J83O42m13k76l32M13l3M3j56J49J68m4j18K55P5j17N0km08M88o53
7306c22R7M73J73m19O0j8o73J121n23l02M13k72l44J83r6M41k39M2R8k01R36p91
7328a63K97o35O19k31K03K13J94m47J42j63r3J0J7l98L75j42J90N4K14n53O6r6
7350c27L93O1k10N27l71o3q2L90j37L7n0k75L89j40l73K85k00M72k07m5k92K89
7372G1l6j0j00J82p40R62n00M00m86J44L99m97J02J98k56O7M4j78M97l90J47m73
$$ y = [-216, 86, -178, 345, -703, 56, -414, 111, -4, 179, 120, -647, 127, 359, -62, 483, 589, 195, 421, -191, 39, 477, -530, -85, 185, 169, -99, 73, 232, 40, -194, -388, -411, -197, -413, -53, -49, -54, 86, 266, -409, -358, -11, 319, 27, -527, -112, 432, -261, -389, -101, -695, 176, -235, 170, 240, 265, -583, -217, -146, -21, 81, -274, -36, 393, -236, -53, 589, 176, -100, -432, -19, -52, -9, -165, -16, 152, 108, -10, 245, 320, 203, 253, 251, -157, 331, -322, -225, 248, 421, 2, 62, 44, -629, 492, -31, -333, 80, -192, -536, -353, -449, -8, -247, -205, -107, -308, 628, -163, 134, -501, 118, -113, 90, 303, 497, 50, 192, 29, -64, -54, -37, -435, -60, -202, -12, 42, 256, -297, -231, -327, 66, 127, -83, 444, 73, 10, -72, 318, 181, 218, 168, -107, 282, 142, -231, 54, -146, 326, 119, 74, -218, 71, 35, 25, -75, 107, -633, 329, -171, 229, -257, -113, 286, -211, -109, 89, -167, -100, -56, -234, 263, -127, 20, -453]
7394d53K86K35l98J76J04l8J88m16O27l88j83N69J59o13m8K5j28M04K42n06L29
7415A73l94L63r7J03j50p3r0M31p87N52J20q01O61N68m55m45L73%j75R39k34k05
7437C77m02L36p35P8L47K40r18N75Q5L77n77M63k86j94K72K5K22l40k36K55M45
7458D09n64N91o33K56L51k73j67J45k83J51J27J64m03k20M56L31q67P35k68m61
7478d23N00l1J59j00o6K38%p43O89n20R38k55n16N34j50l65p0L96r5j33L37l02
7500B2J08kp3o3l06Q78r30K16K56J2k43K39j74K42j76m23P34k91n6L64l44o38
7522f48Q61l26L78m80N45k96j13M1p3M18j84K31n21L25j72K28j70N8Ko8j17K00
7544A19M38p1m35k02K55m47K07K45M14o18K32n58Q80r70P73j47K59m86p1M17K2
$$ y = [-453, -167, 68, -330, -154, -50, -88, 100, -316, 311, -77, -260, 309, 468, -145, -193, -168, -296, 108, 350, -156, 173, -221, 142, 45, 148, -2, -75, -165, 266, -521, 31, 151, -650, 11, 579, 124, -321, 52, 52, -123, 816, 582, 377, -25, 311, -424, -346, 1, 241, -677, -102, -17, 360, -217, 246, -40, -234, 38, 63, 285, -55, -291, -36, 409, -155, 436, -197, 59, 410, 137, -30, 115, -168, -17, 110, 274, -129, -349, 107, 438, -429, 306, 38, -423, 77, 46, 205, 105, 39, 277, 277, -466, 223, -297, 641, 386, -130, 404, 254, -111, -181, 215, 120, -13, 324, 22, 130, 128, 55, -8, -314, 564, -366, -150, 106, 118, -125, 114, -60, 182, 6, -417, 317, 26, -30, 334, -10, -648, 213, -113, 265, -215, 330, 34, -79, -38, -111, 307, 123, 354, -167, 158, -14, 214, 44, 102, 104, 36, -81, 119, 557, 486, 51, -151, 104, -343, -136, 109, 523, -95, 137, -421, 459, -511, 262, 115, 374, -112, -183, 234, 256]
7565B56k40j10O8N55j43l04K67J80j297R69k63j35P1l5L64l21rJ02M27n19Q3j93
7587b27j16L74K8J7m85J39L80l35J89l11J72J93j73k42J60O57n07j87M34j81L11
7608B90k32M8M14l25m17K05M12o77L88L99o02M25m45J75L70n80k19P56n27j55
7628b97N43L61p22p1J12k64J21L80k59j4J52m31K54L81Oq0p77P28r4k50L05p2
7650A2m42O91n64K0L97J45n98M69o0O1m89M4K43K0k5o3l8Q1j95J37k82L60j01
7673a77P71m08k48J65l8j62K43j77j74K70N4L8m37K96j19K17k70M48j65n71K60
7694a84L1j48J19L69m34J68O00p62Q23m80L40n50r1N93j04m48J29n0k3K07Q6j11
7716H0O4k19n1L2J14j82m0l5J44L62n99L68k09J90J68m40q7J51K08j45O03m94
$$ y = [256, 16, -94, -26, 529, 386, 82, 349, 529, -768, 201, -62, -197, -126, -161, 203, -118, -127, -25, 402, -117, -34, -227, -343, 31, 59, 76, -409, -270, 110, -225, -36, -347, -175, 18, -155, -397, -237, 420, -87, -274, 160, -21, 290, 58, 106, 520, 195, -222, -17, 395, -282, 106, 505, -97, 328, -117, 58, 428, -152, -371, 385, -142, -297, 246, 607, -115, -186, -74, -338, -217, 163, -96, -110, 42, -389, -135, 246, 252, 172, -605, 123, 29, -221, 84, 12, -430, 261, -303, -283, 114, 259, -339, 130, 70, 131, -358, -314, -71, -51, -76, -139, -177, -96, -291, -154, -436, -76, -177, 594, 186, -62, 103, 65, -97, 146, -31, -205, 65, 119, 157, -280, 16, -103, 114, -156, 292, 127, -444, -184, -153, -301, -182, 187, -247, -79, 521, -241, 582, 102, 442, -108, -199, 394, 290, -158, -29, -79, -102, 105, 191, 80, 144, -75, -126, -94, 20, -162, -202, -237, -93, 269, -330, 38, -171, 19, 187, -253, -340, -189, 19, -126, 477, -17]
7738a7k77J55m97J071q37O85k26L5l7k79N49r7o9p67O44n32M80K9M07J77m78j06
7760A3L1j21M40n97k9J86J45j28K99p1k64J92j2k7J04J28l15q2k08P39l32l96
7782c05L82M8o7O3K13j63r7N6k44K03n33N93R0J61o45L89k84J46L77m7m24J84
7804I6J50k74j05l45R53n5m99k11L93j10M20r23M34j61L17m49O84n94Q82q39r8
7825c34M26k43K14N44j15p02j81J37P2Q1J87n7q7J52O1q5pk3r8O85l56j0r5M3
7849B09k35l22L82l97N48j20n4k12O9q1m77O27m11J80L76P3P5k52K3J90P9n79
7871c09P21l10l77J7J87j9O63l38n41M79l00J55p2Q6L98J90o16O0l18lJ02m55
7893f00N90o11P10o33P80j62J74l32j88N13r1J00p40P22j2k90L07m98J57m5K25
$$ y = [-17, -294, -139, -636, 435, -402, 283, 57, 92, 55, -224, 325, 228, 159, -608, 36, -496, -16, 13, 420, 597, 119, 13, 44, -77, 363, -234, -263, -77, 68, -60, 239, 168, -96, 96, 84, 57, 161, 289, -26, -108, -316, 423, 91, -305, 77, 125, 58, 121, 334, 171, 74, 130, -114, 89, -444, 149, 239, 400, -245, 144, -140, 6, 383, 336, -88, 96, 246, -28, -133, -478, 475, 420, -79, -290, 103, -7, 413, -510, -76, -237, 80, -369, 315, -279, 603, -236, -334, 92, -151, 63, 607, 492, -210, -391, -254, -182, -101, 86, 29, -58, 94, 155, 70, 63, 40, -58, 627, 271, 261, 166, 209, -26, -348, 34, -363, 185, 65, 11, -201, -132, -213, -690, -63, -474, -294, 82, 155, 230, -22, 1, 191, 270, -309, 412, 102, -275, -258, -71, -90, 573, 235, -306, 173, -127, 28, -44, 42, 440, 630, 14, 74, -244, -247, -145, -600, -10, -621, 89, -544, 236, 74, 248, -84, -272, 241, 150, 250, -490, 232, 220, -70, 237, -261, -104, -149, 76]
7914G6j49M9L04m26N32k31m18j58K13l26N82k65M67l71K60o3j2O87j225N00k9
7935cL4k1L50l20L07m92L65o3K59p52K28L57k50J56l57K82L6r5N76q55M50m06
7957b14N27l23j97K57n25M62M0j8L4k02L37l20J40K79o85Q86m28k47L18J82k84
7978A9j27J5K47j89k81k70L44K81M06r69M64j0k15j6P26n76P95l29n9n19r4P15
8000C58l99K3J18p3OL35k93L35j06m22k5J23L15m79k5L81p6n33O85k84L00J94
8022D58n82Q3j76K16K21j89L99n44o8J45j9j72L13J92j8n03J51K6j48P5K4M34
8044C18m45J91Q3M1m68j22M51j01O1l97M36l65k99M12J22M81N8r2o34L79o9K08
8066B49k93L44l37J17K82j47k43O6n33O9J68N49p30M10L1J55j79k13M23Qj70k76
$$ y = [76, -73, -24, 280, -146, 386, 155, -263, -421, -208, -534, 48, -217, 250, -121, 139, 76, 64, 751, -474, 26, -3, 31, 10, 360, 40, 347, -145, 220, 157, 416, -336, -108, 249, -1, 155, -202, 80, 116, 21, 597, -258, 192, -214, 313, -10, -207, 50, -475, -13, 27, 9, 43, -159, 178, -142, -2, 277, -408, 478, 50, -197, 121, 303, 19, -108, -93, 154, -35, -316, -586, -242, 39, 445, -524, -60, -70, -285, -301, 425, -151, 644, 315, 256, -263, -357, 358, -41, -18, 100, 27, 33, 368, 75, 410, 304, -118, -143, -20, 295, -184, -209, 172, 96, -437, 248, -36, 264, 458, -124, -41, -217, -1, 220, 31, 430, -114, -182, -37, -56, -228, 85, 277, 259, -244, -93, -67, -215, -140, -116, 318, -127, 64, 147, 188, -280, -402, 49, -52, 9, -388, 48, -317, -616, -204, -82, 399, 457, 365, -269, 110, 41, 249, -44, 300, -37, 80, 362, 215, -28, 38, -495, -426, -258, 291, -439, -29, 2, 157, -22, -235, 188, 196, 26, -250]
8088b50L45RK82l20k58L97l54K91l37J17K98l34n2k08K91k09N19j0L1n41O2K45
8110A4J00j5j97l81O16r12O61J52K13p60L67n7M57n26K24K04k91K62K64o96j5
8131c16R9P11l82n12L25O63Rl73m78k79K66M18q04R62n34kJ75m1N49o04l2k02
8153c82J04R18n92M54n07J52k22M41q2p0Q5p02M73L1L17j193J029k22K62m19K75
8174A50M84p59J14K06n29M97K05j50j33n40M09K51m00N17l54K15J38
$$ y = [-250, 95, 104, 386, 66, -192, 205, -149, 142, -195, -78, 220, -114, -166, -374, -83, -292, 227, 217, 248, -293, -231, 14, 114, 99, -98, -479, 137, -775, -114, 38, 251, -509, -142, -199, 258, -268, -44, 160, -131, 131, 395, -301, -316, -217, 494, 112, -400, -75, 588, 597, 224, -254, -533, -267, 151, -653, 309, -225, -227, -52, -93, 456, -148, -180, -382, -278, 640, 48, 502, -5, 147, -75, 366, 284, 214, 299, -403, 70, 101, 418, -775, 254, 32, 294, -125, 150, 634, -125, -11, 195, -334, 163, 368, 218, 85, -455, -46, 205, -195, 322, -32, 183, 321]
8191C21
$$ Imaginary data points
##PAGE= N=2
##DATA TABLE= (X++(I..I)), XYDATA
0@%%%%%%K4m8M8m8M8p2R6j20J47j71K16k64L12l60M29n02N76o68P69q83J006j143
28f08J299j468J654j866K096k342K613k912L242l605M000m435M918n443O020o669
44c506P389q195R099j0125J1308j2672J4273j6186J8519k1438K5211l0310L7624
57B0991m9076O9713j18508M38806M14936p43806k93634J46140J91209j53838O397
68g0670J82119R0775j43197l9940M854j04247j01995K04955K25147j20786k87093
79a60078M7496K52239M485k39255l5345J95021P9644j32918p6150L8180J5611
90a1070n869Q0672M1480j24026j05248J19784J38800j10154j84401P0835K09725
101A20528j124j88280n5921J23103O5591o3501m0845K4412M039k513N0979K2501
$$ y = [0, 0, 0, 0, 0, 0, 0, 24, -24, 24, -24, 24, -48, 48, -72, 75, -96, 120, -144, 168, -192, 237, -265, 311, -357, 412, -471, 535, -608, 691, -777, 877, -989, 1107, -1235, 1378, -1534, 1708, -1897, 2103, -2332, 2586, -2857, 3163, -3506, 3883, -4312, 4787, -5338, 5970, -6702, 7571, -8615, 9904, -11534, 13677, -16633, 20991, -28085, 41628, -76880, 361926, 776862, 33056, -260578, -114438, 76771, -77067, -70670, 111449, 202224, 59027, 19087, 23941, -80306, -182301, 22654, 247801, 127015, -160078, -112582, 139657, 144142, -95113, -130458, 64563, 144207, 11289, -64861, -26681, -11070, -16939, 63733, 105213, -18813, -124061, -4277, 134523, 24369, -160032, -89197, 120528, 119404, -68876, -124797, -1694, 63897, 396, -40449, -16037, -11998, -14511, 36468, 58969]
113E8969q8098o4517R4609J07555q0904j48830L5049J65418K6712j35014o4525
124i3576Q5411O8725l9616n0892O934J7329R824L1155P930o9275n1690P3413R1619
137H7291o1229j29592J9227J45459L0725j24146o7914Q2155P3542m1147n8294
148d3923P808K1630n11J9128J6653m8450n4200N3848R1053m1130j24881L122J34844
161C4991M5719j08090p2492O8464P3971l0856n5091L069K1522N430K0615J3074
173B0326m7545m7018N4701Q5258l5332j10224J632J16291L9167r2389n9783N8971
185a5945O4747k1736m8815o674J3080J3763K5830O291m8822l8182N0834P1711
197F6082l4398r5720rR8785L9963p5799o3005L8740O3243k937m4549k0939J2172
$$ y = [58969, -29129, -93646, 963, 108518, 27614, -121216, -86167, 79251, 105963, -29051, -93576, -8165, 60560, 20944, -29948, -23014, -5685, 4139, 35294, 43224, -26051, -77741, -4328, 87291, 26062, -103530, -84303, 61156, 91881, -32265, -100179, -18024, 55518, 14371, -43923, -36115, -14485, -14996, 4132, 20785, -27665, -81865, -28017, 63036, 21906, -102975, -99853, 34991, 80710, -27380, -99872, -31408, 42563, 11707, -43384, -40315, -18793, -13363, 7252, 20326, -27219, -74237, -19536, 65722, 30390, -79834, -78202, 38089, 77256, -15133, -74916, -15945, 48802, 27066, -21749, -28423, -15343, -1580, 24250, 30541, -18281, -56463, -5629, 66082, 31684, -64036, -64045, 34740, 74703, -1096, -64101, -25361, 37882, 34945, -9604, -30543, -18371]
210a8371K2645K1500m395l9774k5364M2181N6778k2948p8450j2904P8146M8790
222F7834n3557o6457J9150O5994J1252m7064l1184J7035L1372J4626r607l0750
234a1356j9077K7343M9928m993o6593k6618O5078N8249m1740p2284J1426P0760
246D0123J6185n0613l0880K0328K7512P891n638k0632k3754J6541N0687M110o6083
259a4223l5814O2031O2474m0477p6633R872P0656J3534n0471k7986K1104K2207
271A6274M771k200j8322k6344J2205N1694O644o4139l7027N7312N9384l6576o9701
284d6025P779O1567J6069l9795k6609J0300J9660J5406K021k4169k9834J7581
296a6049N2887L729o2295l0106N3390N1888l0847n9454M069N0890J7338k8864
$$ y = [-18371, 4274, 25774, 21379, -18395, -43759, -1578, 55200, 32252, -46198, -59102, 19044, 67834, 14277, -52180, -33030, 32964, 44216, -2848, -34032, -16997, 14375, 29001, 19394, -11356, -30433, -3090, 46838, 41845, -24748, -51366, 13712, 71961, 30221, -42063, -30637, 40123, 56308, 5695, -25185, -4857, 22655, 30546, 24908, 4276, -19478, -2937, 47750, 51860, -14223, -50037, 11994, 74468, 33991, -42642, -32770, 37886, 51420, 949, -27037, -5933, 16274, 21045, 18845, 523, -25821, -13616, 38078, 44722, -19417, -56444, 868, 60252, 23676, -46025, -38246, 23321, 39390, -405, -27014, -16714, 2946, 18352, 20373, -3796, -33630, -16049, 36838, 40567, -21728, -51834, 1556, 53444, 22597, -36857, -32788, 18102, 35440, 6576]
308F576k5295L005J8105J7573J762k4827k6171J5589M4760M413n0461l0040L8647
321f364M7788j6299n2903q896M1703K7437k0228l2657m515K2433K1461k574k7147
334a0761k1140J4997L6596N125l9922k9073K8434M4347p931m7624j3759L5689
346e022K8810j6320l0944n601J9974J8623o7j9136k1038P348L4680J3568l4278
359i403l3197K2843M6912k322m6259j7820L5278L0836j5574l0561l692J9801J5889
372A2731J3j5579j8198N664L0148J2568k9268k9504J8099M0095j510l7898j5793
385b8432K5654K5845r405k3216q166J1627J7719N869j6295k2118M868L1065J2028
398B7043l0116k6758J7814L4471j398l3592j4520K1903K3900n639k2208r833J1766
$$ y = [6576, -18719, -15714, 2391, 19964, 21726, -3101, -29272, -13683, 31077, 35490, -14971, -45011, -6364, 41424, 25125, -27778, -36674, 5029, 32466, 12238, -20419, -24934, -2501, 18960, 16386, -10761, -31901, -16904, 19692, 24817, -15105, -44178, -15744, 28603, 20672, -26952, -40711, -5022, 23788, 7468, -23476, -29077, -9103, 9520, 9453, -9683, -30721, -23373, 11307, 24875, -9403, -42600, -19757, 27155, 24833, -21426, -39246, -3968, 26868, 11294, -19267, -22959, -3158, 12731, 12744, -2835, -21033, -15369, 14779, 27347, -1921, -31425, -13326, 26769, 25259, -12639, -28432, -2778, 23067, 13662, -9554, -17720, -6093, 11626, 17495, 1200, -20918, -16050, 15015, 27043, -3073, -29831, -12017, 22454, 21056, -12536, -27056, -5153, 18747, 13108, -9100, -18933, -7167]
411g167J8965L982j7461j8803P912K6147P815k3463k0944J2493K7899K631k4476
424d470j6253J4237K3937J612k1131j5184J0967K2722M824k0268j8634J0289K4699
437A7347N042k1813j8691J1720K4342L539k1785j6145J1959K2133K350j9348j5140
450a4490R103K0513L311j6732j6193P062J9949O297j7226j7277O604K1024P375
463A9320j8252j7216O078K1035P040j8312j7094O097K1219N925j6971j6643P228
476a0546J9694O011j5738j5375N877J8557O378j3193j5647K593J9083Q318j3244
489B768j8387L004K0790Q487j5538j6394O245J8810M943j2888j3259M083J4415
502G079O574r463j4362j001J5967J0346r957j8887J204J9733Q606j4341j5183
$$ y = [-7167, 11798, 15780, -1681, -20484, -12572, 13575, 21390, -2073, -23017, -10524, 17375, 20006, -4470, -20723, -6486, 17451, 19063, -2068, -17252, -6285, 16437, 21261, 993, -17641, -7352, 17347, 22389, 576, -18115, -6395, 17947, 21486, -299, -16444, -4485, 17648, 19998, 650, -14490, -5387, 15126, 18437, 1705, -14488, -7426, 12523, 18820, 1594, -15683, -9079, 11945, 19320, 1068, -16148, -10070, 10965, 18005, -307, -17401, -11304, 9915, 15840, -1131, -17774, -10546, 9148, 15159, -579, -15954, -10077, 8480, 14858, 1665, -13982, -11389, 7694, 16012, 2768, -15619, -12615, 8175, 16662, 1124, -15270, -9025, 9785, 14728, 1840, -11419, -7336, 7079, 13653, 4190, -10172, -11173, 4794, 15140, 5183, -13704, -12500, 7233, 15839, 1498, -13685]
515a3685N705J4444N427j1374j0552J320J0842P297o361j2850k919J3012J1441
528A1747p954j7754J189J6825Q409j2297j3725M304J3575M054r040r665K005R169
542H42O171m423j0058l139R943J0232m065j5267k232J4505J0610q715j5318J541
556i373J5764M784r907r738K965R590M204m509q103k602P280J0546k553j4174
570e826m873J4053J2142r784j6402K492J5975L233j1215o519M196N242J435M15
584D564m811o801K823J2526K834j6823r073J4442J5399j0050j8435K846J6834
597F275K618j1740m557M771L206K58K303k875q079J938J2379L288j4635r005J3439
612d16J2699q609j3707L604J1949J16o982q11K241j196K063N171l122r922O33
$$ y = [-13685, -7980, 6464, 11891, 517, -10035, -8715, 2127, 9424, 3063, -9787, -12706, 306, 11747, 3793, -13961, -12772, 4053, 12462, 165, -13560, -9256, 4319, 8373, -667, -10332, -8327, 842, 7013, 2590, -7468, -10607, -664, 9568, 5503, -9764, -11996, 2509, 13119, 4404, -10914, -9373, 6391, 11175, 1268, -8470, -5505, 4085, 8289, 3780, -4323, -6925, 355, 10901, 8348, -5826, -10699, 3354, 15496, 5712, -10690, -8198, 7777, 11010, -205, -6724, -2528, 2714, 4149, 4564, -247, -7048, -4225, 8301, 11135, -5688, -14761, -319, 15080, 5030, -13405, -10559, 6275, 8893, -2847, -7404, -2633, 573, 831, 3134, 259, -7820, -5882, 6497, 9785, -4850, -13855, -416, 12283, 3674, -10033, -6429, 5520, 5636, -1346, -2157, 84, -1112, 951, 6122, 3000, -6922, -6289]
627f289J3732L649j5011p672J2324J1339q020j2143K745R553J315n546k705J253
641a476J013J625J936j827n337J99O962L420p639p567N460R835k165r546j959
656g066O911M205l684m472J389K555O83r9k27l947j339N774M916n303q979L238
672e445J1760m28j2483j819J0909M504r113m082P347K649o120P8O232j655p862
687e528K724J0592l847j1807J579J4453N79j4754k704J2746L629j0932k299Q935
701C366Q22o863O70P062l780p881N085J1089p279j2447N041J4091l541j3551K235
716e881J2371j365j0148R48Q486k561o971M490O810o138q676Q159Q285o555r898
731h644N916J1880m129j0857J689Q552j31n502O04L056k074k730M589K052m137
$$ y = [-6289, 7443, 11092, -3919, -11591, 733, 12072, 4052, -8091, -5346, 4207, 5522, -24, -2729, -1476, -463, 1162, 3098, 1271, -4066, -3867, 3095, 6515, -1124, -8691, -3231, 6604, 4439, -5107, -7066, -155, 4050, 366, -4106, -2717, -162, 521, 422, 195, -3752, -5091, 683, 5599, 296, -8683, -5445, 6315, 5887, -6596, -8415, 2494, 6998, -2115, -6197, 1150, 3799, -2321, -2243, 3989, 2334, -5528, -2804, 7788, 3941, -7866, -6287, 8166, 8745, -6009, -8713, 4033, 7662, -3270, -5569, 3366, 4188, -2675, -2005, 5057, 1277, -6604, -1519, 9570, 2291, -10156, -5115, 8976, 5435, -8116, -5881, 6490, 5125, -5023, -4075, 4411, 1850, -5121, -631, 6179, 41, -8635, -476, 7809, 1254, -8644, -2728, 9152, 5023, -5834, -4145, 4407, 4276, -1226, -622, 2434, 360, -2370, 2219, 4271, 134]
746A34l696N174M448m848o007L505P321o53o817n37M094R42k890r65K618j001
762H22j074Q99J150q69k333J651L068m8o437j59N627L745n465n302M787M313l112
779A263n653K338N168k613l710L201L597l897l962M714L927o578m486P886O354
794G549q231p197P188P135o901o226N641P148o773n033O559M964o970l887P579
809B545K832q888l998J0168N147r470n080Q611M866r125m357Q452L829p134l021
824d623P636K272q173j789Q978j53r394n85J0126J570r259k377P688K142p057
839b998j297N593J180o360j63O284n19n167L67O176j895o705J03O450K205m125
855h71k148K566J475k445j569K413O97k016Q79J344o1k416M95K357R84l272k388
$$ y = [134, -3562, 1612, 6060, 1212, -4795, -1290, 6031, 5378, -1439, -1976, 2118, 3060, 170, -795, 1823, 822, -252, 647, 1797, 928, -1405, 246, 3314, 3266, -3171, -3330, 2297, 6042, 577, -4725, 62, 4375, 1263, -4390, -2052, 3116, 503, -3207, -6, 3591, -306, -4268, 446, 4373, -2205, -6691, 1195, 7549, -682, -7879, -691, 6444, -457, -6683, -1042, 6106, -667, -5700, 859, 5823, -1147, -5034, 2545, 5377, -3511, -7509, 2659, 7806, -1664, -6744, 1867, 6733, -2392, -6749, 1703, 5532, -1602, -4623, 3013, 5285, -2888, -4677, 4301, 4148, -5246, -5831, 4295, 5865, -3394, -5771, 1917, 4059, -2998, -4295, 1298, 2478, -3882, -4045, 2239, 1720, -3447, -3080, 3096, 1201, -5504, -5401, 1049, 3254, -871, -3019, -453, 1022, -1423, -2992, -579, 118, -1898, -1019, 325, 264, -2152, -1657, 700, 1684, -1588, -3976]
872c976L112L095p05l641L59M151r24l707l32K970N26k598O27L702j020m481J385
889a457M634k015o273J670P871l33p463m6O539M3n537m22N597j038n439J397P029
906D757k420n969K259N453k770p006L219P041j462o652L051N146l819n477M575
921g4N368m532n879M978O294n223n733M773N624m775o091M579N734m091m382M431
937A001M088n003l290M152L334m872k905L984M697l792l191L502N96k862j501
952b062L209J124k912J36L005Q3k993o66K184N81k638k15J419O21j346O57J132
969A319n75q25n75J100J58n31M34m74O43M34r96j487P32K079j244k099J198K321
987A612l72k277N76J921j159k688J899K338j600k573K051L171k902l086K623K930
$$ y = [-3976, -864, 2231, 1526, -2115, -1756, 2395, 1471, -2236, -2568, 402, 928, -1670, -1043, 2659, 1639, -2842, -1457, 3177, 1162, -5111, -3441, 4430, 4097, -3366, -3412, 3127, 3170, -2367, -2789, 2808, 1770, -3669, -2272, 4757, 2337, -3632, -1373, 4080, 1310, -5696, -2477, 4564, 3102, -3550, -499, 4647, 828, -4649, -74, 5294, 762, -5117, -139, 6155, 932, -4801, -28, 5596, 821, -5270, -691, 5043, 952, -3430, 1001, 5089, 86, -3204, 948, 4282, -590, -3495, 489, 5186, 1394, -1797, 1705, 2301, -561, -2062, 1147, 2271, -641, -505, 2500, 2583, -410, -1076, 1108, 1689, -949, -1164, 255, 876, -470, 187, 1319, 744, -81, -656, 444, 602, 71, 505, 31, 674, 1108, 112, -1375, -643, 1436, 192, -1907, -709, 1612, 1240, -1037, -461, 1460, 301, -2387, -488, 1850, 250, -2323, -272, 2899, -3, -3089, -466, 2464]
1003B464k816k359K742J793j609k029K255J758l753j361M000K070m662j317L841
1018A017J822m114j923M524J298m635j027L652J490m320m90M452M99n095l00M383
1034A233K94l761p18L913O46l187L8K893m92k878L01K052R8k165J51K721j78l100
1052b139N21K256o45q04L0J120l02j106J645P3j169o74J124R80p22o05K06R51
1070G40q36K8qL95k51L26k85o29K60J789j256q62K73J137q14j250J465O57j211
1089c32j020K112K66r47j340J561Q18j658j010K167J605l125p50K708K09k106
1105h42o14K552P47l006o17L104M83k985L5K596J75k774k29L148k69k849N34K385
1123A574k82k944M75L434j754j591N19K059j128k123J508K186j507k191J661J475
$$ y = [2464, -352, -2711, 31, 1824, 215, -1814, 441, 2199, -1554, -2915, 1085, 3155, -1507, -2824, 1017, 2839, -1275, -3198, 1326, 2624, -2011, -3038, 614, 2104, -2216, -2706, 1746, 2245, -2850, -3150, 1233, 1527, -2234, -2952, 961, 1607, -1580, -1542, 1351, 859, -2019, -1718, 334, 432, -1733, -1582, 1139, 961, -2139, -1618, 638, -7, -811, -781, 339, 37, -1069, 576, 649, -520, -1194, -70, 910, 188, -417, -211, 740, -96, -68, -76, 319, 68, 394, 109, -520, -260, 1529, 273, -589, -316, 821, 7, -1243, 222, 879, -332, -1352, 760, 1026, 79, -1261, 300, 1118, -540, -1550, 617, 2222, -903, -1653, 1055, 1264, -842, -1456, 1096, 1843, -1163, -1780, 1324, 1807, -1178, -1143, 1453, 1628, -1146, -1375, 1773, 1504, -1345, -811, 1574, 1292, -1652, -1177, 2257, 503, -1088, -569, 1490, 362, -1761, -253, 1933, 426, -1765, -104, 1371]
1139A371o82j945J073J678j040j480R65J612j345j445J468J160j391j098J091
1154hJ198j292n72R76o4k61M9k14J80p62Q92J96j90n68M71N42o60k88L06o1l16
1175d46M71k02J27r5K27j43K75k63O5Q3k69On9K12r88P76Q41m86j031P25J177
1196A003p07j288Q11J169p31j167K76J227qj123j02R01J93j221K97J260r71n31
1214g12L58J213p47j36p8O03j095l00J170J38r45o29J290L45n72l52N59P0q95
1233g15N5P56K73j189L11J512n25j187JO42P31j006m42L33M09L09Q2n26M4J07
1253b5M16Ro45l01J096k06k44Jo56L52k28M73M40p94m8K97M91K6j132J01Q18M59
1275G00j495K43Q9Q54l95J10l30K47J87j43M51o89p56P77O47j79q22j01J17J082
$$ y = [1371, 689, -1256, -183, 1495, 455, -1025, -60, 1552, 207, -1238, 230, 1390, -1, -1099, -8, 1190, -102, -674, 302, 238, -23, 26, -188, -8, -770, 122, 318, 128, -440, 31, 573, -87, -375, -69, -130, -446, 25, -177, -50, -145, 82, -61, 214, -49, 16, 99, -170, -164, -223, -11, -999, -223, 618, 132, -899, -174, 1003, 296, -992, -181, 988, 257, -910, -634, 593, 585, -538, -640, 261, 454, -767, -470, 790, -181, -712, -354, 859, 112, -24, -102, 501, -594, -894, 276, 414, -531, -1160, 130, 475, -97, -449, 110, 180, -715, -660, 96, 369, -820, -509, 1003, 478, -709, -708, -66, 665, -341, -783, -450, -41, 268, 350, -176, -132, -25, 391, 400, -245, -546, 550, 344, 100, 101, -555, -203, -431, 42, 482, -312, -360, -63, 428, 454, -678, -577, 241, 700, -795, -552, -463, 391, -4, 106, -224, 23, 210, 67, 518, -171, -927, -150, 497, 318, -504, -605, -488, 594]
1295E94k49k98o25L71N43k07L55o40o02R34O47o80j199P45J550j82j809K99Q54
1314D01N30j338r40J863R9q79J40P33o02n19N28J422j290j070Q55J221o18q49
1332c13m35J180K75j057j58J318n36o72L7Q10l30o57J319M77j195j149Q37J576
1350A327j039j518P98R04K58j937P66J051m61j043P99N16j67j148P01J473r72
1367C08j558J271J237j092p52q22J631N26j284K16K37L02j039K98O66M4o56N82
1385A15P25j49j530k52J154J020j411n98O08J527q45j689J427O43m85j28j6K16
1403C32j230O06J094M63k280q65L388M01k532j002K416J026j832j770J806J503
1419A524j881j083K296O25k059q10J956J010k455j306L306K231m844q13K595K101
$$ y = [594, 345, 47, -578, -207, 336, 129, 484, -156, -758, 176, 823, 143, -1056, -311, 1239, 1057, -752, -453, 401, 931, -407, -1347, 516, 615, -264, -124, 609, 7, -512, 16, 1438, 148, -922, -67, 1154, 536, -313, -748, 432, 707, -350, -508, 810, 274, -398, -361, 449, 119, -538, 781, 1258, 63, -1086, -249, 1327, 288, -1230, -432, 472, 730, -1207, -441, 610, 149, -894, -95, 421, 254, -894, -193, 1280, 308, -1250, 21, 1258, 166, -586, -1408, 223, 749, -535, -319, -82, 220, -819, -521, 145, 189, -467, 115, 840, 691, -839, -1091, 63, 1083, -328, -926, -318, 1209, 364, -1325, 102, 745, 260, 132, 116, 332, -898, -292, 802, 1265, -1015, -1880, 1508, 1909, -623, -1625, 791, 1817, -15, -1785, 21, 1524, -357, -1440, 856, 1481, -578, -1388, 568, 1578, -877, -2183, 1123, 3354, -1490, -2303, 292, 2393]
1435B393k533j318K136J075k457j077K849N68k719P1K462P14l765q37L956J46
1451A664k615q78K641Q54k434q16K248N45k302j94K847l92k846N19K715K17l190
1468a417l55K729J44j740j260K648J4j493k18R57J418j774k74J079O85j188r51
1485i96J513R96j578j803J272K114j246j207R08J523r07j890J598O68o09j357
1501a001Q36K463k254k053K040J440j082k743J469L067k169k852K370K842j231
1516A142l520K049K605k087l248K474L647k344l881K628L486l095l228K162M713
1531C503k856l954K802L718k897l653K529M067l077l485L274L222l629k667L208
1546A05L139l528l410L408L237l318l035L903K985m426k343L662K568m345j614
$$ y = [2393, -140, -1458, 678, 1753, -704, -1781, 1068, 1636, -1083, -1012, 1450, 2164, -1601, -2438, 1518, 1664, -951, -1829, 812, 1666, -768, -1584, 664, 1209, -1093, -1287, 1560, 1168, -1678, -1159, 1556, 1773, -1417, -1772, 957, 1101, -639, -1899, 749, 763, -730, -948, 9, 1427, -347, -621, 458, 1143, -45, -996, 517, 1513, -65, -1868, -596, 1518, 272, -935, -27, 1496, 589, -1301, 297, 965, 356, -1001, -165, 2298, 44, -2009, 31, 1471, 389, -2354, -885, 2182, 13, -2839, -469, 2373, 1142, -2378, -329, 2276, 189, -3059, -585, 3062, 718, -3163, -535, 2951, -144, -3372, -1210, 3503, 647, -3307, -505, 3213, 316, -3337, -808, 3259, 182, -3303, -29, 3193, -436, -3103, 105, 3244, -284, -3694, -286, 2951, -367, -3402, 501, 3486, -940, -3283, 379, 2947, -1398, -3012]
1561c012L946J987l874j664L473J557l251k689L948K224k665k580K503K916k929
1576a10j808K222J358k115j609K064J813k765n06K264J429k229j697J391J757
1591A459j193k385K293J600j225j966J189J935j661j545J334J670j293j780J595
1606B7K306j792k064Q49K385l41l572R80L244ll348n50M137n79l405N9L630l14
1624A649l385M06L815n85m113L77L924l02l743K56M604p17m327J96M311n05m674
1641b813P81M311r34m063J699M341k064m548K908L164j559m473J579N085k051
1656A363l901J620L534j286m198K025L726k084l714J930L594j527m388K205L625
1671B524k255l251K315L504j569l261J073K717j201l415J844K877j459k823J801
$$ y = [-3012, 934, 2921, -953, -2617, 856, 2413, -838, -3527, 421, 2645, -20, -2600, -97, 2819, -110, -1918, 304, 1662, -453, -2062, 2, 1815, -950, -1456, 808, 2237, 8, -1689, -298, 1459, 266, -2119, 174, 1774, 549, -1417, -228, 1707, 46, -1499, -165, 1505, 212, -1568, 27, 2333, 541, -1523, -674, 1711, 1370, -2202, -1222, 2022, 2019, -1329, -1879, 2258, 1679, -1726, -1667, 1963, 1649, -1736, -1330, 2485, 1900, -2213, -1836, 2088, 1786, -1957, -1701, 2903, 2186, -2141, -1945, 2366, 1861, -2813, -2032, 2279, 1345, -2718, -1019, 3322, 1258, -3290, -382, 2782, 1223, -3250, -1671, 3414, 1363, -2538, -918, 2616, 1330, -2868, -843, 2883, 799, -2915, -985, 2609, 1082, -3306, -1101, 2524, 269, -2982, -667, 2837, 1268, -1993, -920, 1797, 596, -2819, -975, 1902, 443, -2380, -579]
1686e79L443j636l354J160K412p88k286J409K184j083k232M21J895K03k273N94
1702e10J289l08j877N36K151P9k711l4K711J24k060p91J990N57j904j042K737
1719I37P69k146j449K837J000l426q88L168J532k886j765L182J131k950j673L732
1735A105J341l399j121L208J599l911j093L210J526l896j355M693J306m858p79
1750b424M049M66m062n66M678Q01m777p63M655K85m012j196M884P13m563o36M808
1767B340N4l816j158M393K79m392K91L912N25m414M21K856Q52l887l64L636J69
1784A697l294k04L405J99l213n7K716l90k750L95L435o04k463j83K648j74k438
1801a275P81R60P47k059k45J893L66j592j65J819K57k339p99K358R54j644j325
$$ y = [-579, 2864, 1228, -2126, -966, 1446, 658, -1628, -219, 1965, 882, -1350, -929, 966, 1169, -1104, -510, 779, 471, -1406, -870, 1281, 1360, -1351, -1385, 1326, 1450, -610, -1401, 589, 1146, -758, -1800, 937, 1706, -440, -1889, 948, 1948, -1478, -2366, 802, 2334, -552, -2317, 865, 1996, -954, -2627, 1105, 2446, -953, -2074, 1134, 2733, -1178, -2271, 939, 2465, -1431, -2786, 1907, 3213, -1645, -2424, 1625, 2091, -1971, -2537, 2141, 2942, -1835, -2598, 2057, 2342, -1670, -2866, 2018, 2731, -1832, -2468, 2340, 2394, -1422, -2580, 1813, 2092, -2300, -2009, 1903, 2428, -1986, -1565, 1291, 2143, -1744, -2108, 1528, 1697, -1597, -1801, 1604, 1803, -1410, -1467, 1249, 859, -1891, -1496, 1939, 1335, -1128, -1311, 1337, 1163, -1275, -494, 466, 1213, -846, -1091, 802, 1168, -424, -589, 1230, 1487, -852, -1651, 707, 1661, 17, -1308]
1818a308J485N05q9k143J754J488k037j139J303J580j342j378J346J468p88k259
1834a554K045J029j129j811J208J889j356k059J391J901j117k407J842J949j938
1849a17j806K427Q27j402j889J873K483k888j398K396J644j960k394K931J751
1864B478k770j931K159K402k765j992K122K723k399j856K238J689k564j445K209
1879B98J379k163q69J963R76j609k026K545R73k104q41J937J099k553p80K426
1895F51Q30j912o57K253k12j219n87J376P13j895j73J485J45j640o88J930O53
1912A053q64j058Q07R88p49o99N5J034k56r50O76P11l12n77J5P29j75j346R42
1931B4O41n52q66k16J313L00j184K67L37K94j106J65J637o02r10m48J947q66q99
$$ y = [-1308, 177, 682, 593, -1550, 204, 1692, -345, -1484, -181, 1399, 57, -1321, 25, 1493, 705, -1554, 491, 1520, 391, -1420, -212, 1677, 321, -1738, -347, 1554, 437, -1970, -128, 1821, -117, -1923, 504, 1331, -71, -1960, -87, 2396, -492, -1890, 506, 2150, 190, -2204, 727, 2478, -292, -2223, -64, 2338, -427, -2419, -297, 2426, 27, -1829, 409, 2098, -466, -1911, 298, 1677, -486, -1355, 608, 1584, -25, -2051, 494, 1467, -637, -1478, 459, 1558, -995, -1775, 651, 1481, -431, -1088, 1165, 953, -266, -853, 523, 1236, -659, -832, 653, 798, -842, -1530, 400, 1053, 189, -869, -62, 926, 177, -522, -467, 567, 311, -639, 37, 748, 436, -141, -126, 603, 428, -918, 24, 665, 113, -753, -969, 344, 644, -540, -273, 64, 358, -748, -583, 1054, 452, -458, -906, 1041, 175, -724]
1950g24L86J171j20j496K36J485n34o93m30J561n88j034P88R12r01q23L25J497
1968A018m34j460N35J566q27j207K67J365q54p24O58Q01l45j198R45J024j158
1985b8j046J153R33r08j371J154P27m35p35J96O33l82k75O6J002m34o66L86P76
2004G46p91n97J027k90o27j9N02R97p67L62o21M71o16k15N13N70j84n01J37p0
2024B7j24k25J78O4k71L99L6l99K34K28K4m55O28J09k37k88L33J16k62J88l07
2045dJ78J64k51k48J25k66j25M64J27k73k02O58J7p26l3J71M58m77l1N42k46L45
2067C67p56J92oJ090r00j12M05k73q6N76K0l96j78QP18m61o01M95N78K34r97p3
2089a56J95M37j254N99K71j35o70qR28k17j38l82R37N03j256k21L59L44m86l17
$$ y = [-724, -338, 833, 713, -783, -547, 938, 404, -289, -719, 842, 254, -780, 8, 920, 19, -804, -479, 1018, 584, -876, -341, 1225, 398, -809, -542, 823, -31, -755, -97, 704, 359, -839, 106, 1130, -28, -1074, 79, 1012, 104, -1267, -113, 614, 179, -556, -360, 273, -109, -384, -318, 684, 250, -416, -30, 746, -45, -642, 385, 95, -532, -551, -49, 948, 181, 543, -78, 393, -223, -438, 75, 645, 461, -40, 97, 27, -97, -322, -144, -80, -351, 48, 84, -315, -81, 147, 171, -284, 344, 453, 216, -72, 261, 377, 115, 303, -4, 174, 338, 87, -161, -36, -302, -427, 37, 164, -109, -311, 347, 364, -362, -395, -224, 234, -243, -274, 268, 22, 367, -389, -197, -203, 887, -13, -125, 280, 7, -79, 497, 517, 121, -57, -49, 669, 208, -393, 102, 680, 914, -83, -156, 39, 476, -778, -179, 92, -43, -713, -721, 207, -10, -148, -530, 407, 910, -346, -567, -208, 136, -350, -667]
2109f67R09J64l82j9k2J6p99P68N07m1j336M45O13N84j261k88J375m54l50L32
2129I4K82k89p88Q58K43K5r04K82P41j61p44m59J479j68m00j069R86R43j432m01
2149h82R20N10n23n47J077m33k35K00M37K10j055q1Q01L03p68n03O99O01m43m21
2169a33M39J60o51m38J282R3j491J77J544p90j522L82J822N57j701o17J675J63
2187I51j185r24J510Q91j416j32M49Q02j748J3J351M56j360o71J111R04j188p93
2205i79J251N91j065j65O31M18j108k7R25j93j365L70J445J93j494r18J908Q21
2223A239j416p11J194L70p34j018J229L71j021j26N88Q66j214n69K011m11j032
2240c84n61J004R19q35j129Q85N54q52K24O48k37o24K49O72j63q02L1M20P75q20
$$ y = [-667, 242, 406, 24, 5, -17, -1, -800, -32, 475, 434, -902, -457, 156, 740, -521, -809, 566, 112, -238, 94, 376, 87, -701, 157, 400, 425, -479, -197, 544, 383, -361, -820, 659, 491, 91, -978, 8, 951, -481, -882, 38, 548, 25, -522, 555, 122, -113, 87, 524, 734, -321, -402, 399, 702, -66, -569, 130, 731, 288, -133, 306, 466, -185, -623, 659, 752, -739, -562, 982, 192, -1330, -948, 874, 1431, -270, -887, 788, 951, -234, -1158, 352, 1243, -173, -305, 144, 946, -802, -789, 562, 1018, -342, -1013, 98, 1002, -186, -979, 272, 863, -202, -367, 264, 682, -426, -453, 472, 279, -1086, -716, 729, 922, -572, -1490, 418, 1239, -177, -888, 306, 676, -58, -1076, 153, 524, -497, -623, -35, 831, -383, -952, 1059, 648, -384, -945, 59, 978, 143, -986, -101, 453, -399, -175, 473, 236, -388, -139, 533, 370, -432, -401, 19, 794, -26]
2260b6j374J058J205j065r24Q00J304p09q52m9J036j68r07P36J027r87j331P88
2278d38J546j174j739J374J932j060j735R30J638o11j924L57K394j078j945J455
2294g8J322j627k74Q51J225j209j830J270K227j347j976N25K633n30k597J075
2310c40J267q85j160J281M52p70r89J559J283j608j942J392J745j034j485P64
2326d70J717r47j397R82J141j243l61O54J090j734n31J064J496j558j212N64K045
2343A300p60r48o34K164j73j256k06J391o64j583J475O67p54j143J404K92k52
2360C20j677N32K074l91j874k96J774R48j968n25J169j79l72N90J95M9j218J153
2378C04P96m25k003Q4K647L13k129j314K343R86k606p4J192M98j457M74J300m59
$$ y = [-26, -1400, -342, 863, -202, -1126, -326, 978, 269, -583, -632, 404, 236, -671, 65, 1092, 105, -1226, -438, 1108, -66, -1805, -431, 1501, 441, -1294, -364, 1274, 663, -1261, -904, 1490, 412, -1533, -78, 1244, -383, -657, 194, 1419, 210, -1620, -350, 1877, 530, -1446, -921, 1712, 1182, -1415, -340, 927, 42, -1118, 163, 615, -155, -1144, 415, 1698, 90, -1852, -460, 1285, 251, -1234, -470, 1247, 300, -1097, -115, 1026, -217, -578, 76, 1166, -568, -1099, -35, 1461, -97, -1309, -745, 1300, 540, -408, -1042, 1122, 949, -307, -513, 878, 214, -1369, 106, 773, 19, -1124, 280, 572, 320, -1357, -825, 1249, 858, -1016, -1312, 462, 1410, -558, -1083, 86, -93, -465, 125, 320, 369, -849, 304, 1100, 675, -1328, -1244, 1403, 1716, -413, -1727, 616, 1602, -1004, -1078, 114, 612, -845, -371, 929, 470]
2396D70j137M06J877n89k650J28L438p84k730p2K352L09j760l86J871l65j144
2413g66K73J540j537j087R69K547j011k349L14K054K34k770L95J990k7j547J11
2430f67J155M2j199O70Q73j018j516J712J188l50k296P08J738m10j316k62J632
2447F84k61m07J21M6L98j358P08l6j47q74J175P48m38o61K9P69L99j135m42J027
2467C45M64p48o23L44q4N0N59J90j40j147J77J384K14j784j87R11J841k200p44
2486a178J088J233j136q95M38M15k11l11Q15R0p49j19Q93N58j678q20K123J88
2504G44q53k016K089Q49k20r14PJ192j664L70J124J56j704k28J792L86j824q16
2522a530K240J145k458q07J597J248j275q76Q39J173j649M49J019o16j709M07
$$ y = [470, -667, -261, 1616, 1027, -1623, -1495, 1943, 1159, -1571, -1643, 709, 1018, -742, -1128, 743, 378, -766, -493, 1047, -490, -1577, -608, 1939, 928, -1421, -1107, 947, 1181, -1589, -1194, 796, 769, -778, -667, 488, 530, -669, 1, 874, -144, -1660, 52, 1240, 890, -1406, -698, 1040, 630, -686, -948, 684, 423, 16, 137, 183, 581, -777, -69, -105, -252, -1126, 49, 797, 359, -302, -273, 496, 895, -240, -682, 345, 809, 61, -562, -218, -302, -252, 307, 497, 357, -790, -613, 771, 985, -799, -986, -75, 1766, -434, -1178, -90, 1143, 7, -888, -450, -35, -246, -557, 258, 348, -401, -520, 373, 931, -747, -1567, 556, 744, -109, -2125, -36, 813, 593, -321, -314, 878, -786, -416, 708, 864, -840, -1068, 724, 1110, -714, -1530, 710, 1855, -603, -1410, 187, 1435, 160, -716, 123, 1296, -353, 96, 1115, 499, -1210, -803]
2538h03J617r7j508j23J394P1q05q12J023M03n65L9L8j6n74Q11J93p6q26M24J243
2559A051o12n50n87J172M18r80m96M15N97m76m74M33kN3j94N65k24o37j09Q11
2579A74O18o04q09P28O41n28p98k04J037J36j102j3P36J39n43K20M92p89O2O0
2599c47R22k41r61N19J185o47j206m20J805l7p75k88P76L53q91J12J233r53o90
2618e51J138O40j550j161J179J758j036j297M15J041k79q73J48N69m1j98k36R79
2636F45r43m48P61R47q67j084O30N83n74q63O40R22j97l13k21L04j27M85J90l04
2656A66n19J20O85J57p85k48L68Q96o20q53L5J317m25n13Q46p24R4K86n07M41
2676B17j41n59R82J42o89k95J52O99j12o91o92J135K52n50K27Q0j34k0k97N9l06
$$ y = [-803, 814, 717, -791, -914, 480, 551, -254, -1066, -43, 360, -205, -166, -128, -144, -718, 93, 286, 210, -616, -192, 1051, 439, -111, -698, 474, 892, -88, -584, -169, 428, -48, -522, -89, -91, -38, -232, 333, 109, -528, -637, 174, 792, 188, -621, 107, 748, 220, -578, -782, 255, 391, -711, -724, 12, 151, -392, -172, 320, -469, -407, -347, 575, 334, -627, -108, 1077, 430, -776, -1196, 609, 572, -203, -491, 285, 638, -253, -141, 1092, 139, -551, 587, 1227, -323, -1484, -305, 1453, 417, -880, -465, 576, 297, -576, -428, 141, 100, -98, -334, 645, -298, -746, 15, 962, 95, -989, -359, 224, -350, -1213, -573, 349, 152, -161, -382, -78, -205, 280, 470, 166, -353, -233, 452, 609, -176, -424, -56, 840, 220, -633, -598, 719, 294, -219, 627, -97, -3, 283, -224, 217, 76, -483, 499, 641, -48, -343, -191, 508, 396, -295, -987, 148, 400, -150, 77, 157, 23, 3, -294, -235, -541]
2697e41M30J59L49n01l75l49J710K54j033o24J36P96l4m90L0J16K64L58m18o78
2717d41l95O86O92L27j862R18N92l97l50n15R75K76m85n32O80K61r4l47L88n70
2737a93k40K17P32p49o60K31J355Mj094j45O77J05l87Q1m89O32k07K64r2p85L64
2758c79O39J00j21p70q1O55L59j87q37N17J20L45o41l6P2J6N92p59j61P49J25
2779C17O99j201l95R5O11M62n23l05N78p23P59k43m00m8L27M37j97m44n5N13o1
2800B03J88j199J63N10J17M8m24k2N15l49j87J7L56J21L77k76m07L62L87l2p0
2821C98j095J076K71o69L17r25N57L16k04l63L73q92N48P11m12K87m79O2M15j26
2841A66n75m32J079P9m19k80r4L27K51K12k04L9j8J6J63k50k25LO19j16j005M89
$$ y = [-541, -111, 48, 397, -104, -479, -828, 882, 1136, 103, -521, -385, 411, 377, -113, -83, 33, 297, 655, 237, -441, -836, -150, 542, 869, -993, -75, 517, 120, -230, -745, 230, 506, 21, -511, 169, 430, 336, -11, 377, -193, -433, -216, 516, -233, -893, -662, 693, 697, -397, -542, 135, 240, -147, -66, -555, 77, -130, 134, 42, -743, -379, 260, 360, 239, -531, -612, 43, 402, 215, -622, -105, 15, 360, -281, -317, -245, -229, 363, -396, -557, 192, 317, 1016, -185, -580, -485, 126, 588, 65, -240, 338, -385, 374, 131, -269, -317, 10, 447, 250, -194, -249, 264, 203, 391, -808, -645, -135, -18, 30, -394, -416, 99, -250, -437, -420, -64, 57, 434, 158, -249, 113, 500, 468, 398, -697, 379, 650, -19, 298, -627, -70, 246, 42, -321, 52, -840, -292, 419, 7, 294, -185, -123, 292, 166, -409, -841, 238, 317, -102, -382, -476, -149, 102, 314, 110, 149, 131, 147, 310, 60, -165, -162, 457, 341, -664, -175]
2863a75L58L56q18k02r4L74k25M20j5j23j1M91J79n78l03L73R5J21j03o38O94
2884A76l01P03n12n76P56j62K38l88o32P57M01j28q03j09N42Q14q43k17p5R6Q66
2905F03m54k23J06K04L62j46j084j70M02O26k08j36o53P59O60p45l24O38J99l18
2925I8j66j98J29M81l04K38k41l75K15K27R4m41K22J43K29J96o57q14O39N37l00
2946d8k64k18K65M73N4k32l79N34M64n25l38L92L1J86n72J38k0k8J39O2j36j05
2968a27l11M48M7j0j89K07l71L79j67k2L84k39J52k74j38N43k01N2j72n65J075
2989E01j5k18n2j163Q14P27n61m98K29J23J91J54j63l00P92o05k82M91K0j20M06
3010D71j067L87O9M8P96m38K11r85R72n1n4j106J98P09M84n04l30k99N60p60Q34
$$ y = [-175, 183, 539, -279, -481, -575, -201, -426, -6, -21, -144, -155, 336, 515, -63, -366, 7, 102, 223, 120, -518, 176, -125, 578, 66, -510, 246, 84, 322, -66, -698, 59, 460, 332, -471, -580, -38, 776, -67, -284, -359, -263, 603, 149, -74, 32, 236, 598, 452, -632, -802, -400, 226, 18, -118, -771, -12, 648, -97, -421, 217, 416, 98, -68, -266, -137, 344, 40, 278, 37, -338, -123, 104, 198, -243, -21, 122, 351, 547, -110, -924, -285, 252, -48, -312, -530, -265, 208, 262, 30, -349, 185, 649, 124, -214, 178, 209, 395, -177, -39, -59, -87, 52, 114, -22, -127, -438, 10, 57, 47, -142, 65, -306, 73, -94, -116, 268, 29, 181, -93, -231, 312, 111, 163, -9, -574, 501, 486, 268, 216, -947, -133, 594, 33, -465, -236, -113, 78, 232, 69, -231, 561, -44, -326, 165, 185, 65, 471, -596, -209, -140, -92, 704, 266, 477, -508, 464, 413, 359, -747, -549, 160, 644, 140, -190, -489, 71, -689, 145]
3031A45L44m02m28N24O1n81L20l34P76l54j88q2o5K57l9O09k86l91K38R9K36p25
3053b66j22P96p62M29o1O5j13K92n68K33k82L91n21N45L1o06L52M38l85J19J75
3074A80k21l2J92j76l6j62L70M71m94n52M19K14l07j41m11R45r8J0l71L56q82
3095g26N59k33RL62K26L28r40p3R0N64j0l24l87Q74n10J35k01L18O2k77M92j05
3117B33k30j20O6M49m69p38Q21K66l13n4n95N71n55N42L07o0n14N42M67m17r04
3138g05K80M37O18q28K49J5L50k64l89O12l47K8j69K73M23j033M25L44l37m52
3158d70L07J23L4p07L58O16o38J3O04l97j60mJ69M04m87m5N1J57O15n87m00M54
3180A0J75L7m00N76j84j83j72L20n44L24J09M9q61O32K69j74p2K56L43l40J33
$$ y = [145, 489, 87, -341, 183, 244, -337, -17, -351, 425, 71, -117, -199, -264, -7, -46, 563, 277, -114, 124, 223, 459, -266, -388, 408, -354, 75, 14, 79, -34, 258, -310, -77, -359, 32, -489, 56, 87, -519, -167, 271, -114, 5, 180, -41, -73, 119, -57, -93, -255, 115, 586, 92, -460, -41, 173, -134, -275, -686, 259, 161, 171, -200, 156, -726, -167, -400, -391, -29, 197, 525, -415, -488, -398, 166, 156, -168, -555, 319, -191, -56, -257, 61, 123, -154, 338, 233, 3, -117, -51, 398, -71, -809, 12, 278, -35, -89, -684, -113, -668, -126, 181, 121, -393, 149, 616, 199, -705, -425, 12, 630, -198, 51, 66, 416, 152, -237, 375, 28, 56, -113, 160, 583, -450, -25, 319, -18, -470, -163, -40, -6, -713, -355, 261, -377, -364, 240, -157, -317, -321, -152, 252, -235, -280, -229, -72, 543, -44, -444, 10, 185, 222, -178, 398, 214, 31, -141, 179, -365, -41, 68, 117, -744, -112, 157, -17, -89, 167, 510, 170, 303]
3201C03Jo90J36q1r7N87J35Q2j90Q2n98M47L40q17L71mm3K65k32K45m67k19K91
3224a53K40l20J78k01MjK46J48P50o58k38M96l33n08N2J09P7j88J8r6L47L55p30
3247d06N96l62j5k92R15o96qk2N88m93l10J48M16m04K39K31N54K7n73j6K70J93
3269E80m22o6M74m27J12m26k1K27l11j12J122o38l93N7k25O16p2j67M74l51l12
3290b81j03K59K78j72L1K42p05N2L30O32p27q0L16J05J5m73K79l04Q89m37j67
3311b1k04O98m29j19L67m16P76n04M4j48p6J97n27P44l47J93l2l31P70q61J67
3332e9K17J99n94r2N84K80m59k20L10K1p32J67R21k92Rp7L54l21n88l37Q43m54
3354c20k63j20Q93j65m65J46O18o78O84r32J060N8o84L93m67M85o28N35J40j62
$$ y = [303, 304, -386, -250, -331, -428, 159, 294, 376, 186, 268, -330, 117, 457, -360, 11, 7, -36, 229, -3, 242, -225, -444, -153, 87, -233, -55, -256, -252, -253, -7, 141, 891, 233, -5, 491, 158, -350, -298, -189, -112, -300, -282, -378, -31, 324, -406, 190, -172, -187, -479, 436, -260, -268, -290, 298, -195, -505, -357, 59, -345, -106, 125, 679, 706, 133, 117, 387, 580, 158, 92, 566, 139, 251, -175, -196, 31, -280, -392, 730, 92, -301, -244, -469, 147, 75, -92, 382, 31, -281, -384, -125, 153, -19, 12, 254, -451, -399, -69, 563, -164, -244, 72, 177, 192, -281, -2, -306, 583, 146, -21, -225, 473, 44, -75, 292, -124, 652, 148, 192, 44, -32, 165, -362, 382, 35, 228, 196, -135, 635, -226, -59, 158, 357, -237, -329, 255, 535, 76, -144, 166, 187, -545, -378, 543, 251, 260, 183, 537, 216, -372, -709, 134, -320, -583, -703, 190, 25, -440, -294, 324, -354, 330, -602, 458, 516, -168, 225, -242, 243, -385, 150, 290, 128]
3374A28j80N4K23K82m90r6qo94L94L51o5P3l43M95j42J34k86L80p7K8k47J57j61
3397i0J68q0k84O53n1o37k04O74J00p2Q8k94k0K6k98Q7P56l38o82M18L6J91P9
3420B26p41O33j47k21N56l11J05l93M25N8l78K06R4Jk61J23O31o8L9r98L89M50
3442D18q68K73M68k16M1m11L08K78m22j46J37O26l4j335Q01J83Q4j16m06O13k4
3463B52n28J72K32l82N08K37m31p26J25Q87K79q74J92L66m3k64k26j93L28k5L26
3484B12j71O81n05m17K11M68m96l65R08l62m15O74l59M63l73Ll71M85j37l28N46
3505C52R0k27k55j80L53k79j48J119r41p9j96J176n59l76J38l03P24m70n05M06
3525a60J99J70n01l4J46O9k74L49k22J44J35o3L22m68O6m17N52QL58j072R20J97
$$ y = [128, -52, 2, 225, 507, 17, -79, -87, -781, -387, -36, -101, -28, -371, 124, -18, 116, -170, 210, 133, 161, -86, 71, -90, 78, -2, -286, 367, 316, -321, -525, 149, 249, 177, 265, -29, -49, -23, -321, -234, 522, 184, -498, -80, -44, 147, 226, -515, 118, -29, -250, 306, -5, 100, -293, 132, 190, -188, 18, 112, 113, -148, -25, 606, 538, 577, -421, -32, 418, -450, -177, 291, 75, 116, -295, 13, 291, -131, -277, -140, 486, 452, -883, -82, 101, 185, 69, -337, 276, 252, -276, -104, 128, -254, 254, 491, 60, -666, -541, 346, 625, -249, -57, 309, 266, 2, -224, -417, -89, -114, 212, 41, 722, 217, -200, 11, 479, -17, -382, 526, 164, -251, 423, 64, 527, 154, 157, -214, 271, 134, -194, 352, 442, 215, -40, -220, 133, -146, -294, 825, -116, -195, -391, 785, 226, -150, -12, -315, 409, -61, -566, -160, 39, 209, -292, -326, -180, -111, -385, -36, -258, -114, 21, -42, 280, -188, -122, -539, 13, 21, 379, -693, 227, 424]
3547D24n08l56M45m5j50L24M02l10l86L48O12j368O86j47Q8l58j50O96L2O0n9
3568B80l27j60N29m28M73Q8n65J31J25n45M37l32K88L97o38L14p23O37O0N5p4
3589B2q9j65k11O38r9L86m20J6n2k06M00q09P32n04m7J57L15k98lQ53j40m71R0
3612I5K02k24j09J69N9l07J90k10J66k58J24J81J6l71N17j24O23o38j34k41m8
3633c22l6N92n87j77R0J1O02K63j54l79K73p6q3j59j59M95m98J65L40n57L76J9
3655C9j29m5K76k49L59M4j68r5l7K86q45O82l54K54K76p51Q12j69L8j20M2j03
3677D3j34q8L46q7q3K65k68L98k10Ml83j42J02O86o55j25K71oj74O6k16P38n99
3700b51K02J0M7k32M1M08l20k0q8M39l91P4M35o46J76K60m94J06J52N89o19k79
$$ y = [424, -84, -440, 5, -40, -190, 134, 536, 226, -160, 188, 800, -568, 118, -29, 59, -299, -449, 247, 279, 339, 280, -47, -207, 322, -106, 367, 455, -110, 21, 146, -399, 38, -294, -6, 391, -247, 67, -656, -19, 41, 96, 22, -67, -232, -443, 195, 96, 482, 62, 78, 26, -180, 220, -589, 143, -361, -408, -251, 64, -234, -237, 616, 476, 5, 95, 297, 73, -36, 133, 192, -115, 75, -135, 31, -227, -103, 78, 94, -277, 240, 116, 739, 101, -33, -274, -322, -358, 234, -353, -530, -440, -429, 173, 436, 282, -97, 176, 100, 17, -142, -301, 194, -304, -139, 201, -356, 20, 39, -90, -135, 141, -108, 251, 295, 127, 32, -5, 281, -564, 118, -236, 18, 294, -457, 355, 186, 224, 104, 146, 43, -91, -179, 167, 80, -3, 262, -6, 392, 182, 186, -197, -339, -237, 449, -206, -331, -60, -66, -240, -174, -390, 348, -251, -49, -39, 8, -224, -183, 225, -95, -115, -203, 236, -155, -81, 354, -292, -116, 144, -350, -244, -92, 497, -122, -401]
3722d01P04l87J70m41O70n23L22n65L61J60p1j2J6P5N4J23L0l45j48j8j55R8J52
3745a31m05Q5N63K28l61k27L21O28n82N3K91o28J00R8j05k81O47q49Q34j87N5
3766A47n26J72j08N76o03K51J36r9j24p9Mo1r8J69L07n3p5j67k19JK33L53k6j6
3790I5q26J028K01m01j25P7m51l6Q5M43j52M0J23M1l8m36M44j32M1M78n09J77
3812A67J27p68o3N03L13J08p23N63o57O43k00M40m06j32J37k55L01m90L92J21
3832A21m06j57J53K09K00J01p92O03K31k5l55Q8M04k79J35o84K60K1j28P1j05
3853c34L49j70K39l36M62m60N9N06k06R8l28K66J65n30M18J88m72J51l72K29L13
3874B35o72J7L71j44M75Q2L80o36m74N00M25o45m51N40p0n68L12J055o91l40K37
$$ y = [-401, 303, -84, 86, -355, 315, -208, 114, -451, -90, 70, -1, -13, 3, 78, 132, 255, 285, -60, -208, -226, -381, -283, -131, -536, -451, 112, 340, -21, -248, 73, 701, 119, 172, 463, -165, -65, 33, -72, -353, 294, -555, 279, 92, 147, -379, -207, -315, 261, -342, -91, 45, -54, -178, -257, -253, -314, -412, -243, 64, 11, -64, -231, -450, -449, -216, 137, 111, 95, -731, 297, 498, 97, -28, 49, -402, -438, -353, 90, -62, -22, 101, 142, 104, -332, 112, -20, 21, 499, -10, 167, 294, -474, -537, -34, 279, 387, -336, 227, -430, 213, 13, 453, 47, -85, 52, -203, 98, -392, 0, 121, -285, -442, -289, -80, 120, 221, -571, 32, 263, 238, -117, -29, 375, 96, 231, -453, -193, -172, -300, -229, -334, 15, -155, 84, -252, 210, -250, -191, 315, 109, 207, -121, 145, 310, -220, 198, 386, -86, 65, -307, -78, 235, -437, -420, -49, -193, 282, 364, 744, 108, -366, 134, 559, -86, -537, 3, -67, -635, -323, 732, 41, -299, -62]
3895f2L21k04J97n76l0P44l41j43k89J070j017j44N20M40k90n02L91m03J03L67
3915A52%K51p95L50J89o7R5m96L08j33J94l9m37J92M04k18K0K80l33j61M88k13
3937C1N0q0L67q50L90l2K59M55m06K3k26j01Ll78N08M87n77J71j95L72J81r88
3959e36M82J71n0n52Q50o63K54K50O2n38M41j10n77P90K65o37J86k67J00m26l3
3980e38O22M53q37l3L69Mq8k71N45J3q85P44o39M86J97j00K70m54j18M05L79j21
4002D03r04k73J232k94k40m15J027l99m40R7J89m2K33m48J27OJ47m48M89K15o81
4023d19M42K69k26n09N38R4J52m71j59L19m08K27L05L29o38q9L20M60o28m7k9
4044a68K55K90k44j22K52m30j57M58l64O56k49l14L99k60Ql57Q20o29j56L44l03
$$ y = [-62, 259, 55, 252, -324, -354, 390, 49, -94, -383, 687, -330, -474, 46, 486, 196, -306, 85, -318, -215, 152, 152, 403, -392, -42, 147, 80, 175, -321, -13, -146, 48, 9, -428, -236, 168, -50, -30, 250, -83, -244, 244, 31, 81, 1, 368, -482, -92, -124, 135, 590, 184, 207, -19, -120, -117, -495, 13, 500, -77, 94, -101, 271, 452, -536, -54, 117, 67, -485, 365, -298, -44, 206, 268, -270, 171, 61, -516, 274, 539, -98, 88, -179, -79, -505, -538, 84, 537, -300, -333, 36, 40, -48, -319, 226, 239, -646, 98, -541, -55, 142, 42, 312, -142, -260, 145, 524, 403, -501, -774, 458, 164, -76, -491, 536, 137, -303, -206, -17, -59, 174, -274, -147, -141, 6, -442, 47, 262, -419, 23, 292, 66, -443, 95, 189, 341, -130, -289, 30, -378, -151, 154, 483, -155, -244, 76, 536, -92, -139, -168, 87, 377, 133, 11, 263, -167, -324, 134, -230, 426, 177, -137, 262, 2, 10, -347, 473, -156, -312, 32, -271]
4065b71j55O60l56j40M82k48m34N59l72K35J36L4j5o40K42N83l22j95M37J6j04
4086A32j85L25j21K24m37q26J341m9j001R71n18O56m24k33L30K33J10n60J68K02
4106C38n65q8Q29n04j11j36M30m06o7L07J85K56q23J43K26p6j45N88J28K7p24
4127a88N82o84L03n2P6K82K03n90n95N33L18j21n83M04j31M72m89L79N73j086
4147c94P13k23k00j06l2r5P55j42k56j69K81m88m5K70l55L24J45m7K24J26p74
4168d88L76K53k56p7l26M10K97m42k05L76Q6l80J39O65o65K52K12Q2k22o95P78
4189A70K30p0p30K88j35j04L17%r5M33j68l0j15N6l35J85L01l54K19P17p69q5
4211g4K70n74N72l73l16Q14k41j03n25P46K80k58j80J75k00J73o46K31M35l52
$$ y = [-271, -426, 234, -122, -262, 220, -28, -462, 97, -275, -40, 96, 130, 115, -525, -283, 300, -22, -217, 220, 236, 132, -53, 272, 151, 375, -62, -888, 453, 404, -597, 374, -144, 512, 88, -145, 185, 418, 528, -32, 136, 338, -227, -315, 514, 10, -101, -237, 193, -213, -280, 27, 212, 468, -355, -212, 14, -62, -207, 381, 509, 536, -188, 394, -290, 13, -39, 37, 319, 522, -68, -663, -130, 188, 67, -516, -112, -243, 229, -260, 119, 692, -394, 319, 96, -104, -210, -242, -337, 418, 276, 20, -149, 132, -356, -401, -131, -486, -162, -17, -64, 160, 286, -488, -112, 141, -115, -192, -518, -108, 189, -253, -458, -82, 4, -376, -237, 428, -237, 15, 227, 309, 87, -608, 170, 400, 330, -400, -112, -247, -351, -34, -34, -129, 304, 136, 106, -9, 47, -288, -103, 198, -156, 63, 780, 11, -74, 196, -378, 194, -179, -495, 319, 78, -25, -550, 196, 476, 218, 38, 213, 13, 186, -460, -229, 206, -146]
4231a46K91P1k0o83j00O1L82o12P87L42K16q38R8M11m85o0M85n48M25N4m06J19
4253a56O29p3k45K9K00p41p3P00k81p05O69l60N87k45j86M8K40L56q79K13M46
4274A73p1m4J47n79O76j91k5n95P14j87l1J75k97j9l9K03j38k03K3N47o74J52
4296b83M04j35O6r0k42O12l95J6p6L38r6n48N03M39q3m64J6N01n67J26m81M44
4318EL44p72K98M89m51L52n8j29L76n36R7K71k48PJ40P4q41O86K03j66o74K97
4340b36J17M39j59j31M5M1l01k1j26J14n4N61j79k62K89l78M51r0m07J23J78M41
4362D55o30m2M39k51q7R1M40m56j06J35j42L93j33n28K60K26n83L77L81q4j11
4383D4l27K43r6J01K8p3r7K26N42o70l7L50p71M96J4k47J56M21o39O21R9j7o85
$$ y = [-146, 145, 216, 196, -487, -587, -526, -144, -756, 31, 373, 589, -249, -151, 260, -225, -285, 200, -348, 77, 131, -275, -156, 473, 400, 155, 184, 384, -357, -430, 270, -11, -716, -47, -407, 180, -65, -251, -203, 37, 393, -486, -273, 173, 102, 58, 205, -374, 302, 111, 86, -509, 205, 18, -13, 162, -135, -154, -193, 10, -128, -331, -308, 239, -435, -283, 121, -14, 52, -38, -280, 332, -63, -47, -123, 215, 119, -429, 74, 513, 430, -34, -18, 483, -84, 42, -439, 5, 349, -423, -125, 364, -87, 265, 207, 78, 454, -82, 15, 286, 38, 45, 185, 259, -582, 104, 307, 141, -533, -236, -119, 320, 161, 30, 75, 116, -185, -206, -332, -218, -272, 289, 110, -152, 137, -241, 210, 120, -287, -164, 14, 455, -175, -217, 222, -29, -116, -25, 415, -41, -147, -12, -154, 239, 106, -422, -162, 64, -519, -142, 239, 155, 44, -283, -40, -136, -35, -7, -80, -177, 49, 591, -79, -116, 234, -537, -41, -27, -274, -118, 303, -336, 285, 384, 367, -318]
4406c18N5M29r5n1m89J40J18L67l44Lk35M85k37LO5M2J77l09R7J45l02L84N0k20
4430d0K56j12m94N69o67P71m31J29K73k34O6j72K34j65j76K44K23m83L85j51M4
4451F9rl2J05n69P43j73L4l66L89k58J85k03N0k30P50m08l39K85K5J87J5n44k80
4474e74L13N20k65K1j13L31m43K11m67N11k39j04K96P7k34k66o0N08n3k84M24
4495A10l13J38P6K4k0K53m39K71K12j009O68M90p99m4N56l69K70k88L53l20K10
4516C0j61L83k29M99o21J8J59J19o04N61o06K94m32O16m41K69M65j41L9N9k08
4537F8m50L62p65R43p65M69j04j17K01J76M01l50p16J030n98J04K5m6J45N3j09
4558d3r7J82K91j44n1l00pJ12L02j78J60Q4j65M67m5n85j16K79M41n68n6J93l06
$$ y = [-318, -263, 166, 71, 20, -469, -329, -211, 156, -188, -185, -420, 65, -172, -169, -104, -62, 115, -194, -97, 48, -254, 130, 180, -40, 216, 104, -390, 179, -488, 283, -148, -19, 254, 20, 86, -86, 148, -17, -193, 51, 274, -209, 176, 25, 69, 60, 28, 133, -436, 307, 134, 168, -198, 191, -67, 118, -85, -35, -265, 485, 77, -262, 23, 48, 235, 250, -294, -574, -261, 259, -6, 15, -98, 233, -210, 1, -466, 45, -194, -298, -2, 75, -159, -425, -485, 23, -30, -314, 110, -203, -65, 11, 35, 15, 268, -171, 100, 312, -697, -29, 461, -338, -382, 174, -195, 75, -213, 140, -180, 30, -131, 252, 23, 522, -99, -81, 78, 197, -407, 154, -452, -158, -590, 26, -415, -146, 319, 178, 217, 276, 68, -382, -20, -785, 158, -607, -138, -242, -359, -158, 18, 419, 69, -647, 383, -215, -111, -86, -132, 13, 66, -43, -140, 42, 333, 189, 138, -162, -169, -57, 245, 67, 227, 311, 146, 613, 568, -17, -133, 146, 587, 19, -37, 156, -150]
4581a50q2L11j16J65k56K48j07M34k16q81L49k30K85K28J6l08n6L84K37p4n05
4602c24j30P87o53N2M35R5J19n47L97o2N21j35o19Q2m35P22j59j78m6M73q48L75
4624g8P34p80J86k16k5k8O4k63Q69J4k55R8j09K20k72l60k8q7N94n3n98M91n0
4647F8M1k04mN46k90q7N07l63N1q27N74k47L60O22q16j5O66p54L98M7k09J64N6
4670B84n90m10P29L51k98L78k41P1k59m6K7p8KP70p88K45L61k12l58L4j00J37
4692IK70m64P3L01J9l18m14M65J26L4K23o14L87k60N10o11M23l47J53j19j0K91
4714A27m18j55Q27l00j17j80L12n57k16K98J45M50o50M98M62n11O58p86j54L90
4734A23K39p41L47j82N43p48N03N70r68L97k79L16l29n1L27k40o1n3M30o1k47
$$ y = [-150, -232, 79, -37, 128, -128, 120, 13, 447, 231, -650, -301, -531, -246, -18, -2, -310, -366, 18, 255, 181, -324, -454, 333, -320, -268, 167, 262, 381, -166, 231, 169, 690, 555, -64, 18, -417, 305, 146, -32, -78, 395, -453, -78, 656, -124, 62, -154, -179, -207, -143, -406, 463, 477, 222, 320, 211, 431, 159, -201, -229, -316, 278, 225, -373, 118, 68, 109, -95, -99, 447, 157, 70, 577, 214, 265, -562, 12, -235, 125, 747, -69, -84, 582, -172, 226, 273, 64, 228, 284, -306, -716, 13, 364, 66, 444, 203, 274, 15, -31, -4, -82, -80, 690, -98, 147, 508, 296, -62, -28, -128, 9, 279, -185, -112, 189, 208, -110, -524, -59, 67, 101, 324, -290, 97, -163, 347, -264, 159, -188, -35, -154, -164, 127, -291, -446, 381, 81, -36, -216, 96, -461, -677, -379, -234, 216, -434, 64, 526, 15, 673, -113, -267, 123, 362, -379, -32, -214, 329, -419, 84, 654, -314, 83, -196, 120, -209, -260, 67, -173, -234, -287, 143, 82, -165]
4755a65J56k11J02l4R5k5L83p64M97m40Q00l94L71j040J016k02m17J72j27J64
4775f3Q3P4l27J82J74K58m7m97N03n80P27j065K42K07J77j02K4m51K81O7K8O19
4797E14m62j41J05l46N33J48J33q63J91N52n60L20K25j65l16k50O14k73J09P7
4817A45Mk29j09k06L54j03k9L6m42Q24n81R9K72k61M04n8k70L48m80j22M31l68
4839c41J32O25n42K19nq71J262j42j57j74l89L69J20l35N66j43j76M1L11R9o15
4860a46j54L25J14J09m19M0J15l69O29o86K45K09J94j28K76j24k80k53M85q4j66
4881f8J37k30P0K67j33j06N6Q5j76j08M07j81K04j60K82o28M54l83j5K91Q8k47
4903i4L41p5n68N79j08l9J00K57n51L60K10j71n53M98l93N09n50J86j7K86o44
$$ y = [-165, -9, -220, -118, -152, -57, -82, 301, -463, 34, -406, 394, 0, 371, -669, 347, 145, -272, -100, -227, -63, 20, 94, -233, -51, 123, 381, 334, -163, 340, -240, 487, -578, -336, -129, 48, -54, -30, -481, -200, -133, -105, 514, 52, -89, 16, -330, 203, 351, 484, -379, -188, 364, -196, 124, 349, 184, -132, -382, 232, -41, 68, 145, 149, -80, -189, -395, -41, -144, -173, -137, -579, 245, -336, -237, 35, -226, 178, 120, -150, 198, -282, -404, 27, -341, -209, 416, -126, 93, 88, -783, 479, 337, 180, 6, -383, -14, 106, -229, 337, 194, 18, 59, 370, 469, -146, -300, 25, 139, 248, -171, -131, -16, -385, 244, -442, -197, 12, 206, 78, 354, 230, -50, -303, 182, 98, -68, 69, -161, -91, 176, 43, -63, -7, 78, -98, -206, 201, 20, 224, 64, 346, -282, 172, -211, -226, 65, 153, -94, 247, 172, -396, 183, 75, 36, 136, 393, -158, 202, 412, 241, -312, 186, -207, 302, -248, -62, -79, 207, -437]
4924d37K62L78n35o2K16L81j80K67l29m67P09k49l7M77k50k85k55O25L43j127
4944e55J26L28L11k28l76P28j99K0l96K89J31m78L0L21m3n46M96j5k15O51k37
4965A43M16r10M06j67J09L53l64M64q70L79K52j70R0q8k67K55j17J96N21n06j13
4986A2J64M4K58m45l22J29J25k5l8j92J81J92Kk61P49p13J97M01k05m12K15P7
5008A33O7o87J79K57J02k64LK26J32n6J56o7k61K92K08k72m93J25m23P09q7J27
5030A06J52pk15J36k05K10j38q8L33j54%J19j63m83K06j19K24K53k2n46N38n6
5052H1k23L8K45P1j34K45m92J04J63j42K77P3J54m82lR3j66K47K79j027Q73K7
5074C01k75K1p7K22m91Q5L45P4J20k42k9J95m59N6J87O5k88M82j58k75K51j75
$$ y = [-437, -175, 203, -332, -394, -178, 203, 23, 290, -39, -506, 203, -46, -83, 394, 144, -141, -396, 229, 572, -555, -429, -101, 210, -18, -394, 334, 135, 155, -241, 48, 179, -299, -269, 52, 9, -537, -41, -56, -271, 380, 143, 559, -351, 55, -112, -3, 350, -14, 450, -420, -41, 211, 41, 131, 43, -224, 31, -86, 110, 631, 125, 12, 176, 220, 478, 33, -289, -160, -35, -60, -98, -290, -109, 83, 85, -176, 573, -140, 57, 458, 253, -159, 56, 133, 200, -487, -308, -51, 51, -213, -210, 16, 148, 92, 248, 181, -80, 212, 420, 148, -345, -220, -643, 66, -21, 106, 258, 251, 36, 172, -33, 177, 39, -49, 284, 130, 130, 249, 86, -397, -191, -310, -86, 167, 145, -401, 137, 81, -142, -104, 141, 212, 78, 323, -169, -65, 98, -44, 233, 306, 460, -22, -25, 68, -98, 149, 428, -599, 274, 301, 26, 47, -30, 192, -299, -214, 131, 205, 325, 83, 54, 249, -210, -154, 33, 98, -190, 292, 134, -141, 110, -65]
5096f5J85K36l83M08o05O01q49P02n21Q76l76n1j05L12l14J52k44J60rm75N25
5117A60j85j12PK89J64j12m6R4K9m91M01m56K32L07k92p8L20o83P77K52p77r1
5139b91J53J27j71o2J13k8L04m03N59n82Q03q68J94k9K27J08n81N62j83J70j01
5160B1j34J10K28o07L0Q74n75M04P45j201m3M74r60Q89m92K5M11L6o52r8N05K07
5182A97K41n00p3l83O69l25L99k62j45L27j65j30j70R17n43J34k76o37P68k83
5202b40N27j15m19L05M41n78o4N2j30M46j05k59N02l84J99k62p2N54k59Lj31M
5224A5P4j16N47k27l77l86K36M81p11M11R1J10O8J92m47L86p50j55P11j132P57
5245b22Q8K71O4L6m30J89Q2k81l68N93j7j35K17J43n2l29J73n3l23K10j06J84
$$ y = [-65, 120, 356, -27, 381, -224, 377, -472, 230, -291, 585, 209, 158, 53, 365, 51, 203, -41, 119, 110, -365, 160, -25, -137, -130, 159, 323, 211, 165, 259, 288, -203, 198, -258, -26, 281, -11, -89, 231, -452, 325, 577, -200, -291, -138, -11, -182, -244, -131, -159, 145, -258, 301, -281, 522, -346, -152, -181, 46, 154, -427, 135, -48, 122, 21, -113, -3, 225, -382, -352, 522, -53, 351, 1096, -105, -148, 326, -634, 255, -237, -212, 199, 235, -417, -515, -10, 197, 438, -62, -135, -518, 151, -174, 225, -37, -182, 145, -20, -150, -320, 597, 54, 188, -88, -725, 43, -240, 287, 172, -247, 58, 499, -79, -143, -91, -221, 225, 120, -139, 363, -21, 178, -84, -156, 398, 139, 142, 11, 15, 89, -27, 520, 293, -84, -470, -234, 247, -464, -53, 38, 148, 216, 408, -39, 347, -403, -558, 153, -979, -222, -134, 137, 201, 237, -193, -4, 78, -203, -571, 22, 5, -130, 87, 230, 178, -151, 22, -31, -354, -144, -250, -66]
5267f6J30K08q19j67M52M98l4P1l9k91r7M7q4L44j67L43K00m63J35r18Q06K84
5289C73oo60L82mOq8K6R6m3k29M80n55N08n74L60Ll96O5N01l35J86K56p71Q4L58
5314B3k04n88M63P54o47k27J21O81m20L63l28k6j7m66N85L40j7l22M44o34L22
5335B00l14j48M34q2m6k82o4M63J8r6k74k07N10k21L07k44K20m5J23k5l51q2L44
$$ y = [-66, 64, 272, -547, -714, -262, 236, 202, 273, 234, -57, -154, -107, -191, 153, -14, 329, 529, 66, 201, -717, 89, 373, 367, -293, 89, 85, 91, 3, 29, 125, 82, -147, 333, -222, 286, -288, 72, 75, -321, -256, 245, -90, 96, 352, -419, -335, 23, -181, -769, -306, 448, -199, -426, -305, 376, -44, 319, -9, -35, -52, -518, 67, 407, 390, 68, 512, -122, 200, -114, -262, 172, 90, 44, -238, -302, 161, 179, 83, -191, -398, 112, -109, 198, -46, 174, 129, 252, 227, -124, -206, 138]
$$ [...]
8191d11
##END NTUPLES=NMR FID
##END=
