##TITLE=1H_SA_46.158
 DMSO-d6, 8 sc, 
 22.11.2019
##JCAMPDX= 6.0         $$ Bruker NMR JCAMP-DX V2.0
##DATA TYPE= NMR FID
##DATA CLASS= NTUPLES
##ORIGIN= UXNMR, Bruker Analytische Messtechnik GmbH
##OWNER= root
$$ XWIN-NMR		Version 3.5
$$ Fri Nov 22 14:30:47 2019 Russian Standard Time (UT+4h)  she@DPX200
##.OBSERVE FREQUENCY= 200.1315
##.OBSERVE NUCLEUS= ^1H
##.DELAY= (6, 6)
##.ACQUISITION MODE= SIMULTANEOUS
##.ACQUISITION SCHEME= undefined
##.AVERAGES= 8
##.DIGITISER RES= 18
##SPECTROMETER/DATA SYSTEM= spect
##.PULSE SEQUENCE= zg30
##.SOLVENT NAME= D2O
##.SHIFT REFERENCE= (INTERNAL, D2O, 0, 15.7039)
##AUDIT TRAIL= $$ (NUMBER, WHEN, WHO, WHERE, WHAT)
$$ ##TITLE= Audit trail, XWIN-NMR		Version 3.5
$$ ##JCAMPDX= 5.01
$$ ##ORIGIN= Bruker BioSpin GmbH
$$ ##OWNER= she
$$ F:/spectra/data/she/nmr/H-F/1/audita.txt
$$ ##AUDIT TRAIL=  $$ (NUMBER, WHEN, WHO, WHERE, WHAT)
(   1,<2019-11-22 14:30:02.98 +0400>,<she>,<DPX200>,
      <created by zg, POWCHK disabled, PULCHK disabled
       configuration hash MD5:
       00 E9 B6 7A A2 85 ED C7 34 08 36 98 17 FE 4E 26
       data hash MD5: 16K
       F5 D9 00 B7 D6 D8 6F 20 4D B8 C3 4D F1 39 1E D9>)
$$ ##END=
$$ 
$$ hash MD5
$$ 93 25 5B C6 CA 4F 68 76 DA 33 A7 2A D9 40 3D CC
##$RELAX= 
##$RELAX= 
##$RELAX= 
##$RELAX= 
##$RELAX= 
##$RELAX= 
$$ Bruker specific parameters
$$ --------------------------
##$DU= <F:/spectra>
##$EXPNO= 1
##$NAME= <H-F>
##$PROCNO= 1
##$TYPE= <nmr>
##$USER= <she>
##$AMP= (0..31)
100 100 100 100 100 100 100 100 100 100 100 100 100 100 100 100 100 100 
100 100 100 100 100 100 100 100 100 100 100 100 100 100 
##$AQSEQ= 0
##$AQ_mod= 1
##$AUNM= <au_zg>
##$AUTOPOS= <>
##$BF1= 200.13
##$BF2= 200.13
##$BF3= 200.13
##$BF4= 200.13
##$BF5= 200.13
##$BF6= 200.13
##$BF7= 200.13
##$BF8= 200.13
##$BYTORDA= 1
##$CFDGTYP= 0
##$CFRGTYP= 5
##$CHEMSTR= <none>
##$CNST= (0..31)
1 1 145 1 1 1 1 1 1 1 1 1 1 1 1 1 1 1 1 1 1 1 1 1 1 1 1 1 1 1 1 1 
##$CPDPRG= <>
##$CPDPRG1= <>
##$CPDPRG2= <>
##$CPDPRG3= <>
##$CPDPRG4= <mlev>
##$CPDPRG5= <mlev>
##$CPDPRG6= <mlev>
##$CPDPRG7= <mlev>
##$CPDPRG8= <mlev>
##$CPDPRGB= <>
##$CPDPRGT= <>
##$D= (0..31)
0 1.2 0 0 0 0 0 0 0 0.06 0 0.03 0 0 0 0 0.0002 0 0 0 0 0 0 0 0 0 0 0 0 
0 0 0 
##$DATE= 1574418602
##$DBL= (0..7)
120 120 120 120 120 120 120 120 
##$DBP= (0..7)
150 150 150 150 150 150 150 150 
##$DBP07= 0
##$DBPNAM0= <>
##$DBPNAM1= <>
##$DBPNAM2= <>
##$DBPNAM3= <>
##$DBPNAM4= <>
##$DBPNAM5= <>
##$DBPNAM6= <>
##$DBPNAM7= <>
##$DBPOAL= (0..7)
0.5 0.5 0.5 0.5 0.5 0.5 0.5 0.5 
##$DBPOFFS= (0..7)
0 0 0 0 0 0 0 0 
##$DE= 6
##$DECBNUC= <off>
##$DECIM= 24
##$DECNUC= <off>
##$DECSTAT= 4
##$DIGMOD= 1
##$DIGTYP= 9
##$DL= (0..7)
0 120 120 120 120 120 120 120 
##$DP= (0..7)
150 150 150 150 150 150 150 150 
##$DP07= 0
##$DPNAME0= <>
##$DPNAME1= <>
##$DPNAME2= <>
##$DPNAME3= <>
##$DPNAME4= <>
##$DPNAME5= <>
##$DPNAME6= <>
##$DPNAME7= <>
##$DPOAL= (0..7)
0.5 0.5 0.5 0.5 0.5 0.5 0.5 0.5 
##$DPOFFS= (0..7)
0 0 0 0 0 0 0 0 
##$DQDMODE= 0
##$DR= 18
##$DS= 0
##$DSLIST= <SSSSSSSSSSSSSSS>
$$ [...]
##$SUBNAM2= <"">
##$SUBNAM3= <"">
##$SUBNAM4= <"">
##$SUBNAM5= <"">
##$SUBNAM6= <"">
##$SUBNAM7= <"">
##$SUBNAM8= <"">
##$SUBNAM9= <"">
##$SW= 24.9337058887773
##$SWIBOX= (0..15)
0 0 2 0 0 0 0 0 0 0 0 0 0 0 0 0 
##$SW_h= 4990.01996007984
##$TD= 16384
##$TD0= 1
##$TE= 0
##$TE2= 300
##$TE3= 300
##$TEG= 300
##$TL= (0..7)
0 120 120 120 120 120 120 120 
##$TP= (0..7)
150 150 150 150 150 150 150 150 
##$TP07= 0
##$TPNAME0= <>
##$TPNAME1= <>
##$TPNAME2= <>
##$TPNAME3= <>
##$TPNAME4= <>
##$TPNAME5= <>
##$TPNAME6= <>
##$TPNAME7= <>
##$TPOAL= (0..7)
0.5 0.5 0.5 0.5 0.5 0.5 0.5 0.5 
##$TPOFFS= (0..7)
0 0 0 0 0 0 0 0 
##$TUNHIN= 0
##$TUNHOUT= 0
##$TUNXOUT= 0
##$USERA1= <user>
##$USERA2= <user>
##$USERA3= <user>
##$USERA4= <user>
##$USERA5= <user>
##$V9= 5
##$VALIST= <valist>
##$VCLIST= <CCCCCCCCCCCCCCC>
##$VD= 0
##$VDLIST= <DDDDDDDDDDDDDDD>
##$VPLIST= <PPPPPPPPPPPPPPP>
##$VTLIST= <TTTTTTTTTTTTTTT>
##$WBST= 1024
##$WBSW= 4
##$XGAIN= (0..3)
0 0 0 0 
##$XL= 0
##$YL= 0
##$YMAX_a= 268516
##$YMIN_a= -178716
##$ZGOPTNS= <>
##$ZL1= 120
##$ZL2= 120
##$ZL3= 120
##$ZL4= 120
##$ABSF1= 10
##$ABSF2= 0
##$ABSG= 5
##$ABSL= 3
##$ALPHA= 0
##$AQORDER= 0
##$ASSFAC= 0
##$ASSFACI= 0
##$ASSFACX= 0
##$ASSWID= 0
##$AUNMP= <proc_1d>
##$AZFE= 0.1
##$AZFW= 0.1
##$BCFW= 1
##$BC_mod= 2
##$BYTORDP= 1
##$COROFFS= 0
##$CY= 11.3945322036743
##$DATMOD= 1
##$DC= 2
##$DFILT= <>
##$DTYPP= 0
##$F1P= 16.9975609425685
##$F2P= -3.02152046262296
##$FCOR= 0.5
##$FTSIZE= 0
##$FT_mod= 4
##$GAMMA= 1
##$GB= 0.15
##$INTBC= 1
##$INTSCL= 1
##$ISEN= 128
##$LB= 0.24
##$LEV0= 0
##$LPBIN= 0
##$MAXI= 10000
##$MC2= 0
##$MEAN= 0
##$ME_mod= 0
##$MI= 1.114404
##$NCOEF= 0
##$NC_proc= 0
##$NLEV= 6
##$NOISF1= 3.799351
##$NOISF2= 2.8
##$NSP= 1
##$NTH_PI= 0
##$NZP= 0
##$OFFSET= 15.70392
##$PC= 1
##$PHC0= -9792.81
##$PHC1= 17.40086
##$PH_mod= 1
##$PKNL= yes
##$PPARMOD= 0
##$PSCAL= 0
##$PSIGN= 0
##$REVERSE= no
##$SF= 200.130013532006
##$SI= 16384
##$SIGF1= 3
##$SIGF2= 2
##$SINO= 400
##$SIOLD= 16384
##$SREGLST= <1H.CDCl3>
##$SSB= 0
##$STSI= 0
##$STSR= 0
##$SW_p= 3612.71676300578
##$SYMM= 0
##$S_DEV= 0
##$TDeff= 0
##$TDoff= 0
##$TI= <>
##$TILT= no
##$TM1= 0
##$TM2= 0
##$TOPLEV= 0
##$USERP1= <user>
##$USERP2= <user>
##$USERP3= <user>
##$USERP4= <user>
##$USERP5= <user>
##$WDW= 1
##$XDIM= 8192
##$YMAX_p= 0
##$YMIN_p= 0
$$ End of Bruker specific parameters
$$ ---------------------------------
##NTUPLES= NMR FID
##VAR_NAME=  TIME,          FID/REAL,        FID/IMAG
##SYMBOL=    X,             R,               I
##VAR_TYPE=  INDEPENDENT,   DEPENDENT,       DEPENDENT
##VAR_FORM=  AFFN,          ASDF,            ASDF
##VAR_DIM=   8192,          8192,            8192
##UNITS=     SECONDS,       ARBITRARY UNITS, ARBITRARY UNITS
##FACTOR=    0.0002004,     1,               1
##FIRST=     0,             0,               0
##LAST=      1.6414764,     0,               0
##MIN=       0,             -178716,         0
##MAX=       1.6414764,     268516,          0
$$ Real data points
##PAGE= N=1
##DATA TABLE= (X++(R..R)), XYDATA
$$ [...]
$$ plain form
1914 -413 -407 -266 493 657 -23 -189 121 499 502 38 -55 20 485 156 -42 56 342 368 -150 -656 -203 410 193
1937 193 -219 -370 231 399 213 -88 -145 263 -23 17 -370 -220 297 -46 -165 -881 -123 56 -120 -301 -423
1958 -423 -151 273 2 -466 151 -14 276 -258 -322 165 213 103 -443 -472 205 69 -163 -409 -248 90 49
1979 49 -164 -387 77 380 395 -61 -29 201 375 62 -261 -305 330 265 -245 -346 -77 399 -37 -175 -154 -47
2001 -47 -307 2 -207 -156 466 482 -45 -228 222 127 506 41 -516 -8 240 59 -114 -123 220 -26 179 -412
2023 -412 -2 279 213 193 -284 153 494 59 -223 -561 -172 218 -2 -203 -471 -204 13 -461 -377 -93 223
2044 223 -408 -482 -129 340 471 167 -132 -91 4 343 75 -232 -11 22 66 -324 -252 47 208 -114 -439 -65
2066 -65 433 671 -168 39 107 484 819 107 -33 210 222 116 -232 -31 141 175 -266 -169 -78 58 455 16
$$ packed form
1914d13OJ41P59J64o80j66L10L78Lm64r3P5M65l29j98R8K86K6n18n06M53O13k17
1937A93m12j51O01J68j86l01n7M08k86M0l87J50N17l43j19p16P58J79j76j81j22
1958d23K72M24k71m68O17j65K90n34o4M87M8j10n46k9O77j36k32k46J61L38m1
1979D9k13k23M64L03J5m56L2K30J74l13l23m4O35o5n10j01K69M76m36j38K1J07
2001d7k60L09k09N1O22J6n27j83M50r5L79m65n57N08K48j81j73rL43k46K05n91
2023d12M10K81o6k0m77M37L41m35k82l38L89L90k20k01k68K67K17m74Q4K84L16
2044B23o31p4L53M69J31l04k99M1R5L39k68l07K21L3M4l90P2K99J61l22l25L74
2066f5M98K38q39K07O8L77L35p12j40K43J2j06l48K01J72L4m41R7R1J36L97m39
$$ plain form
2088 16 11 192 317 -114 -58 -326 155 136 -157 -137 -2 -24 -70 -417 -464 53 214 -173 -10 -119 233 88 -83
2111 -83 -328 86 249 132 -30 56 -59 182 52 -197 -358 117 16 -89 -245 -89 55 -126 90 -285 267
2132 267 129 414 -160 149 367 102 1 -84 -127 123 37 -171 -351 15 -92 356 -116 -316 -119 2 -89
2153 -89 -71 117 123 224 84 189 122 -19 269 -109 -393 -87 -22 -113 -266 -110 311 70 -196 -400 -169 211
2175 211 251 -124 -200 159 51 187 -138 -57 47 -37 -203 -23 -504 -85 37 -39 -380 54 194 -35 -58 10
2197 10 180 -18 -59 -201 71 563 315 -107 -229 -29 -50 -220 -282 -404 321 96 119 -266 236 222 144 -70
2219 -70 -248 88 441 270 200 171 211 187 5 -85 -232 -76 222 -12 -320 -114 36 -38 -12 -85 7 360 187
2242 187 -371 195 -172 192 -142 -120 -158 184 106 -223 -59 -75 161 80 -337 37 309 -61 -62 -332 -12 393
$$ packed form
2088A6nJ81J25m31N6k68M81j9k93K0J35k2m6l47m7N17J61l87J63j09L52j45j71
2111h3k45M14J63j17j62Q6j15K41j30k49j61M75j01j05j56J56J44j81K16l75N52
2132B67j38K85n74L09K18k65j01q5m3K50q6k08j80L66j07M48m72k00J97J21r1
2153h9J8J88OJ01j40J05o7j41K88l78k84L06O5r1j53J56M21k41k66k04K31L80
2175B11M0l75p6L59j08J36l25Q1J04q4j66J80m81M19J22p6l41M34J40k29k3O8
2197A0J70j98m1j42K72M92k48m22j22K00k1j70o2j22P25k25K3l85N02j4p8k14
2219g0j78L36L53j71p0k9M0k4j82r0j47J56K98k34l08K06J50p4K6p3R2L53j73
2242A87n58N66l67L64l34K2l8L42p8l29J64j6K36q1m17L74K72l70jk70L20M05
$$ plain form
2264 393 51 43 192 84 173 43 -434 -21 181 270 110 -243 87 305 199 -171 44 -36 89 156 31 160
2286 160 370 -23 74 73 -163 260 -97 -487 -256 -54 302 -16 -228 -79 168 46 317 102 103 111 208 -31 -88
2309 -88 -35 -246 59 -305 -180 226 94 -187 -297 -75 -286 21 -267 26 104 4 135 -227 -175 192 410
2330 410 35 -43 -219 71 225 -96 -314 -252 5 28 -311 -73 97 48 -71 -142 -175 151 126 -206 -247 -79 149
2353 149 176 -332 105 -134 149 -162 -94 -8 30 39 -72 -99 266 95 138 92 373 217 372 198 -102 -202 -140
2376 -140 307 56 -249 123 -429 68 -20 -66 70 191 130 299 150 28 188 110 -102 133 245 69 -203
2397 -203 -147 -279 123 142 -228 -265 -469 -59 -260 -323 10 264 363 -121 -283 51 161 143 -456 -335 80 227
2419 227 15 -405 -137 -76 -123 49 -132 92 -65 -27 -216 -136 -167 89 211 34 -37 173 27 -226 17 -309
$$ packed form
2264C93l42qJ49j08Q9j30m77M13K02Q9j60l53L30K18j06l70K15q0J25O7j25J29
2286A60K10l93R7jk36M23l57l90K31K02L56l18k12J49K47j22K71k15JQR7k39n7
2309h8N3k11L05l64J25M06j32k81j10K22k11L07k88K93P8j00J31l62N2L67K18
2330D10l75p8j76K90J54l21k18O2K57K3l39K38J70m9j19p1l3L26k5l32m1J68K28
2353A49K7n08M37k39K83l11O8Q6L8Rj11k7L65j71M3m6K81j56J55j74l00j00O2
2376a40M47k51l05L72n52M97q8m6J36J21o1J69j49j22J60p8k12K35J12j76k72
2397b03N6j32M02J9l70l7k04M10k01o3L33K54R9m84j62L34J10j8n99J21M15J47
2419B27k12m20K68O1m7J72j81K24j57L8j89Q0l1K56J22j77p1K10j46k53K43l26
$$ plain form
2441 -309 -20 150 106 57 36 -120 33 127 240 165 -40 -95 238 165 212 247 109 -88 -160 124 -276 -255 -191 124
2465 124 59 -301 -218 -214 -187 177 -61 -288 -40 -51 150 -4 -143 104 269 30 40 -244 307 51 -159 -311
2487 -311 -30 -89 -9 -22 -140 195 61 -151 -70 -65 68 299 -429 -142 123 178 262 -219 -179 -48 61 33 -7 -4
2511 -4 37 254 103 -86 167 318 205 327 310 14 37 13 177 -212 253 -53 -174 -38 -53 -166 -37 -154
2533 -154 -338 176 -6 -4 -212 119 21 76 108 -33 -149 118 277 -204 -210 -56 -74 -299 -287 -247 -123 -135 -260 5
2557 5 -174 204 -40 -297 -75 167 53 -194 -204 -147 -48 4 -57 162 -175 155 351 206 -255 -117 -16 228
2579 228 21 -11 45 -67 -48 -201 -79 -31 -195 -90 -171 250 -84 -317 -137 162 34 -162 -187 -265 -188 -180 53
2602 53 131 -61 353 -75 95 -78 -246 -95 162 -74 -143 130 -188 207 170 -172 -199 7 -57 -15 -303 9
$$ packed form
2441c09K89J70m4m9k1j56J53R4J13p5k05n5L33p3M7L5j38j97p2K84m00K1O4L15
2465A24o5l60Q3MK7L64k38k27K48j1K01j54j39K47J65k39J0k84N51k56k10j52
2487c11K81n9Q0j3j18L35j34k12Q1NJ33K31p28K87K65N5Q4m81M0J31J09k8m0L
2511dM1K17j51j89K53J51j13J22j7k96K3k4J64l89M65l06j21J36j5j13J29j17
2533a54j84N14j82Kk08L31r8N5L2j41j16K67J59m81oJ54j8k25J2M0J24j2j25K65
2557Ej79L78k44k57K22K42j14k47j0N7R9N2o1K19l37L30J96j45m61J38J01K44
2579B28k07l2N6j12J9j53J22M8j64J05q1M21l34k33J80K99j28j96k5p8P7QK33
2602E3P8j92M14m28J70j73j68J51K57k36o9K73l18L95l7l42k7K06o4M2k88L12
$$ plain form
2624 9 188 68 12 79 -246 94 13 -343 52 49 -56 -179 37 157 209 -145 20 242 -70 31 -74 -39 -341
2647 -341 -33 22 97 -122 -10 73 103 -180 -154 -183 72 -88 -43 -19 -107 -287 129 -140 154 -133 137 -93 141
2670 141 279 209 83 -263 62 -39 8 -172 -116 -304 -29 -4 230 -67 183 51 -100 74 -119 0 -135
2691 -135 86 -123 41 297 110 -138 62 -369 -18 -240 -180 -77 83 -29 -137 -91 -192 -146 119 96 -246
2712 -246 118 168 416 92 -262 -282 298 72 75 290 34 74 129 11 -120 42 232 -58 -141 89 32 -156 52
2735 52 -55 116 -163 169 43 49 258 -358 51 -145 -54 105 119 296 122 -107 -91 -173 309 -25 110 -26
2757 -26 -74 3 157 178 -112 -31 10 -8 -158 -39 261 -201 236 205 -336 -293 -18 7 22 28 -3 -37 180 -31 31
2782 31 262 -36 327 -88 -90 -3 -27 204 -163 -13 33 169 -175 -123 77 228 -194 90 -465 218 -248 -240 -171
$$ packed form
2624IJ79j20n6O7l25L40q1l56L95lj05j23K16J20N2l54J65K22l12J01j05L5l02
2647c41L08N5P5k19J12Q3L0k83K6k9K55j60M5K4q8j80M16k69K94k87K70k30K34
2670A41J38p0j26l46L25j01M7j80N6j88K75K5K34k97K50j32j51J74j93J19j35
2691a35K21k09J64K56j87k48K00m31L51k22O0J03J60j12j08M6j01M6K65k3l42
2712b46L64N0K48l24l54k0N80k26LK15k56M0N5j18j31J62J90k90q3K30n7j88K08
2735E2j07J71k79L32j26OK09o16M09j96R1J59J4J77j74k29J6q2M82l34J35j36
2757b6m8P7J54K1k90Q1M1j8j50J19L00m62M37l1n41M3K75K5J5Ol1l4K17k11O2
2782C1K31k98L63m15kQ7k4K31l67J50M6J36l44N2K00J51m22K84n55O83m66QO9
$$ plain form
2805 -171 -208 181 -92 -62 -25 7 212 -139 345 160 52 249 77 -328 -137 300 -246 37 185 43 1 149
2827 149 -127 39 -241 -200 -88 -141 -7 6 323 63 -94 115 177 -92 -280 25 203 214 -42 76 -102 -115
2849 -115 -94 -100 77 -141 172 -30 38 -55 -100 -180 7 291 -94 89 181 139 75 132 -208 23 64 7 96 -174 118
2874 118 85 164 83 -255 27 -29 49 59 -197 44 101 107 45 -287 195 220 -122 -42 390 -17 -40 99 130 -134 -37
2899 -37 -99 137 264 175 258 -26 112 67 163 98 170 6 -166 -262 12 158 92 -211 -12 -95 88 266 -191 355
2923 355 189 14 112 -55 -91 18 -37 -84 54 156 -198 -56 367 121 -284 -192 116 108 231 62 116 61 -283
2946 -283 26 -29 59 -23 152 137 53 157 213 181 304 -17 91 -252 -22 328 -5 -276 -200 281 227 -11 -70
2969 -70 180 122 159 -202 138 17 7 -54 -45 263 -14 225 165 -286 192 -148 -9 125 -229 -13 23 6 -92 29
$$ packed form
2805a71l7L89k73L0L7L2K05l51M84j85j08J97j72m05J91M37n46K83J48j42m2J48
2827A49k76J66k80M1J12n3J34J3L17k60j57K09O2k69j88L05J78J1k56J18j78j3
2849a15K1oJ77k18L13k02O8r3m5q0J87K84l85J83R2m2o4N7l40K31M1n7Q9k70K92
2874A18l3P9q1l38K82n6P8J0k56K41N7Oo2l32M82K5l42Q0M32m07k3J39L1k64R7
2899c7o2K36J27q9Q3k84J38m5R6o5P2j64j72r6K74J46o6l03J99q3J83J78m57N46
2923C55j66j75R8j67l6J09n5m7J38J02l54J42M23k46m05R2L08qJ23j69N4n5l44
2946b83L09n5Q8q2J75j5q4J04N6l2J23l21J08l43K30L50l33k71P6M81n4k38n9
2969g0K50n8L7l61L40j21j0o1RL08k77K39o0m51M78l40J39J34l54K16L6j7r8J21
$$ plain form
2993 29 140 231 35 -69 -199 124 -207 143 3 -38 33 12 28 -118 -269 -39 30 32 2 -25 -14 52 -48 350
3017 350 -3 180 3 94 -11 119 -139 28 137 -60 -125 72 -233 -154 93 -116 -194 -165 118 -76 -42 -162
3039 -162 38 298 32 46 -9 296 144 75 245 11 69 159 191 -25 101 114 86 21 176 -97 -94 -94 -83 -106 -269
3064 -269 280 67 10 153 31 -149 -288 92 -104 -141 2 23 21 -185 -59 -131 273 64 -116 224 236 -242
3086 -242 -60 -23 -126 -104 -56 182 -80 350 -20 -183 182 -63 -293 -55 27 -50 -270 328 -92 74 220 114
3108 114 -29 -13 -49 -14 -269 -113 -5 142 -21 -319 -106 6 160 -10 99 160 -65 291 20 -113 156
3129 156 283 -163 -223 53 34 -45 -293 152 222 75 9 -91 153 -147 -88 14 -75 -108 126 108 -125 -110 -32 -220
3153 -220 3 -68 173 15 27 -13 29 -128 116 178 -73 -69 -124 -163 107 -78 -91 124 -420 29 -74 71 -141
$$ packed form
2993B9J11R1j96j04j30L23l31L50j40m1P1k1J6j46j51K30O9Kl0k7J1O6j00L98
3017C50l53J83j77R1j05J30k58J67J09j97o5J97l05P9K47k09p8K9K83j94L4j20
3039a62K00K60k66J4n5L05j52o9J70k34N8R0L2k16J26J3k8o5J55k73L%J1k3j63
3064b69N49k13n7J43j22j80j39L80j96l7J43K1kk06J26p2M04k09j80L40J2m78
3086b42J82L7j03K2M8K38k62M30l70j63L65k45k30K38Q2p7k20N98m20J66J46j06
3108A14j43J6l6L5k55J56J08J47j63k98K13J12J54j70J09O1k25L56k71j33K69
3129A56J27m46o0K76j9p9k48M45P0j47o6j00K44l00N9J02q9l3K34j8k33J5P8j88
3153b20K23p1K41j58J2m0M2j57K44O2k51Mn5l9K70j85j3K15n44M49j03J45k12
$$ plain form
3176 -141 248 75 131 115 279 -328 109 78 103 27 -291 -159 -215 -275 144 -78 30 -182 39 147 -88 -101 295
3199 295 84 -90 -16 -308 -176 22 55 59 -181 -210 265 -54 228 31 248 73 5 104 -219 -75 367 -354
3221 -354 178 77 -134 -56 -24 -95 254 -357 117 297 -153 2 84 338 164 -326 234 219 125 -23 38 29 331
3244 331 -70 -116 128 -161 67 -69 204 -222 10 -269 -111 -38 -76 -143 434 245 -313 123 -24 -197 80
3265 80 -52 -98 -334 -191 -223 -340 9 185 231 -129 -67 -95 -243 222 -123 -122 123 0 -59 -76 -81 -93 -73 26 -79
3290 -79 42 220 27 17 5 311 -261 -66 -21 -261 -130 -252 165 -65 48 -202 280 -162 -28 -66 -103 -142
3312 -142 -160 174 -129 -117 303 163 91 46 -45 56 323 470 38 -97 167 -85 -36 -245 22 259 -113 150
3334 150 101 248 215 25 209 40 -166 -166 130 -284 -13 -154 -110 57 -337 -255 -20 193 -28 -250 199 28
$$ packed form
3176a41L89j73N6j6J64o07M37l1K5p6l18J32n6o0M19k22J08k12K21J08k35j3L96
3199B95k11j74P4k92J32J98L3Mk40k9M75l19K82j97K17j75o8R9l23J44M42p21
3221c54N32j01k11P8L2p1L49o11M74J80m50J55Q2K54j74m90N60j5r4j48O1rL02
3244C31m01m6K44k89K28j36K73m26K32k79J58P3l8o7N77j89n58M36j47j73K77
3265H0j32m6k36J43l2j17L49J76M6l60O2k8j48M65l45JK45j23n9j7nj2K0R9j05
3290g9J21J78j93j0j2L06n72J95M5k40J31j22M17k30J13k50M82m42J34l8l7l9
3312a42j8L34l03J2M20j40p2m5r1J01K67J47m32j35K64k52M9k09K67K37l72K63
3334A50m9J47l3j90J84j69k06%K96m14K71j41M4J67l94Q2K35K13k21k22M49j71
$$ plain form
3356 28 -157 71 -170 -89 126 79 58 83 13 -144 32 22 -66 -51 245 135 -13 -105 62 -125 -137 -128 -145 132 -82
3381 -82 -25 255 -256 -101 -16 -209 142 -83 -81 -32 -282 -71 75 -12 -79 -122 165 334 165 84 -18 39 68 -222
3405 -222 -89 -75 215 -42 118 -132 -257 -137 263 -205 -280 19 -253 -186 -152 -160 107 -18 -32 1 -57 -164 -208
3428 -208 68 -160 473 81 204 193 -100 -85 -265 117 -142 6 -2 10 41 91 37 -149 -307 -193 229 -112 76
3451 76 -116 -133 -206 46 -1 -3 -23 296 264 -57 40 97 -86 -5 116 -19 12 168 111 -124 -192 -162 197 -248 -165
3476 -165 -50 229 130 -12 194 -182 63 -73 31 170 37 -255 -33 222 -87 121 -434 222 164 185 42
3497 42 7 -195 -19 49 -166 -14 166 66 -50 -107 -38 -208 -174 -63 125 51 85 -46 118 193 -268 -167 -61
3520 -61 76 -197 54 38 91 54 71 -143 189 56 53 116 -153 -30 -198 -206 -116 210 95 108 -23 -40 112 -122
$$ packed form
3356B8j85K28k41Q1K15m7k1K5p0j57J76j0q8J5K96j10j48r2J67j87j2Rj7K77k14
3381h2N7K80n11J55Q5j93L51k25KM9k50K11J46q7o7m3K87J69j69q1j02N7K9k90
3405b22J33J4K90k57J60k50j25J20M00m68p5K99k72O7L4qK67j25j4L3n8j07m4
3428b08K76k28O33l92J23j1k93J5j80L82k59J48qJ2L1N0n4j86j58J14M22l41J88
3451G6j92j7p3K52m7kk0L19l2l21R7N7j83Q1J21j35L1J56n7k35o8L0L59m45Q3
3476a65J15K79r9j42K06l76K45j36J04J39j33k92K22K55l09K08n55O56n8K1j43
3497D2l5k02J76O8k15J52J80j00j16n7O9j70L4J11J88p4L4j31J64P5m61J01J06
3520f1J37k73K51j6N3l7J7k14L32j33lO3k69J23j68qR0L26j15J3j31j7J52k34
$$ plain form
3544 -122 32 -16 -82 -26 67 65 -49 85 -4 -192 -186 63 93 -167 -325 120 36 -81 -91 162 316 63 -98 61
3568 61 16 162 27 45 101 -84 -132 -32 16 -130 -90 288 159 -73 93 -85 -36 208 -122 -107 235 64 153
3591 153 -273 184 76 307 -214 -85 17 117 -40 -174 52 231 178 -75 77 43 -120 57 -73 288 91
3612 91 158 392 301 -74 -29 11 -84 51 -274 167 240 -49 -120 -39 198 -102 118 -27 -161 15 -147 -48 27 -6
3636 -6 144 28 -273 -245 61 161 165 -363 -11 193 60 -117 115 242 200 44 -273 -198 -20 55 156 -82 -147
3659 -147 136 431 -168 -267 -55 -43 32 66 59 65 -218 -35 -185 -144 182 38 -178 197 -172 136 166 284 -38
3682 -38 -70 52 -157 104 8 -79 8 15 73 -146 161 -137 27 -1 4 -253 436 -86 -51 -159 -250 159 398 20
3706 20 -207 -131 -208 135 6 107 64 42 192 -227 146 320 214 -94 93 -229 -183 6 -31 5 51 101 -94
$$ packed form
3544a22J54m8o6N6R3kj14J34q9j88OK49L0k60j58M45q4j17j0K53J54k53j61J59
3568F1m5J46j35J8N6j85m8J00M8j46M0L78j29k32J66j78M9K44l30J5L42j71Q9
3591A53m26M57j08K31n21J29J02J00j57j34K26J79n3k53J52l4j63J77j30L61j97
3612I1O7K34r1l75M5M0r5J35l25M41P3k89p1Q1K37l00K20j45j34J76j62R9P5l3
3636fJ50j16l01K8L06J00Mn28L52K04j33j77K32J27m2j56l17P5J78P5J01k38o5
3659a47K83K95n99r9K12J2P5L4pOk83J83j50M1L26j44k16L75l69L08L0J18l22
3682c8l2J22k09K61r6q7Q7PN8k19L07k98J64k8Nk57O89n22L5j08r1M09K39l78
3706B0k27P6p7L43j29J01m3k2J50m19L73J74j06l08J87l22M6J89l7L6M6N0j95
$$ plain form
3729 -94 -192 124 292 -15 260 86 132 135 -127 -121 240 -38 -39 -175 231 23 248 303 -273 4 -275 -144 234
3752 234 -52 -203 -29 -100 -38 72 69 151 -61 -22 37 10 -13 96 -165 -64 -49 336 129 202 -284 -99 31 232
3776 232 113 26 256 3 -150 -31 33 67 91 31 -66 51 88 227 163 -89 234 -7 50 71 -175 -249 82 283
3800 283 31 11 -109 -379 168 -29 -13 392 -21 -267 193 -275 2 126 201 -83 -56 -36 105 -37 210 137
3822 137 -72 -118 -277 -57 71 1 179 -357 -37 57 -125 -109 -204 -110 -243 83 60 -126 362 132 -432 -348 41
3845 41 -5 -16 309 -152 30 -15 -341 -379 -76 318 -99 101 86 -173 -219 59 -211 55 -100 -33 52 -65 -24
3868 -24 -128 64 65 0 -21 -130 354 357 -5 144 -113 136 29 98 158 -201 14 -205 -150 -117 -170 46 -160 -30
3892 -30 -142 19 -30 -212 -56 -96 -221 -330 129 161 217 -13 -181 251 -238 122 94 -26 -3 -44 70 28 4
$$ packed form
3729i4r8L16J68l07K75j74M6Lk62OL61k78jj36M06k08K25N5n76K77k79J31L78
3752B34k86j51J74p1O2J10lQ2k12L9N9k7k3J09k61J01J5L85k07P3m86J85J30K01
3776B32j19q7K30k53j53J19O4L4K4o0r7J17L7J39o4k52L23k41N7K1k46p4L31K01
3800B83k52k0j20k70N47j97J6M05m13k46M60m68K77J24P5k84K7K0J41j42K47p3
3822A37k09m6j59K20J28p0J78n36L20R4j82J6r5R4j33L26k3j86M88k30n64Q4L89
3845D1m6j1L25m61J82m5l26l8L03L94m17K00j5k59m6K78k70K66j55O7Q5j17M1
3868b4j04J92Jo5k1j09M84Ll62J49k57K49j07O9O0l59K15k19N5L3n3K16k06J30
3892c0j12J61m9j82J56m0j25j09M59L2N6k30j68M32m89L60k8j20K3m1J14m2k4
$$ plain form
3915 4 -115 167 -150 -78 117 90 -11 -3 195 31 133 130 -59 -110 -185 54 -27 -127 361 7 -229 -205 -154 -140 -30
3940 -30 44 17 317 333 -200 73 -307 -137 -109 -108 96 45 -26 -118 -205 -33 129 -159 110 93 19 23 148 -37 -41 100
3966 100 55 4 26 140 55 -122 261 57 144 376 51 -78 -98 12 171 -111 175 82 27 -291 21 9 60
3989 60 -40 -192 233 88 12 -268 153 -8 1 -102 -86 -113 175 -180 -336 -71 200 -137 207 -67 70 82
4011 82 -79 -52 19 -24 100 -269 -9 -316 312 -153 -162 41 -71 -23 38 -57 0 29 -91 130 -203 269 33 -8
4035 -8 3 -66 31 13 130 -178 197 20 -111 -103 146 94 -126 -67 -252 311 -145 -56 -178 161 -147 292 -136 -165
4059 -165 -175 -153 -193 222 -116 -313 129 167 -43 -10 -38 0 63 526 39 -3 290 50 129 -315 -52 -218 255
4082 255 257 -125 -127 215 197 -81 -90 -102 84 15 -79 265 20 210 22 -142 31 -170 13 -175 -217 61 -96 -80
$$ packed form
3915Dj19K82l17P2J95k7j01QJ98j64J02lj89n1p5K39q1j00M88l54k36K4N1J4J10
3940c0P4k7L00J6n33K73l80J70K8JK04n1p1r2q7J72J62k88K69j7p4MJ25j85mJ41
3966A00m5n1K2J14q5j77L83k04Q7K32l25j29k0J10J59k82K86r3n5l18L12j2N1
3989F0j00j52M25j45p6k80M21j61Rj03J6k7K88l55j56K65K71l37L44k74J37J2
4011H2j61K7P1m3J24l69K60l07O28m65rK03j12M8O1r5N7K9j20K21l33M72k36m1
4035hJ1o9R7j8J17l08L75j77j31QK49n2k20N9j85N63m56Q9j22L39l08M39m28k9
4059a65j0K2m0M15l38j97M42L8k10L3k8L8O3M63m87m2K93k40P9m44K63j66M73
4082B55Kl82kL42j8k78rj2J86o9r4L44k45J90j88j64J73k01J83j88m2K78j57J6
$$ plain form
4106 -80 39 -87 -207 44 394 61 297 -24 -37 -170 -123 193 -2 64 -39 -86 -73 -96 -75 197 96 39 157
4129 157 14 -38 -30 -40 195 167 100 -55 299 -166 -16 225 -12 -177 213 60 98 144 -137 124 -58 145 21
4152 21 -308 102 87 -190 -71 -76 -102 -29 -144 -14 340 -72 -126 53 -134 -182 101 314 -56 -181 56 96 -130
4175 -130 -181 -136 382 -102 -84 -42 -7 34 219 237 -67 157 9 232 159 128 -235 257 70 169 5 42 -86 16
4199 16 45 -268 -52 -124 -227 -85 246 91 2 228 219 -107 39 255 -365 34 142 95 0 42 85 -319 116
4222 116 30 49 67 3 -209 81 244 -100 -119 36 48 21 150 481 -80 -388 -127 60 86 -86 -25 102 -76
4245 -76 160 -52 16 51 -186 54 265 86 -57 28 -98 -29 -198 -63 -114 -176 7 -320 125 102 280 -430 -167
4268 -167 -158 -64 -37 -269 -226 -121 136 29 -4 -45 11 -46 194 9 95 24 -228 -20 -73 68 81 9 -2 35 -106
$$ packed form
4106h0J19j26j20K51L50l33K36l21j3j33M7L16j95O6j03m7J3k3K1K72j01n7J18
4129A57j43n2Qj0K35k8o7j55L54m65J50K41k37j65L90j53L8M6k81K61j82K03j24
4152B1l29M10j5k77J19nk6P3j15J30L54m12n4J79j87m8K83K13l70j25K37M0k26
4175a30n1M5N18m84J8M2L5M1J85J8l04K24j48K23p3l1l63M92j87R9j64L7j28J02
4199A6K9l13K16p2j03J42L31j55q9K26rl26J46K16o20L99J08m7r5M2M3m04M35
4222A16q6J9J8o4k12K90J63l44j9J55J2k7J29L31n61l08K61J87K6j72O1J27j78
4245g6K36k12O8L5k37K40K11j79j43Q5j26O9j69J35n1o2J83l27M45k3J78p10K63
4268a67RR4K7k32M3J05K57j07l3m1N6n7K40j85Q6p1k52K08n3J41J3p2j1L7j41
$$ plain form
4293 -106 194 228 27 152 42 -10 -332 -53 -84 -100 -310 163 67 172 -193 -41 -13 -51 -248 32 93 188 -132
4316 -132 -28 -129 -134 -67 163 -86 0 267 26 -38 -182 -53 124 62 187 -77 173 -101 -53 241 -291 -141
4338 -141 15 -120 100 77 -465 -40 -46 -225 108 240 -371 434 98 -97 -307 226 -45 -210 -317 223 153
4359 153 29 -108 -104 162 -61 -37 95 37 93 -176 -294 -47 245 -125 -12 -64 -17 33 -99 -48 76 237 120
4382 120 92 -18 15 -75 17 40 -38 -108 -95 58 110 6 248 -62 121 -162 -39 -211 144 102 -142 -349 26
4405 26 146 -6 -57 -201 163 377 209 98 202 -217 -1 34 -16 40 31 188 -197 -136 -126 -2 -68 111 -44
4428 -44 -109 -264 50 -90 -188 97 -256 102 -229 -172 181 -104 12 -46 215 65 111 -65 -49 -54 81 404 -202
4451 -202 104 -93 91 -146 -19 -27 -54 -164 22 -4 -186 129 92 133 -103 -48 38 233 69 146 106 112 -309 -176
$$ packed form
4293a06L00L4k01J25j10n2l22K79l1j6k10M73r6J05l65J52K8l8j97K80O1R5l20
4316a32J04j01nO7K30k49Q6K67k41o4j44J29J77o2J25k64K50k74M8K94n32J50
4338a41J56j35K20k3n42M25oj79L33J32o11Q05l36j95k10N33k71j65j07N40p0
4359A53j24j37MK66k23K4J32n8N6k69j18K47K92l70J13n2M7N0j32N1J24J61j17
4382A20k8j10L3r0R2K3p8p0J3J53N2j04K42l10J83k83J23j72L55m2k44k07L75
4405B6J20j52n1j44L64K14j68j11J04m19K16L5n0N6rJ57l85O1J0J24o6J79j55
4428d4o5j55L14j40r8K85l53L58l31N7L53k85J16n8K61j50M6j76J6nJ35L23o06
4451b02L06j97J84k37J27qk7j10J86k6j82L15l7M1k36N5Q6J95j64P7m0Om21J33
$$ plain form
4475 -176 53 -128 -314 137 76 35 -111 -44 -225 -175 0 221 -65 218 -370 -179 -168 -112 97 58 -69 -109 183
4498 183 256 188 -2 -28 -46 -50 -134 206 -239 25 -128 165 -52 -337 4 15 -351 117 -205 108 -36 7 -98
4521 -98 -107 -40 -168 -76 198 -275 45 -3 -127 -248 -77 -126 -105 -102 20 -109 -194 189 -211 212 -110 -65 -52 -8 -246
4546 -246 72 -161 -90 -138 12 -136 -197 87 -279 3 149 -120 -39 -90 48 220 -35 40 56 146 15 57 172
4569 172 158 -90 186 96 -23 -235 -203 113 -56 104 -23 -213 -34 -79 216 91 -42 85 -185 -163 36 -53
4591 -53 34 186 125 91 -269 30 -166 -7 3 -135 94 -1 -40 30 72 -126 46 13 -77 113 -124 -18 -38 217
4615 217 -44 192 -239 -114 381 -91 170 -108 143 52 52 267 -78 -201 -44 -14 29 -109 71 27 -180 -86
4637 -86 -176 290 -132 194 -74 -208 -43 5 -16 52 -216 2 -207 -174 -155 -92 -34 -179 -278 -98 -365 244 77
$$ packed form
4475a76K29j81j86M51o1m1j46O7j81N0J75K21k86K83n88J91J1N6K09l9j27m0K92
4498A83P3o8j90k6j8mq4L40m45K64j53K93k17k85L41J1l66M68l22L13j44M3j05
4521i8rO7j28R2K74m73L20m8j24j21J71m9K1LJ22j29q5L83m00M23l22M5J3M4k38
4546b46L18k33P1m8J50j48o1K84l66K82J46k69Q1n1J38J72k55P5J6R0j31M2J15
4569A72j4k48K76r0j19k12L2L16j69J60j27j90J79m5K95j25j33J27k70K2J99q9
4591e3Q7J52o1l4l60K99j96J59J0j38K29r5l9P0M2j98J72l3r0J90k37J06k0K55
4615B17k61K36m31J25M95m72K61k78K51r1%K15l45j23J57L0M3j38J80m4k07R4
4637h6r0M66m22L26k68j34J65M8k1O8k68K18k09L3J9O3N8j45r9J80k67O09j67
$$ plain form
4660 77 -65 98 311 5 77 110 32 114 -51 -35 -148 -307 -255 148 -78 -17 91 169 -127 151 240 73 48 137
4684 137 -88 169 147 -102 82 -241 -195 22 356 -25 182 184 -1 94 138 129 80 327 180 47 -109 -57 59
4707 59 46 45 -168 -185 -178 -118 108 -1 75 51 -153 -100 -5 -169 -320 297 -94 -70 186 -460 -177 -6 -46 119 74
4732 74 73 -251 261 -52 -74 -6 154 -22 -112 122 -27 -383 -10 51 241 -181 -191 -91 -2 -154 -153 96 284 80
4756 80 239 204 196 57 -4 283 -241 159 294 -92 72 184 -218 190 208 -261 40 265 -45 38 -52 142 100
4779 100 4 -76 -206 200 223 188 -357 291 48 140 64 -86 26 -114 165 -80 -25 -173 -216 43 92 22 120 239
4803 239 -210 222 -17 19 24 114 -143 -67 -367 -125 -253 -20 93 68 59 166 -111 18 -237 103 228 54 -130
4826 -130 46 2 -178 -61 240 65 38 65 91 107 258 24 -250 -34 107 92 -60 -312 -20 195 89 -43
$$ packed form
4660G7j42J63K13l06P2L3p8Q2j65J6j13j59N2M03k26O1J08P8k96K78Q9j67k5Q9
4684A37k25K57k2k49J84l23M6K17L34l81K07Kj85R5M4rm9K47j47j33j56N2J16
4707E9j3jk13j7PO0K26j09P6k4k04N3R5j64j51O17l91K4K56o46K83J71m0J65m5
4732G4jl24N12l13k2O8J60j76r0K34j49l56L73O1J90m22j0J00Q9j52JK49J88k04
4756H0J59l5qj39o1K87n24M00J35l86J64J12m02M08J8m69L01K25l10Q3r0J94m2
4779A00r6q0j30M06K3l5n45O48k43R2p6j50J12j40K79k45N5j48m3K59M9p0R8J19
4803B39m49M32k39L6NR0k57P6l00K42j28K33J13k5rJ07k77J29k55L40J25j74j84
4826a30J76m4j80J17L01j75k7K7K6J6J51k34k74K16J41j5j52k52K92K15j06j32
$$ plain form
4848 -43 158 33 162 214 11 -390 9 -115 149 -110 -1 0 -55 -103 40 173 -58 -227 -184 24 -57 -28 226
4871 226 28 -109 209 37 -70 50 148 58 -122 -1 -139 -173 24 -124 -352 -51 -166 -127 131 48 -97 -5
4893 -5 94 66 159 -249 142 -146 -135 -154 136 -164 -165 164 -43 -120 111 -46 -93 223 197 -59 284 -46 -137 -12
4917 -12 -38 -37 77 -120 165 106 -2 -23 215 224 35 96 -94 -137 -70 -11 176 154 -103 49 -203 114 -58 -197
4941 -197 90 -145 117 295 171 -120 -56 2 -138 -267 -182 -121 -264 133 -29 -272 25 147 186 -177 -213 -68
4963 -68 -291 60 19 8 -145 -90 -74 15 -369 187 224 90 -165 2 -169 172 181 -62 -26 -75 -83 -219 167 259 -193
4988 -193 -138 144 -44 -32 174 7 -117 -283 -18 170 -182 60 -67 -48 -38 -186 -108 -15 -249 41 -29 -252
5010 -252 -161 266 -143 36 -35 -86 43 61 76 -5 223 61 -178 144 -231 -186 -126 273 160 -283 -302 86 -51
$$ packed form
4848d3K01j25J29N2k03m01L99j24K64k59J09Jn5m8J43J33k31j69M3K08q1K9K54
4871B26j98j37L18j72j07J20R8r0j80J21j38l4J97j48k28L01j15L9K58q3j45R2
4893eR9k8R3m08L91k88J1j9K90l00jL29k07p7K31j57m7L16k6k56L43l30r1J25
4917a2k6JJ14j97K85n9j08k1K38Rj89O1j90m3O7N9J87k2k57J52k52L17j72j39
4941a97K87k35K62J78j24k91O4N8j40j29Q5O1j43L97j62k43K97J22L9l63l6J45
4963f8k23L51m1j1j53N5J6Q9l84N56L7j34k55J67j71L41Rk43L6m9qj36L86R2m52
4988a93N5K82j88J2K06j67j24j66K65J88l52K42j27J9J0j48P8R3k34K90p0k23
5010b52R1M27m09J79p1n1J29J8J5q1K28j62k39L22l75M5O0L99j13m43j9L88j37
$$ plain form
5033 -51 -284 25 230 -221 286 185 134 290 -12 -64 -73 121 -137 -56 97 -189 -19 -134 82 55 32 -207 129
5056 129 -47 3 -101 -16 -126 -175 -162 -239 194 21 111 -161 -41 37 -56 -251 180 68 32 -246 529 344 13
5079 13 -92 -14 -130 -128 170 -14 105 -111 33 136 317 96 -196 100 123 -108 216 25 26 35 -78 185 -279
5102 -279 -58 -99 96 8 55 -134 129 179 -110 233 -282 244 63 -181 -10 -128 -80 -127 163 220 -162 -48
5124 -48 323 23 -58 113 215 38 3 26 50 73 -35 -28 297 -89 -33 365 106 12 -46 -80 124 104 -378 192
5148 192 -269 126 224 -180 -78 -62 389 88 -94 -63 166 -120 29 289 -304 -148 74 2 -50 -439 -306 33
5170 33 -35 121 -22 164 198 72 337 54 47 -148 -105 -147 -100 -45 -119 -50 219 150 160 -78 16 -78 -126 5 -341
5195 -341 -6 42 50 118 -114 105 -7 -222 17 59 -72 -310 150 -178 -139 169 134 -107 -226 -10 209 -4
$$ packed form
5033e1k33L09K05m51N07j01n1J56l02n2rJ94k58Q1J53k86J70j15K16k7k3k39L36
5056A29j76N0j04Q5j10m9J3p7M33j73R0k72J20P8r3j95M31j12l6k78P75j85l31
5079A3j05P8j16KK98j84J19k16J44J03J81k21k92K96K3k31L24j91JRj13K63m64
5102b79K21m1J95q8M7j89K63N0k89L43n15N26j81k44J71j18M8m7K90N7l82J14
5124d8L71l00q1J71J02j77l5K3K4K3j08PL25l86N6L98k59r4n8l4K04k0m82N70
5148A92m61L95R8m04J02J6M51l01j82L1K29k86J49K60n93J56K22p2n2l89J33L39
5170C3o8J56j43J86L4j26K65k83pj95M3m2M7N5p4O9K69o9J0k38R4r4m8J31l46
5195c41L35M8QO8k32K19j12k15K39M2j31k38M60l28L9L08l5k41j19K16K19k13
$$ plain form
5217 -4 -54 92 -3 61 -10 -131 -45 -241 134 86 -199 -2 35 -211 -138 -114 124 282 -167 49 127 1 -6 -293 -99
5242 -99 -355 108 223 -86 -171 40 -283 -68 -302 0 -98 -224 139 298 -61 -292 -31 -190 -14 69 44 -355
5264 -355 113 -207 71 -137 97 -47 8 -93 -173 95 36 126 51 -90 -93 123 112 -22 -167 -186 -51 -178 33
5287 33 143 -204 240 79 -83 227 -20 117 -176 183 -228 -75 -205 73 -140 -40 -229 -136 102 19 -59
5308 -59 17 127 -55 -251 128 -244 -94 -71 -46 -53 48 -234 -344 200 134 -313 -162 -160 -195 186 -28 66 -129 56
5332 56 -18 -35 265 2 50 63 249 -64 6 -82 -70 -74 -78 118 87 263 -111 144 -50 145 124 127 25 203 -35
5357 -35 -137 134 -148 -136 274 301 -272 -1 -205 105 -57 -60 -251 197 136 -45 106 137 231 -66 75 10 -58
5380 -58 67 -105 -2 -31 191 -114 -67 -61 -187 13 -157 -256 165 44 7 -112 96 12 -16 -125 -185 -146 -104 210
$$ packed form
5217dn0J46r5O4p1j21Q6j96L75m8k85J97L7k46P3K4K38J58m49K16P8j26pk87J94
5242i9k56M63J15l09q5K11l23K15k34L02r8j26L63J59l59k31K61j59J76Q3k5l99
5264c55M68l20K78k08K34j44N5j01q0K68n9R0p5j41lK16j1j34j45j9J35j27K11
5287C3J10l47M44j61j62L10k47J37k93L59m11J53j30K78k13J00j89R3K38q3p8
5308e9P6J10j82j96L79l72J50K3K5pJ01k82j10N44o6m47J51Kl5L81k14R4j95J85
5332E6p4j7L00k63M8J3J86l13P0q8J2mmJ96l1J76l74K55j94J95k1Lj02J78k38
5357c5j02K71k82J2M10K7n73K71k04L10j62lj91M48o1j81J51L1R4k97J41o5o8
5380e8J25j72J03k9K22l05M7Oj26K00j70r9M21j21l7j19K08q4k8j09o0L9M2L14
$$ plain form
5404 210 -72 -151 190 -6 -232 99 52 -47 152 124 -123 121 226 15 7 51 -136 -40 236 61 102 116 120 -152
5428 -152 -207 170 118 -37 141 166 -82 -91 -80 -135 -22 56 -121 -332 157 -83 10 -100 -1 -36 -118 -61 44 -76
5452 -76 181 137 37 -94 61 -71 108 -81 -210 -2 -80 39 -32 95 -132 -95 -290 203 220 -64 121 -85
5474 -85 22 87 15 36 -78 111 130 59 -76 121 -71 -9 74 145 -87 -82 115 62 84 -37 -420 89 228 9
5498 9 -11 73 -117 -176 36 30 66 -152 21 206 18 21 30 76 104 -63 25 70 13 3 197 -98 94 208 100 -241
5524 -241 -7 -172 251 248 90 244 -246 100 13 -266 -38 -268 25 -85 96 -52 243 -13 199 298 184
5545 184 92 33 84 -216 -216 127 -14 -94 -127 47 -27 229 21 -12 -22 -122 -154 -104 -11 50 231 144 -53 181 271
5570 271 -5 -59 15 -110 73 -9 -137 -164 -397 63 54 -42 -403 -197 -142 169 349 -146 18 -21 -236 -122 -19
$$ packed form
5404B10k82p9L41j96k26L31m7r9J99k8k47K44J05k11qM4j87R6K76j75M1J4Mk72
5428a52n5L77n2j55J78K5k48rJ1n5J13P8j77k11M89k40R3j10R9l5q2N7J05j20
5452g6K57m4j00j31J55j32J79j89j29K08p8J19p1J27k27L7j95M93J7k84J85k06
5474h5J07O5p2K1j14J89J9p1j35J97j92O2Q3P1k32NJ97n3K2j21l83N09J39k19
5498Ik0Q4j90n9K12oL6k18J73J85j88LRM6K8j67Q8M5n7j0J94k95J92J14j08l41
5524b41K34j65M23lj58J54m90L46q7k79K28k30K93j10J81j48K95k56K12R9j14
5545A84r2n9N1l00%L43j41q0l3J74p4K56k08l3j0j00l2N0R3O1J81q7j97K34R0
5570B71k76n4P4j25J83q2j28k7k33M60rr6l61K06N5L11J80m95J64l9k15J14J03
$$ plain form
5593 -19 -120 -29 -209 -62 48 88 -68 -298 -5 -227 -48 73 380 216 -22 -4 5 -116 223 -139 -81 51
5615 51 -276 -99 -207 193 107 146 -250 -21 -198 -145 -118 -205 215 -47 -125 261 -172 4 52 -267 -32 -177 -126
5638 -126 8 -34 242 -226 14 68 123 221 -268 -173 134 30 203 45 -1 -4 163 -106 51 213 -304 -345 76
5661 76 -90 -193 -44 -226 -22 73 206 85 2 -22 -8 -124 213 -226 -53 -86 -133 -43 78 5 329 -93 -272
5684 -272 143 37 -21 -116 194 -95 20 169 -256 -26 -3 -130 -132 -226 377 180 353 152 -108 5 -161 -128
5706 -128 -21 16 -306 83 214 21 52 68 -140 303 34 106 -168 21 -335 -40 -11 9 36 45 315 143 229
5729 229 -110 -167 -178 -317 -186 91 -100 -57 79 222 314 208 183 -153 -166 12 -101 66 142 156 -115 -159 -187
5752 -187 -14 243 304 58 87 -287 -22 75 31 190 -110 153 33 17 244 54 168 -297 13 -189 -29 -17
$$ packed form
5593a9j01R1j80J47J10M0j56k30K93k22J79J21L07j64k38J8Rj21L39l62N8J32
5615E1l27J77j08M00q6L9l96K29j77N3K7q7M20k62p8L86m33J76M8l19K35j45N1
5638a26J34m2K76m68K40N4N5R8m89R5L07j04J73j58m6lJ67k69J57J62n17m1M21
5661G6j66j03J49j82K04R5J33j21q3k4J4j16L37m39J73l3m7R0J21p3L24m22j79
5684b72M15j06n8r5L10k89J15J49m25K30K3j27kr4O03j97J73k01k60J13j66L3
5706a28J07L7l22L89J31j93L1J6k08M43k69P2k74J89l56K95K9K0K7RK70j72Q6
5729B29l39n7j1j39J31K77j91M3J36J43R2j06k5l36j3J78j13J67P6J4k71m4k8
5752a87J73K57O1k46K9l74K65R7m4J59l00K63j20j6K27j90J14m65L10k02J60J2
$$ plain form
5774 -17 -139 102 212 41 66 10 -232 182 111 65 -65 -109 83 -73 -49 -220 -3 -232 91 15 88 31 88 206
5798 206 81 56 102 -83 88 -68 -109 104 339 47 -126 -68 -70 -103 70 189 -163 88 4 134 -229 180 -160
5821 -160 -117 12 139 25 -261 218 -376 -128 -149 151 10 28 -81 182 64 -42 8 -284 10 -139 -124 19
5843 19 218 98 23 38 -140 -41 6 -183 105 139 -42 9 -258 -128 50 192 172 -80 44 -111 172 185 149
5866 149 63 8 -102 -68 -340 -48 99 -106 -159 -55 -30 -113 -32 -171 -273 -66 132 -41 151 132 -55 -28 -194
5889 -194 -120 129 53 -23 -392 37 20 -31 18 -263 -137 -49 -358 96 -68 -292 -169 -118 -369 260 51 36 125
5912 125 -266 -192 143 -120 -230 -76 232 16 113 -86 59 51 253 157 -337 -296 -33 107 -101 -170 23 -125
5934 -125 30 -163 50 281 -149 109 82 54 -8 86 73 -53 162 -21 -156 247 -177 -122 95 158 108 246 -97
$$ packed form
5774a7j22K41J10j71K5n6k42M14p1m6j30m4J92j56K4j71K17k29L23p6P3n7N7J18
5798B06j25k5M6j85J71j56m1K13K35k92j73N8kl3J73J19l52K51q4J30l63M09l40
5821a60M3J29J27j14k86M79n94K48k1L00j41J8j09K63j18j06N0k92K94j49J5J43
5843A9J99j20p5J5j78R9M7j89K88L4j81N1k67J30J78J42k0k52J24j55K83J3l6
5866A49q6n5j10L4k72K92J47k05n3J04K5q3Q1j39j02K07J98j73J92j9j87K7j66
5889a94P4K49p6p6l69M29j7n1M9k81J26Q8l09M54j64k24J23N1k51O29k09j5Q9
5912A25l91P4L35k63j10J54L08k16R7j99J45qK02r6m94M1K63J40k08o9J93j48
5934a25J55j93K13K31m30K58k7k8o2R4j3j26K15j83j35M03m24N5K17O3n0J38l43
$$ plain form
5957 -97 -7 155 55 8 -160 197 -170 162 -41 37 -194 -30 231 -64 228 10 -42 -22 34 -206 172 -43
5979 -43 -30 58 38 183 -67 -90 -44 75 -41 -146 -155 3 -42 -287 -206 -10 41 95 -182 -200 0 -83 -379 -139 80
6004 80 30 -265 153 226 242 -36 -164 181 188 179 -36 20 27 157 -191 -136 -148 155 -76 -57 -182 183 173 120 46 -3
6030 -3 -94 -342 -328 -124 -100 -305 -36 138 -90 -13 39 97 -208 7 -292 81 421 44 -68 -31 -239 62 -210
6053 -210 222 -124 269 -380 84 254 -182 70 -67 -5 -93 137 16 -129 -73 75 142 110 -87 94 64 -237
6075 -237 -14 122 38 -9 98 113 -63 118 -148 -98 248 -102 -319 110 -32 398 -344 2 126 94 6 68
6097 68 -15 -133 -263 -119 126 -297 2 -127 -235 101 169 -356 -1 -50 335 320 118 -52 -165 164 -290 -46
6119 -46 -101 -59 148 86 158 138 -72 87 241 21 163 -12 72 178 -64 12 -275 194 34 -76 116 137 -142
$$ packed form
5957i7R0J62j00m7j68L57l67L32k03P8k31J64K61k95K92k18n2K0N6k40L78k15
5979d3J3Q8k0J45k50k3M6J19j16j05rJ58m5k45Q1J96N1N4k77j8K00q3k96K40K19
6004H0n0k95M18P3J6k78j28L45Prk15N6PJ30l48N5j2L03k31J9j25L65j0n3p4m9
6030cr1k48J4K04K4k05K69J74k28P7N2N8l05K15k99L73L40l77j12L7k08L01k72
6053b10M32l46L93o49M64J70m36K52j37O2q8K30j21j45N6J48O7l2j97J81l0l01
6075b37K23J36q4m7J07J5j76J81k66N0L46l50k17M29j42M30p42L46J24l2q8O2
6097F8q3j18j30J44K45m23K99j29j08L36O8n25L55m9L85j5k02j70j13L29m54K44
6119d6n5M2K07o2P2k0k10J59J54k20J42j75Q4J06k42P6k87M69j60j10J92K1k79
$$ plain form
6142 -142 -159 -384 -120 -157 249 -36 -335 -89 169 361 -141 -105 -41 -7 70 130 35 -122 -73 35 -207 -81 -205
6165 -205 -123 -1 -119 152 91 56 90 184 174 -170 -417 -179 -346 213 22 -236 53 -350 159 -362 312 175
6187 175 166 -246 106 -152 -21 -74 109 130 -97 -85 60 -94 -87 178 -189 -70 -210 226 7 124 -13 -111 69
6210 69 -147 352 -108 -101 21 89 140 408 -22 -105 -30 -69 118 -122 -67 -208 -85 139 161 149 129 -56 22 -342
6234 -342 57 36 224 -105 -245 -378 138 -114 98 -21 86 -262 -149 -104 -125 -80 -99 -289 -80 -66 59 17
6256 17 -4 -224 82 227 -36 228 251 18 290 -9 175 -94 1 32 -340 -127 293 79 104 33 -25 47 67
6279 67 90 -9 54 -179 145 33 241 -124 410 134 7 106 -8 25 -128 -327 40 16 46 -70 -104 -60 -11 -160
6303 -160 39 -430 157 98 0 32 102 47 -95 8 -44 -120 -190 -395 -61 233 80 130 49 93 217 133 -155 177
$$ packed form
6142a42j7k25K64l7M06k85k99K46K58J92n02L6O4L4P7O0r5j57M9J08k42J26j24
6165b05Q2J22j18K71o1l5L4R4j0l44k47K38j67N59j91k58K89m03N09n21O74j37
6187A75rm12L52k58J31n3J83K1k27J2J45j54PK65l67J19j40M36k19J17j37r8J80
6210F9k16M99m60PJ22O8N1K68m30q3P5l9J87k40N5j41J23K24K2j2k0j85P8l64
6234c42L99k1J88l29j40j33N16k52K12j19J07l48J13M5k1M5j9j90K09J4J25m2
6256A7k1k20L06J45k63K64K3k33K72k99J84k69R5L1l72K13M20k14K5p1n8P2K0
6279F7K3r9O3k33L24j12K08l65N34k76j27R9j14L3j53j99L67k4L0j16l4M4M9j49
6303a60J99m69N87n9r8L2P0n5j42J03n2p6p0k05L34K94j53N0q1M4J24q4k88L32
$$ plain form
6327 177 218 8 -107 156 187 -194 168 -282 -30 77 -14 37 -39 18 105 -176 24 26 -174 6 321 131 118
6350 118 -270 -220 97 50 32 245 -217 -124 12 104 -41 -24 -149 68 -62 -132 26 -102 156 68 13 267 -167
6373 -167 54 23 -77 126 -218 -12 -8 83 -92 249 104 -239 -145 -160 -181 -70 207 139 62 -77 99 -83 -50
6396 -50 -118 -112 70 -300 188 262 -148 -48 16 61 -24 177 233 -84 -81 -85 85 58 -121 112 -7 -77 220 -113 -216
6421 -216 163 -26 99 17 86 -58 -365 415 54 183 -27 54 175 145 -157 -163 60 -4 -71 -26 -38 85 255
6444 255 -123 18 -91 26 -28 -178 0 225 -27 67 -2 -121 173 -30 238 181 41 19 -36 14 -225 221
6466 221 129 2 -8 4 321 -40 -177 -60 -53 68 488 -11 -137 18 -97 129 157 -84 -21 -83 -178 129 -22
6489 -22 -196 119 23 207 -358 -386 -143 -83 43 166 -215 -72 89 -31 -250 179 2 -32 246 232 -153 150
$$ packed form
6327A77M1k10j15K63L1l81L62m50K52J07r1N1p6N7Q7k81K00Kk00J80L15j90j3
6350A18l88N0L17m7j8K13m62R3J36R2j45J7j25K17j30p0J58j28K58q8n5K54m34
6373a67K21l1j00K03l44K06MR1j75L41j45l43R4j5k1J11K77o8p7j39J76j82L3
6396e0o8OJ82l70M88P4m10J00O4M5q5K01N6l17LmJ70k7j79K33j19p0K97l33j03
6421b16L79j89J25q2O9j44l07P80l61J29k10Q1J21l0l02oK23o4o7M5j2J23J70
6444B55l78J41j09J17n4j50J78K25k52R4o9j19K94k03K68n7j40k2n5N0k39M46
6466B21r2j27j0J2L17l61j37J17PJ21M20m99j26J55j15K26K8k41O3o2r5L07j51
6489b2j74L15r6J84n65k8K43O0J26J23l81J43J61j20k19M29j77l4K78j4l85L03
$$ plain form
6511 150 -79 21 -159 232 -57 -37 61 48 102 37 -127 -18 132 -167 34 57 134 28 124 100 -128 -41 90
6534 90 137 -440 -178 4 -54 252 -211 -160 -157 28 55 4 -151 -136 -328 209 -19 -72 -76 91 -86 -181 77 24 168
6559 168 -54 -119 -93 195 36 322 -266 64 -164 -108 -41 -33 232 -78 32 -79 120 -102 -242 213 -233 -123
6581 -123 43 -167 -108 114 -112 254 59 122 -16 -72 -60 23 -16 87 -89 9 -46 441 -346 -214 63 103 -168
6604 -168 133 -222 134 -128 253 98 -29 -59 232 10 -155 62 -128 44 -12 193 -217 -66 -62 -92 226 212
6626 212 20 167 341 111 -166 -257 6 -219 95 194 -261 -86 246 50 -136 133 149 160 14 122 -80
6647 -80 116 -46 -320 22 -35 20 158 -61 54 305 171 87 216 -156 -50 320 255 -154 231 -272 52 -59
6669 -59 -85 -284 127 105 -5 99 188 102 -107 98 -122 -61 -112 -214 165 -101 -149 -48 -52 123 -193 -282 -176 68
$$ packed form
6511A50k29J00j80L91k89K0R8j3N4o5j64J09J50k99K01K3P7j06R6k4k28Q7J31
6534I0M7n77K62J82n8L06m63N1LJ85K7n1j55J5j92N37k28n3mJ67j77r5K58n3J44
6559A68k22o5K6K88j59K86n88L30k28N6O7QK65l10J10j11J99k22j40M55m46J10
6581a23J66k10N9K22k26L66j95O3j38n6J2Q3l9J03j76R8n5M87p87J32K77M0k71
6604a68L01l55L56k62L81j55j27l0K91k22j65K17j90J72n6K05m10J51Ml0L18j4
6626B12j92J47J74k30k77r1K63k25L14R9m55J75L32j96j86K69J6J1j46J08k02
6647h0J96j62k74L42n7N5J38k19J15K51j34q4J29l72J06L70o5m09L85n03L24j11
6669e9k6j99M11k2j10J04Q9q6k09K05k20O1n1j02L79k66m8J01mJ75l16q9J06K44
$$ plain form
6693 68 69 305 -160 -124 132 -233 -80 -62 -88 -359 -80 -204 -54 261 276 -44 66 -59 4 -9 58 56 23 133
6717 133 95 -110 -91 32 -96 425 86 204 -198 78 309 50 -241 -60 -37 -219 -47 11 -53 -139 -172 -285
6739 -285 -58 -129 -100 49 -117 84 99 -206 -61 -114 -169 127 170 24 -447 -88 -29 -24 37 162 230 123 -9 -77
6763 -77 -136 320 -24 96 -10 -79 43 -4 269 35 -261 -107 -73 -144 105 181 121 -161 148 348 -2 395 -121
6786 -121 -93 284 54 -240 -13 108 -104 231 -152 42 -105 -263 -41 15 -261 -182 -160 -32 -112 88 86 -67
6808 -67 201 -98 -74 75 225 -391 171 13 -97 26 26 -128 123 169 -199 56 68 12 172 -14 -128 259
6830 259 -5 -63 -175 -99 135 140 116 -179 99 54 181 -104 -207 -186 -63 -147 -45 -333 14 -173 -120 64 166
6853 166 -12 -55 120 16 -90 -55 200 -19 -162 117 -165 -142 -80 344 -39 43 93 -148 -77 14 33 -201 -143
$$ packed form
6693F8JK36m65L6K56l65J53J8k6k71K79j24J50L15J5l20J10j25O3j3O7kl3J10
6717A33l8k05J9J23j28N21l39J18m02K76K31k59k91J81K3j82J72N8o4q6l3j13
6739b85K27p1K9J49j66K01J5l05J45n3n5K96M3j46m71L59N9NO1J25O8j07j32o8
6763g7n9M56l44J20j06o9J22m7K73k34k96J54L4p1K49P6o0k82L09K00l50L97n16
6786a21K8L77k30k94K27J21k12L35l83J94j47j58K22N6k76P9K2J28q0K00kj53
6808f7K68k99K4J49J50o16N62j58j10J23%j54K51M6l68K55J2n6J60j86j14L87
6830B59k64n8j12P6K34Nk4k95K78m5J27k85j03K1J23q4J02k88L47j87N3J84J02
6853A66j78m3J75j04j06L5K55k19j43K79k82K3O2M24l83Q2N0k41P1R1J9k34N8
$$ plain form
6876 -143 190 -40 310 14 159 -24 -73 -20 -249 203 73 -98 -115 -32 -118 275 16 233 243 -68 175 -125
6898 -125 23 91 109 -71 44 -153 -48 -111 -109 -108 -160 138 31 124 -252 -124 -98 -48 -213 460 -180 -214 66 -65
6922 -65 67 -55 -107 247 94 -218 146 216 -49 -24 8 68 239 184 -77 18 122 -211 315 94 -149 12 -220
6945 -220 -229 5 -6 146 -103 -283 226 339 32 -195 155 410 16 123 51 51 -118 110 -11 110 -116 -25
6967 -25 280 47 131 -72 -45 126 -24 -149 235 96 -2 -22 241 -174 70 -179 130 -443 -18 302 90 -161
6989 -161 13 -26 -41 92 -249 -132 44 -144 139 192 -285 119 87 85 -22 107 60 -95 126 76 15 9 205 66
7013 66 6 -14 -186 -4 -238 96 -111 -172 318 -61 -8 -168 -89 156 -120 -92 31 -129 177 -117 37 -34 67
7036 67 97 -297 68 64 93 -98 -173 -265 215 -65 -34 31 -88 16 -259 56 -72 -49 41 228 199 -32 -57 -194
$$ packed form
6876a43L33k30L50k96J45j83m9N3k29M52j30j71j7Q3q6L93k59K17J0l11K43l00
6898a25J48O8J8j80J15j97J05o3KJn2K98j07R3l76J28K6N0j65O73o40l4K80j31
6922f5J32j22n2L54j53l12L64P0k65K5L2O0J71n5k61R5J04l33N26k21k43J61k32
6945b20rK34j1J52k49j80N09J13l07k27L50K55l94J07p2%j69K28j21J21k26R1
6967b5L05k33Q4k03K7J71j50j25L84j39r8k0K63m15K44k49L09n73M25L20k12k51
6989a61J74l9j5J33l41J17J76j88K83N3m77M04l2kj07J29m7j55K21n0o1oJ96j39
7013F6o0k0j72J82k34L34k07o1M90l79N3j60P9K45k76K8J23j60L06k94J54p1J01
7036F7L0l94L65mK9j91p5r2M80k80L1O5j19J04k75L15j28K3R0J87k9k31k5j37
$$ plain form
7060 -194 18 15 -159 135 -103 -9 87 -105 59 -5 -295 135 -176 208 -310 -236 150 -95 184 135 -24 76
7082 76 41 76 82 -1 -31 24 236 -112 -21 -263 44 -203 -117 -113 65 289 96 78 293 -54 -92 -75 126 87 -70
7107 -70 -167 52 -327 -59 -160 -53 35 -180 175 79 293 113 -210 116 108 -191 178 -49 -114 -154 314 -395 159
7130 159 -19 106 -121 -312 -80 145 302 8 -153 49 220 117 155 162 75 -239 -4 153 -239 -111 -165 61
7152 61 -222 -53 95 -47 35 35 -222 206 -24 -28 -160 115 -221 54 -78 -131 -164 -248 -135 30 147 -52 -149
7175 -149 -7 104 -76 -280 363 168 -178 233 33 -111 -259 219 94 139 114 106 110 -1 208 -114 370 31
7197 31 -88 102 108 -112 206 -227 -245 182 -205 147 110 -128 194 -3 35 132 -161 -46 -123 -180 235 159 86 176
7221 176 -219 44 -267 97 334 85 188 112 118 -134 -212 15 -59 -53 -260 -35 154 179 -248 -116 4 -185 -143
$$ packed form
7060a94K12lj74K94k38R4R6j92J64o4k90M30l11L84n18P4L86k45K79m9j59J00
7082G6l5L5Oq3l0N5K12l48R1k42L07k47Q6MJ78K24j93j8K15l47l8J7K01l9j57
7107g0r7K19l79K68j01J07Q8k15L55r6K14j80l23L26qk99L69k27o5m0M68p09N54
7130A59j78J25k27j91K32K25J57k94j61K02J71j03L8Pq7l14K35J57l92J28n4K26
7152F1k83J69J48j42Q2%k57M28k30mj32K75l36K75j32n3l3q4J13J65J17j99r7
7175a49J42J11j80k04O43j95l46M11k00j44j48M78j25M5k5qMj11K09l22M84l39
7197C1j19J90Ok20L18m33j8M27l87L52l7k38L22j97L8R7k93J15p7n7M15p6p3R0
7221A76l95K63l11L64K37k49J03p6Ok52p8K27p4Ok07K25J89K5m27J32J20j89M2
$$ plain form
7244 -143 48 6 -205 449 81 248 106 -69 -143 -16 -148 171 -175 -56 -74 -8 -14 -58 87 -279 278 -8
7266 -8 -16 85 -37 -489 -15 -102 -13 -194 -45 59 68 48 -68 84 -139 100 -247 -45 -18 -61 142 188 10 293
7290 293 -169 77 -86 47 56 -103 -213 -81 -82 -34 -140 138 128 -70 -59 -321 160 106 -31 177 -106 141 -229
7313 -229 112 -15 -47 -29 -63 -55 -174 403 -87 123 -295 -144 156 -218 -32 165 -213 213 -35 -51 267 68
7335 68 -57 -280 17 -25 202 52 36 72 137 143 75 286 7 -64 13 4 -116 -125 453 -21 -242 73 71 -4 -171 -153
7361 -153 60 50 -34 63 -386 202 -41 53 123 173 140 168 74 145 -76 -108 7 -59 101 101 -126 -159 61 174 -32
7386 -32 -178 80 -202 71 -191 -181 -14 90 -174 -176 -54 -72 -66 25 76 310 162 -206 115 0 -151 -37 -88
7409 -88 118 -189 -325 -64 -103 54 -85 155 50 2 -28 -24 246 -190 59 87 -51 -45 -324 -150 21 153 -45
$$ packed form
7244a43J91m2k11O54l68J67j42j75p4J27j32L19l46J19j8O6om4J45l66N57k86
7266hqJ01j22m52M74q7Q9j81J49J04Rk0j16J52k23K39l47K02K7m3K03M6j78K83
7290B93m62K46j63J33Rj59j10J32jM8j06K78j0j98J1k62M81n4j37K08k83K47l70
7313b29L41j27l2J8l4Qj19N77m90K10m18J51L00l74J86J97l78M26k48j6L18j99
7335F8j25k23K97m2K27j50j6L6O5Oo8K11k79p1P7rj20rN78m74k21L15kp5j67J8
7361a53K13j0q4R7m49N88k43R4P0N0l3K8r4P1k21l2J15o6J60%k27l3K20J13k06
7386c2j46K58k82K73k62J0J67J04k64kJ22j8OR1N1K34j48l68L21j15j51J14n1
7409h8K06l07j36K61l9J57j39K40j05m8l0MK70m36K49K8j38Ok79J74J71J32j98
$$ plain form
7432 -45 -266 -8 214 -7 185 33 99 88 -12 -293 -18 -52 -302 67 132 -3 -191 353 -17 -95 10 -152
7454 -152 -170 -228 -58 105 -20 240 -64 -30 113 41 -26 165 70 -96 58 227 224 145 67 -284 14 47 -56 -22
7478 -22 148 133 235 92 41 18 177 -157 -46 50 83 -179 164 -330 200 -383 113 -165 7 -537 -10 -60
7500 -60 79 609 338 49 -158 18 -41 -50 -133 374 -115 146 169 62 -149 -79 -25 30 176 -170 -156 -125 -164 -225
7524 -225 -316 150 -214 -187 78 -28 -82 45 -67 24 -115 -60 57 -231 -196 -13 -50 138 238 114 6 277
7546 277 40 53 -27 -39 -276 -47 -105 -3 89 18 336 89 -40 -60 41 -45 31 90 -37 258 2 -91 -88 53
7570 53 8 68 294 -104 -159 -186 19 -7 -237 -107 -99 23 -85 76 133 -166 -92 -166 -110 -135 53 -57 -62 182 -113
7595 -113 60 128 -13 -166 -13 135 30 105 26 97 -120 90 -139 -51 52 182 154 176 -21 -79 -61 -133 -379
$$ packed form
7432d5k21K58K22k21J92j52O6j1j00k81K75l4k50L69O5j35j88N44l70p8J05j62
7454a52j8n8J70J63j25K60l04L4J43p2o7J91r5j66J54J69lp9p8l51K98L3j03L4
7478b2J70j5J02j43n1k3J59l34J11R6L3k62L43m94N30n83M96k78J72n44N27n0
7500f0J39N30k71k89k07J76n9rq3N07m89K61K3j07k11P0N4N5J46l46J4L1l9o1
7524b25r1M66l64K7K65j06n4J27j12R1j39N5J17k88L5J83l7J88J00j24j08K71
7546B77k37J3q0j2k37K29n8J02R2p1L18k47j29k0J01q6P6N9j27K95k56r3LJ41
7570E3m5O0K26l98n5k7K05k6k30J30QJ22j08J61N7k99P4p4N6k5J88j10nK44k95
7595a13J73O8j41j53J53J48j05P5p9P1k17K10k29Q8J03J30k8K2j97n8J8p2k46
$$ plain form
7618 -379 57 -38 -282 -127 61 -69 -137 -175 299 -239 -83 5 71 -262 -15 -125 -390 -101 132 236 -97 104
7640 104 -241 -162 29 208 122 18 -52 223 -206 -9 159 -79 38 -156 -11 -5 120 309 20 169 49 258
7662 258 -81 -147 184 42 -427 97 4 -39 -235 380 56 -122 -39 -78 214 4 -163 177 194 -69 72 -154
7684 -154 90 -264 13 -218 -5 210 182 85 -26 -25 -215 3 -139 -17 -66 -20 -51 35 -245 -102 -241 -37 -221
7707 -221 127 144 272 49 -61 47 -33 75 -64 260 -56 188 93 155 26 -33 -49 133 -140 -31 143 -61
7729 -61 211 -252 36 9 244 6 248 -115 -155 181 -184 237 90 94 -74 -259 52 8 -132 4 94 89 12
7752 12 -163 67 -52 -330 -26 31 59 -244 -179 61 -32 -149 85 -103 31 33 25 169 71 -236 56 -38 -107 -168
7776 -168 21 -117 99 132 52 150 84 -74 125 73 40 -4 -4 21 -8 -70 -7 173 -208 169 -9 164 -162 216
$$ packed form
7618c79M36r5k44J55J88j30o8l8M74n38J56Q8O6l33K47j10k65K89K33J04l33K01
7640A04l45P9J91J79q6j04p0K75m29J97J68k38J17j94J45OJ25J89k89J49j20K09
7662B58l39o6L31j42m69N24r3m3j96O15l24j78Q3l9K92k10j67L40J7k63J41k26
7684a54K44l54K77k31K13K15k8r7j11Jj90K18j42J22m9M6l1Q6k80J43j39K04j84
7707b21L48J7J28k23j10J08q0J08j39L24l16K44r5O2j29n9j6J82k73J09J74k04
7729f1K72m63K88k7K35k38K42l63m0L36l65M21j47Mj68j85L11m4j40J36R0np7
7752A2j75K30j19k78L04N7K8l03O5K40r3j17K34j88J34KqJ44r8l07K92r4o9o1
7776a68J89j38K16L3q0R8o6j58J99n2l3m4%K5k9o2O3J80l81L77j78J73l26L78
$$ plain form
7800 216 205 130 18 -202 -138 -130 330 -67 106 -163 -106 -158 18 -75 -95 -210 -131 -6 -65 26 -154 -48 -63 208
7824 208 164 63 99 168 247 188 244 -21 257 -18 -196 -183 234 93 -422 -247 -61 86 -52 310 154 -47
7846 -47 -146 49 -7 138 31 103 -185 -57 373 -144 -299 32 82 31 35 -105 -109 47 179 -69 -146 34 7 -180
7870 -180 130 213 -104 91 -498 -182 -395 96 -127 -138 265 -157 -108 -66 112 94 87 -45 14 -21 69 -80 63
7893 63 27 -178 5 118 -119 129 -96 236 -182 34 -81 -313 42 420 -97 57 -72 131 8 -111 -34
7914 -34 116 15 67 58 227 -176 -96 -136 -184 -73 -94 -199 -60 -160 188 82 -47 136 -215 -38 -363 165 16
7937 16 -436 -126 102 -319 -226 -44 -139 96 337 47 191 19 -102 111 -28 -192 156 -175 174 35 -63
7958 -63 -25 44 -99 262 133 40 34 85 -238 394 -15 40 110 -101 228 336 93 99 -32 96 292 -54 90 88
$$ packed form
7800B16j1p5j12k20O4QM60l97J73k69N7n2J76r3k0j15P9J25n9R1j80J06j5K71
7824B08m4j01L6O9P9n9N6k65K78k75j78J3M17j41n15J75J86J47j38L62j56k01
7846d7r9J95n6J45j07P2k88J28M30n17j55L31N0n1Mj40mJ56J32k48p7J80k7j87
7870a80L10Q3l17J95n89L16k13M91k23j1M03m22M9M2J78j8pj32N9l5R0j49J43
7893F3l6k05J83J13k37K48k25L32m18K16j15k32L55L78n17J54j29K03j23j19P7
7914c4J50j01N2rJ69m03Q0m0m8J11k1j05J39j00L48j06j29J83l51J77l25N28j49
7937A6m52L10K28m21R3J82r5K35K41k90J44j72j21K13j39j64L48l31L49j39r8
7958f3L8O9j43L61j29r3oN1l23O32m09N5P0k11L29J08k43Oj31J28J96l46J44k
$$ plain form
7982 88 87 -239 156 57 -38 -121 -98 22 -159 3 145 -174 103 -68 87 187 -140 -27 118 -104 136 20
8004 20 86 -12 -132 -71 49 223 -143 179 -158 -22 0 154 88 -21 42 -115 -295 -170 45 -224 -104 -72 -118
8027 -118 -68 -12 144 42 -282 110 234 78 111 -279 -103 292 -177 66 -11 38 131 54 -23 -248 140 -5 -42
8050 -42 115 106 132 -193 175 -45 -22 -54 130 -117 -76 218 205 -64 -352 -63 -178 -137 96 52 -14 -69 34 15
8074 15 -234 69 115 119 304 127 141 -17 -130 70 -124 -42 0 339 -243 81 -146 121 -40 256 234 -55 -55
8097 -55 195 -127 -100 -284 105 166 224 -31 -3 -44 -294 -142 -66 -183 0 102 -125 -61 -21 173 -9 -31 17 -11
8121 -11 80 -38 -257 78 38 -461 192 -318 -48 2 10 -36 -29 285 40 -157 -46 -153 162 425 -113 -162 4
8144 4 51 73 293 57 122 122 266 81 58 80 -278 -143 80 161 95 -195 82 188 30 -108 -290 -65 51 -252
$$ packed form
7982H8jl26L95r9r5q3K3J20j81J62J42l19K77j71J55J00l27J13J45k22K40j16
8004B0O6r8j20O1J20J74l66L22l37J36K2J54o6j09O3j57j80J25K15k69J20L2m6
8027a18N0N6J56j02l24L92J24j56L3l90J76L95m69K43p7M9R3p7p7k25L88j45l7
8050d2J57rK6l25L68k20K3l2J84k47M1K94j3k69k88K89j15M1K33m4o6n5J03j9
8074A5k49L03M6MJ85j77J4j58j13K00j94Q2M2L39n82L24k27K67j61K96k2k89%
8097e5K50l22K7j84L89O1N8k55K8m1k50J52P6j17J83J02k27O4M0J94j82k2M8k8
8121a1R1j18k19L35m0m99O53n10K70N0Qm6PL14k45j97J11j07L15K63n38m9J66
8144DM7K2K20k36O5%J44j85k3K2l58J35K23Q1o6k90K77J06j58j38j82K25J16l03
$$ plain form
8168 -252 28 -196 49 -33 0 157 97 -259 96 246 218 105 12 203 159 -232 -72 -178 -20 21 -105 -349
8190 -349 146
$$ packed form
8168b52K80k24K45q2L3J57o0l56L55J50k8j13r3J91m4l91J60j06J58M1j26k44
8190c49M95
8191A46
$$ Imaginary data points
##PAGE= N=2
##DATA TABLE= (X++(I..I)), XYDATA
$$ plain form
0 0 0 0 0 0 0 0 8 -8 8 -8 15 -16 16 -24 24 -32 40 -48 56 -64 74 -89 103 -117 136 -154 176 -200 227 -256
30 -256 289 -324 364 -405 453 -503 563 -624 693 -767 849 -940 1042 -1152 1277 -1418 1575
47 1575 -1754 1963 -2203 2488 -2833 3253 -3791 4493 -5463 6894 -9223 13673 -25296 120414
61 120414 268516 35567 -99097 -63953 104814 163036 104054 3128 -31752 -42955 -36544
72 -36544 -8283 60959 80454 -3092 -130742 -139697 -760 143919 119928 -36104 -143739
83 -143739 -82670 57463 125187 70586 -21014 -72028 -65072 -22223 39861 77704 38461 -68343
95 -68343 -136967 -78949 54503 112568 31078 -92908 -120619 -39538 48482 63610 18911 -34030
107 -34030 -73455 -84551 -43828 37256 77026 6003 -120964 -155698 -40535 102056 108156 -20173
$$ packed form
0@%%%%%%Qj6J6j6K3l1L2m0M8n6P2q8J04j20J38j63J92k20K53k90L30l76M27m83
30b56N45o13O88p69Q58r56J066j187J317j460J616j789J982k194K429k695K993
47A575l329L717m166M691n321O086p044Q284r956J2357j6117K2896l8969J45710
61A20414J48102k32949j34664L5144J68767N8222n8982j00926l4880j1203O411
72c6544K8261O9242J9495q3546j27650q955J38937J44679k3991j56032j07635
83a43739O1069J40133O7724n4601r1600n1014O956M2849O2084L7843l9243j06804
95f8343o8624N8018J33452N8065q1490j23986k7711Q1081Q8020J5128m4699n2941
107c4030l9425j1096M0723Q1084L9770p1023j26967l4734J15163J42591O100j28329
$$ plain form
119 -20173 -120557 -77072 44823 104833 67398 11386 -4936 -3182 -9073 8217 64421 93320
131 93320 22355 -97999 -125247 -12226 109041 84735 -60146 -152276 -88409 43258 92860
142 92860 34020 -36782 -45682 -12242 17368 41291 68791 66794 7266 -61950 -51291 43271
154 43271 112937 64369 -53949 -109718 -48597 47215 72556 18350 -45062 -64105 -41600 1191
166 1191 44474 59160 18180 -54625 -80555 -16909 73585 86585 3537 -79435 -71903 5144
178 5144 59645 46517 3005 -21897 -25077 -16906 12923 63076 84217 31918 -52087 -65288 23638
191 23638 114583 91506 -24435 -99675 -54294 40050 66408 8883 -48714 -50437 -25350 -14262
203 -14262 -5038 24703 44311 7847 -55492 -56216 31313 111565 81854 -27294 -84873 -27581
$$ packed form
119b0173j00384M3485J21895O0010l7435n6012j6322J754n891J7290N6204K8899
131I3320p0965j20354k7248J13021J21267k4306j44881r2130O3867J31667M9602
142I2860n8840p0802q900L3440K9610K3923K7500j997n9528o9216J0659R4562
154D3271O9666m8568j18318n5769O1121R5812K5341n4206o3412j9043K2505M2791
166A191M3283J4686m0980p2805k5930O3646R0494J3000q3048q2972P532P7047
178E144N4501j3128m3512k4902l180Q171K9829N0153K1141n2299q4005j3201Q8926
191B3638R0945k3077j15941p5240M5381R4344K6358n7525n7597j723K5087J1088
203a4262R224K9741J9608l6464o3339p24Q7529Q0252k9711j09148n7579N7292
$$ plain form
215 -27581 65141 81041 11885 -54798 -59632 -28195 -6459 -820 895 -10850 -48308 -78407 -52948
228 -52948 17394 55377 12159 -62640 -79204 -18708 47280 49926 -134 -42837 -45454 -22338
240 -22338 5379 27184 27119 -7657 -55115 -60631 -3004 61394 58017 -12633 -65145 -38236 32326
253 32326 63176 31624 -12244 -23361 -11783 -2935 6594 27722 35450 -467 -52891 -52618 18556
266 18556 83515 61492 -22155 -62026 -6694 75944 90875 36733 -10387 -2344 28813 38534
278 38534 31552 32520 32135 2705 -38388 -37340 16441 58352 25542 -51228 -79558 -24806 46058
291 46058 52707 -648 -42799 -31623 5986 27492 27144 19213 4347 -20354 -35109 -12867 29389
304 29389 37853 -8829 -62906 -62205 -10564 28454 13954 -28174 -49757 -38077 -15670 953 10938
$$ packed form
215b7581R2722J5900o9156o6683m834L1437K1736N639J715j1745l7458l0099K5459
228e2948P0342L7983m3218p4799j6564O0496O5988K646n0060m2703k617K3116
240b2338K7717K1805o5l4776m7458n516N7627O4398l377p0650n2512K6909P0562
253C2326L0850l1552m3868j1117J1578Q848R529K1128P728l5917n2424K73P1174
266A8556O4959k2023q3647l9871N5332Q2638J4931n4142m7120Q043L1157R721
278C8534o982R68l85k9430m1093J048N3781M1911l2810p6770k8330N4752P0864
291D6058O649n3355m2151J1176L7609K1506l48p931j4866k4701j4755K2242M2256
304B9389Q464m6682n4077P01N1641L9018j4500m2128k1583J1680K2407J6623R985
$$ plain form
317 10938 8405 -16706 -48370 -46668 -854 40878 24076 -36967 -70635 -36503 22008 36695
329 36695 348 -33608 -28494 -2701 10520 12892 21817 27788 8308 -23021 -19890 28742 66984
342 66984 38829 -29120 -56622 -11143 47268 46882 -6415 -43654 -27518 8511 21555 13016 10605
355 10605 14906 5873 -9688 485 40526 65026 35140 -17764 -29618 14227 57784 46809
367 46809 -3523 -34817 -22213 5944 16376 8503 -2168 -12729 -24932 -26270 -2121 28883
379 28883 28081 -9441 -40799 -25929 17932 38664 14892 -21459 -30593 -13613 2051 5234 4545
392 4545 355 -14927 -33106 -27961 7569 36283 18759 -28336 -47348 -11860 34671 36531 -3788
405 -3788 -33885 -23621 1542 7760 -2082 -5685 -3338 -13491 -30991 -25087 9803 34760 13933
$$ packed form
317A0938k533k5111l1664J702M5814M1732j6802o1043l3668L4132N8511J4687
329C6695l6347l3956N114K5793J3221K372Q925N971j9480l1329L131M8632L8242
342F6984k8155o7949k7502M5479N8411l86n3297l7239J6136L6029J3044q539k411
355A0605M301r033j5561J0173M0041K4500k9886n2904j1854M3845M3557j0975
367D6809n0332l1294J2604K8157J0432p873j0671j0561j2203j338K4149L1004
379B8883q02l7522l1358J4870M3861K0732k3772l6351r134J6980J5664L183o89
392D545m190j5282j8179N145L5530K8714j7524m7095j9012L5488M6531J860m0319
405c788l0097J0264K5163O218r842l603K347j0153j7500N904L4890K4957k0827
$$ plain form
418 13933 -30350 -39241 4427 49258 44084 379 -24646 -6486 23681 29421 13226 1186 -1279
431 -1279 -7712 -17022 -10398 12238 20911 -4209 -37434 -35207 4094 34310 21605 -13481 -26788
444 -26788 -6736 18921 23720 13967 4747 -2355 -10033 -9185 7197 24428 15628 -17281 -37067 -18075
458 -18075 17499 26386 769 -25405 -21753 466 13098 9867 4661 3307 -3410 -14977 -11804
471 -11804 11526 28040 9623 -27325 -37424 -5795 29078 25038 -9994 -29522 -12445 15361
483 15361 21775 9878 3873 8041 6491 -2556 -136 19895 30910 10368 -23543 -28620 2942
496 2942 30592 17697 -18984 -34969 -14725 11766 15045 955 -6606 -3317 -1327 -2081 5252 20534
510 20534 22450 1165 -20359 -14159 14245 27565 8033 -21752 -28023 -9678 6710 4142 -7094
$$ packed form
418A3933m4283q891M3668M4831n174m3705k5025J8160L0167N740j6195j2040k465
431a279o433r310O624K2636Q673k5120l3225K227L9301L0216j2705l5086j3307
444b6788K0052K5657M799r753r220p102p678Q48J6382J7231q800l2909j9786J8992
458a8075L5574Q887k5617k6174L652K2219J2632l231n206j354o717j1567L173
471a1804K3330J6514j8417l6948j0099L1629L4873m040l5032j9528J7077K7806
483A5361O414j1897o005M168j550r047K420K0031J1015k0542l3911n077L1562
496B942K7650j2895l6681j5985K0244K6491L279j4090p561L289J990p54P333J5282
510B0534J916k1285k1524O200K8404J3320j9532k9785o271J8345J6388k568j1236
$$ plain form
523 -7094 -12836 -13240 -14477 -11307 2820 15038 6883 -16299 -26350 -6569 20419 21069 -4918 -25530
537 -25530 -18271 2394 9192 -245 -8150 -7069 -6833 -11301 -7707 8732 20541 7653 -16811 -19443
551 -19443 7032 32267 23793 -7022 -21367 -5459 16244 16405 356 -7948 -4041 -1683 -5352
564 -5352 -3063 10564 17970 4784 -14455 -11444 15768 35134 22054 -5301 -12855 5467 23507
577 23507 20287 4116 -4633 -3123 -1832 -3488 -323 7152 5609 -10229 -22034 -11538 11739 19791
591 19791 2573 -16961 -14783 4486 16067 9209 -2410 -5630 -4278 -5628 -6237 757 6910 -1425
605 -1425 -19624 -25170 -7726 13291 10747 -11597 -24283 -12502 8012 11920 722 -7157 -4505
618 -4505 -1346 -4350 -4879 3610 9363 -1689 -19472 -20336 488 17839 8997 -14249 -21115 -3557
$$ packed form
523g094n742m04j237L170J4127J2218q155k3182j0051J9781K6988O50k5987k0612
537b5530P259K0665O798r437p905J081K36m468L594J6439J1809j2888k4464k632
551a9443K6475K5235q474l0815j4345J5908K1703J61j6049q304L907K358l669
564e352K289J3627P406j3186j9239L011K7212J9366j3080k7355p554J8322J8040
577B3507l220j6171q749J510J291j656L165P475j543j5838j1805J0496K3277Q052
591A9791j7218j9534K178J9269J1581o858j1619l220J352j350o09O994O153q335
605a425j8199n546J7444K1017k544k2344j2686J1781K0514L908j1198p879K652
618d505L159l004n29Q489N753j1052j7783q64K0824J7351q842k3246o866J7558
$$ plain form
632 -3557 16043 15342 2330 -4019 2095 7348 5100 5164 11066 13344 1735 -12273 -9253 9630 18687
647 18687 5256 -15566 -17234 551 14608 10671 -1719 -5329 1413 5004 5118 7551 12609 10071
661 10071 -1960 -9570 -1016 13997 15023 -2665 -18019 -13290 2857 9427 449 -9186 -8992 -3434
675 -3434 -1778 -2136 3045 8132 2552 -9491 -11949 2006 15468 9766 -9869 -19371 -8408 7058
689 7058 6732 -5363 -12444 -8102 -2003 -2595 -3178 2452 7056 873 -9636 -7707 8202 18669 9004
704 9004 -9793 -13914 479 13107 8628 -4993 -10379 -4416 796 -539 -1004 3197 5271 -1232
718 -1232 -8077 -2324 12625 18014 6360 -8366 -6778 7673 16275 8095 -3795 -6430 -1275 1602
732 1602 -721 -756 2069 478 -7176 -10636 -1243 11137 10446 -2940 -12008 -4626 9316 12421 2498
$$ packed form
632c557J9600p01j3012o349O114N253k248O4N902K278j1609j4008L020J8883R057
647A8687j3431k0822j668J7785J4057l937j2390l610O742L591J14K433N058k538
661A0071j2031p610Q554J5013J026j7688j5354M729J6147O570q978r635J94N558
675c434J656l58N181N087n580j2043k458J3955J3462n702j9635r502J0963J5466
689G058l26j2095p081M342O099n92n83N630M604o183j0509J929J5909J0467r665
704I004j8797m121J4393J2628m479j3621n386N963N212j335m65M201K074o503
718a232o845N753J4949N389j1654j4726J588J4451Q602q180j1890k635N155K877
732A602k323l5K825j591p654l460R393J2380o91j3386r068P382J3942L105r923
$$ plain form
747 2498 -6653 -5353 32 44 -2676 -1946 901 -3139 -11336 -12097 -412 9023 4024 -9741 -13986 -1791
763 -1791 11110 9780 -1174 -6825 -1502 3794 2351 -700 733 2530 -2459 -10415 -8348 3275
777 3275 9723 1322 -11298 -11075 2577 12485 8343 -2184 -4374 2489 7389 5088 2866 4397 4991
792 4991 -801 -6114 -1962 7457 8779 -1791 -11631 -7944 5123 10619 3156 -5080 -3914 2954 5874
807 5874 3440 2577 4564 3195 -2540 -5401 429 7934 5334 -6734 -12750 -6186 5110 5712 -3137
822 -3137 -9211 -5095 1101 2573 213 747 3408 1105 -3754 -4623 3405 8820 3003 -8955 -11701
837 -11701 -2414 6326 2946 -6818 -10604 -4316 1444 848 -1646 -19 2599 192 -3405 -1286 6935
852 6935 10439 2669 -7190 -5901 4070 9269 2936 -6463 -7143 -856 2923 932 -1480 493 1716
$$ packed form
747B498r151J300N385J2k720P30K847m040q197p61J1685R435m999j3765m245J2195
763a791J2901j330j0954n651N323N296j443l051J433J797m989p956K067J1623
777C275O448q401j2620K23J3652R908m142j0527k190O863M900k301k222J531N94
792D991n792n313M152R419J322j0570r840L687J3067N496p463q236J166O868K920
807E874k434q63J987j369n735k861N830P505k600j2068o016O564J1296O02q849
822c137o074M116O196J472k360N34K661k303m859q69Q028N415n817j1958k746
837a1701R287Q740l380r764l786O288N760n96k494J627K618k407l597K119Q221
852F935L504p770r859J289R971N199o333r399o80O287L779j991k412J973J223
$$ plain form
867 1716 -1141 -3401 843 8189 8557 143 -6696 -2455 7431 9340 1141 -6442 -5020 1104 2451
882 2451 -808 -2450 -484 -158 -3270 -4099 1107 7426 5087 -3358 -6418 407 8603 7400 -1539 -6516
898 -6516 -2932 2295 1696 -2554 -3191 -1431 -2127 -5829 -5418 836 5261 1338 -6235 -6141 2671 9473 6036
915 6036 -2417 -4267 1247 5525 3054 -1007 -947 718 -1144 -4276 -3042 2771 4353 -1233 -7247 -4878
931 -4878 4547 8515 2796 -3879 -2833 3440 6184 2628 -126 914 2125 -867 -3001 -849 3992
946 3992 3148 -3518 -7642 -2984 5200 5972 -771 -5327 -2557 3531 4479 1008 -840 309 820 -1728
962 -1728 -3593 -310 3187 -68 -6734 -8370 -2428 3512 2153 -4527 -7285 -2329 3182 2861 -487
977 -487 -861 1234 1487 -1260 -1165 2638 4278 -111 -6018 -5829 533 4598 210 -6179 -6398 -728 3192
$$ packed form
867A716k857k260M244P346L68q414o839M241R886J909q199p583J422O124J347
882B451l259j642J966L26l112q29N206O319k339q445l060O825Q196j203q939m977
898f516L584N227n99m250o37J760o96l702M11O254M425l923p573R4Q812O802l437
915F036q453j850N514M278k471m061O0J665j862l132J234N813J582n586o014K369
931d878R425L968n719o675J046O273K744l556k754J040J211k992k134K152M841
946C992q44o666m124M658Q184P72o743m556K770O088R48l471j848J149N11k548
962a728j865L283L497l255o666j636N942N940j359o680k758M956N511l21l348
977d87l74K095K53k747R5L803J640m389n907J89O362M065m388o389k19N670L920
$$ plain form
994 3192 1585 -1130 -179 2118 1888 74 1419 5369 5933 901 -3594 -1212 5031 6682 308 -4774
1010 -4774 -3400 2252 3949 1127 -1217 149 2008 1068 -584 1415 5234 4425 -655 -3401 394
1025 394 5471 4721 -1742 -5598 -2269 2317 1965 -1863 -3071 -963 320 -823 -1811 1052 3968 1756
1041 1756 -2902 -3411 1321 5179 2433 -3648 -5719 -1635 1630 -197 -3865 -4480 -2296 -2232 -3356 -3341
1057 -3341 -185 1731 -905 -4466 -3175 2818 5497 1585 -3328 -3039 1507 3477 992 -2501 -2028
1072 -2028 -182 -763 -2448 -1990 1021 1496 -2183 -4396 -955 3862 5021 551 -3117 -748 4157 4794
1088 4794 1406 -1060 220 1867 1287 -776 133 2381 1721 -1870 -3111 483 5140 4041 -919 -2628
1104 -2628 1167 4590 4252 553 -914 939 1815 240 -1330 321 1748 -159 -3845 -3522 272 3386
$$ packed form
994C192j607k715R51K297k30j814J345L950N64n032m495K382O243J651o374n082
1010d774J374N652J697k822k344J366J859r40j652J999L819q09n080k746L795
1025C94N077p50o463l856L329M586l52l828j208K108J283j143r88K863K916k212
1041A756m658n09M732L858k746o081k071M084L265j827l668o15K184O4j124J5
1057c341L156J916k636l561J291N993K679l912m913K89M546J970k485l493M73
1072b028J846n81j685M58L011M75l679k213L441M817J159m470l668K369M905O37
1088D794l388k466J280J647n80k063R09K248o60l591j241L594M657j099m960j709
1104b628L795L423l38l699j467J853Q76j575j570J651J427j907l686L23L794L114
$$ plain form
1120 3386 802 -3282 -3656 614 3878 2559 -834 -617 1353 2207 -157 -329 969 1416 -814 -4212
1136 -4212 -3296 994 1930 -1652 -5328 -4061 541 2220 -605 -2665 -1486 953 1239 -440 19 1457
1152 1457 1848 -970 -3075 -1131 2486 2051 -2485 -4522 -2501 1441 1753 -1303 -2844 -777 965 454
1168 454 -444 345 2056 1517 -1350 -2433 850 3041 1842 -2454 -4053 -864 2229 1448 -1544 -2682
1184 -2682 -20 1729 385 -468 1142 2783 1427 -713 -847 2476 4230 1323 -2357 -2267 679 2579
1200 2579 458 -2113 -2287 -189 695 -688 -707 875 2060 463 -1188 194 3235 4120 900 -1797
1216 -1797 -606 2572 3525 182 -1996 -818 409 488 -1139 -1351 273 522 -1246 -2036 23 2784
1232 2784 2178 -690 -2466 -180 3038 2498 -571 -2072 -703 616 -338 -1726 -1108 153 -419 -2095
$$ packed form
1120C386k584m084l74M270L264j319l393K17J970Q54k364j72J298M47k230l398
1136d212R16M290R36l582l676J267M602J679k825k060J179K439K86j679M59J438
1152A457L91k818k105J944L617m35m536k037K021L942L12l056j541K067J742n11
1168D54q98P89J711n39k867j083L283K191j199m296j599L189L093p81k992j138
1184b682K662J749j344q53J610J641j356k140j34L323J754k907l680R0K946J900
1200B579k121k571j74K098Q84j383j9J582J185j597j651J382L041Q85l220k697
1216a797J191L178R53l343k178J178J227P9j627k12J624K49j768p90K059K761
1232B784o06k868j776K286L218n40l069j501J369J319r54j388O18J261n72j676
$$ plain form
1248 -2095 -2561 109 2061 657 -2048 -2568 315 2676 1179 -1660 -1748 -206 771 -652 -1877 -958
1264 -958 -257 -1231 -3126 -2598 273 1461 -401 -2512 -1904 975 2652 1109 -995 -634 1443 1758 270
1281 270 -403 678 1063 -325 -1903 -1077 1078 1183 -934 -2779 -1295 2044 2381 595 -1175 337
1297 337 2076 2193 908 725 1683 2010 350 -1068 632 2530 1251 -1074 -2263 -39 2218 1888
1313 1888 -702 -1174 675 1928 1020 184 512 1849 1350 -258 -1291 1029 2000 113 -2169 -2430 207
1330 207 1376 -22 -1988 -1962 -185 926 -228 -1217 -106 915 309 -1237 -410 863 1697 -555 -2458
1347 -2458 -1976 295 812 -866 -3006 -2081 -325 -61 -1384 -1597 -338 259 -5 -1501 -242 1169 1510
1364 1510 -638 -1900 -474 1439 1326 -616 -2106 -1140 460 384 -1196 -1221 -2 281 -190 -853 420
$$ packed form
1248b095m66K670J952j404k705n20K883K361j497k839q8J542R77j423j225R19
1264i58P01r74j895N28K871J188j862k111O08K879J677j543k104L61K077L15j488
1281B70o73J081L85j388j578Q26K155J05k117j845J484L339L37j786j770J512
1297C37J739J17j285j83R58L27j660j418J700J898j279k325j189K224K257l30
1313A888k590m72J849J253r08q36L28J337m99j608j033K320R71j887k282k61K637
1330B07J169j398j966K6J777J111j154r89J111J021o06j546Q27J273Q34k252j903
1347b458M82K271N17j678k140R25J756K64j323k13J259N97k64j496J259J411L41
1364A510k148j262J426J913j13j942j490R66J600p6j580k5J219K83m71o63J273
$$ plain form
1381 420 2009 1412 -497 -1060 926 2587 1777 -443 -1368 284 1205 288 -581 -361 788 611 -459
1398 -459 -509 1096 2231 1158 -697 -567 1443 2703 1380 -558 -219 1060 1419 -131 -847 -276 393
1415 393 -230 -1037 -1017 656 1122 -335 -1388 -364 1474 1739 268 -997 -177 1210 1241 -280 -678 -381
1433 -381 57 -858 -1749 -771 225 -73 -1461 -1919 -483 929 637 -777 -1412 -232 985 733 -524 -619
1451 -619 111 321 -824 -950 -280 620 -449 -2055 -1634 -198 756 -195 -1757 -1057 256 1173 590 -349
1469 -349 -92 1069 655 -205 -525 554 1516 -59 -1560 -1423 733 1045 -259 -1473 -860 675 1396
1486 1396 242 -285 465 1338 912 97 170 1200 1252 159 -1298 -387 1214 1123 -188 -1370 -331 1069
1504 1069 1151 -19 -388 640 1334 834 61 373 1304 1021 -187 -651 47 1154 625 -762 -1162 -144
$$ packed form
1381D20J589n97j909n63J986J661q10k220r25J652R21r17q69K20J149j77j070
1398d59n0J605J135j073j855J30K010J260j323j938L39J279L59j550p16N71O69
1415C93o23q07K0J673M66j457j053J024J838K65j471j265Q20J387L1j521l98K97
1433c81M38r15q91R78R96k98j388m58J436J412k92j414o35J180J217k52j257r5
1451f19P30K10j145j26O70R00j069j606M21J436R54r51j562P00J313R17n83r39
1469c49K57J161m14q60l20J079R62j575j501J37K156L12j304j214O13J535P21
1486A396j154n27P50Q73m26q15P3J030N2j093j457R11J601r1j311j182J039J400
1504A069Q2j170l69J028O94n00p73L12R31k83j208m64O98J107n29j387m00J018
$$ plain form
1522 -144 399 398 -705 -1026 32 478 -139 -444 58 939 401 -919 -690 650 1345 150 -1298 -897 41
1541 41 26 -664 -1404 -890 196 -202 -1096 -1032 116 513 236 -880 -388 891 918 -24 -1305 -702 534
1560 534 476 -644 -1209 -271 324 -220 -954 -566 337 603 5 -1085 -229 1504 1077 80 -638 178 1067
1579 1067 815 -100 -844 247 417 -191 -555 -98 451 478 -583 -748 531 1144 1036 -193 -350 764
1597 764 1254 800 15 -47 582 529 -32 -582 42 292 -39 -795 -950 261 1011 514 -619 -388 669 1412
1617 1412 455 -343 -180 741 829 -191 -174 371 182 -179 -1073 -648 144 401 -593 -1270 -748 516 574 -27
1637 -27 -499 -252 624 380 -101 -206 418 517 -375 -809 -556 394 146 -875 -1269 -247 254 284 -422 -713
1657 -713 338 551 17 -136 114 248 271 -565 -607 -7 355 8 -1106 -941 79 499 108 -517 -704 319
$$ packed form
1522a44N43jj103l21J058M46o17l05N02Q81n38j320K29J340O95j195j448M01R38
1541D1j5o90p40N14J086l98q94O4J148L97k77j116M92J279K7r42j281O03J236
1560E34n8j120n65R38N95n44p34L88R03K66n98j090Q56J733m27r97p18Q16Q89
1579A067k52r15p44J091J70o08l64M57N49K7j061j65J279O13j08j229j57J114
1597G64M90m54p85o2O29n3n61n50O24K50l31p56j55J211P50m97j133K31J057P43
1617A412r57p98J63R21Q8j020J7N45j89l61q94M25P92K57r94o77N22J264N8o01
1637b7m72K47Q76k44m81j05O24R9q92m34K53R50k48j021l94J022N01L0p06k91
1657g13J051K13n34j53K50J34K3q36m2O00L62l47j114J65J020M20l91o25j87J023
$$ plain form
1677 319 593 91 -187 464 863 586 -339 -302 750 828 55 -728 -361 483 518 -332 -782 -391 490 324 -161
1698 -161 -18 492 948 278 -283 182 760 839 -101 -514 129 816 570 -355 -164 -203 785 -91 -489 -140 293
1719 293 596 -208 -198 351 645 567 -616 -312 208 844 368 -874 -832 -202 289 -436 -617 -464 -7 7 -521
1740 -521 -450 -107 547 11 -499 -676 316 961 122 -401 -601 127 -18 -327 -875 -420 -213 -114 -738 -470 92
1761 92 163 -103 -1008 -412 454 684 -88 -271 71 674 247 -335 -300 116 249 -75 -470 -250 427 161 -234
1782 -234 -554 34 869 461 152 -117 435 599 648 -100 73 290 503 -178 -311 -32 616 387 33 -689
1802 -689 324 575 462 10 -143 493 583 428 -329 306 311 263 -287 -391 291 239 -286 -636 -833 -64 221
1823 221 -268 -936 -329 210 555 -108 -144 45 324 -93 -65 -521 205 265 -483 -595 -384 351 392 -473 -912
$$ packed form
1677C19K74n02k78O51L99k77r25L7J052P8p73p83L67Q44L5q50m50L91Q81j66m85
1698a61J43N10M56o70n61M65N78P9r40m13O43O87k46r25J91l9R88q76l98L49M33
1719B93L03q04J0N49K94p8j183L04N20O36m76j242M2O30M91p25j81J53M57J4n28
1740e21P1L43O54n36n10j77R92O45q39n23k00P28j45l09n48M55K07R9o24K68N62
1761I2P1k66r05N96Q66K30p72j83L42O03m27n82L5M16J33l24l95K20O77k66l95
1782b34l20N88Q35m08l09k69N52J64M9p48J73K17K13o81j33K79O48k29l54p22
1802f89J013K51j13m52j53O36R0j55p57O35Nm8n50j04O82n2n25l50j97P69K85
1823B21m89o68O07N39L45o63l6J89K79m17K8m56P26O0p48j12K11P35M1q65m39
$$ plain form
1844 -912 -329 -90 -33 -419 -162 -175 528 140 -205 55 420 608 103 -309 -54 332 273 -344 -785 194 86
1865 86 192 -2 -259 206 171 -22 -363 36 480 279 -215 -413 115 668 237 -372 -388 499 242 -15 -368
1886 -368 -174 175 366 100 -61 408 961 288 -89 334 705 663 176 -123 -86 237 273 -89 -214 -18 252
1907 252 -640 -473 -520 86 255 -168 -405 -16 359 520 116 -315 324 406 334 -320 187 -195 191 -244 -578
1928 -578 -326 156 223 -291 -341 -159 116 250 -119 -70 35 624 35 -75 -152 27 174 -116 -549 -215 343
1949 343 -172 -275 -367 227 554 -200 -227 -162 265 382 -26 69 105 180 362 -98 -348 -100 -32 176 -674 -291
1971 -291 276 425 -31 -535 -208 245 649 -6 -80 396 280 24 -275 23 181 272 -90 -509 -133 179 185
1992 185 -176 -229 -36 252 -47 -506 -94 190 352 152 -226 373 159 208 -74 -440 321 163 -28 -385 -157
$$ packed form
1844i12N83K39N7l86K57j3P03l88l45K60L65J88n05m12K55L86n9o17m41R79j08
1865H6J06j94k57M65l5j93l41L99M44k01m94j98N28N53m31o09j6Q87k57k57l53
1886c68J94L49J91k66j61M69N53o73l77M23L71m2m87k99L7L23L6l62j25J96K70
1907B52q92J67m7O06J69m23k37L89L75J61m04m31O39Q2p2o54N07l82L86m35l34
1928e78K52M82O7n14n0J82K75J34l69M9J05N89n89j10p7J79J47k90m33L34N58
1949C43n15j03r2N94L27p54k7O5M27J17m08R5L6P5J82m60k50K48O8K08q50L83
1971b91N67J49m56n04L27M53M04o55p4M76j16k56k99K98J58R1l62m19L76L12O
1992A85l61n3J93K88k99m59M12K84J62k00l78N99k14M9k82l66P61j58j91l57K28
$$ plain form
2013 -157 -31 97 290 -136 -419 121 238 57 117 -23 380 260 -302 -296 370 476 -168 -490 -106 346 272
2034 272 -272 -305 -350 249 128 -348 -137 472 36 197 -106 318 303 -33 7 -381 -306 58 122 -65 -574 -44
2056 -44 216 -216 -186 -471 228 298 -31 -107 -26 550 35 -145 -280 119 475 -7 -88 -259 53 134 -248 -278 -223
2079 -223 111 181 -113 -62 -172 262 208 -319 -172 43 429 33 5 40 184 89 -247 -147 -183 340 -220 -255 -209
2102 -209 531 -6 142 -113 59 328 166 -90 21 285 50 123 21 -223 -224 98 -133 -243 -140 120 213
2123 213 -179 -181 -461 368 245 -200 -312 33 221 -27 -255 -123 64 221 -275 29 110 329 294 -180 -179 -127
2145 -127 438 155 -80 -281 94 247 52 -3 260 131 230 -442 -325 271 89 214 -280 54 -46 204 -45
2166 -45 86 -125 96 244 72 -139 3 180 104 -340 -192 295 210 126 -35 -44 77 248 -402 -397 -463 339 278
$$ packed form
2013a57J26J28J93m26k83N40J17j81O0j40M03j20n62OO66J06o44l22L84M52p4
2034B72n44l3m5N99j21m76K11O09m36J61l03M24j5l36M0l88P5L64O4j87n09N30
2056d4K60m32L0k85O99P0l29p6Q1N76n15j80j35L99L56m82q1j71L12Q1l82l0N5
2079b23L34P0k94N1j10M34n4n27J47K15L86l96k8L5J44r5l36J00l6N23n60l5M6
2102b09P40n37J48k55J72K69j62k56J11K64k35P3j02k44jL22k31j10J03K60R3
2123B13l92kk80Q29j23m45j12L45J88k48k28J32J87J57m96L04Q1K19l5m74JN2
2145a27N65k83k35k01L75J53j95n5K63j29R9o72J17N96j82J25m94L34j00K50k49
2166d5J31k11K21J48j72k11J42J77p6m44J48M87q5q4j61rJ21J71o50No6Q02o1
$$ plain form
2189 278 -262 -186 152 342 -79 -110 119 49 80 -45 -451 35 90 201 -252 -397 -290 -234 -183 -189 -229 292 356 -200
2213 -200 -27 51 390 -67 -120 -510 218 9 335 9 -94 58 23 -177 -72 55 -28 303 -13 -98 369 306
2235 306 140 -142 217 355 249 -12 106 14 129 227 -104 -206 -40 -144 -169 0 -107 50 51 125 -168 375
2257 375 301 118 -145 146 -187 272 -89 -200 -204 -171 -49 -125 -171 -44 -115 234 -194 -278 206 196 95 -320 -399
2280 -399 -29 213 253 -141 -117 27 23 -263 -85 -229 -136 -118 -44 -94 1 398 154 200 -171 80 47 28 -109 -20
2304 -20 380 295 121 -84 169 -176 -196 -300 20 46 115 252 -56 -143 -195 140 223 -58 255 418 -81 -105 -139
2327 -139 188 4 -13 -233 -176 188 -68 -132 -237 67 493 -202 -215 -214 -48 173 -112 -56 27 151 122 -64 -55 -204
2351 -204 -134 120 -98 -230 179 34 -59 -447 -78 31 -140 89 -374 -155 113 -10 -148 53 193 58 -350
$$ packed form
2189B78n40P6L38J90m21l1K29p0L1j25m06M86N5J11m53j45J07N6N1om0N21O4n56
2213b00J73P8L39m57n3l90P28k09L26l26j03J52l5k00J05J27q3L31l16q5M67o3
2235C06j66k82L59J38j06k61J18r2J15R8l31j02J66j04k5J69j07J57JP4k93N43
2257C75p4j83k63K91l33M59l61j11mL3J22p6m6J27p1L49m28q4M84j0j01m15p9
2280c99L70K42M0l94K4J44mk86J78j44R3J8P4n0R5L97k44M6l71K51l3j9j37Q9
2304b0M00q5j74k05K53l45k0j04L20K6O9J37l08q7n2L35Q3k81L13J63m99k4l4
2327a39L27j84j7k20N7L64k56o4j05L04M26o95j3JJ66K21k85N6Q3J24k9j86Rj49
2351b04P0K54k18j32M09j45r3l88L69J09j71K29m63K19K68j23j38K01J40j35m08
$$ plain form
2372 -350 15 -156 -178 -156 -55 1 43 313 -115 -124 252 158 283 31 -97 88 35 -68 -27 -320 -137 209 -122
2395 -122 -499 47 61 104 -80 31 -205 427 137 -56 35 -112 49 167 -86 156 -34 219 -121 144 -140
2416 -140 40 -161 -201 63 -218 4 162 -1 71 -26 245 166 20 -301 292 -87 -415 -181 -109 -5 108 124
2438 124 -226 -81 265 80 -86 -65 57 90 -169 99 -12 148 1 -118 -360 7 515 -229 -56 226 -79
2459 -79 52 44 -238 -10 200 -71 -286 -9 142 105 -8 60 298 33 136 152 173 264 -105 219 -136 -169 210
2482 210 201 -157 -59 -232 -60 10 -96 -182 -195 -368 247 -87 -530 -137 -179 -83 -293 11 91 4 -145 34 -227
2505 -227 96 94 -312 -128 106 -217 495 266 -123 -229 93 100 17 -124 292 -72 40 -257 -220 -104 -190 -213 22
2528 22 -226 -89 330 -245 155 373 -71 22 135 46 213 373 102 133 -3 174 -69 166 -172 210 141 32
$$ packed form
2372c50L65j71k2K2J01N6M2K70m28rL76r4J25k52j28J85n3j03M1k93J83L46l31
2395a22l77N46J4M3j84J11k36O32k90j93R1j47J61J18k53K42j90K53l40K65k84
2416a40J80k01m0K64k81K22J58j63P2r7K71p9j46l21N93l79l28K34P2J04J13J6
2438A24l50J45L46j85j66K1J22L3k59K68j11J60j47j19k42L67N08p44J73K82l05
2459g9J31qk82K28K10k71k15K77J51l7j13O8K38k65J03J6K1R1l69L24l55l3L79
2482B10rl58R8j73J72P0j06q6j3j73O15l34m43L93m2R6k10L04Q0q7j49J79k61
2505b27L23km06J84K34l23P12k29l89j06L22Pq3j41M16l64J12k97L7J16q6k3K35
2528B2k48J37M19n75M00K18m44R3J13q9J67J60k71L1j36J77k43K35l38L82o9j09
$$ plain form
2550 32 -334 113 166 -92 -241 -165 -163 -102 282 49 -163 115 -111 73 7 -17 -38 5 -141 -251 330 253 -105 -149
2574 -149 -149 33 177 146 -247 37 -154 127 -284 -69 -254 141 -166 -6 49 230 -135 -72 172 5 31 75
2596 75 -220 128 52 55 179 215 -166 249 -46 39 -238 -132 -118 -31 -273 -586 220 144 128 57 104 119 77 23 166
2621 166 154 198 -102 189 48 -266 169 267 209 -190 -107 267 68 18 -156 232 -5 -120 -85 -56 234 205 114
2644 114 -49 67 96 -7 -83 57 -56 -33 -84 -194 195 87 -111 45 171 -54 -29 42 -96 267 255 -269
2666 -269 376 -221 -144 -127 7 132 -32 141 47 267 -197 101 -29 -52 171 -123 -57 503 10 -144 -87 30
2688 30 328 372 169 -229 169 -113 -179 -82 138 -195 -84 -253 -159 57 51 -18 -120 -7 174 162 326 -96 -26
2711 -26 -54 104 -35 -167 -58 120 441 3 250 -44 52 20 -297 147 -23 258 146 -48 -2 -74 79 223
$$ packed form
2550C2l66M47N3k58j49P6KO1L84k33k12K78k26J84o6k4k1M3j46j10N81p7l58m4
2574a49%J82J44l1l93K84j91K81m11K15j85L95l07J60N5J81l65O3K44j67K6M4
2596G5k95L48p6LJ24L6l81M15k95Q5k77J06J4Q7k42l13Q06p6j6p1M7J5m2n4J43
2621A66j2M4l00K91j41l14M35R8n8l99Q3L74j99n0j74L88k37j15L5K9K90k9r1
2644A14j63J16K9j03p6J40j13K3n1j10L89j08j98J56J26k25K5P1j38L63j2n24
2666b69O45n97P7J7J34J25j64J73r4K20m64K98j30k3K23k94O6N60m93j54N7J17
2688C0K98M4k03l98L98k82o6R7K20l33J11j69R4K16oo9j02J13J81j2J64m22P0
2711b6k8J58j39j32J09J78L21m38K47k94R6l2l17M44j70K81j12j94M6p2J53J44
$$ plain form
2733 223 -21 -26 90 -86 -43 -30 144 147 143 129 -147 44 70 -167 -64 72 112 392 -159 261 383 -130 1 -216
2757 -216 62 -69 -138 0 82 -216 -112 316 -40 -35 166 9 -286 78 -236 125 222 -12 -269 70 -56 40
2779 40 -77 256 19 149 379 0 115 -105 303 -167 -89 -341 -316 -239 19 -247 -56 17 100 94 -91 -121 30
2802 30 -65 -19 -81 27 16 131 105 -124 42 262 -231 -342 93 -37 249 -285 -9 -77 18 159 -287 167 160
2825 160 99 -64 -262 234 145 225 -92 -148 3 221 144 34 142 318 -53 184 35 -98 121 -202 -96 -162
2847 -162 75 -83 57 -69 -7 -31 25 -65 236 -365 -122 -303 -87 -177 109 196 185 49 266 128 -278 341
2869 341 -144 150 207 99 45 -60 -244 -255 -1 -51 -251 180 -207 -195 -76 -112 54 -131 -184 -143 6 241 -123
2892 -123 17 252 -90 -50 102 -173 -37 -109 49 -195 69 -20 -32 223 -117 -11 -101 88 -92 97 192 318
$$ packed form
2733B23k44nJ16j76M3J3J74Lmj4k76J91K6k37J03J36M0K80n51M20J22n13J31k17
2757b16K78j31o9J38Q2k98J04M28l56NK01j57k95L64l14L61R7k34k57L39j26R6
2779D0j17L33k37J30K30l79J15k20M08m70P8k52K5P7K58k66J91P3Q3oj85l0J51
2802C0r5M6o2J08j1J15k6k29J66K20m93j11M35j30K86n34K76o8R5J41m46M54p
2825A60o1j63j98M96q9Q0l17n6J51K18p7j10J08J76l71K37j49j33K19l23J06o6
2847a62K37j58J40j26O2k4N6r0L01o01K43j81K16r0K86Q7j1j36K17j38m06O19
2869C41m85K94N7j08n4j05j84j1K54n0k00M31l87J2J19l6J66j85n3M1J49K35l64
2892a23J40K35l42M0J52k75J36p2J58k44K64q9j2K55l40J06r0J89j80J89R5J26
$$ plain form
2914 318 -140 -46 83 192 413 22 -75 -11 101 7 8 147 -373 65 -51 52 -223 106 -132 -223 -189 250 217
2937 217 -193 146 200 -80 -7 -56 -337 104 162 224 -129 29 143 -27 207 113 55 167 -87 96 -83 -134 -5
2960 -5 50 80 -89 -85 51 -37 -109 -163 -194 -108 -3 182 -66 18 -241 -271 -203 35 -121 104 45 35 170 -63 -33 -7
2986 -7 87 116 188 -292 70 -41 254 -190 -115 -214 155 -152 159 -266 -21 245 76 -254 236 -58 90 -17
3008 -17 141 260 30 50 250 -188 243 -33 -94 -13 -101 -100 312 98 -218 195 99 226 1 -9 -36 296 -45
3031 -45 -81 -474 -238 -17 -52 91 98 62 11 -34 13 -67 -13 259 -117 239 -241 121 78 -112 -173 -123 143 -183 -113
3056 -113 -88 170 -75 -89 -19 -5 -54 198 -100 23 258 -21 334 105 -180 -93 -45 -45 73 -249 -64 70 45
3079 45 282 -440 18 -110 155 -396 15 -23 -17 -225 -97 -240 106 -173 -184 -220 -150 3 -10 -147 -66 -74 109 -64
$$ packed form
2914C18m58R4J29J09K21l91r7O4J12r4JJ39n20M38j16J03k75L29k38r1L4M39l3
2937B17m10L39N4k80P3m9k81M41N8O2l53J58J14j70K34r4n8J12k54J83j79n1J29
2960eN5L0j69MJ36q8p2n4l1Q6J05J85k48Q4k59l0O8K38j56K25n9j0J35k33L0K6
2986gR4K9P2m80L62j11K95m44P5r9L69l07L11m25K45K66j69l30M90k94J48j07
3008a7J58J19k30K0K00m38M31k76o1Q1q8JM12k14l16M13r6J27k25j0k7L32l41
3031d5l6l93K36K21l5J43Pl6n1m5M7q0N4K72l76L56m80L62m3j90o1N0K66l26P0
3056a13K5K58k45j4P0J4m9K52k98J23K35k79L55k29k85Q7M8%J18l22J85J34k5
3079D5K37p22M58j28K65n51M11l8Ok08J28j43L46k79j1l6P0J53j3j37Q1qJ83j73
$$ plain form
3103 -64 27 210 -107 6 246 151 -19 64 121 -89 -253 -165 -162 97 45 -101 18 11 -62 116 -123 -123 -10 -72 -62
3128 -62 25 192 -247 112 51 204 228 -107 155 169 53 -207 -95 -90 250 26 -66 293 62 258 84 -179 1
3151 1 -86 5 175 -282 112 -68 -185 99 -172 283 142 32 -45 -93 -136 -47 -216 -49 -33 -348 -235 -69 -22
3174 -22 -19 296 45 -153 -57 17 -251 -24 -126 30 183 -114 -179 -143 143 33 -224 318 149 -174 78 11 119
3197 119 -8 16 122 88 -221 -7 -428 15 109 -146 -67 -63 68 -7 -78 -55 -37 -5 42 85 39 -29 116 92 -34
3222 -34 -64 260 102 139 -222 75 0 297 147 29 -305 75 -10 113 144 3 -122 -57 -129 -19 168 158 -69
3245 -69 269 -23 -329 -14 92 104 -159 465 -248 -105 138 59 -60 49 -60 66 -7 145 131 70 50 -145
3267 -145 0 26 -96 209 63 16 99 -34 -102 110 -71 39 -21 37 246 103 -6 -56 105 119 27 -21 -72 -171
$$ packed form
3103f4R1J83l17J13K40r5j70Q3N7k10j64Q8LK59n2j46J19pp3J78k39%J13o2J0
3128f2Q7J67m39L59o1J53K4l35K62J4j16k60J12NL40k24r2L59k31J96j74k63J80
3151Aq7R1J70m57L94j80j17K84k71M55j41j10p7m8m3Q9j69J67J6l15J13J66M7
3174b2LL15k51j98R6P4k68K27j02J56J53k97o5L6K86j10k57N42j69l23K52o7J08
3197A19j27K4J06l4l09K14m21M43R4k55P9MJ31p5p1K3J8L2M7M3m6o8J45k4j26
3222c4l0L24j58L7l61K97p5K97j50j18l34L80q5J23L1j41j25O5p2J10J87j0k27
3245f9L38k92l06L15J06J2k63O24p13J43K43p9j19J09j09J26p3J52j4o1k0j95
3267a45J45K6j22L05j46m7Q3j33o8K12j81J10o0N8K09j43j09n0J61J4r2m8n1r9
$$ plain form
3291 -171 106 -34 266 -57 85 61 124 95 -255 -103 -255 -206 198 -159 -159 -176 137 -106 -29 30 -231 -40 135
3314 135 70 -149 134 20 11 -52 122 207 63 -232 381 -169 -130 139 -196 -174 -97 -245 29 -17 -255 -107 -25
3337 -25 288 177 255 -6 -17 -81 110 40 -192 -13 -94 64 -49 47 75 73 184 -144 57 -183 67 98 -3 -234
3361 -234 -38 -41 249 24 -121 50 87 178 185 -118 147 81 122 142 23 -51 -150 -172 -248 -13 -96 255 -91 -69 193
3386 193 -44 91 28 -66 -82 -194 -54 -179 -118 -116 -84 -161 -75 152 75 157 -55 -117 13 -165 47 -182 5 325
3410 325 216 231 -83 -272 425 20 -416 -113 -180 -161 -91 381 -175 -71 262 -351 136 205 154 -76 -94 60
3432 60 -164 187 -79 43 116 42 -25 -231 -80 -155 297 131 164 -124 -239 96 129 141 147 -82 161 -69 -106 -68
3456 -68 64 343 -65 93 0 -34 139 122 -25 -43 26 -262 -100 48 96 52 72 125 -47 -153 -157 -338 -228 -31
$$ packed form
3291a71K77j40L00l23J42k4O3k9l50J52j52M9M04l57%j7L13k43P7N9k61J91J75
3314A35o5k19K83j14ro3J74Q5j44k95O13n50L9K69l35K2P7j48K74m6k38J48Q2
3337b5L13j11P8k61j1o4J91p0k32J79q1J58j13R6K8kJ11l28K01k40K50L1j01k31
3361b34J96lK90k25j45J71L7R1Pl03K65o6M1K0j19p4r9k2p6K35q3L51l46K2K62
3386A93k37J35o3r4j6j12J40j25O1KL2p7Q6K27p7Q2k12o2J30j78K12k29J87L20
3410C25j09J5l14j89O97m05m36L03o7J9P0M72n56J04L33o13M87O9n1k30j8J54
3432F0k24L51k66J22P3p4o7k06J51p5M52j66L3k88j15L35L3J2Ok29K43k30l7L8
3456f8J32K79m08J58r3l4J73j7j47j8O9k88J62J48M8m4K0N3j72j06mj81J10J97
$$ plain form
3480 -31 -161 -336 -67 46 385 148 -185 -143 -49 -230 -9 -204 157 -56 51 118 -298 110 -77 -89 -203 -137
3502 -137 -168 86 96 246 -13 -24 32 296 143 75 -192 -74 -105 34 271 16 76 127 -14 82 157 -87 37
3525 37 -15 65 -185 213 110 394 -207 -168 9 208 -110 167 -89 143 -98 -59 84 -222 288 -141 -24 139
3547 139 266 -34 -37 -28 276 54 -353 -88 61 113 -174 324 6 53 -28 -100 -237 -170 -117 23 -109 45 -14 174
3571 174 -23 -181 181 207 149 126 -223 -188 93 -79 196 -187 -158 -153 -207 126 25 94 -135 74 -45 39 -248
3594 -248 -120 -70 21 120 24 0 444 -21 -47 9 -374 71 -115 31 -46 161 -223 -122 -16 178 -73 -52 -45 -39
3618 -39 -7 -58 75 68 129 -133 186 -59 -16 219 -136 -130 58 -36 -172 169 97 -33 158 -135 2 400 108 217
3642 217 197 128 177 -173 30 -222 -94 -87 -49 -272 -78 368 94 115 -104 -202 -195 169 -154 -120 -285 -112 -31 -67
$$ packed form
3480c1j30j75K69J13L39k37l33M2R4j81K21j95L61k13J07O7m16M08j87j2j14O6
3502a37l1K54J0J50k59j1N6K64j53o8k67J18l1J39K37k55O0N1j41R6P5k44J24
3525C7n2Q0k50L98j03K84o01L9J77J99l18K77k56K32k41L9J43l06N10m29J17J63
3547A39J27l00lRL04k22m07K65J49N2k87M98l18M7q1p2j37O7N3J40j32J54n9J88
3571A74j97j58L62K6n8k3l49L5K81j72K75l83K9Nn4L33j01O9k29K09j19Q4k87
3594b48J28N0R1R9r6k4M44m65k6N6l83M45j86J46p7K07l84J01J06J94k51K1PO
3618c9L2n1J33pO1k62L19k45M3K35l55OJ88r4j36L41p2j30J91k93J37L98k92J09
3642B17k0o9M9l50K03k52J28PL8k23J94M46k74K1k19r8PL64l23L4j65J73Q1l6
$$ plain form
3666 -67 -108 -35 -126 227 82 164 25 39 -102 203 197 -249 88 35 163 267 252 121 194 10 95 -235 -113 -37
3690 -37 -277 143 127 -18 59 -177 -37 -50 70 102 -56 -48 -169 332 -16 -98 70 -61 -51 188 -129 14 90
3713 90 -93 53 291 153 63 -125 25 0 225 103 148 209 170 33 -69 -163 144 346 -93 149 -10 -133
3735 -133 -97 130 77 -66 -8 -242 -11 166 -40 -104 29 -307 -227 -98 -367 -213 -48 -130 7 -48 44 -82 -125
3758 -125 99 -183 -18 6 -65 -139 -369 -325 -282 263 202 6 22 -125 -25 -100 100 -176 -6 21 108 195 49 -126
3782 -126 -152 81 -9 46 -141 28 322 141 125 166 -26 37 -194 43 -133 -125 -248 48 7 -219 -31 142 -16
3805 -16 317 -32 -180 -149 -200 136 165 17 -169 162 52 -84 98 164 -42 -18 -224 22 91 -123 -115 -6 90
3828 90 -8 -216 23 9 154 79 20 6 325 -8 18 -238 33 -39 71 -28 26 -115 3 86 153 125 -14 101
$$ packed form
3666f7m1P3r1L53j45Q2j39J4j41L05om46L37n3J28J04j5j31P3j84Q5l30J22P6
3690c7k40M20j6j45P7k36J40j3J20L2j58Qj21N01l48q2J68j31J0K39l17J43P6
3713I0j83J46K38j38r0j88J50k5K25j22M5O1l9j37j02r4L07K02m39K42j59j23
3735a33L6K27n3j43N8k34K31J77k06o4J33l36Q0J29k69J54J65q2J37n5R2j26m3
3758a25K24k82J65K4p1p4k30M4M3N45o1j96J6j47J00p5K00k76J70K7Q7Q7j46j75
3782a26k6K33r0N5j87J69K94j81j6M1j92O3k31K37j76Qj23K96m1k26J88J73j58
3805a6L33l49j48L1n1L36K9j48j86L31j10j36J82O6k06K4k06K46O9k14QJ09R6
3828I0r8k08K39j4J45p5n9j4L19l33K6k56K71p2J10r9N4j41J18Q3O7k8j39J15
$$ plain form
3852 101 -114 200 16 0 87 84 29 211 -279 -198 -10 132 118 21 84 164 5 140 62 59 -65 337 137 277
3876 277 -325 -138 69 -121 163 180 -138 -103 -10 135 -16 -68 -21 28 117 111 54 -215 -334 -2 29 103 -36 89
3900 89 -487 252 185 -83 -233 16 142 -273 35 33 160 73 194 108 -187 -311 191 9 47 -183 -134 -88 -34
3923 -34 -158 230 6 -62 16 66 -32 -122 -102 61 -165 -79 -78 139 69 281 -27 -149 154 -7 68 -148 44 30
3947 30 -51 -86 14 260 21 -100 -13 -223 109 4 13 36 43 -234 -143 50 -149 -103 174 -54 -16 -33 27 51 -323
3972 -323 -52 -8 -9 207 8 -206 -86 111 -35 -110 -143 100 146 -92 -152 38 7 -26 -71 -54 -116 128 -133 -95
3996 -95 134 146 236 138 278 -152 79 -124 -12 111 -27 149 79 -278 -358 -82 -155 134 -247 103 29 88 151
4019 151 -212 131 106 -189 -52 238 -10 -150 8 -303 -211 28 35 -66 -210 -77 146 148 80 121 -82 166 -163
$$ packed form
3852A01k15L14j84j6Q7ln5J82m90Q1J88J42j4r7O3Q0j59J35p8lj24M02k00J40
3876B77o02J87K07j90K84J7l18L5R3J45j51n2M7M9Q9on7k69j19L32L1P4j39J25
3900H9n76P39o7k68j50K49J26m15L08kJ27q7J21q6k95j24N02j82L8k30M9M6N4
3923c4j24L88k24o8P8N0r8r0K0J63k26Q6JK17p0K12l08j22L03j61P5k16J92j4
3947C0q1l5J00K46k39j21Q7k10L32j05RK3Pk77R1J93j99M6K77k28L8j7O0K4l74
3972c23K71M4jK16j99k14J20J97j46p5l3K43M6k38o0J90l1l3m5J7o2K44k61L8
3996i5K29J2R0r8J40m30K31k03J12J23j38J76p0l57q0K76p3K89l81L50p4N9O3
4019A51l63L43k5k95J37K90k48j40J58l11R2K39Pj01j44J33K23Ko8M1k03K48l29
$$ plain form
4042 -163 -100 41 69 -147 -125 141 -27 279 217 -64 0 -263 9 -72 134 -108 -85 -183 115 -128 -17 -178 -272
4065 -272 -294 42 -127 54 -124 -103 -23 -37 -160 -91 -65 -286 79 38 9 125 -15 -104 -25 -7 -242 -210 65 6
4089 6 -314 -166 62 176 99 68 87 -110 322 128 136 -186 -45 5 9 78 -61 -92 -164 415 26 -185 288 85
4113 85 -173 -16 -127 38 -107 29 -121 5 108 -271 121 101 89 -94 42 330 146 162 -74 -308 -174
4134 -174 48 84 -117 -87 13 10 93 86 291 160 -85 82 -74 -162 -30 -40 60 -58 -112 -91 380 2 -112 133
4158 133 53 -284 81 86 -171 -319 144 51 -237 -212 291 -193 -54 368 90 -94 -285 46 6 108 33 90 -2
4181 -2 21 59 178 191 23 -42 34 -63 187 182 263 -342 -192 -202 112 48 -85 123 -190 206 -264 248 -194 -108 60
4206 60 -254 -86 94 24 -69 49 -368 -246 152 -211 84 -67 16 186 147 64 3 -66 -103 253 142 -26 -184
$$ packed form
4042a63O3J41K8k16K2K66j68L06o2k81O4k63K72q1K06k42K3r8K98k43J11j61r4
4065b72k2L36j69J81j78K1Q0j4j23O9K6k21L65m1k9J16j40q9P9J8k35L2K75n9
4089Fl20J48K28J14p7l1J9j97M32j94Ql22J41N0MO9j39l1p2N79l89k11M73k03
4113H5k58J57j11J65j45J36j50J26J03l79L92k0j2j83J36K88j84J6k36k34J34
4134a74K22L6k01L0J00lQ3pK05j31k45J67j56q8J32j0J00j18n4K1M71l78j14K45
4158A33q0l37L65Nk57j48M63r3k88K5N03m84J39M22k78j84j91L31m0J02p5N7r2
4181bK3L8J19J3j68o5P6r7K50nQ1o05J50j0L14o4j33K08l13L96m70N12m42Q6J68
4206F0l14J68J80p0r3J18m17J22L98l63K95j51Q3J70l9q3o1o9l7L56j11j68j58
$$ plain form
4229 -184 -67 68 -18 53 -131 38 -204 -79 168 249 -222 -109 -124 -171 -48 87 -78 161 -72 -268 -141 402
4251 402 -9 -116 58 -126 -243 127 -51 21 -64 325 -149 74 -39 -172 -189 -134 142 -28 -89 53 -205 -155
4273 -155 134 -203 206 382 81 -120 -93 -182 5 44 79 -195 114 -63 -17 -110 135 -104 86 -25 5 394
4295 394 2 -258 52 -32 -118 -225 -225 -266 -23 212 156 -39 141 5 -5 -7 156 41 47 -285 49 36 221 51
4319 51 -132 -150 59 130 236 17 182 -116 364 141 -112 -54 -251 -68 186 -132 -16 53 15 -45 -281 50
4341 50 -49 70 269 59 -121 84 135 -37 83 81 66 149 -418 118 117 -138 -462 -254 -138 -72 -67 -139 -106 316 -96
4366 -96 210 67 -145 -91 -155 -55 -117 -248 -5 -26 -128 -77 37 85 -37 153 -110 -389 -76 -118 -87 276 228
4389 228 -67 -33 200 -178 216 116 51 102 174 235 56 -46 -98 248 -75 -189 -23 -6 39 -72 29 175 89
$$ packed form
4229a84J17J35q6P1j84J69k42J25K47Q1m71J13j5m7J23J35j65K39k33j96J27N43
4251D02m11j07J74j84j17L70j78P2q5L89m74K23j13j33j7N5K76j70o1J42k58N0
4273a55K89l37M09J76l01k01K7q9J87L9L5k74L09j77M6r3K45k39J90j11L0L89
4295C94l92k60L10q4q6j07%m1K43K35n6j95J80j36j0kJ63j15Ol32L34j3J85j70
4319E1j83j8K09P1J06k19J65k98M80k23k53N8j97J83K54l18J16O9l8o0k36L31
4341E0r9J19J99k10j80K05N1j72J20kj5Q3n67N36jk55l24K08J16O6Np2L3M22m12
4366i6L06j43k12N4o4J00o2j31K43k1j02N1J14M8j22J90k63k79L13m2L1L63m8
4389B28k95L4K33l78L94j00o5N1P2O1j79j02n2L46l23j14J66J7M5j11J01J46q6
$$ plain form
4412 89 -249 41 45 77 -141 217 -181 107 -41 12 237 -6 -120 357 51 30 -255 -136 197 -273 -10 87
4434 87 198 -55 -194 204 -50 8 -52 -250 88 69 -92 155 -57 40 118 81 -86 172 -60 215 72 20 139
4457 139 106 43 -181 -15 -10 -81 -277 170 141 33 -30 -193 92 145 29 89 -63 145 79 -222 -133 171 -89 18
4481 18 123 -183 146 50 105 -247 100 115 -4 225 -15 -25 40 83 -16 82 -83 38 156 -256 65 -232 16
4504 16 -66 -2 -153 -89 -186 14 -334 40 -129 -5 -202 -278 99 173 -146 -138 41 -31 100 -64 125 -29 -24 156
4528 156 -283 57 88 294 -47 -412 -319 -65 -154 -127 -131 4 150 1 -207 6 -159 95 14 191 289 18 -159
4551 -159 -14 133 -336 -70 -89 171 102 -144 39 -58 -158 39 343 -106 -208 -330 -138 571 -121 70 78 -244
4573 -244 11 81 26 80 -250 37 45 80 -226 117 44 111 -43 -88 -29 261 -2 78 60 -242 87 -90 -4 -191
$$ packed form
4412H9l38K90ML2k18L58l98K88j48N3K25k43j14M77l06k1k85J19L33m70K63R7
4434H7J11k53j39L98k54N8o0j98L38j9j61K47k12R7P8l7j67K58k32K75j43n2J19
4457A39l3o3k24J66Np1j96M47k9j08o3j63K85N3j16O0j52K08o6l01Q9L04k60J07
4481A8J05l06L29r6N5l52L47J5j19K29k40j0O5M3r9R8j65J21J18m12L21k97K48
4504A6q2O4j51O4r7K00l48L74j69J24j97p6L77P4l19QJ79p2J31j64J89j54NJ80
4528A56m39L40L1K06l41l65R3K54q9K7mJ35J46j49k08K13j65K54q1J77R8k71j77
4551a59J45J47m69K66j9K60o9k46J83r7j00J97L04m49j02j22J92P09o92J91Ql22
4573b44K55P0n5N4l30K87QL5l06L43p3O7j54m5N9K90k63Q0j8l02L29j77Q6j87
$$ plain form
4597 -191 9 138 121 13 -71 105 -121 -244 220 224 15 -186 -24 -93 78 -208 -119 -35 -32 2 198 -299 149
4620 149 -53 -316 147 97 -213 -132 9 130 -46 90 129 -348 57 -243 200 100 103 -115 -208 -64 112 239
4642 239 -161 96 197 76 -48 72 -6 -82 37 -167 179 55 250 170 -90 15 -93 239 81 -92 96
4663 96 7 91 -6 120 -219 -196 -134 5 91 7 71 -262 55 91 285 -66 163 -29 45 253 2 94 112 115 -100
4688 -100 -82 20 179 202 215 34 117 40 115 57 -97 -25 -46 56 -92 62 -185 58 -162 62 -378 -195 212
4711 212 64 55 16 84 -325 62 241 -137 -424 41 -241 126 -23 -255 -222 -222 126 -174 -52 328 128 20
4733 20 115 -96 -203 -95 -193 -104 44 -119 -130 152 -43 -37 -402 69 75 91 67 -123 41 -87 -137 82 -59 -87
4757 -87 325 41 -93 177 136 274 183 3 253 120 -66 -89 -45 62 236 -19 -59 74 -39 -210 -195 124
$$ packed form
4597a91K00J29j7j08q4J76k26j23M64Mk09k01J62o9J71k86Q9Q4LL4J96m97M48
4620A49k02k63M63n0l10Q1J41J21j76J36L9m77M05l00M43j00Lk18r3J44J76J27
4642B39m00K57J01j21j24J20p8p6J19k04L46j24J95q0k60J05j08L32j58j73J88
4663I6q9Q4r7J26l39K3O2J39Q6q4O4l33L17L6J94l51K29j92P4K08k51R2J8Lk15
4688a00J8J02J59K3J3j81Q3p7P5n8j54P2k1J02j48J54k47K43k20K24m40J83M07
4711B12j48rl9O8m09L87J79l78k87M65k82L67j49k32L3%L48l00J22L80k00j08
4733B0R5k11j07J08r8Q9J48j63j1K82j95Ol65M71OJ6k4j90J64j28n0K19j41k8
4757h7M12k84j34K70m1J38r1j80K50j33j86k3M4J07J74k55m0J33j13j71J5L19
$$ plain form
4779 124 222 8 -172 -145 24 -522 -11 -116 -78 161 -66 -63 9 15 87 -165 52 121 -238 -199 -87 130 -140 -121
4803 -121 61 -28 -265 -29 122 -63 58 103 75 202 218 299 -215 -57 55 73 -118 41 64 -80 -185 -76
4825 -76 224 113 74 32 45 40 -134 38 -218 111 113 -11 78 35 29 75 -68 116 -10 212 65 57 182 -11 40
4850 40 -183 -83 45 132 10 332 -188 -130 -253 -41 -70 -26 -136 69 -95 83 -138 50 -17 -5 130 63 72
4873 72 173 -160 -308 -16 14 39 -21 -417 -286 46 19 208 27 153 -30 -127 116 -192 -40 -133 -214 -167 -272
4896 -272 -206 82 -91 -20 58 34 83 50 -53 -24 -48 -156 15 127 -203 -192 76 20 -305 252 300 30 231 330
4920 330 -130 69 -92 -162 90 139 -235 -102 1 200 207 70 -331 149 -45 -25 211 261 147 77 -15 121 -41
4943 -41 -86 -58 59 -129 -243 -39 -145 173 -229 22 -228 61 143 -191 48 -178 -106 -127 81 -150 18 -87
$$ packed form
4779A24R8k14j80K7J69n46N11j05L8K39k27LP2OP2k52K17O9l59L9J12K17k70J9
4803a21J82q9k37K36J51j85J21M5k8J27J6Q1n14J58J12J8j91J59K3j44j05J09
4825g6L00j11l9m2J3nj74J72k56L29Kj24Q9m3oM6j43J84j26K22j47qJ25j93N1
4850D0k23J00J28Q7j22L22n20N8j23K12k9M4j10K05j64J78k21J88o7J2J35o7R
4873G2J01l33j48K92L0K5o0l96J31L32k7J89j81J26j83r7K43l08J52r3q1M7j05
4896b72O6K88j73P1P8k4M9l3j03K9k4j08J71J12l30J1K68n6l25N57M8k70K01R9
4920C30m60J99j61p0K52M9l74J33J03J99Pj37m01M80j94K0K36N0j14p0r2J36j62
4943d1m5K8J17j88j14K04j06L18m02K51k50K89Q2l34K39k26P2k1K08k31J68j05
$$ plain form
4965 -87 -152 -148 4 -6 367 261 56 164 99 -7 -134 15 -207 -2 -199 -138 57 -59 -14 -331 2 -127 -59
4988 -59 -89 -44 -171 -48 56 -221 -59 -156 -173 -357 -24 -222 72 150 114 323 -27 23 111 115 -231 45 18 92
5012 92 -534 -224 -9 -67 48 -465 43 -38 -70 255 140 37 -5 10 200 148 89 -34 306 98 111 -224 137
5035 137 158 94 -158 -63 -18 65 -40 -17 -63 78 -144 -144 -297 -290 -167 66 14 288 -46 249 281 394 29 -12 -295
5060 -295 -66 -153 101 -48 -102 96 -102 35 432 -278 89 -137 -6 74 -179 -214 -150 194 154 -77 -208 227
5082 227 404 66 37 62 212 -13 3 97 -208 53 -139 73 -58 -150 207 59 -257 97 167 25 -140 -176
5104 -176 -83 52 -19 -16 122 112 208 197 76 -314 289 -65 -38 -137 -17 35 -156 63 73 -1 251 4 176 -90
5128 -90 -120 -348 -189 -139 128 -16 163 -136 126 161 62 -30 -16 64 73 18 -17 -405 347 32 -115 47 -237 10
$$ packed form
4965h7o5MJ52j0L73j06k05J08o5j06j27J49k22K05j97O1J95j16M5l17L33j29O8
4988e9l0M5j27J23J04k77J62r7j7j84L33j98K94P8l6K09l50N0Q8Ml46K76k7P4
5012I2o26L10K15n8J15n13N08q1l2L25j15j03m2J5J90n2n9j23L40k08J3l35L61
5035A37K1o4k52R5M5Q3j05K3m6J41k22%j53PJ23K33n2K74l34K95L2J13l65m1k83
5060b95K29q7K54j49n4J98j98J37L97p10L67k26J31Q0k53l5O4L44m0k31j31M35
5082B27J77l38k9K5J50k25J6R4l05K61j92K12j31r2L57j48l16L54P0j42j65l6
5104a76R3J35p1LJ38j0R6j1j21l90O03l54K7r9J20N2j91K19J0p4K52k47J72k66
5128i0l0k28J59N0K67j44J79k99K62L5r9r2J4Q0Rn5l5l88P52l15j47J62k84K47
$$ plain form
5152 10 -367 36 253 285 -162 -20 -40 -221 -296 -308 -140 243 -214 -187 -100 154 22 42 -29 77 95 -17 -287
5175 -287 148 117 -96 -43 167 -3 72 177 -25 452 -179 4 387 -29 -96 91 -19 -114 -208 38 -160 35
5197 35 -85 2 52 143 -196 -76 114 111 -125 7 162 -16 78 -90 28 -86 -97 102 128 -38 406 -362 119
5220 119 151 -175 -347 -193 80 -223 -130 100 -167 -101 -110 -35 60 -239 78 37 99 241 78 237 -77 29 -282
5243 -282 206 -120 199 -83 -7 -103 -31 -242 -6 -45 -147 -13 13 24 46 244 -258 -104 -57 -37 -124 -2 119
5266 119 -3 -84 -205 147 90 237 84 -69 27 54 -27 -184 -143 -54 -4 108 31 -108 -100 27 94 229 -157 -169
5290 -169 -36 216 -125 -75 301 -139 0 -238 -69 119 -57 103 -234 -110 -193 397 53 -51 -293 130 115
5311 115 55 -22 -73 70 166 209 -281 -176 -56 197 143 -59 93 -169 222 -258 -19 -318 277 -171 269 -116
$$ packed form
5152A0l77M03K17L2m47J42k0j81p5j2J68L83m57K7Q7K54j32K0p1J06J8j12k70
5175b87M35l1k13N3K10j70P5J05k02M77o31J83L83m16o7J87j10r5r4K46j98J95
5197C5j20Q7N0R1l39J20J90lk36J32J55j78R4j68J18j14j1J99K6j66M44p68M81
5220A19L2l26j72J54K73l03R3K30k67O6rP5R5k99L17m1O2J42j63J59l14J06l11
5243b82M88l26L19k82P6r6P2k11K36l9j02J34K6J1K2J98n02J54M7K0q7J22J21
5266A19j22q1j21L52n7J47j53j53R6K7q1j57M1Q9N0J12p7j39QJ27O7J35l86j2
5290a69J33K52l41N0L76m40J39k38J69J88j76J60l37J24q3N90l44j04k42M23j5
5311A15o0p7n1J43R6M3m90J05J20K53n4k02J52k62L91m80K39k99N95m48M40l85
$$ plain form
5333 -116 -57 -17 -64 -31 -76 -173 -385 286 -95 60 -179 89 183 139 -217 156 -86 -133 -90 -53 -97 -197 453 8
5357 8 -78 -104 -24 20 -15 -83 -21 138 -317 22 -89 -62 154 28 -55 -101 -29 228 61 69 101 -239 31 -42 33 -71
5383 -71 65 202 -24 171 45 18 -29 -54 -149 -133 146 -99 -218 150 -109 283 282 1 -102 242 -103 120 34
5406 34 -64 -164 256 -204 158 32 -42 239 -228 59 80 239 -102 -134 -18 85 -114 88 122 -42 110 44
5428 44 -66 -83 45 80 -17 42 -295 -27 -119 -181 40 19 17 -165 -131 -150 -2 -275 351 44 -21 -140 14 52 216
5453 216 -74 -78 -28 0 317 124 180 164 30 4 -42 -54 -304 119 142 -66 16 -227 77 18 3 44 -3 -127 257
5478 257 -99 -364 -77 128 27 67 -40 7 344 -9 -160 -226 89 -164 -233 -223 14 67 -31 -60 25 -230 -208
5501 -208 65 257 103 1 312 45 -255 119 -125 148 58 19 119 153 -170 -181 -128 272 -175 176 -108 139
$$ packed form
5333a16N9M0m7L3m5r7k12O71l81J55k39K68R4m4l56L73k42m7M3L7m4j00O50m45
5357Hq6k6Q0M4l5o8O2J59m55L39j11K7K16j26q3m6P2K57j67QL2l40K70p3P5j04
5383g1J36J37k26J95j26k7m7k5r5J6K79k45j19L68k59L92jk81j03L44l45K23q6
5406C4r8j00M20m60L62j26p4K81m67K87K1J59l41l2J16J03j99K02L4j64J52o6
5428D4j10j7J28L5r7N9l37K68r2o2K21k1kj82L4j9J48k73O26l07o5j19J54L8J64
5453B16k90mN0K8L17j93N6j6j34k6m6j2k50M23K3k08Q2k43L04n9j5M1m7j24L84
5478B57l56k65K87K05j01M0j07M7L37l53j51o6L15k53o9J0K37N3r8k9Q5k55K2
5501b08K73J92j54j02L11k67l00L74k44K73r0l9J00L4l23j1N3M00m47L51k84K47
$$ plain form
5523 139 109 69 -64 -130 -55 198 -127 4 254 45 124 -53 -121 28 86 -332 -247 -250 11 -111 73 75 -202 -131
5547 -131 -251 -13 -51 100 -63 12 312 26 -99 32 -131 144 -113 -274 -124 15 43 -159 347 7 -113
5568 -113 31 147 11 -54 -208 118 132 23 156 61 79 -117 16 -110 357 66 51 97 -199 -140 -46 -130 363
5591 363 -33 -286 -184 -157 -56 47 -60 198 -338 -168 9 -277 175 196 -133 -121 -12 230 -114 -68 22 60
5613 60 -120 117 -27 -66 377 -78 -136 -191 87 -1 92 56 72 159 181 -169 278 159 -158 -74 4 22 88 -315 -87
5638 -87 -58 60 119 45 -167 102 -36 -52 -39 180 -55 19 6 20 44 -96 251 291 184 175 25 -84 -120 77 162
5663 162 -303 -55 -39 -82 -108 -7 202 -338 16 45 141 -5 12 133 -154 38 69 309 -104 163 120 -85 -137
5686 -137 -384 13 -36 92 180 185 291 -100 112 -61 -87 -71 185 125 231 328 -113 78 -125 41 112 170 444
$$ packed form
5523A39l0m0j33o6P5K53l25J31K50k09P9j77o8J49N8m18Q5lK61j22J84Kk77P1
5547a31j20K38l8J51j63P5L00k86j25J31j63K75k57j61J50J39K8k02N06l40j20
5568a13J44J16j36o5j54L26J4j09J33r5J8j96J33j26M67k91j5M6k96N9R4q4M93
5591C63l96k53J02K7J01J03j07K58n36J70J77k86M52K1l29J2J09K42l44M6R0L8
5613F0j80K37j44l9M43m55n8n5K78q8R3l6J6Q7K2l50M47j19l17Q4P8J8O6m03K28
5638h7K9J18N9p4k12K69j38j6J3K19k35P4j3J4K4j40L47M0j07rj50j09l6J97Q5
5663A62m65K48J6m3k6J01K09n40L54K9R6j46J7J21k87J92L1K40m13K67m3k05n2
5686a37k47L97m9J28Q8NJ06l91K12j73k6J6K56o0J06R7m41J91k03J66P1N8K74
$$ plain form
5709 444 73 -77 -77 85 314 -90 331 -221 49 -98 -285 -151 57 -210 60 27 137 -17 0 209 61
5730 61 164 -218 8 15 -49 -81 -43 -181 149 86 62 -38 7 -213 -38 4 42 -97 153 -263 -263 -16 268 63
$$ packed form
5709D44l71j50%J62K29m04M21n52K70j47j87J34K08k67K70l3J10j54J7K09j48
5730F1J03l82K26Po4l2L8j38L30o3k4j00M5k20J75M2L8j39K50m16%K47K84k05
$$ [...]
8191A45
##END NTUPLES=NMR FID
##END=
