##TITLE=1H_SA_44.157
 DMSO-d6, 8 sc, 
 22.11.2019
##JCAMPDX= 6.0         $$ Bruker NMR JCAMP-DX V2.0
##DATA TYPE= NMR FID
##DATA CLASS= NTUPLES
##ORIGIN= UXNMR, Bruker Analytische Messtechnik GmbH
##OWNER= root
$$ XWIN-NMR		Version 3.5
$$ Fri Nov 22 14:26:18 2019 Russian Standard Time (UT+4h)  she@DPX200
##.OBSERVE FREQUENCY= 200.1315
##.OBSERVE NUCLEUS= ^1H
##.DELAY= (6, 6)
##.ACQUISITION MODE= SIMULTANEOUS
##.ACQUISITION SCHEME= undefined
##.AVERAGES= 8
##.DIGITISER RES= 18
##SPECTROMETER/DATA SYSTEM= spect
##.PULSE SEQUENCE= zg30
##.SOLVENT NAME= D2O
##.SHIFT REFERENCE= (INTERNAL, D2O, 0, 15.7039)
##AUDIT TRAIL= $$ (NUMBER, WHEN, WHO, WHERE, WHAT)
$$ ##TITLE= Audit trail, XWIN-NMR		Version 3.5
$$ ##JCAMPDX= 5.01
$$ ##ORIGIN= Bruker BioSpin GmbH
$$ ##OWNER= she
$$ F:/spectra/data/she/nmr/H-F/1/audita.txt
$$ ##AUDIT TRAIL=  $$ (NUMBER, WHEN, WHO, WHERE, WHAT)
(   1,<2019-11-22 14:25:12.59 +0400>,<she>,<DPX200>,
      <created by zg, POWCHK disabled, PULCHK disabled
       configuration hash MD5:
       00 E9 B6 7A A2 85 ED C7 34 08 36 98 17 FE 4E 26
       data hash MD5: 16K
       A3 A4 98 AE 11 74 F4 85 7F A5 0C 4C 35 D2 C7 81>)
$$ ##END=
$$ 
$$ hash MD5
$$ 57 FC 36 2A CD 68 A6 F6 9A 5B 1D DD 77 FD 18 74
##$RELAX= 
##$RELAX= 
##$RELAX= 
##$RELAX= 
##$RELAX= 
##$RELAX= 
$$ Bruker specific parameters
$$ --------------------------
##$DU= <F:/spectra>
##$EXPNO= 1
##$NAME= <H-F>
##$PROCNO= 1
##$TYPE= <nmr>
##$USER= <she>
##$AMP= (0..31)
100 100 100 100 100 100 100 100 100 100 100 100 100 100 100 100 100 100 
100 100 100 100 100 100 100 100 100 100 100 100 100 100 
##$AQSEQ= 0
##$AQ_mod= 1
##$AUNM= <au_zg>
##$AUTOPOS= <>
##$BF1= 200.13
##$BF2= 200.13
##$BF3= 200.13
##$BF4= 200.13
##$BF5= 200.13
##$BF6= 200.13
##$BF7= 200.13
##$BF8= 200.13
##$BYTORDA= 1
##$CFDGTYP= 0
##$CFRGTYP= 5
##$CHEMSTR= <none>
##$CNST= (0..31)
1 1 145 1 1 1 1 1 1 1 1 1 1 1 1 1 1 1 1 1 1 1 1 1 1 1 1 1 1 1 1 1 
##$CPDPRG= <>
##$CPDPRG1= <>
##$CPDPRG2= <>
##$CPDPRG3= <>
##$CPDPRG4= <mlev>
##$CPDPRG5= <mlev>
##$CPDPRG6= <mlev>
##$CPDPRG7= <mlev>
##$CPDPRG8= <mlev>
##$CPDPRGB= <>
##$CPDPRGT= <>
##$D= (0..31)
0 1.2 0 0 0 0 0 0 0 0.06 0 0.03 0 0 0 0 0.0002 0 0 0 0 0 0 0 0 0 0 0 0 
0 0 0 
##$DATE= 1574418311
##$DBL= (0..7)
120 120 120 120 120 120 120 120 
##$DBP= (0..7)
150 150 150 150 150 150 150 150 
##$DBP07= 0
##$DBPNAM0= <>
##$DBPNAM1= <>
##$DBPNAM2= <>
##$DBPNAM3= <>
##$DBPNAM4= <>
##$DBPNAM5= <>
##$DBPNAM6= <>
##$DBPNAM7= <>
##$DBPOAL= (0..7)
0.5 0.5 0.5 0.5 0.5 0.5 0.5 0.5 
##$DBPOFFS= (0..7)
0 0 0 0 0 0 0 0 
##$DE= 6
##$DECBNUC= <off>
##$DECIM= 24
##$DECNUC= <off>
##$DECSTAT= 4
##$DIGMOD= 1
##$DIGTYP= 9
##$DL= (0..7)
0 120 120 120 120 120 120 120 
##$DP= (0..7)
150 150 150 150 150 150 150 150 
##$DP07= 0
##$DPNAME0= <>
##$DPNAME1= <>
##$DPNAME2= <>
##$DPNAME3= <>
##$DPNAME4= <>
##$DPNAME5= <>
##$DPNAME6= <>
##$DPNAME7= <>
##$DPOAL= (0..7)
0.5 0.5 0.5 0.5 0.5 0.5 0.5 0.5 
##$DPOFFS= (0..7)
0 0 0 0 0 0 0 0 
##$DQDMODE= 0
##$DR= 18
##$DS= 0
##$DSLIST= <SSSSSSSSSSSSSSS>
$$ [...]
##$SUBNAM2= <"">
##$SUBNAM3= <"">
##$SUBNAM4= <"">
##$SUBNAM5= <"">
##$SUBNAM6= <"">
##$SUBNAM7= <"">
##$SUBNAM8= <"">
##$SUBNAM9= <"">
##$SW= 24.9337058887773
##$SWIBOX= (0..15)
0 0 2 0 0 0 0 0 0 0 0 0 0 0 0 0 
##$SW_h= 4990.01996007984
##$TD= 16384
##$TD0= 1
##$TE= 0
##$TE2= 300
##$TE3= 300
##$TEG= 300
##$TL= (0..7)
0 120 120 120 120 120 120 120 
##$TP= (0..7)
150 150 150 150 150 150 150 150 
##$TP07= 0
##$TPNAME0= <>
##$TPNAME1= <>
##$TPNAME2= <>
##$TPNAME3= <>
##$TPNAME4= <>
##$TPNAME5= <>
##$TPNAME6= <>
##$TPNAME7= <>
##$TPOAL= (0..7)
0.5 0.5 0.5 0.5 0.5 0.5 0.5 0.5 
##$TPOFFS= (0..7)
0 0 0 0 0 0 0 0 
##$TUNHIN= 0
##$TUNHOUT= 0
##$TUNXOUT= 0
##$USERA1= <user>
##$USERA2= <user>
##$USERA3= <user>
##$USERA4= <user>
##$USERA5= <user>
##$V9= 5
##$VALIST= <valist>
##$VCLIST= <CCCCCCCCCCCCCCC>
##$VD= 0
##$VDLIST= <DDDDDDDDDDDDDDD>
##$VPLIST= <PPPPPPPPPPPPPPP>
##$VTLIST= <TTTTTTTTTTTTTTT>
##$WBST= 1024
##$WBSW= 4
##$XGAIN= (0..3)
0 0 0 0 
##$XL= 0
##$YL= 0
##$YMAX_a= 159714
##$YMIN_a= -111374
##$ZGOPTNS= <>
##$ZL1= 120
##$ZL2= 120
##$ZL3= 120
##$ZL4= 120
##$ABSF1= 10
##$ABSF2= 0
##$ABSG= 5
##$ABSL= 3
##$ALPHA= 0
##$AQORDER= 0
##$ASSFAC= 0
##$ASSFACI= 0
##$ASSFACX= 0
##$ASSWID= 0
##$AUNMP= <proc_1d>
##$AZFE= 0.1
##$AZFW= 0.1
##$BCFW= 1
##$BC_mod= 2
##$BYTORDP= 1
##$COROFFS= 0
##$CY= 11.3945322036743
##$DATMOD= 1
##$DC= 2
##$DFILT= <>
##$DTYPP= 0
##$F1P= 16.9975609425685
##$F2P= -3.02152046262296
##$FCOR= 0.5
##$FTSIZE= 0
##$FT_mod= 4
##$GAMMA= 1
##$GB= 0.15
##$INTBC= 1
##$INTSCL= 1
##$ISEN= 128
##$LB= 0.24
##$LEV0= 0
##$LPBIN= 0
##$MAXI= 10000
##$MC2= 0
##$MEAN= 0
##$ME_mod= 0
##$MI= 1.114404
##$NCOEF= 0
##$NC_proc= 0
##$NLEV= 6
##$NOISF1= 3.799351
##$NOISF2= 2.8
##$NSP= 1
##$NTH_PI= 0
##$NZP= 0
##$OFFSET= 15.70392
##$PC= 1
##$PHC0= -9809.176
##$PHC1= 39.60086
##$PH_mod= 1
##$PKNL= yes
##$PPARMOD= 0
##$PSCAL= 0
##$PSIGN= 0
##$REVERSE= no
##$SF= 200.130013532006
##$SI= 16384
##$SIGF1= 3
##$SIGF2= 2
##$SINO= 400
##$SIOLD= 16384
##$SREGLST= <1H.CDCl3>
##$SSB= 0
##$STSI= 0
##$STSR= 0
##$SW_p= 3612.71676300578
##$SYMM= 0
##$S_DEV= 0
##$TDeff= 0
##$TDoff= 0
##$TI= <>
##$TILT= no
##$TM1= 0
##$TM2= 0
##$TOPLEV= 0
##$USERP1= <user>
##$USERP2= <user>
##$USERP3= <user>
##$USERP4= <user>
##$USERP5= <user>
##$WDW= 1
##$XDIM= 8192
##$YMAX_p= 0
##$YMIN_p= 0
$$ End of Bruker specific parameters
$$ ---------------------------------
##NTUPLES= NMR FID
##VAR_NAME=  TIME,          FID/REAL,        FID/IMAG
##SYMBOL=    X,             R,               I
##VAR_TYPE=  INDEPENDENT,   DEPENDENT,       DEPENDENT
##VAR_FORM=  AFFN,          ASDF,            ASDF
##VAR_DIM=   8192,          8192,            8192
##UNITS=     SECONDS,       ARBITRARY UNITS, ARBITRARY UNITS
##FACTOR=    0.0002004,     1,               1
##FIRST=     0,             0,               0
##LAST=      1.6414764,     0,               0
##MIN=       0,             -111374,         0
##MAX=       1.6414764,     159714,          0
$$ Real data points
##PAGE= N=1
##DATA TABLE= (X++(R..R)), XYDATA
$$ plain form
0 0 0 0 0 0 0 0 0 0 0 0 -8 8 -8 8 -8 13 -16 16 -23 24 -31 33 -40 47 -52 61 -69 79 -90 101 -113 129 -144 161
34 161 -180 200 -223 249 -274 305 -338 374 -413 459 -507 564 -626 697 -778 873 -981 1111
52 1111 -1271 1473 -1733 2079 -2578 3355 -4743 7990 -35563 40756 128398 39739 -75765 -111374
66 -111374 -28636 58912 79142 22528 -35139 -53297 -25227 13753 45114 45230 9705 -47896
78 -47896 -70502 -23138 59118 79788 6547 -86578 -92637 -4188 81479 68416 -23344 -91776
90 -91776 -66486 16878 67820 40802 -23624 -60184 -41281 6295 39522 36532 2076 -36966
102 -36966 -48312 -19098 29441 50307 16101 -43157 -66685 -26996 34841 53879 10528 -50848
114 -50848 -67657 -24291 36170 52770 9480 -48644 -61804 -16644 39848 51690 10024 -41243
$$ packed form
0@%%%%%%%%%%qJ6j6J6j6K1k9L2l9M7n5O4p3Q7r9J13j30J48j69J91k14K42k73L05
34A61l41L80m23M72n23N79o43P12p87Q72r66J071j190J323j475J651j854K092
52A111k382K744l206L812m657N933q098J2733m3553P6319Q7642q8659j15504l5609
66a11374Q2738Q7548K0230n6614n7667j8158K8070L8980L1361J16l5525n7601
78d7896k2606M7364Q2256K0670p3241r3125o059Q8449Q5667j3063r1760o8432
90i1776K5290Q3364N0942k7018o4426l6560J8903M7576L3227k990l4456l9042
102c6966j1346K9214M8539K0866l4206n9258k3528L9689O1837J9038m3351o1376
114e0848j6809M3366O0461J6600m3290n8124j3160M5160N6492J1842m1666n1267
$$ plain form
126 -41243 -50428 -9529 38025 44683 7108 -32483 -36699 -9712 18951 27735 13389 -13870 -36776
139 -36776 -35038 -3131 33044 33349 -11508 -58362 -52698 6100 55856 38213 -29251 -69131 -34213
152 -34213 33852 57656 15461 -37495 -41896 -3246 28784 25160 3315 -9444 -11838 -13827 -10802
165 -10802 8729 29009 17935 -24078 -51879 -24955 32321 52701 6217 -55585 -57775 3951
177 3951 56421 39135 -21643 -51169 -19409 27928 37807 10351 -12675 -11226 286 4347 5454
190 5454 14011 19528 3509 -25244 -29909 3942 39541 28478 -22978 -54889 -27099 27197 43983
203 43983 4912 -41233 -41683 -620 32567 25970 -4472 -22269 -12533 7650 18442 17893 12775
216 12775 4111 -5492 -6227 8737 27257 28076 4870 -19328 -17234 8950 30207 22263 -8009 -28843
$$ packed form
126d1243r185M0899M7554O658l7575l9591m216K6987K8663Q784j4346k7259k2906
139c6776J738L1907L6175L05m4857m6854N664N8798M9756j7643o7464l9880L4918
152c4213O8065K3804m2195n2956m401L8650L2030l624k1845j2759k394j989L025
165a0802J9531K0280j1074m2013k7801K6924N7276K0380m6484o1802k190O1726
177C951N2470j7286o0778k9526L1760M7337R879k7456k3026J449J1512M061J107
190E454Q557N517j6019k8753m665L3851L5599j1063n1456l1911K7790N4296J6786
203D3983l9071m6145m50M1063L3187o597l0442j7797R736K0183J0792n49n118
216A2775q664r603p35J4964J8520Q19k3206k4198K094K6184K1257p944l0272k0834
$$ plain form
230 -28843 -20147 7059 24328 13967 -13014 -28742 -18810 7698 23490 13290 -10434 -22618
242 -22618 -10387 12962 23859 13630 -3759 -9838 -1401 10570 16406 15231 9722 274 -7822
255 -7822 -4150 13659 27848 17929 -10643 -26134 -7276 26050 34647 5054 -28324 -25331 9312
268 9312 33328 18831 -13000 -22692 -2447 17690 13870 -1725 -5086 3519 4772 -6042 -8906
281 -8906 6626 20967 8384 -20286 -27424 1218 32239 24453 -14682 -36056 -11717 28299 34513
294 34513 2435 -25582 -13943 17185 28023 10610 -6626 -1397 12466 12224 1024 410 13374
307 13374 18263 1687 -17309 -11256 14335 25020 2919 -27779 -27914 1718 22885 8915 -21735
320 -21735 -30404 -9920 11873 10496 -6703 -15101 -7060 3597 5252 2239 3689 8013 6231 -679
$$ packed form
230b8843Q696K7206J7269j0361k6981j5728R932K6508J5792j0200k3724j2184
242b2618J2231K3349J0897j0229j7389o079Q437J1971N836j175n509r448q096
255g822L672J7809J4189r919k8572j5491J8858L3326Q597k9593l3378K993L4643
268I312K4016j4497l1831r692K0245K0137l820j5595l361Q605J253j0814k864
281h906J5532J4341j2583k8670p138K8642L1021p786l9135k1374K4339M0016O214
294C4513l2078k8017J1639L1128J0838j7413j7236N229J3863k42j1200o14J2964
307A3374M889j6576j8996O053K5591J0685k2101l0698j35K9632K1167j3970l0650
320b1735q669K0484K1793j377j7199q398Q041J0657J655l013J450M324j782o910
$$ plain form
334 -679 -756 9856 20586 15176 -1042 -8964 830 16535 18110 3491 -11419 -12269 -1064 8802
348 8802 6608 -5244 -15576 -15537 -6347 2744 2610 -6479 -15367 -14103 -3876 4873 3288 -4842 -9195
363 -9195 -5365 1225 3758 2640 2500 2653 -674 -4386 -1368 8613 13374 3547 -11734 -13099 3421
378 3421 18256 11383 -10518 -19738 -5773 13946 14130 -5477 -17177 -8005 7418 7611 -4894 -10700
392 -10700 -2468 5041 -1863 -12764 -9266 5583 9619 -6468 -22560 -15391 7535 15691 -2849
405 -2849 -25072 -20727 4614 17991 3467 -18168 -17136 2991 15219 5434 -8438 -6514 7671
418 7671 11636 656 -6426 1844 14238 10304 -6165 -12594 963 16176 10596 -10975 -21111
431 -21111 -7620 10286 8517 -11075 -22284 -13144 1813 3077 -8459 -15127 -9646 -1064 -1555 -6374
$$ packed form
334f79p7J0612J0730n410j6218p922R794J5705J575j4619j4910q50J1205R866
348H802k194j1852j0332L9R190R091j34r089q888J264J0227Q749j585q130m353
363i195L830O590K533j118j40J53l327l712L018R981M761r827j5281j365J6520
378C421J4835o873k1901r220J3965J9719J84j9607j1700R172J5423J93j2505n806
392a0700Q232P509o904j0901L498J4849M036j6087j6092P169K2926Q156j8540
405b849k2223M345K5341J3377j4524k1635J032K0127J2228r785j3872J924J4185
418G671L965j0980p082Q270J2394l934j6469o429J3557J5213n580k1571j0136
431b1111J3491J7906j769j9592j1209R140J4957J264j1536o668N481Q582m91m819
$$ plain form
445 -6374 -5387 1396 3741 -962 -5883 -546 9611 11604 2918 -5108 -1377 8687 12771 5635 -2849
460 -2849 -4175 1067 5051 3809 -602 -3938 -6172 -5339 -2498 309 -1013 -5806 -9263 -6940 -610
475 -610 1873 -1607 -6153 -5670 -466 2191 271 -1200 736 2467 -26 -2833 -20 6683 7392 -1129
491 -1129 -8279 -3810 7617 10796 655 -10470 -7425 5730 11955 2838 -8440 -6949 4753 9820
505 9820 1979 -5703 -2132 7202 7450 -2470 -6923 1161 10670 6494 -7781 -11719 492 12537 6871
520 6871 -9577 -15656 -3056 10577 7139 -8226 -14462 -2643 8940 5940 -5852 -8149 2337
533 2337 10050 4465 -4560 -2074 9078 13203 3822 -5527 -1091 12028 15122 3139 -8217 -4050
547 -4050 8727 12213 1346 -9052 -6786 3461 5972 -1957 -8780 -5466 1270 1066 -4462 -6440
$$ packed form
445f374R87O783K345m703m921N337J0157J993q686q026L731J0064M084p136q484
460b849j326N242L984j242m411l336k234Q33K841K807j322m793l457K323O330
475f10K483l480m546M83N204K657j920j471J936J731k493k807K813O703P09q521
491a129p150M469J1427L179j0141j1125L045J3155O225r117j1278J491J1702N067
505I820p841p682L571R334K48r920m453Q084R509m176j4275l938J2211J2045n666
520F871j6448o079J2600J3633l438j5365o236J1819J1583l000j1792k297J0486
533B337P713n585r025K486J1152M125r381r349M436J3119L094j1983j1356M167
547d050J2777L486j0867j0398K266J0247K511p929o823L314O736k04n528j978
$$ plain form
561 -6440 -915 3905 1246 -5159 -4419 3687 8367 3982 -2986 -2069 4776 8947 5854 -255 -1102 2895
577 2895 5599 3569 755 1039 1973 671 -1420 -497 2123 1957 -1897 -4508 -1645 3077 2919 -1633
593 -1633 -3894 -1160 3181 3017 -602 -1362 1586 3700 1200 -1854 433 4464 3733 -2306 -5534 -545
609 -545 5846 3980 -4414 -8432 -2257 5237 4274 -3901 -7629 -1334 5875 4406 -3011 -4555 2400 7390
625 7390 3763 -2986 -1961 6093 9670 2353 -5346 -2531 7095 9294 155 -8401 -5091 4749 6808
640 6808 -2162 -10358 -6705 2518 3873 -4513 -9843 -4765 3209 2301 -5535 -7424 -30 6771 3488
655 3488 -4724 -5392 3253 9828 5281 -3499 -4161 4208 10185 4689 -3771 -4140 2903 6790 1245 -5163
671 -5163 -3752 1987 2960 -2665 -6441 -2627 2418 1277 -4820 -6817 -1392 4211 2094 -4024 -5392
$$ packed form
561f440N525M820k659o405P40Q106M680m385o968R17O845M171l093o109q47L997
577B895K704k030k814K84R34j302k091R23K620j66l854k611K863M722j58m552
593a633k261K734M341j64l619p60K948K114k500l054K287M031p31o039l228M989
609e45O391j866q394m018O175P494r63q175l728O295P209j469p417j544O955M990
625G390l627o749J025Q054L577p317p699K815R626K199r139q556L310R840K059
640F808q970q196L653R223J355q386n330N078P974r08p836j889P394O801l283
655C488q212o68Q645O575m547q780o62Q369N977n496q460l69P043L887n545o408
671e163J411N739R73n625l776L814N045j141o097j997N425N603k117o118j368
$$ plain form
686 -5392 385 4874 2591 -2642 -2681 1361 3755 932 -2589 -1020 2010 2218 -1418 -3505 -463 3047
702 3047 1033 -3723 -4404 394 3730 1178 -3564 -3264 1890 4321 1264 -2029 -448 3367 3972 241
718 241 -2436 851 4518 2669 -3100 -3705 1036 4008 71 -5917 -6075 -236 3043 -1261 -6951 -5952
734 -5952 15 2866 -1629 -5724 -3218 3088 4142 -748 -4085 604 6829 5575 -508 -2675 3007
749 3007 8231 5352 -1968 -3782 2143 7062 3114 -4204 -5279 230 4033 -330 -6387 -5743 157
764 157 2205 -2767 -6951 -4222 2315 2696 -2691 -6161 -1632 4884 4486 -1816 -4462 487 6123 5291
780 5291 -922 -3053 1660 5696 3577 -1997 -2753 1840 4289 680 -3773 -2904 2231 3041 -1690 -4772
796 -4772 -2189 2702 2945 -2046 -4711 -1313 3667 3380 -1743 -3438 209 3961 1724 -2827 -2509 1457
$$ packed form
686e392N777M489k283n233l9M042K394k823l521J569L030K08l636k087L042L510
702C047k014m756o81M798L336k552m742L00N154K431l057l293J581L815O05l731
718B41k677L287L667j849n769o05M741K972l937n988j58N839L279m304n690R99
734e952N967K851m495m095K506O306J054m890l337M689O225j254o083k167N682
749C007N224k879p320j814N925M919l948p318j075N509L803m363o057O44N900
764A57K048m972m184K729O537L81n387l470M529O516l98o302k646M949N636q32
780E291o213k131M713M036k119n574p56M593K449l609m453Q69N135Q10m731l082
796d772K583M891K43m991k665L398M980k87n123j695L647L752k237m551L18L966
$$ plain form
812 1457 3054 -384 -4136 -2491 1900 2509 -2155 -5101 -2621 1975 2110 -2469 -4867 -1036 3122 2626
828 2626 -1867 -2793 1306 4259 2313 -1514 -893 3220 4757 1336 -2603 -1223 3455 3854 -1142 -4561
844 -4561 -2147 2461 1721 -3379 -6059 -2418 1315 -226 -4548 -5630 -1156 1981 -21 -3906 -3880 1398
860 1398 3861 709 -3155 -1733 3568 5326 947 -2982 -530 4381 4739 -190 -3503 -919 3228
875 3228 3008 -2354 -5071 -1335 1998 137 -4471 -5026 -956 2185 -867 -5074 -3972 1443 3271 -451
891 -451 -4315 -2524 2988 4150 -389 -3656 -1319 3142 3328 -1218 -3614 -355 3214 1533 -3234 -4158
907 -4158 -74 2741 -298 -4448 -3830 781 2950 -153 -3873 -2692 2041 3644 553 -2935 -1058
922 -1058 3540 3751 -410 -2329 669 4133 2595 -2010 -2737 697 3155 405 -3757 -4205 -85 2329
$$ packed form
812A457J597l438l752J645M391O09m664k946K480M596J35m579k398L831M158m96
828B626m493r26M099K953j946l827O21M113J537l421l939J380M678L99m996l419
844d561K414M608p40n100k680L641L733j541m322j082M474L137k002l885K6N278
860A398K463l152l864J422N301J758m379l929K452M911L58m929l313K584M147
875C228k20n362k717L736L333j861m608n55M070L141l052m207J102N415J828l722
891d51l864J791N512J162m539l267K337M461J86m546k396L259L569j681m767r24
907d158M084K815l039m150O18M611K169l103l720J181M733J603l091l488J877
922a058M598K11m161j919K998L464j538m605p27L434K458k750m162m48M120K414
$$ plain form
938 2329 -1256 -4591 -3541 787 2144 -1542 -4195 -1791 2468 2913 -908 -2705 504 4484 3662 -762
954 -762 -1475 2115 5175 3387 -1359 -1375 2061 4614 1476 -2738 -2418 1772 2876 -612 -3965 -2339
970 -2339 1464 1988 -1877 -3761 -1277 2788 1983 -1802 -2931 405 4101 2532 -1631 -1908 2156 5044
986 5044 2299 -2032 -1035 2833 4176 918 -2305 -859 3067 3739 -288 -2865 -524 3191 2716 -1467
1002 -1467 -2638 387 3843 2792 -1427 -1945 1615 4606 2470 -1424 -1208 2407 4021 1372 -1909
1017 -1909 -871 2475 3109 -190 -2791 -761 2537 2192 -1686 -3526 -702 2543 1572 -1893 -3004 902
1033 902 3580 2136 -1241 -1203 2688 5037 2598 -959 325 4196 5431 1893 -1155 478 3754 4039
1049 4039 52 -2578 -505 2477 1891 -2201 -3642 -848 1761 137 -3354 -3547 30 2320 -275
$$ packed form
938B329l585l335J050M328J357l686k653K404M259M45l821j797L209L980q22m424
954g62p13L590L060j788m746j6L436K553l138m214L20M190J104l488l353J626
970b339L803N24l865j884K484M065q05l785j129L336L696j569m163k77M064K888
986E044k745m331R97L868J343l258l223J446L926O72m027k577K341L715m75m183
1002a467j171L025L456j051m219n18L560K991k136l894K16L615J614k649l281
1017a909J038L346O34l299k601K030L298l45l878j840K824L245r71l465j111L906
1033I02K678j444l377L8L891K349k439l557J284L871J235l538l048J633L276K85
1049D039l987k630K073K982n86m092j441K794K609j624l491j93L577K290k595
$$ plain form
1064 -275 -3251 -1815 2167 3109 373 -1914 570 3960 3879 660 -1334 1264 4442 3447 -460 -1614
1080 -1614 1229 3499 2130 -1776 -2451 595 2680 293 -3207 -2751 774 2079 -812 -3251 -2185
1095 -2185 1507 1727 -910 -3376 -1068 2325 2212 -1782 -2938 -83 2725 1561 -1710 -2262 615 2443
1111 2443 335 -2619 -2307 1253 1976 -814 -3244 -1808 1796 2297 -969 -3285 -1060 2259 2340 -1215
1127 -1215 -2648 -435 2670 1341 -1495 -2554 -26 1953 264 -3183 -3157 18 1245 -1179 -4181
1142 -4181 -3722 -208 468 -2414 -4677 -2988 399 612 -2142 -3632 -898 1924 1217 -1603 -2177 689
1158 689 3095 1566 -1245 -1621 1800 3081 306 -2346 -1569 987 1832 -1030 -3672 -2715 285 41
1174 41 -3129 -4669 -2538 -256 -720 -3594 -4478 -1637 965 -422 -2943 -3093 -15 2111 197 -2129
$$ packed form
1064b75k976J436L982R42k736k287K484L390q1l219j994K598L178r95l907j154
1080a614K843K270j369l906o75L046K085k387l500M56L525J305k891k439J066
1095b185L692K20k637k466K308L393j13l994j156K855K808j164l271n52K877J828
1111B443k108k954L12L560P23k790k430J436L604N01l266k316K225L319Q1l555
1127a215j433K213L105j329k836j059K528J979j689l447K6L175J227k424l002
1142d181M59L514O76k882k263J689L387K13k754j490K734K822p07k820n74K866
1158F89K406j529k811l76L421J281k775k652P77K556Q45k862k642R57L000k44
1174D1l170j540K131K282m64k874q84K841K602j387k521j50L078K126j914k326
$$ plain form
1190 -2129 -1231 1576 2692 -65 -2038 -982 2109 2258 -1213 -2874 -1013 1489 893 -2343 -3425 -833
1206 -833 1207 -91 -3135 -3345 -572 1750 -349 -3184 -2405 720 2236 -537 -2906 -1776 1859 2045
1222 2045 -975 -2650 -1339 1927 1784 -1531 -2984 -632 1835 731 -2362 -2979 -144 2087 428
1237 428 -2231 -2106 805 2606 254 -1987 -1135 1985 2689 140 -1575 16 2421 2711 -364 -2042
1253 -2042 -332 2360 1602 -1308 -2503 -226 1662 625 -2389 -2456 -17 1815 125 -2485 -1578 852
1269 852 2252 423 -1787 -369 2521 3029 801 -907 946 3213 2909 431 -360 1600 3211 2009
1285 2009 -690 -832 1471 2453 836 -1476 -1394 1327 1923 -209 -2276 -1020 1584 1908 -381 -1365 478
1302 478 2544 2276 -143 -742 1417 3378 2274 -323 -88 2432 3635 1616 -523 -224 2243 2739
$$ packed form
1190b129Q98K807J116k757j973J056L091J49l471j661J861K502n96l236j082K592
1206h33K040j298l044k10K773K322k099k835P79L125J516k773k369J130L635J86
1222B045l020j675J311L266j43l315j453K352K467j104l093o17K835K231j659
1237D28k659J25K911J801k352k241Q52L120P04k549j715J591K405K90l075j678
1253b042J710K692p58k910j195K277J888j037l014o7K439J832j690k610R07K430
1269H52J400j829k210J418K890N08k228j708J853K267l04k478p91J960J611j202
1285B009k699j42K303R82j617k312Q2K721N96k132k067J256K604L24k289r84J843
1302D78K066k68k419n99K159J961j104k597K35K520J203k019k139K99K467M96
$$ plain form
1318 2739 429 -1495 -234 1935 2223 -203 -1787 370 2099 1965 -684 -1343 589 3101 2061 -582
1334 -582 -907 2064 3354 1694 -640 -247 2481 3452 995 -1309 -620 1988 2834 189 -1690 -587
1350 -587 2256 1892 -1089 -2015 87 2364 1944 -709 -1490 663 2723 1690 -1120 -952 1623 3296
1366 3296 1531 -900 -388 2083 3004 701 -1351 -331 1682 1987 -142 -2121 -566 1573 1327 -1033
1382 -1033 -2229 -121 1474 866 -1300 -1409 602 1918 765 -1087 -918 1329 2169 577 -1212 -59
1398 -59 1606 1851 63 -1352 -117 1719 902 -1185 -1630 -205 1118 139 -1767 -2040 -131 1209 -454
1415 -454 -2338 -1831 737 1038 -708 -2045 -853 1417 1241 -771 -1996 -156 1655 968 -1374 -2093
1431 -2093 -119 1276 -9 -1854 -2251 -247 911 -615 -2693 -2411 73 842 -1152 -2769 -1898 436
$$ packed form
1318B739k310j924J261K169K88k426j584K157J729j34k649o59J932K512j040k643
1334e82l25K971J290j660k334L93K728R71k457k304O89K608Q46k645j879J103
1350e87K843l64k981r26K102K277m20k653p81K153K060j033k810J68K575J673
1366C296j765k431N12K471R21k303k052J020K013L05k129j979J555K139k46k360
1382a033j196K108J595o08k166j09K011J316j153j852J69K247Q40j592j789J153
1398e9J665K45j788j415J235J836q17k087m45J425J323r79j906k73J909J340j663
1415d54j884N07K568L01j746j337J192K270j76k012j225J840J811o87k342p19
1431b093J974J395j285j845l97K004J158j526k078K82K484P69j994j617Q71K334
$$ plain form
1447 436 823 -1124 -2845 -930 1659 1148 -1281 -1958 -48 1870 780 -1593 -2035 -210 1181 6
1463 6 -2578 -2474 221 987 -908 -2891 -2552 -122 901 -1281 -3091 -1803 584 864 -1526 -2459 -1043
1480 -1043 957 848 -1194 -1966 -208 1525 584 -1668 -1903 140 1504 -92 -2099 -2042 398 775 -909
1497 -909 -2641 -1789 117 303 -1371 -2536 -1490 472 320 -1282 -1890 -803 1244 337 -1562 -1435 326
1514 326 1575 587 -1089 -673 523 1100 -401 -1911 -839 817 704 -819 -2013 -1243 710 224 -1464
1531 -1464 -2069 -410 922 89 -1719 -1373 5 1259 127 -1132 -964 1337 1900 268 -1004 -451
1547 -451 1366 1465 45 -1524 -228 1599 1159 -837 -1667 -226 1231 556 -1229 -1507 405 1365 231
1564 231 -1365 -1255 1107 2100 375 -1404 -298 1740 1798 352 -1182 -112 1972 1562 -417 -1046 369
$$ packed form
1447D36L87j947j721J915K589n11k429o77J910J918j090k373m42J825J391j175
1463Fk584J04K695P66j895j983L39K430J023k182j810J288K387K80k390r33J416
1480a043K000j09k042p72J758J733r41k252k35K043J364j596k007N7K440L77j684
1497i09j732Q52J906J86j674j165J046J962j52j602o08J087K047r07j899J27J761
1514C26J249r88j676M16J196N77j501j510J072J656j13j523j194P70J953m86j688
1531a464o05J659J332q33j808L46J378J254j132j259J68K301N63j632j272N53
1547d51J817R9j420j569J296J827m40j996q30J441J457o75j785k78J912R60j134
1564B31j596J10K362R93j725j779J106K038N8j446j534J070K084m10j979o29J415
$$ plain form
1581 369 1698 788 -963 -1124 283 1834 685 -1219 -1032 1070 1987 800 -1055 -452 1576 2252 635
1598 635 -1023 376 2142 2067 236 -626 398 2110 1732 -115 -882 526 1909 642 -940 -1114 528
1615 528 1178 405 -1056 -727 577 1702 55 -1383 -386 1455 1568 112 -672 650 2373 2050 342
1632 342 -243 1442 2487 1820 155 -272 1430 2056 744 -389 -594 730 1422 187 -895 -630 1043
1649 1043 1300 -412 -1642 -590 1133 529 -594 -1040 609 1688 1070 -440 -328 907 1957 1144
1665 1144 -710 -157 1420 1857 301 -887 -314 1106 1887 0 -985 -332 1387 1227 -500 -1475 17
1682 17 1455 976 -694 -1055 73 1509 585 -767 -913 578 1364 122 -1349 -835 683 1167 -333
1699 -333 -1437 -680 969 705 -676 -1668 -458 1127 326 -711 -1305 192 1180 538 -985 -482 656
$$ packed form
1581C69J329r10j751j61J407J551j149j904J87K102R17j187j855O03K028O76j617
1598F35j658J399J766p5j831q62J024J712l78j847p67J408J383j267j582j74J642
1615E28O50p73j461L29J304J125j647j438R97J841J13j456p84J322J723l23j708
1632C42n85J685J045o67j665m27J702O26j312j133k05J324O92j235j082K65J673
1649A043K57j712j230J052J723o04j123m46J649J079o18j510J12J235J050q13
1665A144j854N53J577M37j556j188N73J420P81j887r85O53J719j60j727r75J492
1682A7J438m79j670l61J128J436r24j352j46J491P86j242j471N14J518M84j500
1699c33j104P57J649k64j381r92J210J585q01j037n94J497R88o42j523N03J138
$$ plain form
1716 656 1723 476 -1047 -622 819 1750 233 -795 -531 733 1196 -390 -1707 -1110 507 175 -1866
1733 -1866 -1928 -869 545 -141 -1725 -1578 -261 666 -181 -1598 -1239 165 874 310 -1333 -345 989
1750 989 1427 73 -1056 -96 1318 1015 -649 -1285 -235 964 342 -1394 -1460 -463 333 -293 -1940 -1773
1768 -1773 -81 130 -635 -1856 -1393 210 547 -690 -1326 -700 711 732 -614 -1087 -164 924 356 -488
1786 -488 -1019 43 972 -25 -1115 -1109 155 862 -142 -1247 -849 243 439 -303 -1122 -527 463 806 -779
1805 -779 -1549 -128 845 409 -1088 -943 -60 583 131 -1337 -836 177 740 -347 -1495 -1241 295 654
1823 654 -393 -1287 -842 694 906 -790 -1313 53 938 716 -801 -855 227 1397 576 -629 -564 584
1841 584 953 475 -943 -483 570 1119 105 -1246 -860 635 455 -819 -1088 -739 484 481 -763 -1159
$$ packed form
1716F56J067j247j523M25J441R31j517j028K64J264M63j586j317N97J617l32k041
1733a866o2J059J414o86j584J47J317R27q47j417L59J404P09n64j643R88J334
1750I89M38j354j129R60J414l03j664o36J050J199o22j736o6R97P96o26j647J67
1768a773J692K11p65j221M63J603L37j237o36O26J411K1j346m73R23J088n68q44
1786d88n31J062R29r97j090OJ264P07j004j105L98J092J96p42q19N95R90L43j585
1805g79p70J421R73m36j497J45Q83O43m52j468N01J013N63j087j148K54J536L59
1823F54j047q94M45J536K12j696n23J366Q85k22j517n4J082J170q21j205O5J148
1841E84L69m78j418M60J053N49j014j351L86J495j80j274k69L49J223lj244l96
$$ plain form
1859 -1159 -419 828 497 -604 -808 407 1322 571 -415 -211 737 1334 562 -825 -332 646 876 58
1877 58 -1102 -368 787 766 -501 -968 -174 863 266 -756 -804 366 892 37 -907 -316 615 1290 361
1896 361 -344 -248 1030 1320 -17 -411 39 977 1136 -312 -871 -86 698 748 -583 -885 296 939 313
1915 313 -680 -963 410 771 341 -575 -208 961 1322 214 -822 329 1017 1405 -182 -484 335 1499
1933 1499 907 -151 -611 265 1347 209 -525 -688 241 788 210 -680 -670 567 802 -229 -1136 -565
1951 -565 544 973 -161 -739 213 881 921 250 -679 320 1086 707 -276 -533 364 1083 508 -711 -552
1970 -552 683 809 76 -776 -454 392 884 183 -869 -420 368 282 -449 -348 14 1076 590 -625 -636
1989 -636 282 546 345 -995 -992 334 538 -146 -864 -494 304 798 -90 -755 -116 868 361 -196 -255 263
$$ packed form
1859a159P40J247l31j101k04J215R15p51r86K04R48N97p72j387M93R78K30q18
1877E8j160P34J155k1j267m67P94J037n97j022m8J170N26q55r44N91R31O75r29
1896C61p05R6J278K90j337l94M50R38J59j448n59P85P84N0j331l02J181O43o26
1915C13r93k83J373L61m30r16L67J169L61j108j036J151O88L88j587l02Q19J164
1933A499n92j058m60Q76J082j138p34j63R29N47n78q90J0J237K35j031r07N71
1951e65J109M29j134n78R52O68M0o71r29R99P66l79r83k57Q97P19n75j219J59
1970e52J235J26p33q52L22Q46M92p01j052M49P88q6p31J01L62J062m86j215j1
1989f36R18K64k01j340LJ326K04o84p18L70P98M94q88o65O39R84n07n57n9N18
$$ plain form
2009 263 1142 496 -362 -558 460 970 454 -489 -613 673 794 -116 -593 -652 374 270 -559 -1029 -516
2028 -516 936 453 -658 -1148 -103 388 118 -834 -844 -97 996 420 -768 -345 385 1070 316 -484 -144
2047 -144 754 975 215 -618 -177 553 789 -111 -829 -348 536 342 -687 -941 -427 261 240 -732 -1476 -419
2067 -419 371 -206 -1162 -751 19 788 166 -756 -413 544 776 125 -702 123 751 732 -86 -469 107 848
2087 848 380 -150 -532 54 860 345 -468 -156 21 703 34 -688 -182 538 264 -247 -583 -409 535 243
2107 243 -327 -816 -79 186 -7 -610 -584 -416 20 108 -888 -389 211 516 -310 -501 149 425 348 -157 -79
2128 -79 135 803 705 30 -370 489 840 74 -647 -466 387 960 -31 -787 -635 241 963 -445 -1171 -750
2148 -750 594 601 -697 -1120 -326 876 491 -708 -925 137 781 464 -564 -617 180 1084 720 -612 -550
$$ packed form
2009B63Q79o46q58j96J018N10n16r43j24J286J21r10m77n9J026j04q29m70N13
2028e16J452m83j111m90J045M91k70r52j0P47J093n76j188M23P30O85p54q00L40
2047a44Q98K21p60q33M41P30K36r00p18M81Q84j94j029k54N14O88k1r72p44J057
2067d19P90n77r56M11P70P69o22r22L43R57K32o51q27Q25O28j9q18l83N76P41
2087H48m68n30l82N86Q06n15q13L12J77O82o69p22N06P20k74n11l36J74R44k92
2107B43n70m89P37K65j93o03K6J68M36Q8r96M99O00L05q26j91O50K76p7n05P8
2128g9K14O68r8o75m00Q59L51p66p21J81Q53N73r91p56J52Q76P22j408p26M21
2148g50J344Pj298m23P94J202l85j199k17J062O44l17j028n3P97R04l64j332O2
$$ plain form
2167 -550 297 815 468 -292 -382 441 1016 292 -1058 -746 625 728 -13 -797 -333 666 466 -399 -1029 -301
2187 -301 513 648 -358 -870 -289 656 515 -475 -713 -181 240 433 -876 -448 62 302 203 -369 -568 170
2207 170 211 309 -619 -352 -210 205 16 -342 171 34 554 66 167 -1 682 145 11 -208 158 55 -197
2228 -197 -95 -183 -61 -528 -688 -386 51 -239 -519 -581 -626 -71 100 -335 -630 -86 577 110 -114 -564 243
2249 243 1005 380 -177 -86 495 1101 573 -789 -406 351 900 -26 -552 -284 353 711 -208 -1012 -813 431
2269 431 502 -460 -1076 -912 315 417 -513 -1242 -660 468 507 -753 -1260 -444 611 556 -195 -744 60 966
2289 966 738 -234 -1174 156 945 719 -420 -586 180 1229 422 -312 -464 599 982 357 -428 -567 280
2308 280 822 -134 -811 -589 54 430 -148 -830 -582 -27 366 -238 -1008 -670 -155 170 -36 -570 18 406
$$ packed form
2167e50Q47N18l47p60r0Q23N75p24j350L12J371J03p41p84M64R99k00q65o30P28
2187c01Q14J35j006n12N81R45j41r90k38N32M21J93j309M28N10K40r9n72j99P38
2207A70M1R8r28K67J42M15j89l58N13j37N20m88J01j68O83n37j34k19L66j03k52
2228a97J02q8J22m67j60L02M37k90k80o2m5N55J71m35k95N44O63m67k24m50Q07
2249B43P62o25n57R1N81O06n28j362L83P57N49r26n26K68O37L58r19q04J99J244
2269D31P1r62o16J64J227J02r30p29N82J128L9j260n07Q16J055n5p51n49Q04R06
2289I66k28r72r40J330P89k26j139j66P66J049q07p34j52J063L83o25p85j39Q47
2308B80N42r56o77K22O43L76n78o82K48N55L93o04p70L38N15L25k06n34N88L88
$$ plain form
2328 406 299 325 86 249 509 559 483 305 459 612 551 736 313 401 234 62 252 437 106 -12 106 -42
2350 -42 -143 -403 -520 -444 124 -15 -475 -965 -80 225 68 -242 -967 13 552 405 -316 -580 796 1018
2370 1018 746 -79 -7 564 1093 824 97 -92 433 1300 641 -303 -629 745 941 504 -755 -617 414
2389 414 698 180 -933 -1231 104 692 -160 -1208 -928 141 801 3 -1519 -523 868 692 -5 -699
2407 -699 -366 810 1269 293 -614 -52 1066 1266 237 -296 277 987 1310 351 -292 -61 533 762 -167
2426 -167 -516 -281 670 539 -498 -945 -551 127 80 -609 -889 -347 62 -100 -334 -427 -400 300 576 -498
2446 -498 -407 165 314 455 191 -9 426 751 844 654 99 268 452 695 419 39 -322 131 311 294 -414
2467 -414 -684 -287 -18 -180 -481 -996 -505 37 7 -801 -986 -756 13 -44 -666 -1032 -304 756 792 -209
$$ packed form
2328D06j07K6k39J63K60N0p6j78J54J53o1J85m23Q8j67j72J90J85l31j18J18j48
2350d2j01k60j17P6N68j39m60m90Q85L05j57l10p25R80N39j47p21k64J376K22
2370A018k72q25P2N71N29k69p27j89N25Q67o59r44l26J374J96m37j259J38J031
2389D14K84n18j113k98J335N88q52j048K80J069O60p98j522R96J391j76o97o94
2407f99L33J176M59r76r07N62J118K00j029n33N73P10L23r59o43K31N94K29r29
2426a67l49K35R51j31j037m47L94O78m7o89k80N42M09j62k34r3K7P00K76j074
2446d98R1N72J49J41k64k00M35L25R3j90n55J69J84K43k76l80l61M53J80j7p08
2467d14k70L97K69j62l01n15M91N42l0q08j85K30P69n7o22l66P28J060L6j001
$$ plain form
2487 -209 -668 92 1078 775 -67 -436 182 1105 896 -294 -792 42 936 666 -440 -1059 -221 1033 276
2506 276 -792 -1157 -412 683 -46 -1083 -1089 -194 688 -112 -1098 -1451 -23 554 287 -900 -924 88 1100
2525 1100 233 -908 -845 454 978 666 -682 -947 758 1017 289 -426 -733 335 862 44 -652 -990
2543 -990 277 702 3 -735 -944 -95 274 -345 -986 -890 148 131 -300 -626 -709 -11 233 75 -571 -552 230
2564 230 318 233 -261 -566 307 654 514 -456 -377 160 639 268 -149 -179 -155 363 194 119 -596 -486 331 26
2586 26 -505 -871 -605 235 97 -583 -1091 -523 377 362 -3 -1025 -229 153 907 -28 -772 -261 666 1179
2606 1179 158 -732 0 881 1244 197 -601 -231 801 826 19 -925 -385 711 719 -273 -1227 -428 579
2625 579 842 -480 -1501 -572 678 791 -338 -978 -113 1081 892 -171 -664 84 1142 1055 -11 -445
$$ packed form
2487b09m59P60R86l03q42l69O18R23k09j190m98Q34Q94k70j106o19Q38J254p57
2506B76j068l65P45J095p29j037oQ95Q82q00r86l53J428N77k67j187k4J012J012
2525A100q67j141O3J299N24l12j348k65J705K59p28p15l07J068N27q18o96l38
2543i90J267M25o99p38k09Q49L69o19o41R6J038j7m31l26q3O98K44j58o46J9P82
2564B30Q8q5m94l05Q73L47j40r70P9N37M79l71m17l0K4N18j69p5p15J10Q17l05
2586B6n31l66K66Q40j38o80n08N68R00j5l65j022P96L82P54r35p44N11R27N13
2606A179j021q90P32Q81L63j047p98L70J032K5q07r44N40J096Qr92r54P99J007
2625E79K63j322j021R29J250J13j129o40Q65J194j89j063m93P48J058q7j066m34
$$ plain form
2643 -445 68 940 814 -461 -579 -170 1025 784 -151 -779 79 949 480 -635 -1039 -196 615 355 -251
2662 -251 -1068 -325 513 392 -496 -694 15 421 355 -124 -214 -72 582 651 -148 -166 32 408 759 76 -26
2683 -26 260 638 607 165 -269 128 794 688 288 -110 -318 522 378 -22 -338 -141 220 558 86 -802 -363
2704 -363 219 348 218 -301 -297 293 738 470 -207 -200 416 1261 465 -423 -31 378 933 338 -327 -56 533
2725 533 889 494 -428 -416 205 837 -274 -761 -819 331 695 -379 -1060 -897 299 752 -157 -803 -615
2744 -615 297 807 131 -760 -677 725 1144 408 -485 99 1024 1392 335 -444 -39 567 1295 426 -544 -596
2764 -596 549 1023 -205 -1079 -815 179 591 -149 -1102 -676 92 -26 -601 -940 -643 53 548 -254 -487
2783 -487 -481 454 522 126 -314 -468 833 519 313 -356 -200 753 531 252 -120 -167 366 491 163 -198 -473
$$ packed form
2643d45N13Q72j26j275j18M09J195k41r35o28Q58Q70m69j115m04Q43Q11k60o06
2662b51q17P43Q38j21q88j98P09M06o6m79r0J42O54O9p99j8J98L76L51o83j02
2683b6K86L78l1m42m34L97O66j06m00l98k08Q40j44m00l16J97L61L38m72q88M39
2704c63N82J29j30n19MN90M45k68o77PO16Q45p96q88L92M09N55n95o65K71N89
2725E33L56l95r22J2O21O32j111m87n8J150L64j074o81J63J196M53r09o46J88
2744f15R12N10o76q91Q3J402M19p36q93N84R25L68j057p79M05O06P28q69r70n2
2764e96J145M74j228q74K64R94M12p40r53M26P68j18n75l39K97O96M95q02k33
2783d87OR35O8l96m40j54J301l14k06o69J56R53k22k79l72m7N33J25l28l61k75
$$ plain form
2804 -473 41 457 213 -711 -631 -303 13 -497 -702 -856 -14 -43 -111 -332 -772 -253 318 -137 -218 -406 50
2825 50 650 422 -179 -189 123 792 714 117 -268 232 654 615 -161 -282 421 684 327 -387 -982 -41 445
2846 445 75 -578 -1043 -467 -88 -371 -814 -1390 -667 293 446 -485 -1156 -368 161 90 -435 -325 243 839
2866 839 376 77 -485 112 830 704 -300 -388 393 778 672 -314 -406 363 577 283 -523 -616 15 276 -310
2887 -310 -682 -962 -460 31 -506 -950 -1213 -134 205 -492 -699 -715 224 492 121 -313 -463 90 678 618
2907 618 -44 57 219 941 430 -74 82 230 591 362 -25 -185 -19 412 134 -95 -541 -212 67 6
2927 6 -131 -357 -789 57 -5 -372 -633 -429 -20 466 -379 -281 -130 313 676 73 -456 399 631 817 167
2948 167 -198 152 991 637 770 -187 -54 713 363 116 -571 -148 423 346 -145 -339 -369 207 227 -489 -824
$$ packed form
2804d73N14M16k44r24Q0L28L16n10k05j54Q42k9o8k21m40N19N71m55q1j88M56
2825E0O00k28o01j0L12O69p8n97l85N00M22l9p76j21P03K63l57p14n95R41M86
2846D45l70o53m65N76L79k83m43n76P23R60J53r31o71P88N29p1n25J10N68N96
2866H39m63k99n62N97P18j26j004q8P81L85j06r86r2P69K14k94q06r3O31K61n86
2887c10l72k80N02M91n37m44k63J079L39o97k07j6R39K68l71m34j50N53N88o0
2907F18o62J01J62P22n11n04J56J48L61k29l87j60J66M31k78k29m46L29K79o1
2927Fj37k26m32Q46o2l67k61K04M09M86q45R8J51M43L63o03n29Q55K32J86o50
2948A67l65L50Q39l54J33r57J33P67l50k47o87M23N71p7m91j94l0N76K0p16l35
$$ plain form
2969 -824 -764 -126 537 -548 -629 -183 254 -17 -425 -422 -71 483 734 99 -377 22 744 838 -52 -223 163
2990 163 653 1021 83 -415 117 475 448 -289 -645 -306 357 412 -23 -594 -409 131 -7 -347 -570 -252 327
3011 327 299 26 -589 -128 -23 241 -319 -448 57 679 191 -224 85 152 855 453 205 -5 356 347 419 -232
3033 -232 -104 29 284 284 -218 -176 164 -42 110 404 -382 -752 -10 62 -63 -752 -494 -207 330 7 -291
3054 -291 -177 260 275 237 -3 -294 447 473 25 111 20 103 567 -47 -24 -272 257 387 108 -181 -282 135
3076 135 292 106 -130 -585 38 50 -68 -682 -293 -34 249 58 -550 -562 -297 212 249 -419 -253 -45 321
3097 321 212 -302 -226 416 295 20 -340 -21 30 322 -74 -597 -74 58 387 -29 -266 -457 77 52 -115
3118 -115 -517 -236 243 167 -89 -285 -282 -35 30 58 -578 -116 193 297 82 -234 68 262 325 -59 -219 295
$$ packed form
2969h24O0O38O63j085q1M46M37k71m08LL51N54K51o35m76L99P22R4q90j71L86
2990A63M90L68r38m98N32L58k7p37l56L39O63N5m35n71J85N40j38l40k23L18N79
3011C27k8k73o15M61J05K64n60j29N05O22m88m15L09O7P03m02k48k10L61rP2o51
3033b32J28J33K55%n02M2L40k06J52K94p86l70P42P2j25o89K58K87N37l23k98
3054b91J14M37J5l8k40k91P41K6m48Q6r1Q3M64o14K3k48N29J30k79k89j01M17
3076A35J57j86k36m55O23J2j18o14L89K59K83j91o08j2K65N09L7o68J66K08L66
3097C21j09n14P6O42j21k75l60L19N1K92l96n23N23J32L29m16k37j91N34k5j67
3118a15m02K81M79p6k56j96LK47O5K8o36M62L09J04k15l16L02J94O3l84j60N14
$$ plain form
3140 295 -57 267 224 198 -191 18 232 350 -381 -185 91 -69 -87 -393 -225 -226 -55 -89 -189 -403 -70 387
3162 387 -154 -275 -389 -290 208 84 68 15 -50 482 10 -220 -91 53 525 496 155 -145 131 387 307 -174
3184 -174 -388 -353 318 287 -372 -463 -27 202 7 -276 -249 -242 33 238 -49 -458 -83 224 170 -172 -97 -152 364
3207 364 20 -361 15 164 386 263 202 -124 77 91 317 -110 -149 89 376 47 -229 58 -140 393 59
3228 59 -150 -549 -125 -99 -100 -63 -432 177 98 279 25 -344 -140 526 287 -25 75 473 520 330 -145 31
3250 31 204 186 407 -188 -3 137 -226 0 -161 -108 -46 403 503 -121 32 212 177 54 -4 -361 -200 -80
3272 -80 -105 -340 54 153 -63 192 -149 -316 12 362 -229 -68 37 167 241 295 166 -36 28 146 157 269
3294 269 251 -114 92 -197 152 76 -165 -191 -21 -219 -192 106 -41 18 132 -241 -216 -28 -290 28 -338 -3
$$ packed form
3140B95l52L24m3k6l89K09K14J18p31J96K76j60j8l06J68jJ71l4j00k14L33M57
3162C87n41j21j14R9M98j24j6n3o5N32m72k30J29J44M72k9l41l00K76K56q0m81
3184a74k14L5O71l1o59r1M36K29j95k83K7PK75K05k87m09L75L07n4l42P5n5N16
3207C64l44l81L76J49K22j23o1l26K01J4K26m27l9K38K87l29k76K87j98N33l34
3228E9k09l99M24K6jL7l69O09p9J81k54l69K04O66k39l12J00L98M7j90m75J76
3250C1J73j8K21n95J85J40l63K26j61N3O2M49J00o24J53J80l5j23n8l57J61J20
3272h0k5k35L94R9k16K55l41j67L28L50n91J61J05J30P4N4j29k02O4J18J1J12
3294B69j8l65K06k89L49p6k41k6J70j98K7K98j47N9J14l73K5J88k62L18l66L35
$$ plain form
3316 -3 209 163 116 43 -201 -7 155 185 61 75 427 180 -191 30 -111 175 13 -231 -534 -258 139 156 12
3339 12 42 -168 39 82 -121 -236 66 24 16 -128 -310 69 188 -10 91 -132 216 23 170 231 64 -86
3361 -86 -114 243 -93 436 -77 253 342 -74 -75 70 188 -99 321 -86 141 143 -327 234 -251 -120 -65 -55 -183
3384 -183 -228 136 -105 -128 -54 72 77 17 -51 -202 -93 -200 -97 195 86 -17 48 133 132 229 -179 -24 52 202
3408 202 231 75 50 41 -64 168 117 15 167 337 441 -142 -21 -436 -151 -102 -491 -153 -145 339 -164 -67 -150
3431 -150 -66 -69 -7 -120 172 -28 -349 157 -181 142 243 -26 24 -118 -229 -16 259 176 -178 77 74 109 -23
3454 -23 -148 178 34 83 191 -87 226 -20 312 81 -195 41 -136 -74 -155 -97 46 -51 186 61 -185 77
3476 77 3 -217 -41 -93 25 -209 -38 16 -22 26 220 -147 -156 96 127 30 170 113 -33 -67 226 -71 -230 50
$$ packed form
3316cK12m6m7p3k44J94J62L0j24J4L52k47l71K21j41K86j62k44l03K76L97J7j44
3339A2L0k10K07M3k03j15L02m2qj44j82L79J19j98J01k23L48j93J47O1j67j50
3361h6k8L57l36N29n13L30Q9m16jJ45J18k87M20m07K27Km70N61m85J31N5J0j28
3384a83m5L64k41k3P4J26No0o8j51J09j07J03K92j09j03O5Q5jR7m08J55P6J50
3408B02K9j56k5rj05K32n1j02J52J70J04n83J21m15K85M9l89L38QM84n03R7q3
3431a50Q4lO2j13K92k00l21N06l38L23J01k69N0j42j11K13K75q3l54K55lL5j32
3454b3j25L26j44M9J08k78L13k46L32k31k76K36j77O2q1N8J43r7K37j25k46K62
3476G7p4k20J76n2J18k34J71N4l8M8J94l67rK52L1r7J40n7j46l4K93k97j59K80
$$ plain form
3500 50 -102 -133 -41 133 -80 71 92 -28 123 -154 14 -38 116 184 -122 142 -253 -240 78 -283 -18 -72 -121
3523 -121 -32 48 -293 -96 -47 -107 212 -3 12 -84 -14 136 34 169 -67 286 -78 -122 58 135 202 -145 -161 159
3547 159 -91 139 33 -5 -32 -14 -201 -66 24 -331 -81 104 28 81 -83 -312 106 187 -94 -221 46 -7 -219
3570 -219 294 248 2 30 116 -74 51 144 126 -192 15 -3 -4 11 258 10 -25 65 -72 -5 79 153 -102 -8 136
3595 136 -131 -7 -311 -211 -76 158 254 -16 332 140 259 -191 195 189 156 141 230 -63 180 267 -9 -221
3617 -221 181 90 200 -14 -185 104 182 103 2 -64 -99 36 27 -10 -17 113 -79 -315 -199 100 -52 102 -4
3640 -4 -123 120 -85 114 -78 62 143 -35 423 485 325 195 73 35 -81 -49 -18 45 242 -107 207 227 -43
3663 -43 -155 -88 -263 209 -119 116 32 237 -439 -78 59 88 -7 53 35 -240 94 -282 136 191 -54 183 4
$$ packed form
3500E0j52l1R2J74k13J51K1j20J51k77J68n2J54O8l06K64l95J3L18l61K65n4m9
3523a21Q9Q0l41J97M9o0L19k15J5r6P0J50j02J35k36L53l64m4J80P7O7l47j6L20
3547A59k50K30j06l8k7J8j87J35R0l55K50J85p6N3j64k29M18Q1k81j27K67n3k12
3570b19N13m6k46K8Q6j90J25R3j8l18K07j8jJ5K47k48l5R0j37O7Q4P4k55R4J44
3595A36k67J24l04J00J35K34R6k70L48j92J19m50L86ol3j5Q9k93K43Q7k76k12
3617b21M02r1J10k14j71K89P8p9j01o6l5J35rl7pJ30j92k36J16K99j52J54j06
3640dj19K43k05J99j92J40Q1j78M58O2j60j30j22l8j16L2L1O3J97l49L14K0k70
3663d3j12O7j75M72l28K35q4K05o76L61J37K9r5O0j8k75L34l76M18N5k45K37j79
$$ plain form
3686 4 83 -26 -144 100 -22 -99 296 6 -118 -199 -132 173 64 30 -64 108 -204 110 -216 66 30 -94 -116
3709 -116 -45 -126 -353 138 305 -26 83 -37 -177 211 -98 14 97 -64 -51 81 234 53 11 258 -126 130
3731 130 -186 148 349 -173 115 -98 151 -145 -240 116 -112 158 -134 -259 -177 -423 48 73 -405 -255 106
3752 106 -57 -134 -108 -190 -209 39 225 -294 -248 -37 -5 67 78 -124 -59 -286 195 27 89 -311 123 326 131
3775 131 -163 5 77 63 13 -38 -225 -281 -19 -6 2 -5 111 -137 -199 -147 100 -105 -74 -195 -91 -95 29 -118 6
3800 6 135 -198 102 25 370 60 23 164 292 321 351 -24 -85 -89 -309 61 96 -166 -3 -151 -168 -267 -234 191
3824 191 -163 19 -112 -22 366 -57 67 129 -174 99 178 221 292 83 212 303 -252 -105 -134 11 -87 -226 -246
3847 -246 181 -93 -84 127 23 80 -30 140 -25 -67 -171 148 -156 61 -225 6 -47 -39 123 -215 -124 -258 81
$$ packed form
3686DP9j09j18K44j22p7L95k90j24q1O7L05j09l4r4J72l12L14l26K82l6j24k2
3709a16P1q1k27M91J67l31J09j20j40L88l09J12Q3j61J3J32J53j81m2K47l84K56
3731A30l16L34K01n22K88k13K49k96r5L56k28K70k92j25Q2k46M71K5m78J50L61
3752A06j63p7K6q2j9K48J86n19M6K11L2P2J1k02O5k27M81j68O2m00M34K03j95
3775A31k94J68P2j4n0n1j87n6K62J3QpJ16k48o2N2K47k05L1j21J04mJ24j47J24
3800FJ29l33L00p7L45l10l7J41J28K9L0l75o1mk20L70L5k62J63j48j7r9L3M25
3824A91l54J82j31R0L88m23J24O2l03K73P9M3P1k09J29R1n55J47k9J45r8j39k0
3847b46M27k74RK11j04N7j10J70j65m2j04L19l04K17k86K31n3QJ62l38R1j34L39
$$ plain form
3870 81 -111 101 -173 -85 110 103 164 179 -6 90 -3 28 87 -44 64 38 24 1 -88 -160 25 50 71 172 106 -84
3896 -84 188 243 -36 228 -43 6 -21 -118 213 45 -167 13 -356 -67 150 208 -90 -21 175 -149 -42 -246
3918 -246 287 284 211 -98 177 -53 -98 -54 180 30 45 -76 -2 -223 -9 217 32 209 -89 -282 5 -47 293
3941 293 -48 -5 -296 318 22 29 145 150 204 279 133 158 234 195 227 59 -11 -175 15 121 231 -103 319 -60
3965 -60 231 -117 99 -134 219 -286 -25 -109 154 49 34 -48 170 323 262 -67 -65 -92 100 -90 -268 -251 -321
3988 -321 200 166 76 -202 -25 -193 -2 19 -92 262 55 48 71 52 167 234 -101 -22 -82 132 145 26 -264 20
4012 20 45 36 -119 8 -178 -7 -84 176 -125 -219 -90 20 -65 53 -34 83 -207 -114 -54 -377 316 26 -18 155
4036 155 244 88 178 -115 -109 -188 -56 84 -40 -212 48 -126 -140 -108 -267 165 230 62 -190 50 -57 82 -271
$$ packed form
3870H1j92K12k74Q8J95pO1J5j85R6r3L1N9j31J08k6j4k3q9p2J85K5K1J01o6j90
3896h4K72N5k79K64k71M9k7r7L31j68k12J80l69K89K17N8k98O9J96l24J07k04
3918b46N33lp3l09K75k30m5M4K34j50J5j21P4k21K14K26j85J77k98j93K87n2L40
3941B93l41M3k91O14k96PJ16NN4P5j46K5P6l9L2j68p0j64J90J06J10l34M22l79
3965f0K91l48K16k33L53n05K61q4K63j05j5q2K18J53o1l29Kk7J92j90j78J7p0
3988c21N21l4r0k78J77j68J91K1j11L54k07pK3j9J15O7l35P9o0K14J3j19k90K84
4012B0K5rj55J27j86J71p7K60l01r4J29J10q5J18q7J17k90R3O0l23O93k90m4J73
4036A55Q9j56R0k93Op9J32J40j24j72K60j74j4L2j59M32O5j68k52K40j07J39l53
$$ plain form
4059 -271 152 -192 -189 181 -176 253 164 -91 -80 57 -107 2 31 28 238 -117 112 52 -176 55 139 122 -35
4082 -35 78 -143 -129 161 -39 -117 105 77 -271 -103 -159 -330 101 -150 -40 263 117 -57 74 56 67 151 -162
4105 -162 42 -21 -435 -7 -112 -138 -170 20 -22 155 -4 -3 -156 -52 -294 -139 -12 -78 106 109 38 78 340 242
4129 242 76 -138 105 -36 303 186 -105 -184 67 -166 132 188 231 45 -190 77 49 34 187 -140 -263 -200
4151 -200 114 243 31 29 31 152 300 -20 253 100 110 -33 129 -124 -24 279 -32 82 14 57 57 23 59 134
4175 134 174 255 175 -441 209 71 108 264 -8 -60 298 56 118 -222 -181 76 -87 73 -298 247 169 83 -43
4198 -43 95 20 -50 17 63 113 65 217 44 -50 118 180 136 53 -44 -106 196 322 -57 -254 204 -6 135 213 94
4223 94 85 -36 260 -177 -57 12 -107 145 51 71 -140 120 28 -82 -69 160 427 62 -106 12 -54 -82 -144 -61
$$ packed form
4059b71M23l44LL70l57M29q9k55J1J37j64J09K9lK10l55K29o0k28K31Q4j7j57
4082c5J13k21J4K90k00p8K22k8l48J68n6j71M31k51J10L03j46j74J31j8J1Q4l13
4105a62K04o3m14M28j05k6l2J90m2J77j59Jj53J04k42J55J27o6J84Lp1M0K62r8
4129B42j66k14K43j41L39j17k91p9K51k33K98N6M3j86k35K67k8j5J53l27j23O3
4151b00L14J29k12kKJ21J48l20K73j53J0j43J62k53J00L03l11J14o8M3%l4L6P5
4175A34M0Q1q0o16O50j38L7J56k72n2L58k42O2l40M1K57j63J60l71N45p8q6j26
4198d3J38p5p0O7M6N0m8J52j73r4J68O2m4q3r7o2L02J26l79j97M58k10J41P8j19
4223I4rj21K96m37J20O9j19K52r4K0k11K60r2j10J3K29K67l65j68J18o6k8o2Q3
$$ plain form
4247 -61 232 -119 -35 -176 129 24 375 -89 161 -281 129 -144 -80 -259 -51 -233 253 176 296 21 -2 184
4269 184 244 14 43 105 45 -123 29 -215 9 -47 59 341 -82 62 -82 -175 -72 208 224 -41 -83 -50 27
4292 27 -100 61 42 -25 121 84 -116 -97 -135 161 109 292 30 -117 132 -119 -177 -254 106 -5 33 -53 179 -134
4316 -134 188 -188 -207 56 -122 -64 142 -93 100 222 134 -95 71 -185 168 -53 -212 0 205 -121 -196
4337 -196 82 44 -69 -239 244 -166 197 22 77 -177 43 20 264 -197 -120 -214 -232 119 13 -219 -40 81
4359 81 58 55 143 155 68 22 205 94 87 71 -296 35 -167 -295 -48 -124 92 83 -50 -3 39 -270 -69 155 -208
4384 -208 -8 -39 -208 -65 62 -21 -104 151 -14 -5 173 -42 16 51 396 60 -151 10 -158 40 16 13 -167
4407 -167 -112 -102 -256 95 0 190 -145 -48 -286 279 119 126 125 286 -268 -141 62 17 -92 -206 185 -62 -24
$$ packed form
4247f1K93l51Q4j41L05j05L51m64K50m42M10k73O4j79K08j82M86p7J20k75k3J86
4269A84O0k30K9O2o0j68J52k44K24n6J06K82m23J44j44r3J03K80J6k65m2L3P7
4292B7j27J61j9o7J46l7k00J9l8K96n2J83k62j47K49k51n8p7L60j11L8q6K32l13
4316a34L22l76j9K63j78N8K06k35J93J22q8k29J66k56L53k21j59K12K05l26p5
4337a96K78l8j13j70M83m10L63j75N5k54K20k3K44m61P7r4j8L51j06k32J79J21
4359H1k3lQ8J2q7m6J83j11pj6l67L31k02j28K47p6K16rj33M7M2l09K01K24l63
4384b08K00l1j69J43J27q3q3K55j65RJ78k15N8L5L45l36k11J61j68J98k4lj80
4407a67N5J0j54L51r5J90l35R7k38N65j60PjJ61n54J27K03m5j09j14L91k47L8
$$ plain form
4430 -24 -61 -1 81 -4 5 6 -250 -296 -187 95 174 48 55 -47 66 -97 9 -324 304 140 55 -136 -171 -370 25
4455 25 -46 -163 -68 -143 310 117 231 -101 95 206 65 -216 -359 310 183 81 14 -20 -25 211 -186 57 24
4478 24 -112 33 -16 -137 169 163 131 -181 36 183 95 19 200 -243 18 -56 -210 144 -357 100 -152 182 -122
4501 -122 -121 -45 -37 -40 18 20 -387 312 -78 55 303 -15 -123 -287 321 -154 89 -55 -239 -56 -75 -124 57 -64
4525 -64 -44 18 -75 -243 122 -267 -333 62 -154 -16 313 -115 265 94 -33 39 38 188 58 13 144 -216 -32
4548 -32 272 217 214 143 86 -34 181 201 73 -164 -125 -239 -143 181 -78 -137 206 -421 262 -31 79 113 -85 73
4572 73 70 -2 -127 145 90 -178 -419 220 0 -173 14 238 -265 90 -301 -283 234 148 282 -184 -255 -167 65
4595 65 281 -55 156 62 -106 -77 -74 45 60 -70 -329 -1 -91 189 338 78 -156 121 -88 3 293 159 -139
$$ packed form
4430b4l7O0Q2q5RJk56m6J09K82P9j26Pj02J13j63J06l33O28j64q5j91l5j99L95
4455B5p1j17R5p5M53j93J14l32J96J11j41k81j43O69j27j02o7l4nK36l97K43l3
4478B4j36J45m9j21L06ol2l12K17J47q8p6J81m43K61p4j54L54n01M57k52L34l04
4501a22JP6QlN8Km07O99l90J33K48l18j08j64O08m75K43j44j84J83j9m9J81j21
4525f4K0O2r3j68L65l89o6L95k16J38L29m28L80j71j27P2jJ50j30m5J31l60J84
4548c2L04n5lp1n7j20K15K0j28k37L9j14R6L24k59n9L43o27O83k93J10L4j98J58
4572G3lp2j25K72n5k68k41O39k20j73J87K24n03L55l91J8N17q6J34m66p1Q8K32
4595F5K16l36K11r4j68K9LJ19J5j30k59L28r0K80J49k60k34K77k09R1K90j34k98
$$ plain form
4618 -139 40 89 -88 -227 166 196 43 -254 139 27 101 132 37 164 -135 -87 -86 -238 -44 -68 -105 206 -234
4641 -234 -79 -132 155 -52 -145 -15 110 -340 100 113 -95 319 70 -59 11 -16 -63 261 -76 -157 22 -145
4663 -145 -153 -57 156 -50 6 -92 -305 -23 -132 -267 14 25 -376 40 31 -263 -287 -366 105 -117 -218 200 215 -46
4687 -46 90 160 -7 -184 236 195 -218 -92 27 215 -50 -45 -122 24 360 90 25 97 -253 22 44 -106 -321
4710 -321 -108 133 -212 -290 320 167 69 -76 -96 192 -308 -56 -197 192 295 100 -131 -78 13 -110 310 83
4732 83 -314 -219 263 280 -222 -172 -62 -111 104 74 -200 -289 -82 124 -330 35 48 -403 -191 15 240 94 -94
4755 -94 -300 108 -44 157 241 -83 -260 -146 67 131 129 124 -85 -12 91 97 68 55 -53 -142 211 25 75 27 -116
4780 -116 56 -206 42 34 -226 -17 267 31 -29 -224 -160 46 -24 -2 -164 -122 291 198 190 -63 50 -146 -42
$$ packed form
4618a39J79M9j77j39L93L0j53k97L93j12P4L1r5J27k99M8Jj52J94k4l7L11m40
4641b34J55n3K87k07r3J30J25m50M40J3k08M14k49j29P0k7m7L24l37q1J79j67
4663a45qR6K13k06N6r8k13K82j09j35K81J1m01M16rk94k4p9M71k22j01M18J5k61
4687d6J36P0j67j77M20m1m13J26J19J88k65Np7J46L36k70o5P2l50K75K2j50k15
4710c21K13K41l45p8O10j53r8j45k0K88n00K52j41L89J03j95k31N3R1j23M20k27
4732H3l97R5M82J7n02N0J10m9K15l0k74q9K07K06m54L65J3m51K12K06K25j46j88
4755i4k06M08j52K01Q4l24j77J14K13O4knk09P3J03Ok9j3j08q9L53j86N0m8j43
4780a16J72k62K48qk60K09K84k36o0j95O4K06p0K2j62M2M13r3qk53J13j96J04
$$ plain form
4803 -42 260 -44 49 -158 145 -251 -5 97 -109 110 430 54 -6 -66 -75 135 178 -108 -157 147 -80 175 -91
4826 -91 -77 174 -17 -57 -9 -108 -188 -61 96 109 -120 -201 185 574 51 152 48 128 55 -244 -65 199 -94
4849 -94 139 -99 180 8 -36 -182 -218 54 -59 47 -141 53 66 -12 214 201 -240 122 318 50 -116 -8
4871 -8 49 147 368 -278 183 -191 190 223 -166 49 -271 -173 59 207 85 83 171 -124 105 -128 190 59 67 120
4895 120 -81 24 49 -197 -201 179 131 25 133 28 -278 -56 -241 49 141 -28 -125 -102 -114 -52 161 215 -121
4918 -121 -105 -96 10 -237 -120 -19 -11 7 12 97 -365 -117 -220 180 149 -96 -170 143 143 -79 107 149 273 -9 -195
4943 -195 -280 -278 5 5 186 229 -184 266 -34 110 -209 -39 -50 -34 -123 -169 180 -73 16 159 -331 -261 126 230
4967 230 -268 -18 324 -95 243 -223 154 73 175 54 -162 245 319 -137 -146 -129 5 35 51 88 161 295 168
$$ packed form
4803d2L02l04R3k07L03l96K46J02k06K19L20l76o0o0rK10M3k86m9L04k27K55k66
4826i1J4K51j91m0M8r9q0J27J57J3k29q1L86L89n23J01j04Q0p3k99J79K64k93
4849i4K33k38K79j72m4j46l6K72j13J06j88J94J3p8K26j3m41L62J96k68j66J08
4871hN7R8K21o46M61l74L81L3l89K15l20R8K32J48j22kQ8k95K29k33L18j31QN3
4895A20k01J05K5k46mL80m8j06J08j05l06K22j85K90R2j69r7K3j2O2K13N4l36
4918a21J6RJ06k47J17J01QJ8NQ5m62K48j03M00l1k45p4L13%k22J86M2J24k82j86
4943a95q5KK83%J81M3m13M50l00J44l19J70j1J6q9m6L49k53Q9J43m90P0L87J04
4967B30m98K50L42m19L38m66L77q1J02j21k16M07P4m56rJ7J34L0J6L7P3J34j27
$$ plain form
4990 168 -209 163 36 -15 -27 222 -37 158 51 -51 304 31 312 10 -118 -287 -481 113 286 -75 -145
5011 -145 243 283 276 9 -262 -139 89 -184 -108 -94 -144 7 68 17 -119 117 215 216 -236 -412 -210 88 19 -66
5035 -66 -221 271 -77 98 211 -339 -320 -30 184 126 -124 145 -126 137 147 23 -27 -35 52 -312 134 -15 27
5058 27 167 -140 -134 -174 4 119 -79 122 -1 -22 -218 152 -57 144 45 -393 282 -77 -89 109 18 -52 148
5081 148 148 -15 -206 -96 6 -305 61 11 -25 175 71 178 -84 263 -320 19 -73 468 47 -156 84 41
5103 41 159 -63 129 -24 253 -482 -60 -35 186 -167 72 -239 -188 96 147 33 -3 -112 -204 179 17 210
5125 210 -188 252 -44 121 -96 99 144 156 25 -51 259 44 66 -252 -226 -116 38 158 162 -24 179 37
5147 37 -64 243 -267 -69 -131 -138 -154 -45 -4 28 -18 123 -157 135 162 -173 345 20 -29 -4 -23 71 376 -36
$$ packed form
4990A68l77L72j27n1j2K49k59J95j07j02L55k73K81l02j28j69j94N94J73l61p0
5011a45L88M0pk67k71J23K28k73P6J4n0J51O1n1j36K36R8Jm52j76K02K98o9q5
5035f6j55M92l48J75J13n50J9K90K14n8k50K69k71K63J0j24n0qQ7l64M46j49M2
5058B7J40l07Om0J78J15j98K01j23k1j96L70k09K01r9m38O75l59j2J98r1p0K00
5081A48%j63j91J10J02l11L66n0l6K00j04J07k62L47n83L39r2N41m21k03K40m3
5103D1J18k22J92j53K77p35M22K5K21l53K39l11N1K84N1j14l6j09r2L83j62J93
5125B10l98M40k96J65k17J95M5J2j31p6L10k15K2l18K6J10J54J20Mj86K03j42
5147C7j01L07n10J98o2pj6J09M1L2m6J41k80K92K7l35N18l25m9K5j9R4L05m12
$$ plain form
5171 -36 -63 -47 -31 -142 37 248 -90 171 185 -36 34 121 90 -212 11 -164 22 -210 -74 212 134 -43 17
5194 17 -346 180 64 -44 339 -230 -204 123 211 -76 -145 -297 -142 296 -53 -76 -99 17 60 42 -16 23 184
5217 184 48 118 214 324 -84 -16 -53 56 -294 25 171 97 -3 -45 115 -157 191 260 -66 -95 -147 104 147
5240 147 96 -175 100 247 52 -82 120 34 90 236 106 84 169 -105 -121 6 -57 79 137 -131 -35 85 40
5263 40 73 -132 0 -106 196 163 -68 87 21 75 142 -116 -177 188 144 171 -51 -42 -159 265 96 -226 141 110
5287 110 -84 80 -192 -3 38 -195 164 81 81 179 -49 -114 2 -56 217 145 -16 -67 29 -287 238 114 -341
5310 -341 -60 -124 104 -173 -293 245 24 128 191 8 39 209 94 29 -117 184 143 41 -65 33 212 41
5332 41 242 164 -153 112 -72 -107 185 -152 -182 64 -78 -193 70 170 -17 -139 -61 -164 -53 -67 50 -13
$$ packed form
5171c6k7J6J6j11J79K11l38K61J4k21P0Q7l1l02K23j75J86k32J36K86p8j77O0
5194A7l63N26j16j08L83n69K6L27Q8k87o9j52J55M38l49k3k3J16M3j8n8L9J61
5217A84j36P0R6J10m08O8l7J09l50L19J46p4j00m2J60k72L48O9l26k9n2K51M3
5240A47n1k71K75J47j95j34K02q6N6J46j30k2Q5k74j6J27o3J36N8k68R6J20m5
5263D0L3k05J32j06L02l3k31J55o6N4O7k58o1L65m4K7k22Rj17M24j69l22L67l1
5287A10j94J64k72J89M1k33L59q3%R8k28o5J16n8K73p2j61n1R6l16N25j24m55
5310c41K81o4K28k77j20N38k21J04O3j83L1J70j15o5j46L01m1j02j06R8J79j71
5332D1K01p8l17K65j84l5K92l37l0K46j42j15K63J00j87j22P8j03J11j4J17o3
$$ plain form
5354 -13 -197 -111 -9 -75 153 256 123 -74 -44 7 134 225 -301 314 192 114 98 -235 -191 46 142 -235 1
5377 1 167 151 -57 -348 153 -192 390 124 -266 4 -63 -65 63 -253 -122 129 -185 48 -167 185 -280 24
5399 24 -87 -50 -372 86 293 -87 -39 148 -166 2 170 -182 -295 289 -85 -165 -41 -103 -94 -87 -265 169 -2
5422 -2 42 38 -53 -74 -128 -41 -61 -44 -122 -103 -205 -95 -104 185 140 -148 249 -25 88 -102 -278 36 284 229 -251 -55
5448 -55 91 111 36 135 -223 -123 24 233 314 -135 -62 46 -158 70 45 -217 49 178 -14 -142 -106 -27 -266
5471 -266 0 -67 154 138 -12 -58 106 -62 129 94 42 226 168 -167 -174 51 28 113 -167 -337 -25 212 -76
5494 -76 -6 -157 -100 195 -140 -32 -78 469 162 -62 42 143 -39 -79 36 -51 -99 -274 -149 6 393 130
5516 130 208 288 86 83 -121 -346 67 -397 73 -29 -272 229 -228 -176 282 -98 -166 -77 -67 184 221 -158 -138
$$ packed form
5354a3j84Q6J02o6K28J03j33j97L0N1J27R1n26O15j22p8j6l33M4K37R6l77K36
5377AJ66j6k08k91N01l45N82k66l90K70o7kJ28l16J31K51l14K33k15L52m65L04
5399B4j11L7l22M58K07l80M8J87l14J68J68l52j13N84l74q0J24o2RPj78M34j71
5422bM4mr1k1n4Q7k0J7p8J9j02J10rK89m5k88L97k74J13j90j76L14K48n5m80J96
5448e5J46K0p5R9l58J00J47K09Q1m49P3J08k04K28k5k62K66J29j92j28L6P9k39
5471b66K66o7K21j6j50m6J64j68J91l5n2J84n8l35pK25k3Q5k80j70L12K37k88
5494g6P0j51N7K95l35J08m6N47l07k24J04J01j82m0J15q7m8j75J25J55L87k63
5516A30P8Q0k02lk04k25M13m64M70j02k43N01m57N2M58l80o8Q9J0K51L7l79K0
$$ plain form
5539 -138 -19 -106 178 -176 -192 26 -39 -113 96 -11 -6 -35 60 190 58 124 -70 -170 298 162 328 -163 60
5562 60 -27 267 100 399 208 57 -44 359 -4 -183 -62 226 133 -28 76 -58 106 -38 -28 49 -78 -54
5584 -54 254 296 198 121 -183 -20 22 -93 -8 189 287 -23 350 -10 188 -394 -9 150 228 60 289 -388 -7
5607 -7 -151 182 134 -159 -66 -44 -59 185 -77 -179 132 -47 4 94 125 -256 8 160 -93 84 76 131 134 5 -36
5632 -36 -20 147 192 309 -207 24 213 210 -88 240 -142 -27 -48 -123 123 250 -103 7 -96 -261 85 -22
5654 -22 61 -186 -117 -49 33 -28 -153 -2 -20 160 30 257 25 21 116 43 -93 -94 -3 -39 299 29 133 69 -186
5679 -186 -163 -178 -183 210 97 213 -75 146 43 -147 -139 -56 -128 -25 -43 191 -19 127 -101 17 52 -112 -224
5702 -224 2 -115 18 -191 -15 -25 -243 -3 58 137 46 238 169 103 327 256 -238 25 107 60 98 -108 63
$$ packed form
5539a38J19q7K84l54j6K18o5p4K09j07Nk9R5J30j32O6j94j00M68j36J66m91K23
5562F0q7K94j67K99j91j51j01M03l63j79J21K88r3j61J04j34J64j44J0P7j27K4
5584e4L08M2r8p7l04J63M2j15Q5J97R8l10L73l60J98n82L85J59P8j68K29o77L81
5607gj44L33m8k93R3K2j5K44k62j02L11j79N1R0L1l81K64J52k53J77qN5Lj29m1
5632c6J6J67M5J17n16K31J89lk98L28l82J15k1p5K46J27l53J10j03j65L46j07
5654b2Q3k47O9O8Q2o1j25J51j8J80j30K27k32mR5p3j36jR1l6L38k70J04o4k55
5679a86K3j5nL93j13J16k88K21j03j90QQ3p2J03j8K34k10J46k28J18L5j64j12
5702b24K26j17J33k09J76j0k18K40O1P9r1J92o9o6K24p1m94K63Q2m7L8k06J71
$$ plain form
5725 63 61 -43 36 -140 146 -152 -176 -229 -64 8 201 21 -41 100 -104 297 -22 -21 -312 -218 48 170 34 118
5749 118 226 67 -105 -31 63 27 -53 -94 -88 104 26 -73 -348 -146 156 147 -117 -158 -170 22 -86 -393 -183 60
5773 60 203 -58 153 -30 -115 -76 -95 -118 -267 -10 114 117 316 159 -143 154 23 126 -82 -94 -6 66 117 23
5797 23 182 -56 470 -51 393 -79 -37 349 -180 142 -111 141 214 47 -17 83 -1 -97 265 256 57 -73 -122
5820 -122 77 112 93 141 24 97 -158 -101 -25 275 170 -43 161 17 27 27 -234 65 83 -87 9 32 329 103
5844 103 312 -46 268 91 -58 -169 -121 138 106 -179 -223 -214 84 -134 47 -111 -86 151 -86 85 136 -53
5866 -53 350 -124 152 86 -103 100 13 23 -48 -249 -8 43 -98 77 69 -132 -324 36 -121 417 161 20 208
5889 208 -101 -50 -290 273 39 170 46 38 144 116 -216 -253 186 44 292 -40 264 -8 131 295 67 101
$$ packed form
5725F3kj04P9j76K86k98k4n3J65P2J93j80o2J41k04M01l19Jk91R4K66J22j36Q4
5749A18J08j59j72P4R4l6q0m1OJ92p8r9k75K02L02rk64m1j2J92j08l07K10K43
5773F0J43k61K11j83q5L9j9k3j49K57J24LJ99j57l02K97j31J03k08j2Q8P2N1r4
5797B3J59k38N26n21M44m72M2L86n29L22k53K52P3j67o4J00q4r6L62rj99j30m9
5820a22J99L5j9M8j17P3k55N7P6L00j05k13K04j44J0%k61K99J8j70R6K3K97k26
5844A03K09l58L14j77j49j11M8K59l2k85m4RK98k18J81j58K5K37k37J71N1j89
5866e3M03m74K76o6j89K03q7J0p1k01K41N1j41J75qk01j92L60j57N38k56j41J88
5889B08l09N1k40N63k34J31j24qJ06k8l32l7M39j42K48l32L04k72J39J64k28L4
$$ plain form
5911 101 156 -41 -49 78 176 47 -80 83 -28 -143 138 118 -162 85 -133 309 8 225 323 -11 -39 37 113
5934 113 80 28 114 240 239 34 -151 238 -40 248 -96 -53 -212 -115 -119 -11 -72 89 104 -28 130 85 -62 32
5958 32 151 15 46 6 -19 -144 2 1 46 256 185 -125 55 -4 141 45 -93 45 -24 -186 163 -332 -31 129
5982 129 -126 165 132 -125 309 14 198 -256 -62 -17 -270 -3 80 293 -66 53 195 223 162 -197 -97 113
6004 113 -252 16 199 -11 78 119 -10 278 -134 -39 155 102 82 -9 125 -236 -96 93 -333 24 -339 -104
6026 -104 235 26 371 -95 110 -230 104 29 -90 139 -41 10 186 96 19 -10 -87 -78 3 181 -13 -38 200
6049 200 -43 -237 -69 78 -3 -4 8 204 171 62 63 30 20 -241 80 137 84 69 142 -172 118 77 -201 -273 54
6074 54 -36 102 21 135 -62 140 108 107 -56 -66 132 40 44 -151 -239 -159 211 -222 65 46 167 346 -172 139
$$ packed form
5911A01N5j97qJ27R8j29j27J63j11j15K81k0k80K47k18M42l01K17R8l34k8P6P6
5934A13l3n2Q6J26jk05j85L89k78K88l44M3j59R7mJ08o1J61J5j32J58m5j47R4
5958C2J19j36L1m0k5j25J46jM5K10p1l10J80n9J45r6j38J38o9j62L49m95L01J60
5982A29k55K91l3k57M34k95J84m54J94M5k53K67Q3K13l59J19J42K8o1l59J00K10
6004A13l65K68J83k10Q9M1j29K88m12R5J94n3k0r1J34l61J40J89m26L57l63K35
6026a04L39k09L45m66K05l40L34p5j19K29j80N1J76r0p7k9p7RQ1J78j94k5K38
6049B00k43j94J68J47q1jJ2J96l3j09Jl3j0k61L21N7n3j5P3l14K90m1k78p2L27
6074E4r0J38q1J14j97K02l2jj63j0J98r2Mj95q8Q0L70m33K87j9J21J79n18L11
$$ plain form
6098 139 -219 -100 -18 137 61 -186 -60 20 49 71 154 81 -132 -146 -44 114 117 -72 -22 -234 34 -191 -79 95
6122 95 67 -118 -206 164 -2 8 36 -78 -192 -43 53 -235 -113 -82 -197 -24 341 53 84 2 -221 215 151
6145 151 -87 119 8 -122 -62 197 158 -182 -111 -112 120 -95 49 243 74 60 76 21 -294 -27 135 -308 62
6168 62 38 256 -40 261 130 -83 -335 -124 3 -11 -134 -251 -113 351 -98 -161 -16 -31 79 163 -197 -73
6190 -73 -209 -142 -158 -243 67 -29 35 -116 125 -167 -67 -77 -208 24 -191 81 101 -152 41 -302 85 -143 -134
6213 -134 263 132 57 -19 202 -269 -168 33 -164 -92 -3 42 -73 62 -206 -145 251 77 -48 102 -410 -323
6235 -323 -191 253 264 -153 5 76 179 -134 -22 223 321 -139 95 124 104 -63 106 -75 119 -1 272 -4
6257 -4 -238 41 22 272 143 11 -156 -75 3 -95 -224 71 7 152 -141 -246 48 -81 -62 175 216 59 -125
$$ packed form
6098A39l58J19Q2J55p6k47J26Q0K9K2Q3p3k13j4J02J58Lj89N0k12K68k25J12J74
6122I5k8j85q8L70j66J0K8j14j14J49R6k88J22L1j15J73L65k88L1q2k23M36o4
6145A51k38K06j11j30O0K59l9l40P1jK32k15J44J94j69j4J6n5l15K67J62m43L70
6168F2k4K18k96L01j31k13k52K11J27j4j23j17J38M64m49o3J45j5J10Q4l60J24
6190g3j36O7j6q5L10r6O4j51K41k92J00j0j31K32k15K72K0k53J93l43L87k28R
6213a34L97j31p5p6K21m71J01K01j97P2Q9M5j15J35k68O1L96j74j25J50n12Q7
6235c23J32M44J1m17J58P1J03l13J12K45R8m60K34K9k0j67J69j81J94j20K73k76
6257dk34K79j9K50j29j32j67Q1P8r8j29K95o4J45k93j05K94j29J9K37M1j57j84
$$ plain form
6280 -125 17 -17 13 240 69 -29 -262 -171 174 83 -114 -50 -215 28 -15 48 -271 193 -94 167 109 -235 -114
6303 -114 -56 95 -164 156 -43 -202 -277 160 -251 -55 9 -24 -237 -113 307 95 49 29 -8 -208 33 -45 -21
6326 -21 256 -110 207 -274 125 -70 297 114 129 267 126 109 317 191 -389 264 46 111 99 162 97 66 -217
6349 -217 -242 328 140 -287 -44 203 318 -267 -183 51 162 -138 -38 55 -226 82 -336 3 88 32 68 67 3
6372 3 -101 31 -11 -179 -46 -105 184 167 122 88 -7 -94 43 391 -87 86 85 39 407 102 134 -78 316 -90
6396 -90 -68 -62 -174 135 138 180 -24 116 -50 -249 -168 112 92 -89 139 48 198 32 -135 -97 12 72 -96 20
6420 20 -127 196 -238 31 82 -93 -30 301 -199 106 164 -19 -162 -295 4 23 -222 15 251 -306 -118 195
6442 195 -113 182 -194 -76 67 -114 251 142 180 37 -317 -74 -78 169 -35 -3 227 200 377 -166 13 -8
$$ packed form
6280a25J42l4L0K27j71r8k33R1L45r1j97O4j65K43m3O3l19M64k87K61n8l44J21
6303a14N8J51k59L20j99j59p5M37m11J96O4l3k13J24M20k12m6k0l7k00K41p8K4
6326b1K77l66L17m81L99j95L67j83J5J38j41j7K08j26n80O53k18O5j2O3o5l1k83
6349b17k5N70j88m27K43K47J15n85Q4K34J11l00J00R3k81L08m18L39Q5n6L6jo4
6372Cj04J32m2j68J33n9K89j7m5l4r5q7J37L48m78J73jm6L68l05L2k12L94m06
6396i0K2Oj12L09LM2k04J40j66j99Q1K80k0j81K28r1J50j66j67L8J09O0j68J16
6420B0j47L23m34K69N1j75O3L31n00L05N8j83j43j33K99J9k45K37K36n57J88L13
6442A95l08K95l76J18J43j81L65j09L8j43l54K43mK47k04L2K30k7J77n43J79k1
$$ plain form
6464 -8 72 -157 -126 -66 35 -196 -66 144 -166 -54 70 127 -56 -13 -74 40 -290 -272 -166 72 129 226 -57 28
6488 28 262 19 5 -165 110 76 112 -56 -74 110 221 101 -60 -186 -78 -9 -23 -29 308 -144 -46 66 -118
6511 -118 293 86 106 112 38 64 18 27 -45 -107 19 -12 -80 91 38 80 -292 98 -76 -39 -190 110 28 154 -17
6536 -17 -159 -154 205 -469 35 -250 -95 99 -397 95 -157 113 184 35 182 -4 -143 -96 33 120 -57 -1
6558 -1 157 -6 -208 -338 44 41 -306 102 129 -198 7 0 -18 -311 -121 132 -172 327 287 328 80 41 236 -4
6582 -4 -29 2 -21 137 -203 -51 -72 -127 13 104 -111 -55 -27 173 -25 -31 -31 205 -17 -33 98 74 86 -48 -144 -94
6608 -94 208 -20 -95 -271 8 68 -14 153 -209 -94 -232 -17 96 -71 38 222 -298 0 -106 -37 35 129
6630 129 26 185 -113 126 -219 -120 157 -329 -11 22 112 45 121 384 90 -145 -167 -212 65 -28 -33 86 103 400
$$ packed form
6464hQ0k29L1O0J01k31J30K10l10J12J24N7j83M3o1J14l30J8J06K38N7R7k83Q5
6488B8K34k43j4j70K75l4L6j68j8J84J11j20j61j26J08O9j4oL37m52R8J12j84
6511a18M11k07K0Op4K6m6Rp2o2J26l1o8J71n3M2l72L90j74L7j51L00q2J26j71
6536a7j42NL59o74N04k85J55J94m96M92k52K70P1j49J47j86j39M7J29Q7j77N6
6558aJ58j63k02j30L82ll47M08K7l27K05pj8k93J90K53l04M99m0M1k48l9J95k40
6582dk5L1k3J58l40J52k1n5J40R1k15N6K8K00j98o%K36k22j6J31k4J2j34r6N0
6608i4L02k28p5j76K79O0q2J67l62J15j38K15J13j67J09J84n20K98j06O9P2R4
6630A29j03J59k98K39l45R9K77m86L18L3R0o7P6K63k94k35k2m5K77r3nJ19J7K97
$$ plain form
6654 400 -265 139 -13 -131 -247 16 12 -174 -25 -27 104 40 -67 -240 39 200 154 207 -61 -116 154 347 46
6677 46 116 -176 158 240 -67 123 -65 -101 -206 53 -379 120 149 249 -7 99 93 48 222 41 225 -92 -21
6700 -21 8 65 39 -153 105 -142 -136 22 -10 65 -13 27 -23 -59 -130 -96 69 -135 -77 74 -66 327 -222 24 82
6725 82 28 158 29 84 -39 -354 -225 274 -50 144 78 -133 33 -80 -44 -323 -232 -406 -40 229 -49 -40 182
6748 182 -10 -79 -34 -209 -153 -32 145 39 -327 54 -117 114 -250 -29 -245 94 142 -326 -8 -108 -260
6769 -260 139 -167 -54 -63 -180 110 -260 -179 142 -191 88 48 -47 55 -173 58 -177 115 182 -241 13 31
6791 31 -33 -13 260 -70 -115 -73 -176 -258 -68 65 192 -120 -40 -161 89 -63 -115 -80 -226 44 78 117 -2 201
6815 201 54 86 23 -94 -21 150 401 -90 -311 146 -176 -21 188 -115 -86 191 190 -171 230 -15 -64 91
$$ packed form
6654D00o65M04j52j18j16K63mj86J49kJ31o4j07j73K79J61m6N3k68n5K70J93l01
6677D6P0k92L34Q2l07J90j88l6j05K59m32M99K9J00k56J06om5J74j81J84l17P1
6700b1K9N7k6j92K58k47OJ58l2P5p8M0n0l6p1L4J65k04N8J51j40L93n49K46N8
6725H2n4J30j29N5j23l15J29M99l24J94o6k11J66j13L6k79R1j74L66K69k78RK22
6748A82j92o9M5j75N6J21J77j06l66L81j71K31l64K21k16L39M8m68L18j00j52
6769b60L99l06J13rj17K90l70Q1L21l33K79m0r5J02k28K31k35K92O7m23K54J8
6791C1o4K0K73l30m5M2j03q2J90J33J27l12Q0j21K50j52n2L5j46K70L4L9j19K03
6815B01j47L2o3j17P3J71K51m91k21M57l22J55K09l03K9K77jl61M01k45m9J55
$$ plain form
6837 91 -208 -218 -214 375 -36 -13 -17 188 -136 72 -105 -117 -38 169 97 -95 140 -201 97 20 -273 -17 314 362
6861 362 56 -9 68 -51 34 -19 130 183 104 121 1 -92 206 9 331 -117 -35 203 136 0 -12 -215 2 -241
6885 -241 115 208 404 99 95 140 130 183 73 10 190 119 -269 54 244 -481 -103 -93 68 241 -143 55 26
6908 26 -45 -41 -2 176 457 -43 -26 278 -183 23 53 -106 164 188 91 -52 18 -55 0 44 -149 -138 -111 27 104
6933 104 148 216 -56 16 20 127 0 -195 -90 52 98 111 -259 208 -360 -107 74 -22 -85 32 11 -120 -26 100
6957 100 -31 141 11 8 27 -73 47 91 -11 84 73 302 148 64 -30 188 394 -44 -101 48 -145 -84 93
6980 93 -274 -112 16 183 117 149 -25 -119 237 -76 3 37 -41 -217 203 -31 -45 99 -221 18 -13 -102 166
7003 166 -192 -29 297 208 -35 -130 19 -282 18 74 113 -111 5 -1 3 -88 -30 -103 114 9 138 10 -101 65
$$ packed form
6837I1k99j0MN89m11K3mK05l24K08j77j2P9K07p2j92K35l41K98p7k93K56L31M8
6861C62l06o5P7j19Q5n3J49N3p9J7j20r3K98j97L22m48Q2K38o7j36j2k03K17k43
6885b41L56R3J96l05mM5j0N3j10o3J80p1l88L23J90p25L78J0J61J73l84J98k9
6908B6p1ML9J78K81n00J7L04m61K06L0j59K70K4r7j43P0p3N5M4j93J1K7J38P7
6933A04M4O8k72P2MJ07j27j95J05J42M6J3l70M67n68K53J81r6o3J17k1j31R4J26
6957A00j31J72j30lJ9j00J20M4j02R5j1K29j54q4r4K18K06m38n7J49j93O1J77
6980I3l67J62J28J67o6L2j74r4L56l13P9L4p8j76M20k34j4J44l20K39l1q9K68
7003A66l58J63L26q9k43r5J49l01L00N6L9k24J16oMr1N8p3K17j05J29j28j11J66
$$ plain form
7027 65 165 609 -11 185 -21 -296 188 35 -50 -30 174 177 239 380 26 -2 280 -59 -26 204 97 104 156 -4
7051 -4 -103 249 14 -97 -84 -166 146 -98 167 -32 -83 112 -78 -171 -271 -33 -68 -81 -165 -39 -9 -2 36 -391 85
7076 85 60 -256 155 -18 191 17 17 -65 181 -183 -6 -117 30 -32 127 24 -235 -286 -136 180 -149 23
7098 23 -71 -10 104 -273 -144 241 -237 -59 50 42 -342 35 -243 -203 20 24 14 251 -102 -75 -67 33 111 6
7122 6 -58 80 39 173 -262 51 182 -165 -217 -114 -159 -250 -50 103 209 145 -126 -4 -146 75 -39 -157 -140
7145 -140 271 98 21 70 -2 -123 71 -239 -172 247 -198 194 211 -27 75 -137 -60 124 134 76 109 -159 -216
7168 -216 89 -142 -32 158 148 -87 -192 -75 25 -145 136 263 103 -81 -33 4 -59 142 -4 61 -304 -82
7190 -82 176 347 -97 34 -159 -32 -247 42 199 -16 87 -295 -187 -35 93 -41 -128 54 -59 63 321
$$ packed form
7027F5J00M44o20J96k06k75M84j53q5K0K04LO2J41l54k8K82l39L3K30j07PN2j60
7051dr9L52k35j11J3q2L12k44K65j99n1J95j90r3j00K38l5j3q4J26L0PL8m27M76
7076H5k5l16M11j73K09j74%q2K46l64J77j11J47o2J59j03k59n1J50L16l29J72
7098B3r4O1J14l77J29L85m78J78J09ql84L77k78M0K23Mj0K37l53K7QJ00P8j05
7122Fo4J38m1J34m35L13J31l47n2J03m5r1K00J53J06o4k71J22j42K21j14j18J7
7145a40M11j73p7M9p2j21J94l10O7M19m45L92J7k38J02k12P7J84J0n8L3k68n7
7168b16L05k31J10J90j0k35j05J17J00j70K81J27j60j84M8L7o3K01j46O5l65K22
7190h2K58J71m44J31j93J27k15K89J57k15J03l82J08J52J28j34q7J82j13J22K58
$$ plain form
7211 321 -223 -34 14 -111 147 137 -97 166 23 171 -88 99 -12 71 -102 9 88 213 67 181 -123
7232 -123 351 -103 53 137 -50 -92 115 -50 -150 -193 -200 -175 282 167 61 127 -264 -170 204 -92 84 149 142 -146
7256 -146 -78 -122 -89 319 94 -228 -205 -50 120 164 129 -75 260 -40 118 -8 -54 53 -25 80 42 -63 -7
7279 -7 254 91 -79 238 161 -195 88 -76 41 -126 274 105 -93 111 -28 330 73 117 -255 15 14 -105
7301 -105 128 123 -96 -1 22 312 271 -143 -93 152 -28 -168 256 -398 169 69 -84 -104 15 107 -152 -40 -161
7324 -161 -56 112 -123 -145 10 -145 -310 0 -379 -74 136 -160 194 -198 121 238 -67 255 83 -8 219
7345 219 177 275 162 -158 164 -137 -192 -3 -91 -161 -13 74 -444 16 -229 147 -13 71 13 -80 175 -107 -149
7368 -149 2 184 33 -189 -118 138 227 -32 -68 417 50 125 408 -204 -368 -74 34 211 -329 -178 -316
$$ packed form
7211C21n44J89M8j25K58j0k34K63j43J48k59J87j11Q3j73J11P9J25j46J14l04
7232a23M74m54J56Q4j87m2K07j65j00m3pK5M57j15j06O6l91R4L74k96J76O5pk88
7256a46O8m4L3M08k25l22K3J55J70M4l5k04L35l00J58j26m6J07p8J05l8j05N6
7279gK61j63j70L17p7l56K83j64J17j67M00j69j98K04j39L58k57M4l72K70jj19
7301a05K33nk19R5K3K90m1m14N0K45j80j40M24o54N67j00j53k0J19R2k59J12j21
7324a61J05J68k35k2J55j55j65L10l79L05K10k96L54l92L19J17l05L22j72r1K27
7345B19m2R8j13l20L22l01n5J89q8p0J48Q7n18M60k45L76j60Q4n8r3K55k82m2
7368a49J51J82j51k22P1K56Q9k59l6M85l67P5K83o12j64K94J08J77n40J51j38
$$ plain form
7389 -316 73 -194 17 -149 1 146 95 133 -189 69 -122 372 -41 112 177 -201 -242 -401 27 109 140 76
7411 76 -102 -144 112 19 -14 -26 443 -1 -33 108 243 -40 -81 -76 66 62 61 155 85 124 122 -105 -96 23 100 -223 86
7438 86 -123 -146 138 83 105 -83 -121 -293 -29 -10 -318 -373 214 8 115 242 0 166 5 -342 20 -179
7460 -179 -9 202 128 43 -44 4 61 188 125 111 15 -11 -18 -82 -211 -128 -76 -156 -299 -11 -88 -128 -133 -120 110 227 76
7487 76 -4 -135 65 33 199 157 99 -6 1 191 -136 -335 80 -61 -183 -270 19 -283 125 3 -99 -32 -133
7510 -133 311 47 138 129 -88 83 -303 28 155 -39 -75 160 -67 370 -55 7 174 -142 -289 -111 -96 18
7532 18 -214 -45 -35 -230 111 153 47 -2 72 12 172 65 168 214 115 -116 241 170 -233 58 -128 242 97
7555 97 131 -42 81 -54 -102 -50 -196 78 146 -370 -20 145 -62 135 -5 -173 50 -21 -130 165 38 -63
$$ packed form
7389c16L89k67K11j66J50J45n1L8l22K58j91M94m13J53O5l78m1j59M28Q2L1o4
7411G6j78m2K56r3l3j2M69m44l2J41J35k83m1NJ42mjR4p0L9kk27RJ19P7l23L09
7438H6k09k3K84n5K2j88l8j72K64J9l08n5N87k06J07J27k42J66j61l47L62j99
7460a79J70K11p4q5q7M8N7J27o3j4r6k6po4j29Q3N2q0j43K88p7m0nJ3K30J17j51
7487G6q0j31K00l2J66m2n8j05PJ90l27j99M15j41j22q7K89l02M08j22j02O7j01
7510a33M44k64R1rk17J71l86L31J27j94l6K35k27M37m25O2J67l16j47J78J5J14
7532A8k32J69J0j95L41M2j06m9P4o0J60j07J03M6r9k31L57p1m03K91j86L70j45
7555I7L4j73J23j35m8N2j46K74O8n16L50J65k07J97j40j68K23p1j09K95j27j01
$$ plain form
7577 -63 140 -156 36 195 2 20 207 -186 -36 68 -83 194 2 -327 100 217 -10 -81 273 73 206
7598 206 -33 82 98 127 -139 40 174 -146 179 -119 45 115 -269 -192 -19 -131 139 127 305 67 -130 -69
7620 -69 54 -165 176 -297 46 224 109 69 197 235 -88 5 0 -112 77 -72 77 23 -55 -39 -9 -64 80 51
7644 51 -220 -220 -10 -87 -84 -55 -183 -48 73 228 -152 15 29 -260 -55 48 -143 -245 -180 215 -148 -175 334
7667 334 -47 -160 339 30 -20 7 317 -133 21 281 26 -173 -22 -266 -158 15 -286 41 203 -230 97
7688 97 -212 -112 4 -498 291 -298 -97 7 -98 109 -214 219 91 114 52 -203 34 -260 65 -100 -3
7709 -3 -185 171 -71 73 14 -229 156 -112 88 -26 115 184 171 -145 56 -28 45 201 116 51 256 -115 -343
7732 -343 -181 181 -78 -414 123 19 -17 -337 -36 -97 88 147 -8 37 -179 -41 118 -113 321 272 26 110
$$ packed form
7577f3K03k96J92J59j93J8J87l93J50J04j51K77j92l29M27J17k27p1L54k00J33
7598B06k39J15J6K9k66J79J34l20L25k98J64P0l84P7J73j12K70j2J78k38j97O1
7620f9J23k19L41m73L43J78j15m0J28L8l23R3nj12J89j49J49n4p8J6L0n5J44k9
7644E1k71%K10p7LK9j28J35J21J55l80J67J4k89K05J03j91j02O5L95l63k7N09
7667C34l81j13M99l09n0K7L10m50J54K60k55j99J51k44J08J73l01L27J62m33L27
7688I7l09J00J16n02P89n89K01J04j05K07l23M33j28K3o2k55K37k94L25j65R7
7709cj82L56k42J44n9k43L85k68K00j14J41O9j3l16K01q4P3J56q5o5K05l71k28
7732c43J62L62k59l36N37j04l6l20L01o1J85N9j55M5k16J38J59k31M34m9k46Q4
$$ plain form
7754 110 -30 196 6 78 -43 -96 -90 43 103 104 -145 -38 -132 104 85 134 -66 397 -329 -210 101 -38 -90 116
7778 116 206 123 156 -3 -172 -82 115 51 -97 -200 -276 41 -30 -8 35 -11 77 -119 -62 67 115 -175 -190 36 -255
7803 -255 127 40 -76 -359 33 32 -79 398 20 340 93 -15 104 236 7 90 91 23 79 373 210 -249 126
7826 126 148 369 -42 -260 -164 34 -150 -150 -81 -56 213 -295 223 -379 -213 -98 -44 281 -54 -155 212 -123
7848 -123 -69 -164 116 11 193 184 -39 73 -82 67 -82 -82 -24 287 5 -125 -96 345 -90 -196 47 -63 -156
7871 -156 221 -90 35 403 333 20 92 -143 109 351 -119 69 -54 -51 36 -62 -142 265 -49 17 -159 -50 35
7894 35 113 -94 -87 -206 12 66 -60 -124 31 -89 -61 -88 -203 215 -230 55 68 -128 42 114 96 -36 116 -86
7918 -86 115 262 -40 98 137 -32 -144 -347 -25 -33 302 -250 -41 -106 -47 186 -68 66 72 -118 -140 -281 33
$$ packed form
7754A10j40K26j90P2j21n3OJ33O0Jk49J07r4K36j9M9k00M63p26J19L11j39n2K06
7778A16R0q3L3j59j69R0J97o4j48j03p6L17p1K2M3m6Q8j96N7J29M8k90j5K26k91
7803b55L82q7j16k83L92jj11M77l78L20k47j08J19J32k29Q3Jo8N6K94j63m59L75
7826A26K2K21m11k18R6J98j84%O9K5K69n08N18o02J66J15N4L25l35j01L67l35
7848a23N4r5K80j05J82rk23J12j55J49j49%N8L11k82j30K9M41m35j06K43j10r3
7871a56L77l11J25L68p0l13P2k35K52K42m70J88j23LQ7r8q0M07l14O6j76J09Q5
7894C5P8k07Pj19K18N4j26o4J55j20K8k7j15M18m45K85J3j96J70P2j8j32J52k02
7918h6K01J47l02J38L9j69j12k03L22qL35n52K09o5N9K33k54J34Oj90k2j41L14
$$ plain form
7941 33 143 191 149 130 -290 207 -33 -52 -74 -173 127 150 -175 -142 80 298 197 -98 -9 42 -22 -48 -124 78 -269
7966 -269 289 17 -93 -2 103 226 -22 -96 -151 -131 -275 -50 -282 21 -56 -39 -84 -44 354 -63 133 97 -106
7989 -106 74 139 -249 -195 -95 183 10 -148 3 281 79 -34 -360 -115 211 49 64 -203 -58 21 -231
8010 -231 -135 120 259 -71 -70 -63 39 -16 229 10 118 15 -27 70 -279 -64 -117 -57 -28 -141 -171 -233 74 79 -118
8035 -118 223 -159 -80 -120 82 176 61 -28 -98 118 -244 -151 110 44 -173 109 -59 100 105 31 -88 121 156 -201
8059 -201 -167 139 93 -68 -87 63 71 221 53 -53 114 203 -3 302 -271 -56 -46 138 -21 -101 197 -354 -202
8082 -202 -105 191 93 70 95 239 -9 374 45 -73 -145 -136 -27 0 141 208 62 37 -97 129 130 201 -15 -84 111
8107 111 -95 92 -227 -142 -58 174 -21 70 -40 -55 110 31 46 -113 -108 287 -111 38 29 27 -104 8 73 304
$$ packed form
7941C3J10M8m2j9m20M97k40j9k2r9L00K3l25L3K22K18j01k95Q9N1o4k6p6K02l47
7966b69N58k72j10R1J05J23k48p4n5K0j44K25k32L03p7J7m5M0L98m17J96l6k03
7989a06J80O5l88N4J00K78j73j58J51K78k02j13l26K45L26j62J5k67J45P9k52
8010b31R6K55J39l30JPJ02n5K45k19J08j03m2R7l49K15n3O0K9j13l0o2L07Nj97
8035a18L41l82P9m0K02R4j15q9p0K16l62R3K61o6k17K82j68J59Np4j19K09L5l57
8059b01L4L06m6j61j9J50QJ50j68j06J67Q9k06L05n73K15J0J84j59q0K98n51J52
8082b02R7K96r8k3K5J44k48L83l29j18p2RJ09K7J41O7j46k5j34K26JP1k16o9J95
8107A11k06J87l19Q5Q4K32j95R1j10j5J65p9J5j59NL95l98J49rkj31J12O5K31
$$ plain form
8131 304 153 -2 -268 193 125 47 -54 366 -99 43 34 -194 47 -105 -41 -55 275 -74 188 -174 105 -56
8153 -56 184 -41 83 11 134 -24 -85 11 -48 66 0 50 7 -116 -188 210 -41 41 -24 41 -34 -15 43 142 -65
8178 -65 -11 23 -160 -158 -139 -233 -109 -57 -147 -59 -80 -13 -259
$$ packed form
8131C04j51j55k66M61o8p8j01M20m65J42rk28K41j52O4j4L30l49K62l62K79j61
8153e6K40k25J24p2J23j58o1R6n9J14o6N0m3j23p2L98k51Q2o5O5p5J9N8R9k07
8178f5N4L4j83KJ9r4J24N2r0Q8k1O7k46
8191b59
$$ Imaginary data points
##PAGE= N=2
##DATA TABLE= (X++(I..I)), XYDATA
$$ plain form
0 0 0 0 0 0 0 0 0 -1 4 -8 8 -8 9 -16 16 -24 24 -32 34 -41 48 -57 65 -74 89 -98 113 -130 146 -164 187 -208
32 -208 232 -261 291 -323 360 -400 444 -493 545 -602 668 -740 820 -910 1011 -1127 1261 -1413
50 -1413 1598 -1817 2088 -2429 2879 -3500 4412 -5897 8725 -16094 76746 159714 1194 -93988
64 -93988 -74236 48214 108812 75617 -15228 -59077 -43596 8168 37799 40230 11331 -27577
76 -27577 -62450 -51242 8112 65950 48299 -37277 -100718 -60080 42096 95993 40906 -56295
88 -56295 -88215 -22165 65369 84677 25101 -41705 -50117 -2778 47964 59384 29265 -12836
100 -12836 -35983 -22389 17575 51773 43678 -6586 -53190 -47229 8914 56083 43197 -17950
112 -17950 -64629 -50449 9329 53687 38362 -20967 -64635 -47228 12350 52921 34865 -21287
$$ packed form
0@%%%%%%%jNj2J6j6J7k5L2m0M8n6O6p5Q9j05J22j39J63j87K11k43K76l10L51l95
32b08M40m93N52o14O83p60Q44r37J038j147J270j408J560j730J921k138K388k674
50a413L011l415L905m517N308o379P912j0309J4622k4819R2840Q2968j58520r5182
64i3988J9752J22450O0598l3195r0845m3849J5481N1764K9631K431k8899l8908
76b7577l4873J1208N9354N7838j7651q5576o3441M0638J02176N3897n5087r7201
88e6295l1920O6050Q7534J9308n9576o6806q412M7339N0742J1420l0119m2101
100a2836k3147J3594L9964L4198q095n0264m6604N961N6143M7169j2886o1147
112a7950m6679J4180N9778M4358j5325n9329m3668J7407N9578M0571j8056n6152
$$ plain form
124 -21287 -57951 -38899 14509 48008 29457 -18449 -45753 -27705 11483 33217 24188 -1942
136 -1942 -24076 -28639 -8858 24348 43276 23074 -23190 -48621 -19092 40471 63924 19467
148 19467 -47100 -59715 -3980 55010 48671 -13190 -57930 -41294 8724 30964 9094 -23138
160 -23138 -32212 -23406 -15788 -8819 4187 11318 -7285 -40438 -45483 -4166 43335 39140 -17273
173 -17273 -59794 -33457 36148 67627 25462 -36676 -44736 5019 48488 38669 -2783 -23931
185 -23931 -12408 5027 8095 3352 2897 777 -15933 -34040 -26392 7272 27002 307 -47482
198 -47482 -57946 -13328 34985 29305 -21488 -55263 -33430 15742 37445 13428 -21475 -28177
210 -28177 -5691 16966 20552 10355 -251 -6024 -8680 -2444 11753 21815 11903 -12699 -26133
$$ packed form
124b1287l6664J9052N3408L3499j8551m7906k7304J8048L9188K1734r029k6130
136a942k2134m563J9781L3206J8928k0202m6264k5431K9529N9563K3453m4457
148A9467o6567j2615N5735N8990o339o1861m4740J6636N0018K2240k1870l2232
160b3138r074Q806P618O969J3006P131j8603l3153n045M1317M7501m195n6413
173a7273m2521K6337O9605L1479m2165o2138q060M9755M3469r819m1452k1148
185b3931J1523J7435L068m743m55k120j6710j8107P648L3664J9730k6695m7789
198d7482j0464M4618M8313n680n0793l3775K1833M9172K1703k4017l4903o702
210b8177K2486K2657L586j0197j0606n773k656O236J4197J0062r912k4602j3434
$$ plain form
223 -26133 -12225 15401 25623 4958 -24933 -32069 -10726 16553 21270 -426 -25687 -29153 -7735
236 -7735 16489 19919 -364 -23663 -24513 -4380 16402 16239 -2383 -18830 -16836 -2293 9272
249 9272 9155 1712 -5850 -10763 -10647 -1552 13923 19093 2981 -19824 -21665 6030 33506 27264
263 27264 -7727 -30423 -12150 24848 36409 9559 -21820 -21207 5927 22214 10029 -9549
275 -9549 -12125 -1155 777 -8742 -9756 3575 10727 -4917 -27343 -22662 9214 29993 10272
288 10272 -26978 -32829 2790 37374 29012 -9122 -27328 -3751 28678 30335 5162 -10314 56
301 56 15981 13572 1238 682 11482 11933 -4686 -16285 -4363 18274 19138 -7585 -30189 -17783
315 -17783 14916 25866 2489 -25408 -22824 5094 22861 12522 -7956 -12307 987 12257
$$ packed form
223b6133J3908K7626J0222k0665k9891p136K1343K7279M717k1696k5261l466K1418
236g735K4224L430k0283k3299q50K0133K0782j63j8622j6447J994J4543J1565
249I272j17p443p562m913J16R095J5475N170j6112k2805j841K7695K7476o242
263B7264l4991k2696J8273L6998J1561k6850l1379O13K7134J6287j2185j9578
275i549k576J0970J932r519j014J3331P152j5644k2426M681L1876K0779j9721
288A0272l7250n851L5619L4584q362l8134j8206K3577L2429J657k5173j5476J0370
301E6J5925k409j2334n56J0800M51j6619j1599J1922K2637Q64k6723k2604J2406
315a7783L2699J0950k3377k7897K584K7918J7767j0339k0478m351J3294J1270
$$ plain form
327 12257 10571 4299 3490 6542 4614 -404 807 10808 15252 5827 -8837 -10388 4031 16753
341 16753 11852 -4681 -14484 -7468 8106 14165 6842 -5646 -10369 -3628 8073 13669 8302 -2116
355 -2116 -6931 -1391 9362 13853 7015 -2901 -5186 716 6933 6251 1596 -632 -1112 -3278 -4662
370 -4662 -1313 6533 6849 -4198 -14354 -8751 9190 18291 5704 -13799 -14981 5136 22076 14594
384 14594 -5893 -12627 2245 17114 13398 -1368 -5849 3750 9940 2047 -7062 -2357 9813 8657
398 8657 -8309 -18499 -5742 14273 13983 -8489 -24481 -11382 13654 18912 -1910 -20514 -12084
411 -12084 10389 17786 2201 -11228 -5510 9263 10785 -1350 -7302 1968 11724 4608 -10128
424 -10128 -11386 4518 15529 4514 -15256 -17333 1255 16136 7592 -12795 -17284 -2281 12195
$$ packed form
327A2257j686o272q09L052j928n018J211J0001M444r425j4664j551J4419J2722
341A6753m901j6533r803P016J5574O059p323j2488m723O741J1701N596n367j0418
355b116m815N540J0753M491o838r916k285N902O217o82m655k228m80k166j384
370d662L349P846L16j1047j0156N603J7941R101j2587j9503j182K0117J6940p482
384A4594k0487o734J4872J4869l716j4766m481R599O190p893r109M705J2170j156
398H657j6966j0190J2757K0015k90k2472j5992J3099K5036N258k0822j8604Q430
411a2084K2473P397j5585j3429N718J4773J522j2135n952R270R756p116j4736
424a0128j258J5904J1011j1015j9770k077J8588J4881q544k0387m489J5003J4476
$$ plain form
437 12195 8853 -5088 -9622 -991 6883 4672 -1868 -1921 3672 4566 -2076 -5919 -755 6557 4335
452 4335 -6206 -11847 -5497 4288 4044 -5229 -12556 -9394 -1696 2125 -1033 -5592 -6679 -4635 -1372
467 -1372 1935 3298 1213 -2087 -2979 1562 7164 7166 1760 -2466 -606 4118 5068 943 -1905 -1061 -502
484 -502 -2986 -5653 -3238 904 -1232 -9196 -13351 -6326 3749 2843 -8742 -15686 -8431 5536 7780
499 7780 -3460 -12184 -6082 6843 9204 -38 -6583 -667 8245 6549 -3066 -5259 3694 10803 2971
514 2971 -9054 -9223 4168 12126 2363 -12958 -13342 1809 11820 3331 -12192 -13754 254 9766
528 9766 3018 -9509 -9334 2325 7478 -247 -8730 -4527 5855 6447 -4153 -11182 -3422 8588
542 8588 7345 -5783 -13137 -4386 8293 8667 -4239 -11519 -4063 6920 7774 -1353 -5912 -340 6815
$$ packed form
437A2195l342j3941m534Q631P874k211o540n3N593Q94o642l843N164P312k222
452D335j0541n641O350R785k44r273p327L162P698L821l158m559j087K044L263
467a372L307J363k085l300q92M541N602Kn406m226J860M724R50m125k848Q44N59
484e02k484k667K415M142k136p964m155P025J0075r06j1585o944P255J3967K244
499G780j1240q724O102J2925K361r242o545N916Q912j696r615k193Q953P109p832
514B971j2025j69J3391P958r763j5321l84J5151J0011q489j5523j562J4008R512
528I766o748j2527J75J1659N153p725q483M203J0382N92j0600p029P760J2010
542H588j243j3128p354Q751J2679L74j2906p280P456J0983Q54r127m559N572P155
$$ plain form
557 6815 5456 -684 -1716 4293 7300 3038 -3293 -1466 5380 7059 181 -6480 -4641 2671 4356
572 4356 -2257 -8011 -6945 -1301 74 -3114 -5528 -4422 -1902 -2164 -3047 -1305 1784 1648 -1241 -1354
588 -1354 2616 7032 5726 1542 192 4471 7758 6167 2055 1205 4260 5018 1530 -1388 330 3311
604 3311 1222 -4952 -6653 -1011 3672 -556 -8167 -9013 -1635 4485 1546 -6442 -7761 -15 6556
619 6556 3131 -3828 -3618 3801 7962 2470 -3523 -602 7198 8053 166 -5613 -327 8800 7891 -2261
635 -2261 -8214 -1791 8030 7462 -3014 -9091 -1871 6726 6143 -3133 -6928 -33 6824 3734 -4099
650 -4099 -4952 2670 7138 1655 -6095 -5140 4033 7265 70 -8010 -5959 3354 6538 -491 -8223 -5365
666 -5365 3008 4964 -1082 -5866 -2151 4645 4533 -633 -2597 1923 6914 4672 -1003 -1068 4499 8346
$$ packed form
557F815j359o140j032O009L007m262o331J827O846J679o878o661J839P312J685
572D356o613n754J066N644J375l188k414J106K520k62q83J742L089j36k889j13
588a354L970M416j306m184j350M279L287j591m112q50L055P58l488k918J718K981
604C311k089o174j701N642M683m228p611q46P378O120k939p988j319P746O571
619F556l425o959K10P419M161n492n993K921P800Q55p887n779N286R127r09j0152
635b261n953O423R821n68j0476o077P220Q597n83r276l795O895O857l090p833
650d099q53P622M468n483p750R55R173L232p195q080K051R313L184p029p732K858
666e365Q373J956o046m784L715O796j12n166j964M520M991k242n675o5N567L847
$$ plain form
682 8346 4537 -2200 -2499 3728 6292 1650 -3860 -3406 770 1772 -2117 -5626 -3550 -710 -1477 -4473
698 -4473 -5338 -1849 1127 -764 -4750 -3577 1769 4324 774 -2752 -594 4556 6190 2050 -496
713 -496 1780 5431 4935 636 -1020 2336 4556 1705 -3486 -2905 1808 3692 -1356 -6082 -4604 1841
729 1841 3294 -2157 -6735 -4000 2165 3472 -1718 -5201 -1530 4005 3432 -2093 -3939 800 5920
744 5920 2770 -3641 -4129 2373 5861 1621 -5242 -4867 2240 5818 554 -5757 -4168 2757 5374 209
760 209 -4934 -2168 4222 5268 -292 -3825 710 5998 4791 -1645 -4174 1459 6364 3335 -3209
775 -3209 -5195 320 4826 1313 -5349 -5899 -595 2968 -826 -6014 -4923 415 2245 -1490 -4936
790 -4936 -1731 3556 3709 -868 -2990 1354 6343 5329 -56 -1471 2940 6570 4417 -484 -1483 2678
$$ packed form
682H346l809o737k99O227K564m642n510M54M176J002l889l509K076K840p67k996
698d473q65L489K976j891l986J173N346K555l550l526K158N150J634m140k546
713d96K276L651m96m299j656L356K220k851n191N81M713J884n048m726J478O445
729A841J453n451m578K735O165J307n190l483L671N535n73n525j846M739N120
744E920l150o411m88O502L488m240o863L75P107L578n264o311J589O925K617n165
760B09n143K766O390J046n560l533M535N288j207o436k529N633M905l029o544
775c209j986N515M506l513o662n50N304L563l794n188J091N338J830l735l446
790d936L205N287J53m577k122M344M989j014n385j415M411L630k153m901r99M161
$$ plain form
806 2678 5143 1740 -3139 -2476 1453 2027 -2234 -5080 -2743 1138 843 -3779 -5706 -1831 2305 1097
822 1097 -3393 -4294 213 4148 1747 -2039 -1828 2947 4963 1709 -1784 -129 3788 4510 480 -2615
838 -2615 -113 4117 3352 -1705 -3829 -173 3912 2399 -2809 -3878 120 3754 1262 -3087 -3039 1652
854 1652 3801 773 -3280 -1945 2149 3733 -741 -4126 -1904 2988 2920 -2141 -5057 -1632 2933 1791
870 1791 -3581 -5062 -1110 3034 1261 -3658 -4153 582 4050 1535 -2516 -1381 3199 5155 1388
885 1388 -2198 128 4809 5212 59 -2965 -322 4021 3157 -2059 -4595 -1765 1868 468 -4478 -5729
901 -5729 -1942 1018 -1233 -5737 -5126 -341 1974 -1636 -5146 -2860 2390 3524 -59 -3070 -334
916 -334 4135 4654 504 -1678 682 4519 3735 -910 -2517 755 3288 971 -3438 -3736 369 1881
$$ packed form
806B678K465l403m879O63L929N74m261k846K337L881k95m622j927L875M136j208
822A097m490r01M507L935k401l786K11M775K016l254l493J655L917P22m030l095
838b615K502M230p65n057k124L656M085j513n208j069L998L634k492m349M8M691
854A652K149l028m053J335M094J584m474l385K222M892o8n061k916L425M565j142
870A791n372j481L952M144j773m919m95M735L468k515m051J135M580J956l767
885A388l586K326M681M03n153l024K643M343q64n216k536K830L633j400m946j251
901e729L787K960k251m504O11M785K315l610l510K286N250J134l583l011K736
916c34M469N19m150k182K360L837p84m645j607L272K533k317m409k98M105J512
$$ plain form
932 1881 -1482 -5237 -3926 87 871 -2480 -5136 -3383 1117 1394 -2610 -4308 -1616 2350 1736 -2456
948 -2456 -3487 492 3037 1190 -2700 -2900 1271 3307 290 -3574 -2679 1327 2973 -725 -4147 -2186
964 -2186 1723 2321 -1664 -3845 -1257 2913 2208 -1810 -3009 254 3251 1621 -2821 -3128 966 2766
980 2766 -52 -4139 -3132 961 1929 -1526 -4967 -3182 928 1454 -2219 -4913 -2336 1538 1364 -2099
996 -2099 -3593 -167 3695 2215 -1566 -2031 2179 4762 2344 -1621 -1366 2544 4681 1259 -2238 -1280
1012 -1280 1933 2676 -831 -3871 -2254 1332 974 -2788 -4544 -1795 1007 410 -3722 -3871 -7 2413
1028 2413 858 -2526 -2213 2008 4202 1477 -1587 -281 3404 4642 1358 -1306 231 3937 3699
1043 3699 -122 -2521 98 3481 2047 -1770 -3307 65 2478 849 -2546 -2712 731 2646 556
$$ packed form
932A881l363l755J311M013P84l351k656J753M500K77m004j698K692L966o14m192
948b456j031L979K545j847l890k00M171K036l017l864Q95M006J646l698l422J961
964b186L909N98l985k181K588M170p05m018j199L263K997j630m442l07M094J800
980B766k818m087J007M093R68l455l441J785M110N26l673k694K577L874j74l463
996b099j494L426L862j480l781m65M210K583k418l965K55L910K137l422l497R58
1012a280L213P43l507l040J617L586l58l762j756K749K802n97m132j49L864K420
1028B413j555l384L13M221K194k725l064J306L685J238l284k664J537L706k38
1043C699l821k399K619L383j434l817j537L372K413j629l395j66L443J915k090
$$ plain form
1058 556 -2383 -1669 2437 3632 616 -1931 -130 3919 3617 200 -1834 671 3915 2774 -912 -2017
1074 -2017 1009 3598 1764 -2018 -2067 1162 3486 1123 -2436 -1957 2114 3363 554 -1845 -493 3335
1090 3335 3793 583 -1380 920 4087 3523 -184 -1475 1121 3761 2480 -1138 -2082 1001 2784 994
1106 994 -2234 -2016 1123 2315 -64 -2606 -1554 2159 2646 -318 -2052 276 3655 3264 19 -1488
1122 -1488 1500 4482 3765 219 -968 1768 4173 2210 -1694 -1422 1672 2862 526 -2498 -1801 1479
1138 1479 2268 -817 -3341 -1364 1899 1844 -930 -2544 -25 3338 2166 -586 -1289 1346 3456 2100
1154 2100 -741 -923 2050 3706 787 -1866 -1526 1633 2285 -702 -3011 -1585 1435 1339 -1443 -3337
1170 -3337 -1051 1689 1041 -2229 -2718 13 2427 1395 -1558 -1809 1230 3245 1279 -1712 -1297 1836
$$ packed form
1058E56k939P14M106J195l016k547J801M049l02l417k034K505L244j141l686j105
1074b017L026K589j834l782m9L229K324k363l559M79M071J249k809k399J352L828
1090C335M58l210j963K300L167n64l707j291K596K640j281l618r44L083J783j790
1106I94l228K18L139J192k379k542J052L713M87k964j734K328L379l91l245j507
1122a488K988K982p17l546j187K736K405j963l904K72L094J190k336l024O97L280
1138A479P89l085k524J977L263n5k774j614K519L363j172k752p03K635K110j356
1154B100k841j82K973J656k919k653L40L159O52k987k309J426L020r6k782j894
1170c337K286K740o48l270m89K731K414j032k953k51L039K015j966k991M15L133
$$ plain form
1186 1836 2827 -81 -2522 -1019 1888 1346 -1719 -3493 -1486 1195 616 -2900 -3917 -1178 1279 187
1202 187 -3075 -3214 -119 2014 -185 -2747 -2077 1381 2608 172 -2315 -806 2270 2640 -594 -2445
1218 -2445 -958 1942 1423 -1899 -3538 -1409 1278 -109 -2908 -3500 -1256 1088 -596 -3856 -3146 -55
1234 -55 1338 -1065 -3402 -2568 637 1569 -744 -2940 -1721 1497 1466 -1591 -2771 -1274 1345 831 -2545
1251 -2545 -3319 -935 1324 169 -2951 -3373 -523 1454 -546 -3312 -2545 167 1410 -799 -2494 -1829
1267 -1829 1484 1691 -922 -2433 -562 1803 1136 -1462 -2704 -785 994 203 -2431 -2857 -686 762
1283 762 -901 -3264 -2794 -124 503 -1344 -2790 -1651 565 1050 -1242 -2318 -326 1673 1578 -729
1299 -729 -1363 863 2405 1438 -1102 -1435 1219 2214 310 -2192 -1501 798 1479 -965 -2894 -1603 703
$$ packed form
1186A836R91k908k441J503K907n42l065j774K007K681n79l516j017K739K457j092
1202A87l262j39L095K133k199k562O70L458J227k436k487J509L076L70l234j851
1218b445J487K900n19l322j639K129K687j387k799n92K244K344j684l260P10L091
1234e5J393k403k337Q34L205R32k313k196J219L218l1l057j180J497K619n14l376
1251b545p74K384K259j155l120m22K850J977k000k766P67K712J243k209j695O65
1267a829L313K07k613j511J871K365o67k598j242J919J779p91k634m26K171J448
1283G62j663k363M70K670O27j847j446J139K216M85k292j076J992J999r5k307
1299g29o34K226J542r67k540l33K654R95j904k502O91K299O81k444j929J291K306
$$ plain form
1316 703 523 -1527 -3088 -951 1193 768 -1468 -2131 340 2456 1194 -1012 -1078 1427 3199 1564
1332 1564 -1066 -381 2037 2857 561 -1502 -258 1638 2170 -372 -2189 -835 2027 1657 -994 -2392
1348 -2392 -143 2009 1154 -1527 -2186 643 2559 1291 -1340 -1044 1655 2837 1312 -1060 -623 2389
1364 2389 2851 646 -1233 -19 2314 2563 -182 -1583 35 2214 1606 -572 -1456 600 2242 1690
1380 1690 -605 -1028 1599 2984 1719 -346 146 2299 3125 1260 -681 82 2391 2736 475 -955
1396 -955 414 2382 1895 -367 -1197 746 1988 867 -1047 -1149 722 2077 1032 -1168 -308 1784
1412 1784 2682 910 -324 523 2576 2909 505 -109 819 3072 2032 186 -715 1188 2535 1303
1428 1303 -1005 -1107 1301 2335 155 -1706 -1415 1128 1993 -11 -1547 -459 1805 1608 -212 -1360
$$ packed form
1316G03j80k050j561K137K144m25k236o63K471K116j262k206o6K505J772j635
1332A564k630O85K418Q20k296k063J244J896N32k542j817J354K862l70k651j398
1348b392K249K152q55k681o59K829J916j268k631K96K699J182j525k372M37L012
1364B389M62k205j879J214K333K49k745j401J618K179o08k178q84K056J642n52
1380A690k295m23K627J385j265k065M92K153Q26j865j941P63K309L45k261j430
1396i55J369J968m87k262q30J943J242j121j914j02J871J355j045k200Q60K092
1412A784Q98j772j234Q47K053L33k404o14R28K253j040j846r01J903J347j232
1428A303k308j02K408J034k180j861K91K543Q65k004j536J088K264j97j820j148
$$ plain form
1444 -1360 497 2363 1962 -13 -1139 795 2921 1727 -856 -804 1085 2484 892 -1267 -1676 1048
1460 1048 1827 -277 -1871 -1352 1183 1520 -891 -2220 -990 1388 1580 -692 -1939 -213 2196 1650
1476 1650 -736 -1104 363 2209 1008 -1257 -1439 662 1443 357 -1607 -1752 665 1078 -397 -2143
1492 -2143 -1245 657 598 -1337 -2379 -1176 702 846 -1046 -1816 -163 1297 802 -882 -1325 438 1539
1509 1539 319 -1494 -1157 733 1387 -236 -1762 -1412 153 608 -1101 -2194 -1425 96 -312 -1913
1525 -1913 -2202 -854 615 10 -1772 -2002 97 1172 -154 -1753 -1357 330 1115 -412 -1986 -856
1541 -856 731 826 -830 -2322 -1054 538 36 -1818 -2518 -976 740 -273 -2283 -2378 -463 806 -461
1558 -461 -2232 -1742 275 1243 -492 -1765 -1043 1193 918 -797 -1752 -763 1006 997 -1419 -1984 -564 1022
$$ packed form
1444a360J857J866m01j975j126J934K126j194k583N2J889J399j592k159m09K724
1460A048P79k104j594N19K535L37k411j329J230K378J92k272j247J726K409n46
1476A650k386l68J467J846j201k265j82K101P81j086j964j45K417M13j475j746
1492b143Q98J902n9j935j042J203J878J44j892p70J653J460m95j684m43J763J101
1509A539j220j813L37J890O54j623j526L50J565M55j709j093P69J521m08j601
1525a913k89J348J469o05j782k30K099J075j326j599L96J687P85j527j574J130
1541h56J587R5j656j492J268J592n02j854p00J542J716j013k010r5J915J269j267
1558d61j771M90K017R68j735j273P22K236k75j715r55R89J769rk416n65J420J586
$$ plain form
1576 1022 389 -1697 -2158 -474 652 -634 -2392 -2121 -78 1091 -400 -2077 -1543 549 1517 -503
1592 -503 -1705 -731 1364 1388 -626 -1551 -299 1214 999 -1019 -1572 -218 961 363 -1293 -1869 -173
1609 -173 903 -524 -1908 -1478 373 693 -167 -1490 -595 756 1118 -198 -1271 -98 1600 1254 -270
1626 -270 -1087 365 1303 1038 -569 -752 600 1359 328 -1258 -653 684 1008 -131 -1530 -631 624
1643 624 979 -636 -1515 -625 1094 1091 -192 -717 472 1866 972 -101 -363 1064 1924 823 -658 -205
1661 -205 1033 1717 92 -844 -497 1244 1383 -259 -1074 92 991 929 -643 -1185 401 1778 976 -476
1679 -476 -568 846 2084 1220 -66 -426 1096 2202 1054 -761 -221 1506 1862 217 -733 -99 1254
1696 1254 1450 -473 -1077 2 1321 1266 -416 -982 391 1401 718 -463 -584 921 1896 571 -704
$$ packed form
1576A022o33k086m61J684J126j286j758K71K043J169j491j677N34K092R68k020
1592e03j202R74K095K4k014r25J252J513k15k018n53J354J179n98j656n76J696
1609a73J076j427j384M30J851L20q60j323Q95J351L62j316j073J173J698l46j524
1626b70q17J452R38k65j607j83J352P59j031j586O05J337L24j139j399Q99J255
1643F24L55j615q79Q90J719lj283n25J189J394q94j073k62J427Q60j101j481M53
1661b05J238O84j625r36L47J741J39j642q15J166Q99o2j572n42J586J377q02j452
1679d76r2J414J238q64j286l60J522J106j148j815N40J727L56j645r50O34J353
1696A254J96j923o04J079J319n5j682n66J373J010o83j181j21J505R75j325j275
$$ plain form
1713 -704 173 1468 1725 508 -679 -148 1390 1430 -125 -928 9 1353 1240 -489 -1232 187 1527
1730 1527 988 -754 -733 881 1658 605 -630 -624 1272 1631 618 -579 -409 1482 1490 169 -777 91
1748 91 1641 824 -593 -1049 -121 1019 530 -1032 -1573 462 891 84 -1124 -1182 426 1088 -13 -963
1766 -963 -570 1444 1261 -27 -723 74 1607 1327 90 -614 404 1306 811 -277 -1106 15 910 280
1784 280 -1191 -1369 102 615 -278 -1525 -1374 422 576 -701 -1404 -846 676 694 -352 -1048 127 862
1802 862 654 -563 -769 367 1356 292 -485 -835 570 802 -110 -1256 -884 510 870 -450 -1375 -626
1820 -626 688 743 -901 -1608 -519 620 -35 -866 -1414 -216 562 10 -1241 -1212 413 919 -214 -1176
1838 -1176 -1092 215 440 -434 -1245 -686 310 732 -689 -1537 -510 740 951 -588 -1027 -232 1094 716
$$ packed form
1713g04Q77J295K57j217j187N31J538M0j555q03R37J344j13j729p43J419J340
1730A527n39j742K1J614P77j053j235OJ896L59j013j197J70J891Qj321r46Q68
1748I1J550q17j417m56R28J140m89j562n41K035M29q07j208n8J608O62j101r50
1766i63L93K014j83j288o96P97J533k80j237p04J018R02m95j088q29J121Q95o30
1784B80j471j78J471N13q93j247J51J796J54j277p03N58J522J8j046o96J175P35
1802H62k08j217k06J136R89j064p77l50J405K32r12j146L72J394L60j320r25P49
1820f26J314N5j644p07J089J139o55q31n48J198P78n52j251K9J625N06j133r62
1838a176Q4J307K25q74q11N59R96M22j421q48J027J250K11j539m39P95J326l78
$$ plain form
1856 716 -464 -817 169 1077 299 -721 -746 69 832 33 -1322 -919 500 329 -1031 -1572 -971 345
1874 345 -262 -1193 -1865 -744 214 158 -971 -1168 -79 955 347 -1028 -424 677 1449 385 -557 -138
1892 -138 1137 1235 120 -696 -60 835 693 -337 -998 -446 359 122 -991 -1256 -614 8 -492 -1190 -1318
1911 -1318 -115 450 -370 -1340 -728 451 370 -514 -569 -74 1043 1242 -214 -775 1 1193 843 -401
1929 -401 -552 288 1325 396 -446 -269 205 1151 162 -801 -564 496 1076 -122 -989 -333 540 737 -177
1948 -177 -749 -258 829 482 -517 -982 -334 736 465 -790 -1090 40 766 336 -751 -757 308 781 200
1967 200 -795 -45 855 1018 153 -487 52 958 921 105 -375 114 1172 629 -180 -264 377 884 286 -751
1987 -751 -809 360 442 -296 -799 -739 148 296 -423 -970 -305 629 257 -582 -840 353 888 533 -258 -347 742
$$ packed form
1856G16j180l53R86R08p78j020k5Q15P63p99j355M03J419j71j360n41O01J316
1874C45o07r31o72J121R58n6j129j97J089J034o08j375O04J101P72j064r42M19
1892a38J275R8j115q16O36Q95j42j030o61N52Q05k37j113k65O42O22n00o98j28
1911a318J203N65q20r70O12J179q1q84n5M95J117J99j456n61P76J192l50j244
1929d01j51Q40J037r29q42J77M74R46r89r63K37J060N80j198q67O56Q73J97r14
1948a77n72M91J087l47r99m65O48J070k71j255l00J130P26m30j087oJ065M73n81
1967B00r95P50R00J63q65o40N39R06l7q16m80M89J058n43q09q4O41N07n98j037
1987g51n8J169Q2p38n03O0Q87J48p19n47O65R34l72q39k58J193N35l55p91q9J089
$$ plain form
2008 742 1291 610 -70 21 1126 1130 363 -394 -384 753 998 -47 -533 -13 631 515 -543 -1252 6 782
2028 782 -67 -791 -1018 -92 786 305 -515 -673 600 857 251 -798 -566 692 1113 34 -979 -125
2046 -125 547 863 -325 -636 -24 1024 1013 -487 -661 241 781 561 -410 -613 500 1199 526 -804 -497
2065 -497 637 1026 279 -716 -566 527 916 -266 -1258 -561 521 409 -743 -1014 -626 339 270 -624 -912
2084 -912 -420 743 261 -547 -314 151 681 212 -34 -184 535 750 461 38 115 825 775 -6 -308 40
2104 40 502 406 -338 -430 -37 386 -26 -511 -521 -139 258 -206 -683 -226 66 373 -216 -445 -126 287 320 -242
2126 -242 -491 266 425 393 -456 -88 639 628 166 -189 -165 648 629 206 -682 3 1143 721 -177 -633 -48
2147 -48 578 531 -307 -744 135 783 349 -598 -880 81 896 135 -989 -948 288 698 -250 -1132 -740 250
$$ packed form
2008G42N49o81o80R1J105Mp67p57J0J137K45j045m86N20O44j16j058p09J258P76
2028G82q49p24k27R26Q78m81q20j58J273K57o06j049K32J258M21j079j013Q54
2046a25O72L16j188l11O12J048j1j500j74R02N40k20r71k03J113O99o73j330L07
2065d97J134L89p47r95J50J093L89j182r92O97J082j12j152k71L88R65o9q94k88
2084i12M92J163m82q08K33M65N30m69k46j50P19K15k89m23P7P10n0p81l02L48
2104D0M62r6p44r2L93M23m12m85j0L82L97m64m77M57K92L07n89k29L19M13L3n62
2126b42k49P57J59l2q49L68P27j1m62l55K4Q13j9m23q88O85J140m22q98m56N85
2147d8O26m7q38m37Q79O48m34r47k82R61Q15p61j124M1J236M10r48q82L92R90
$$ plain form
2167 250 746 120 -922 -175 388 833 -276 -1055 -152 978 1025 -7 -704 215 1293 853 35 -499 103
2186 103 1380 728 -587 -629 148 742 254 -608 -681 45 679 -56 -928 -857 -5 410 -302 -840 -474 9
2206 9 300 -152 -426 -145 274 382 179 -164 344 677 394 303 -29 337 200 392 4 -241 475 65 -67
2227 -67 164 -35 -85 -257 -579 -209 -10 -240 -405 -597 -455 333 -8 -474 -822 -48 375 64 -707 -268 110
2248 110 445 127 -507 -302 289 872 222 -523 -159 654 554 200 -438 -139 987 627 -359 -429 -54 789
2268 789 682 -588 -1000 48 694 541 -623 -1250 -326 794 691 -1074 -1231 -229 733 143 -774 -1116
2286 -1116 -100 848 -83 -925 -754 232 737 105 -774 -912 819 1179 161 -635 -503 659 785 169
2304 169 -755 -401 720 414 -295 -989 -439 485 409 -790 -781 -501 223 208 -603 -854 -624 21 -30 -410 -503
$$ packed form
2167B50M96o26j042P47N63M45j109p79R03J130M7j032o97R19J078m40q18n34O02
2186A03J277o52j315m2P77N94m88q62p3P26O34p35q72P1Q52M15p12n38L66M83
2206IK91m52k74K81M19J08k03l43N08L33k83r1l32L66j37J92l88k45P16m10j32
2227f7K31j99n0j72l22L70J99k30j65j92J42P88l41m66l48P74M23l11p71M39L78
2248A10L35l18o34K05N91N83o50p45L64Q13j00l54o38K99J126l60r86p0L75Q43
2268G89j07j270m12J048O46j53j164o27R24J120j03j765j57J002R62n90r17l42
2286a116J016R48r31q42J71R86N05o32q79j38J731L60j018p96J32J162J26o16
2304A69r24L54J121l06p09o94N50R24p6j199RK80P24j5q11k51K30O45n1l80r3
$$ plain form
2325 -503 -364 51 531 -214 -245 -502 497 437 -79 -169 98 63 284 -271 -80 27 20 226 17 66 -143 -183 -108
2348 -108 -55 -168 -509 -583 -100 198 -144 -596 -579 3 241 -109 -439 -593 168 838 122 -698 -476 163 825
2369 825 208 -873 -795 405 525 284 -524 -487 361 729 226 -846 -686 401 1295 -158 -690 -348 806
2388 806 727 -142 -766 -638 792 971 -33 -754 -258 1025 1006 61 -1053 -332 985 720 -317 -930 100
2407 100 1016 889 -174 -1015 -87 858 560 -461 -872 -295 746 416 -458 -698 -28 645 407 -239 -732
2426 -732 -79 801 749 -420 -522 252 671 436 -241 -56 78 827 559 -341 -199 148 435 813 -42 -370
2446 -370 134 729 582 -49 -252 -12 483 577 0 -150 -61 286 481 -167 -351 -317 113 299 175 -10 -206
2467 -206 305 166 431 62 -192 297 668 682 267 156 485 1113 711 -290 -244 247 1017 620 -307 -550
$$ packed form
2325e03J39M15M80p45l1k57R99o0n16r0K67l5K21n55J91J07pK06k09M9k09m0P5
2348a08N3j13l41p4M83K98l42m52J7N82K38l50l30j54P61O70p16q20K22O39O62
2369H25o17j081P8J200J20k41q08L7Q48L68n03j072J60J087Q94j453n32L42J154
2388H06p9q69o24J28J430J79j004p21M96J283j9r45j114P21J317k65j037o13J030
2407A00R16j27j063q41R28R45k98j021m11N77J041l30q74k40O70O73k38o46m93
2426g32O53Q80n2j169j02P74M19k35o77J85J34P49k68r00J42L47K87L78q55l28
2446c70N04N95j47o31k03K40M95R4n77j50Q9L47J95o48j84L4M30J86j24j85j96
2467b06N11j39K65l69k54M89L71J4m15j11L29O28m02j001M6M91P70l97r27k43
$$ plain form
2487 -550 234 997 195 -338 -990 -81 697 296 -775 -1350 115 770 67 -1115 -1021 -18 895 341 -723
2506 -723 -739 566 1320 403 -507 -355 421 1240 917 -595 -332 778 1499 407 -652 -650 982 997 21
2525 21 -939 -908 566 1198 -215 -1122 -1089 308 508 -229 -1170 -758 295 471 -225 -1199 -671 293 471 -431
2545 -431 -892 -490 356 866 -184 -446 -169 805 1028 -33 -600 -47 669 586 478 -247 1 195 563 75
2565 75 -709 -203 125 226 -106 -536 -747 -406 23 -322 -967 -638 -445 46 -349 -970 -693 -266 90 107 -493
2586 -493 -590 59 351 698 -113 -267 253 1010 842 102 -377 112 836 978 -245 -468 -157 440 265 -604
2606 -604 -1045 -406 256 197 -705 -1789 -1000 243 -163 -1222 -1273 -540 518 179 -876 -1346 -400 745 607
2625 607 -402 -730 108 1160 824 -193 -508 325 1285 886 -418 -1025 290 1381 924 -357 -713 233
$$ packed form
2487e50P84P63q02n33o52R09P78m01j071n75J465O55p03j182R4J003R13n54j064
2506g23j6J305P54r17r10J52P76Q19l23j512K63J110P21j092j059KJ632J5r76
2525B1r60L1J474O32j413r07L3J397K00p37r41M12J053J76o96r74N28R64J78r02
2545d31m61M02Q46N10j050k62K77R74K23j061n67N53P16q3j08p25K48J94L68m88
2565G5p84N06L28J01l32m30k11L41M29l45o45L29J93M91l95o21K77M27L56J7o00
2586d93r7O49K92L47q11j54N20P57j68p40m79M89P24J42j223k23L11N97j75q69
2606f04m41O39O62n9r02j084P89J243m06j059n1P33J058l39j055m70R46J145j38
2625F07j009l28Q38J052l36j017l15Q33R60l99j304o07J315J091m57j281l56R46
$$ plain form
2643 233 863 82 -1179 -1058 -406 719 83 -1046 -930 -137 236 -495 -1013 -1178 -325 426 -82 -915 -718
2662 -718 124 388 162 -366 -403 526 859 632 -17 -132 570 1057 659 -108 -172 748 960 412 -39 -202 138
2683 138 676 299 -714 -805 -214 47 21 -599 -862 -613 -97 13 -461 -801 -521 -21 -21 -12 -786 -175 274 667
2705 667 28 -60 149 784 1090 356 -11 149 1071 1004 111 85 -139 792 878 141 -421 -453 55 653 -46 -844
2727 -844 -631 0 693 -158 -1179 -666 178 388 -367 -895 -506 506 880 159 -682 45 720 1022 408
2746 408 -560 129 935 1337 291 -524 71 1343 1199 -135 -384 104 896 908 -326 -758 -185 526 463
2765 463 -463 -1246 -578 580 312 -729 -909 -281 503 391 -299 -705 -16 772 377 -241 -294 11 1039
2784 1039 1148 209 27 92 794 980 230 -257 376 806 893 222 -268 -102 323 705 -68 -243 -241 171 267
$$ packed form
2643B33O30p81j261J21O52J125o36j129J16P93L73p31n18j65Q53P51n08q33J97
2662g18Q42K64k26n28l7R29L33k27o49j15P02M87l98p67o4R20K12n48m51j63L40
2683A38N38l77j013r1N91K61k6o20k63K49N16J10m74l40K80N00%Rp74O11M49L93
2705F67o39q8K09O35L06p34l67J60R22o7q93k6k24R31Q6p37n62l2N08N98o99p98
2727h44K13O31O93q51j021N13Q44K10p55n28L89J012L74p21q41P27O75L02o14
2746D08r68O89Q06M02j046q15N95J272j44j334k49M88P92J2j234m32N73P11o3
2765D63r26p83O68J158k68j041j80O28P84j12o90m06O89P88l95o18n3L05J028
2784A039J09r39j82O5P02J86p50m87O33M30Q7o71m90J66M25L82p73j75KM12R6
$$ [...]
8191b21
##END NTUPLES=NMR FID
##END=
