##TITLE=1H_SA_43.142(RM)
 CDCl3, 8 sc, 
 14.10.2019
##JCAMPDX= 6.0         $$ Bruker NMR JCAMP-DX V2.0
##DATA TYPE= NMR FID
##DATA CLASS= NTUPLES
##ORIGIN= UXNMR, Bruker Analytische Messtechnik GmbH
##OWNER= root
$$ XWIN-NMR		Version 3.5
$$ Mon Oct 14 16:01:56 2019 Russian Standard Time (UT+4h)  she@DPX200
##.OBSERVE FREQUENCY= 200.1315
##.OBSERVE NUCLEUS= ^1H
##.DELAY= (6, 6)
##.ACQUISITION MODE= SIMULTANEOUS
##.ACQUISITION SCHEME= undefined
##.AVERAGES= 8
##.DIGITISER RES= 18
##SPECTROMETER/DATA SYSTEM= spect
##.PULSE SEQUENCE= zg30
##.SOLVENT NAME= Acetone
##.SHIFT REFERENCE= (INTERNAL, Acetone, 0, 15.7039)
##AUDIT TRAIL= $$ (NUMBER, WHEN, WHO, WHERE, WHAT)
$$ ##TITLE= Audit trail, XWIN-NMR		Version 3.5
$$ ##JCAMPDX= 5.01
$$ ##ORIGIN= Bruker BioSpin GmbH
$$ ##OWNER= she
$$ F:/spectra/data/she/nmr/H-F/1/audita.txt
$$ ##AUDIT TRAIL=  $$ (NUMBER, WHEN, WHO, WHERE, WHAT)
(   1,<2019-10-14 15:59:28.00 +0400>,<she>,<DPX200>,
      <created by zg, POWCHK disabled, PULCHK disabled
       configuration hash MD5:
       00 E9 B6 7A A2 85 ED C7 34 08 36 98 17 FE 4E 26
       data hash MD5: 16K
       64 D6 03 D4 DD 93 EE A1 24 85 A5 5F 4C FC 75 F8>)
$$ ##END=
$$ 
$$ hash MD5
$$ 3B AE C6 5D AE 69 CD 87 75 1E 7C 2F F0 FE 83 26
##$RELAX= 
##$RELAX= 
##$RELAX= 
##$RELAX= 
##$RELAX= 
##$RELAX= 
$$ Bruker specific parameters
$$ --------------------------
##$DU= <F:/spectra>
##$EXPNO= 1
##$NAME= <H-F>
##$PROCNO= 1
##$TYPE= <nmr>
##$USER= <she>
##$AMP= (0..31)
100 100 100 100 100 100 100 100 100 100 100 100 100 100 100 100 100 100 
100 100 100 100 100 100 100 100 100 100 100 100 100 100 
##$AQSEQ= 0
##$AQ_mod= 1
##$AUNM= <au_zg>
##$AUTOPOS= <>
##$BF1= 200.13
##$BF2= 200.13
##$BF3= 200.13
##$BF4= 200.13
##$BF5= 200.13
##$BF6= 200.13
##$BF7= 200.13
##$BF8= 200.13
##$BYTORDA= 1
##$CFDGTYP= 0
##$CFRGTYP= 5
##$CHEMSTR= <none>
##$CNST= (0..31)
1 1 145 1 1 1 1 1 1 1 1 1 1 1 1 1 1 1 1 1 1 1 1 1 1 1 1 1 1 1 1 1 
##$CPDPRG= <>
##$CPDPRG1= <>
##$CPDPRG2= <>
##$CPDPRG3= <>
##$CPDPRG4= <mlev>
##$CPDPRG5= <mlev>
##$CPDPRG6= <mlev>
##$CPDPRG7= <mlev>
##$CPDPRG8= <mlev>
##$CPDPRGB= <>
##$CPDPRGT= <>
##$D= (0..31)
0 1.2 0 0 0 0 0 0 0 0.06 0 0.03 0 0 0 0 0.0002 0 0 0 0 0 0 0 0 0 0 0 0 
0 0 0 
##$DATE= 1571054367
##$DBL= (0..7)
120 120 120 120 120 120 120 120 
##$DBP= (0..7)
150 150 150 150 150 150 150 150 
##$DBP07= 0
##$DBPNAM0= <>
##$DBPNAM1= <>
##$DBPNAM2= <>
##$DBPNAM3= <>
##$DBPNAM4= <>
##$DBPNAM5= <>
##$DBPNAM6= <>
##$DBPNAM7= <>
##$DBPOAL= (0..7)
0.5 0.5 0.5 0.5 0.5 0.5 0.5 0.5 
##$DBPOFFS= (0..7)
0 0 0 0 0 0 0 0 
##$DE= 6
##$DECBNUC= <off>
##$DECIM= 24
##$DECNUC= <off>
##$DECSTAT= 4
##$DIGMOD= 1
##$DIGTYP= 9
##$DL= (0..7)
0 120 120 120 120 120 120 120 
##$DP= (0..7)
150 150 150 150 150 150 150 150 
##$DP07= 0
##$DPNAME0= <>
##$DPNAME1= <>
##$DPNAME2= <>
##$DPNAME3= <>
##$DPNAME4= <>
##$DPNAME5= <>
##$DPNAME6= <>
##$DPNAME7= <>
##$DPOAL= (0..7)
0.5 0.5 0.5 0.5 0.5 0.5 0.5 0.5 
##$DPOFFS= (0..7)
0 0 0 0 0 0 0 0 
##$DQDMODE= 0
##$DR= 18
##$DS= 0
##$DSLIST= <SSSSSSSSSSSSSSS>
$$ [...]
##$SUBNAM2= <"">
##$SUBNAM3= <"">
##$SUBNAM4= <"">
##$SUBNAM5= <"">
##$SUBNAM6= <"">
##$SUBNAM7= <"">
##$SUBNAM8= <"">
##$SUBNAM9= <"">
##$SW= 24.0689530833862
##$SWIBOX= (0..15)
0 0 2 0 0 0 0 0 0 0 0 0 0 0 0 0 
##$SW_h= 4816.95568400771
##$TD= 16384
##$TD0= 1
##$TE= 0
##$TE2= 300
##$TE3= 300
##$TEG= 300
##$TL= (0..7)
0 120 120 120 120 120 120 120 
##$TP= (0..7)
150 150 150 150 150 150 150 150 
##$TP07= 0
##$TPNAME0= <>
##$TPNAME1= <>
##$TPNAME2= <>
##$TPNAME3= <>
##$TPNAME4= <>
##$TPNAME5= <>
##$TPNAME6= <>
##$TPNAME7= <>
##$TPOAL= (0..7)
0.5 0.5 0.5 0.5 0.5 0.5 0.5 0.5 
##$TPOFFS= (0..7)
0 0 0 0 0 0 0 0 
##$TUNHIN= 0
##$TUNHOUT= 0
##$TUNXOUT= 0
##$USERA1= <user>
##$USERA2= <user>
##$USERA3= <user>
##$USERA4= <user>
##$USERA5= <user>
##$V9= 5
##$VALIST= <valist>
##$VCLIST= <CCCCCCCCCCCCCCC>
##$VD= 0
##$VDLIST= <DDDDDDDDDDDDDDD>
##$VPLIST= <PPPPPPPPPPPPPPP>
##$VTLIST= <TTTTTTTTTTTTTTT>
##$WBST= 1024
##$WBSW= 4
##$XGAIN= (0..3)
0 0 0 0 
##$XL= 0
##$YL= 0
##$YMAX_a= 285017
##$YMIN_a= -296849
##$ZGOPTNS= <>
##$ZL1= 120
##$ZL2= 120
##$ZL3= 120
##$ZL4= 120
##$ABSF1= 10
##$ABSF2= 0
##$ABSG= 5
##$ABSL= 3
##$ALPHA= 0
##$AQORDER= 0
##$ASSFAC= 0
##$ASSFACI= 0
##$ASSFACX= 0
##$ASSWID= 0
##$AUNMP= <proc_1d>
##$AZFE= 0.1
##$AZFW= 0.1
##$BCFW= 1
##$BC_mod= 2
##$BYTORDP= 1
##$COROFFS= 0
##$CY= 11.3945322036743
##$DATMOD= 1
##$DC= 2
##$DFILT= <>
##$DTYPP= 0
##$F1P= 20.1720416913024
##$F2P= 0.152960286110954
##$FCOR= 0.5
##$FTSIZE= 0
##$FT_mod= 4
##$GAMMA= 1
##$GB= 0.15
##$INTBC= 1
##$INTSCL= 1
##$ISEN= 128
##$LB= 0.24
##$LEV0= 0
##$LPBIN= 0
##$MAXI= 10000
##$MC2= 0
##$MEAN= 0
##$ME_mod= 0
##$MI= 1.114404
##$NCOEF= 0
##$NC_proc= 0
##$NLEV= 6
##$NOISF1= 3.799351
##$NOISF2= 2.8
##$NSP= 1
##$NTH_PI= 0
##$NZP= 0
##$OFFSET= 15.70392
##$PC= 1
##$PHC0= -9575.683
##$PHC1= 19.80093
##$PH_mod= 1
##$PKNL= yes
##$PPARMOD= 0
##$PSCAL= 0
##$PSIGN= 0
##$REVERSE= no
##$SF= 200.130013532006
##$SI= 16384
##$SIGF1= 3
##$SIGF2= 2
##$SINO= 400
##$SIOLD= 16384
##$SREGLST= <1H.CDCl3>
##$SSB= 0
##$STSI= 0
##$STSR= 0
##$SW_p= 3612.71676300578
##$SYMM= 0
##$S_DEV= 0
##$TDeff= 0
##$TDoff= 0
##$TI= <>
##$TILT= no
##$TM1= 0
##$TM2= 0
##$TOPLEV= 0
##$USERP1= <user>
##$USERP2= <user>
##$USERP3= <user>
##$USERP4= <user>
##$USERP5= <user>
##$WDW= 1
##$XDIM= 8192
##$YMAX_p= 0
##$YMIN_p= 0
$$ End of Bruker specific parameters
$$ ---------------------------------
##NTUPLES= NMR FID
##VAR_NAME=  TIME,          FID/REAL,        FID/IMAG
##SYMBOL=    X,             R,               I
##VAR_TYPE=  INDEPENDENT,   DEPENDENT,       DEPENDENT
##VAR_FORM=  AFFN,          ASDF,            ASDF
##VAR_DIM=   8192,          8192,            8192
##UNITS=     SECONDS,       ARBITRARY UNITS, ARBITRARY UNITS
##FACTOR=    0.0002076,     1,               1
##FIRST=     0,             0,               0
##LAST=      1.7004516,     0,               0
##MIN=       0,             -296849,         0
##MAX=       1.7004516,     285017,          0
$$ Real data points
##PAGE= N=1
##DATA TABLE= (X++(R..R)), XYDATA
$$ [...]
1874B0j20o8J78jMm9Q2J10r0j08p5L5K07M6k77J38J30j85j10j01L01k07K64m9
$$ 20 -100 -168 10 9 13 -36 46 156 66 -42 -117 -82 125 171 -106 32 162 -23 -133 -234 67 -140 124 75
1898G5L4N2m63J50J65j73j50K05k3J72k29J55l63J79K12J3O7k22MM24n77N3M93
$$ 75 109 161 -302 -152 13 -160 -310 -105 -128 44 -185 -30 -393 -214 -2 11 78 -144 -140 284 -293 -240 253
1921B53k30l27J43L38j54j41j49J65J70L04k85J31o7l36L71N8j38j85J63K06l88
$$ 253 23 -304 -161 177 23 -118 -267 -102 68 372 87 218 151 -185 186 244 106 -79 84 290 -98
1942i8L7L97l59M63k42m9l01K44J31K2k55K72j80r3J82N4l6l10l7J00J4K03L7
$$ -98 -61 336 -23 440 198 149 -152 92 223 245 -10 262 82 -11 171 225 189 -121 -158 -58 -44 159 196
1965A96o7m1j92L56j55L34m14N6R3J78k40l06L14j24J3K92j71L3k14L05l1o29
$$ 196 129 88 -104 252 97 431 17 73 166 344 104 -202 112 -12 1 293 122 155 -59 246 215 -414
1987d14K42J44j0K09k88J67j56N0m3J50K27m94K09J30j5N5k9j75kK66k54K69m56
$$ -414 -172 -28 -38 171 -117 50 -106 -56 -99 51 278 -216 -7 123 108 163 134 -41 -43 223 -31 238 -218
2010b18J92l89K08L11M7l08L52l48n6q6K83j00j90K92N7k16J81l16M04K4j26M1
$$ -218 -26 -415 -207 104 151 -157 195 -153 -209 -295 -12 -112 -302 -10 47 -169 12 -304 100 124 -2 39
2032C9j69O1k08K11J23l87J28K06K27q4l98J40O8j79J28K61l95L81K1j39p0j38
$$ 39 -130 -69 -277 -66 57 -330 -202 4 231 147 -251 -111 -43 -222 -94 167 -228 153 174 35 -35 -173
2054a73K13k6k14J24J91O5n7P9p5j76J1L21k62M0l58M51j83OJ37l17M39k89o2
$$ -173 40 14 -200 -76 115 180 123 202 127 -49 -38 283 21 61 -297 154 -29 -23 114 -203 236 -53 -115
2077a15L24K21n33k42M74K78m76J10j8N9pJ63p5M2k1j37J41O5m53J19J49K45m52
$$ -115 209 430 -103 -345 129 407 -69 41 23 82 75 238 163 205 184 47 188 253 -200 -81 68 313 -139
2100a39J67J57r9j88J71j01j24L05N2k6r5l9J58j79J70k87K49j2R5j08M5m2j94
$$ -139 28 185 86 -102 69 -32 -156 149 201 175 80 41 199 20 190 -97 152 140 235 127 172 130 -64
2123f4J76nj37k54K81J88q5k20K81k08j98K7O31l22q1n8n9J10j60L8J69L1m99
$$ -64 112 107 -30 -284 -3 185 100 -120 161 -47 -245 -218 413 91 10 -48 -107 3 -157 -119 50 81 -418
2146d18J96J10P3L92n07qm2J3R4Q4j18j09K15K34m71K51J19p3Q2j83o1K69n7j76
$$ -418 -222 -112 -39 353 -154 -162 -204 -191 -97 -13 -131 -240 -25 209 -262 -11 108 35 117 -66 -127 142 85 -91
2170i1J95k37P5J82O2k46l2J50j1q4O4j29O9L78k77l3j16L7J77N7j36q6L1K69
$$ -91 104 -133 -58 124 186 -60 -92 58 47 -37 27 -102 -33 345 68 35 -81 -44 133 190 54 -32 -1 268
2194B68j94k68K12R6o0l04M11j17m1J40J25j64j21l6Q9%J67k42k7J62J47l70K21
$$ 268 74 -194 18 114 54 -250 161 44 3 143 268 104 -17 -53 36 36 203 -39 -66 96 243 -127 94
2217I4m0k84K23M7L8l28L45J69o8k21J10K21k17j34K99k38q9J99J41n69L23k9
$$ 94 54 -230 -7 40 78 -250 95 264 196 -25 85 306 89 -45 254 16 -73 126 267 -302 21 -8
2239hl8j99Q7K26r0K64k75L40j98q2jP9p5M4j3M2l63M53l10k5J20k11K28k48K39
$$ -8 -46 -245 -158 68 -22 242 -33 307 109 27 26 105 30 74 61 103 -260 193 -117 -142 -22 -233 -5 -253 -14
2264a4K4J0k32J07K9K02m7j47J16j52K84j82Oj25Q9k93j32L57K51k05p8j68J56
$$ -14 10 20 -212 -105 -76 126 79 -68 48 -104 180 -2 4 -121 -32 -325 -457 -100 151 -54 -132 -300 -144
2287a44P7Q3p7l72L54J26k05N4O6K25j71%J89m69L74j41N1M5p5o2O9L4j6K77m05
$$ -144 -67 16 -61 -433 -79 47 -158 -104 -38 187 16 16 205 -264 110 -31 20 65 -10 -72 -3 31 15 292 -113
2312a13J98K79p43K95r5M43k18j61J08l02L86J18k99J37J2J83j95J6r9j7L66j05
$$ -113 85 364 -379 -84 -179 264 46 -115 -7 -309 77 195 -104 33 45 228 33 49 -50 -67 299 194
2334A94k25K70j77O5J0j37K65j85L1o0L20m20J54Q4j75L8J72Q8l84J04P0J89n74
$$ 194 -31 239 62 127 137 0 265 80 111 51 371 -49 105 189 14 52 224 312 -72 32 102 291 -283
2357b83L18R4L16n44K50l56J23K77m4j11j25k35M13j75O8R2k82P2n8M7R8J21j66
$$ -283 35 129 445 -99 151 -205 -82 195 151 40 -85 -320 93 -82 -14 78 -204 -132 -190 -143 -45 76 -90
2380i0R6j81n9J33P1j51L0K54k8j79J52j99K19k83J13l4K48k20J74j39N0j22L65
$$ -90 6 -175 -234 -101 -30 -181 -151 103 75 -104 48 -151 68 -215 -102 -136 112 -108 66 -73 -23 -145 220
2403B20m53q6K56K13l7l6K8N7j78J90p8J36j48O9k01Mj0k0J46q7j28P1K58k13
$$ 220 -233 -319 -63 150 113 77 105 162 -16 174 96 232 84 153 -48 -44 -54 -74 72 -15 -143 -72 186 -27
2427b7j15L54j48o3j51M15j34l15K79J70l36J07l24K03o8j40J34L12m02M52j79
$$ -27 -142 212 64 1 -150 265 131 -184 95 265 -71 36 -288 -85 -153 -293 -159 153 -249 203 24
2448B4J48j95j01K87k78K83l08J65K04k15J68m22L60j0L0J8k06Q5j4q3K78l3l55
$$ 24 172 -23 -124 163 -115 168 -140 25 229 14 182 -240 120 110 140 158 -48 37 23 -60 218 185 -170
2471a70L35k05R3J62J64o94L00j15P8lJ74L0n7Q0k84n3L59l8l65J96l8J22k16
$$ -170 165 -40 53 215 379 -315 -15 -130 -52 -55 119 149 92 172 -112 -165 194 156 -209 -13 -51 71 -145
2494a45J89j8J40m14K88k32J37M9K20j93r8j38L52j83j05K13j56L53j19j38j39
$$ -145 44 26 166 -248 40 -192 -55 -6 214 21 -77 -215 137 -46 -151 62 -94 259 140 2 -137
2515a37J0k4J32l1K69j98P1j61J35J20p1l66K88j36J10k05L07n4o4J12k2j75k01
$$ -137 -127 -151 -19 -50 219 21 92 -69 66 186 115 -251 37 -99 11 -194 113 59 -5 107 85 -90 -291
2538b91k7P22m27j19M61n22j21K91j1o8K71p3k66J35J88J93l84M7N0J16j44M4
$$ -291 -318 404 -23 -142 319 -203 -324 -33 -44 -112 159 86 -180 -45 143 336 -48 -1 49 165 21 65
2560F5L0L9k52K38n0j7K5j31J2ON4O2JM6Q0k21J20k08L28k90K80o5k56O1J23r7
$$ 65 95 134 -118 120 70 53 78 -53 -41 -35 19 81 82 128 208 -13 107 -101 227 -63 217 152 -104 -43 80 -17
2586a7m1l9K9k6K21k48J31J11L6J00j77k00J44p2M1m27M90k24J29j14Q4K76k40
$$ -17 -58 -97 -68 -94 127 -121 10 121 157 257 80 -120 24 -48 -7 -434 56 -168 -39 -153 -69 207 -33
2609c3j63L25j67O9l7j21K53q1J12p9j70l9N5K56l21K80q9p9O1l09M04J6m7jj12
$$ -33 -196 129 -38 31 -6 -127 126 45 157 78 -92 -131 -76 180 -141 139 50 -29 32 -277 127 143 96 95 -17
2634a7l9K30k17K61j45j66R0Q9n0J21j28J77q5j63L25n46L86k1K9p0k1j01j96
$$ -17 -56 174 -43 218 73 -93 -3 86 36 157 29 206 121 -42 283 -263 123 102 131 61 40 -61 -257
2657b57M50l71J25rj67J21Q2k11K16J10k46L8K38j77q1O3J34k66K54j11K34n29
$$ -257 193 -178 -53 -62 -229 -108 -26 -237 -21 89 -157 -119 119 -58 -139 -76 58 -208 46 -65 169 -360
2679c60M28R0j22J08j09N7k25r2J65N3K36m20L07j43J88m31M87j70J27j1j81j23
$$ -360 68 158 36 144 35 92 -133 -225 -60 -7 229 -191 116 -27 161 -270 217 47 174 163 -18 -141
2701a41L08j7l04J80r1j5j00J78k1J36k83Q8L35m9j47j9j18j72N40j99j50k0m2
$$ -141 167 150 -154 26 -65 -80 -180 -2 -23 113 -170 -82 253 204 57 38 -80 -252 288 89 -61 -81 -123
2724a23J98j28O8J55l19J89j42J94j69Q5j05J7j29L28k58j9J38J08j68j48J04
$$ -123 75 -53 15 170 -149 40 -102 92 -77 8 -97 -80 -209 119 -139 -158 -20 88 -80 -228 -124
2745a24L86k4k46J90j56o6q1L45j13q5k15K43o3J07k16K41p5J33j42j84K30k0
$$ -124 262 238 -8 182 26 -40 -121 224 111 26 -189 54 -9 98 -118 123 48 181 39 -145 85 65
2767F5L9j41J68j10Mj44L3J34k41J21j7j33L86n11J36K65l05M18k39L36k51j54
$$ 65 104 -37 131 21 25 -119 -86 48 -193 -72 -89 -222 164 -347 -211 54 -251 167 -72 264 13 -141
2789a41L4K75l20K09j43K1J71J11k71K21l72K28k00J87K27l86K73K32m19k8J03
$$ -141 -107 168 -152 57 -86 -65 106 217 -54 167 -205 23 -177 10 237 -149 124 356 -63 -91 12
2810A2L5l1l23N74l97j01L81k35L4P6O1oj9k64J5K32l1p4J40l8l7J79n14O17m47
$$ 12 47 16 -307 267 -130 -231 150 -85 -51 25 86 80 61 -203 -188 44 13 -61 79 41 4 183 -331 286 -161
2835a61M06l06op7j56K57O9p5J81k45K56l30K29J05l2l25J94O9p3j7J24M8j72
$$ -161 245 -61 -67 -144 -300 -43 26 -49 132 -113 143 -187 42 147 115 -210 -16 53 -20 -37 87 135 -37
2858c7j08K3N00p48K21J37J07K21k95p4%p4K3J58m4k0m0r2K78M2j93l7j71p3L02
$$ -37 -145 -122 378 -370 -149 -12 95 316 21 -53 -53 -127 -104 54 10 -10 -50 -142 136 178 -15 -52 -223 -296 6
2883FK38j59n7O1kk52M71L2m78J86j43L2N8N6j36J50m3l29J75K77l01j46L59N0
$$ 6 244 85 28 89 87 -165 306 338 -140 46 -97 -65 -7 49 -87 63 20 -309 -134 143 -158 -304 55 105
2907A05r9k31K46q2o4k20M99m7q5k37L00l4M1j30J44k31J88n2P3j18K90k08j92
$$ 105 6 -225 21 -61 -125 -345 154 107 22 -215 85 51 92 -38 106 -125 63 11 84 -34 256 48 -144
2930a44J62j06N8J02J30l80J02j82M44j6rj16j44J42m76M70J16NJ91k24j63M3
$$ -144 18 -88 -30 72 202 -178 -76 -258 186 170 161 45 -99 43 -433 37 153 158 349 125 -38 5
2952En1J73k8k39K37l1J38k42j05M26k01p4O9J22j31o8R4k36J49p3o9K17l20K23
$$ 5 -46 127 99 -140 97 66 204 -38 -143 283 82 8 77 199 68 0 94 -142 7 -66 -135 82 -238 -15
2976a5Q8j87j85K19j40K71N1j18j64J33J64n8J4j78K4J64M9q1k00J43J1N4K30
$$ -15 73 -114 -299 -80 -220 51 102 -16 -180 -47 117 59 73 -105 -81 83 132 51 -149 -6 5 59 289
2999B89Q8m90Q2J46j5o0l2J51j27L2j46J01J9O3R6k9K6n5j57J02j40K82J43m58
$$ 289 377 -113 -31 115 100 40 8 159 32 64 -82 19 38 101 197 168 194 139 -18 84 -56 226 369 -89
3023h9K82l12L32k58K47J89n20J43r6J89j89K06n2l03L39l14K95kP0k82Q2K75
$$ -89 193 -119 213 -45 202 391 -129 14 -82 107 -82 124 72 -231 108 -206 89 87 157 -125 -43 232
3045B32n32L33J20n6j24k41J66n1J57J52j99r2J14j1Nn1L0j6o1K4J14j62N9K22
$$ 232 -300 33 153 97 -27 -268 -102 -153 4 156 -43 -135 -21 -32 -27 -78 -48 -64 -125 -101 13 -149 -90 132
3069A32j29J9M0Q2k54o7j30P72q49L36J50m19N17l42N14m33O6j51Q5J74Q7l05
$$ 132 3 22 62 144 -110 -177 -307 465 -384 -48 102 -317 200 -142 372 -61 5 -146 -61 113 200 -105
3091a05m9K50J1k62J74R0lo8m0M23k96k1j30n2K42l10K19p7j5K15l5l01l0Q8K04
$$ -105 -154 96 107 -155 19 109 106 38 -2 421 125 104 -26 -78 164 -146 73 -4 -19 196 161 -140 -170 -82 122
3116A22k12J24j04J41pk2j87L33k01P0L1K04k80J94m17K03k5k9J68j33mJ58k0
$$ 122 -90 34 -70 71 64 42 -145 188 -13 57 88 292 12 206 -211 -8 -33 -62 106 -27 -31 127 107
3139A07j79J30l17K45J27N5r9L4m63O28l35J22oj29R7p7K33k36pl4J66rjN7l1
$$ 107 -72 58 -259 -14 113 168 69 103 -360 268 -67 55 49 -80 17 -60 173 -63 -70 -104 62 53 52 109 78
3164G8O1O0j35N6j78J46L5K88l5k28O1k71k56K61r8L48l96Q3l0J30Q1j69L24l06
$$ 78 139 199 64 120 -58 88 123 411 376 148 209 -62 -318 -57 -155 193 -203 -120 -150 -20 61 -108 216 -90
3188i0k55L41Q8n74O22j44q5M2M2O9k10K92k59J65J80j87L71n87KL3oL44l2l39
$$ -90 -345 -4 84 -490 132 -12 -97 -55 -13 56 -154 138 -121 44 224 37 408 -179 -177 -144 -150 194 162 -177
3212a77J10j11J25M9j24J59l73M90k40j89M06K2m12N63l10k63O2J67j90J58K02
$$ -177 -67 -178 -53 -4 -128 31 -342 148 -92 -281 125 147 -265 298 -12 -275 -213 -46 -236 -78 124
3233A24PJ83k70K5l9Q4M4K92n82N11l16k1o4K5K99k52j26p1K23l56J51j53K99
$$ 124 131 314 44 69 30 114 158 450 -132 379 63 42 -22 3 302 50 -76 -147 76 -280 -129 -282 17
3256A7r5J98r3Q8j73k2M41k75O7N8n77K63R4K52k23k47K29k6m5J06J33j66J64
$$ 17 -78 120 27 115 -58 -80 361 86 153 211 -366 -103 -9 243 20 -227 2 -24 -69 37 170 4 168
3279A68k25J45k83K99k13P6oJ34O8R4j08l14K85P8j58k28L77j64J44q3j66K43
$$ 168 -57 88 -195 104 -109 -33 -39 95 163 257 149 -165 120 198 40 -188 189 25 169 86 -80 163
3301A63j34J8j37k14M80l5J45m82J86J26j25J0n9L81m66j17J98J52K0J30l98m8
$$ 163 29 47 -90 -304 176 141 286 -196 -10 116 -9 1 -58 323 -143 -260 -62 90 110 240 -158 -206
3323b06L24k43K2J40jl25M98n3J46k87q9NO5k94L96j96k3Q2M99m68kj8K13j07
$$ -206 118 -125 -103 37 36 -289 209 156 302 15 -74 -69 -4 -298 98 -98 -121 -39 460 -8 -10 -28 185 78
3347G8k02J62L7Qj10j10K45j30nj12j8J14J0L4j61L60j75l83K99O9o9L8K03j38
$$ 78 -124 38 75 83 -27 -137 108 -22 -27 -139 -157 -43 -33 1 -160 200 25 -358 -59 10 -59 -21 182 44
3371D4j03J29j86K11j56K99l03l5K29Rk49J30J9L17k74j5j93JN3L8l4J71M3k73
$$ 44 -59 70 -116 95 -61 238 -65 -100 129 138 -111 19 38 355 81 66 -127 -126 -73 -35 -69 102 145 -128
3395a28l9j58N24j03J8k4j70J25n9O8K46k87O4k8l6J11n3j16K32n29L61K74k20
$$ -128 -167 -325 199 96 114 90 -80 45 -14 54 300 13 77 49 13 124 71 -45 187 -342 19 293 73
3418G3M7m5Np1N4j60k8K21k62j8J46J44n1k52P3o5K9J40j33J64r2o0P7O3K1J44
$$ 73 120 75 80 9 63 -97 -125 96 -166 -184 -38 106 55 -197 -124 -189 -160 -20 -153 11 -81 -141 -64 -1 20 164
3444A64k24l4K89j67M3N7j20m5O3L16k89k90J65L22m81M21k30N2Q1J51m79R4o9
$$ 164 -60 -94 195 28 71 128 8 -37 26 342 53 -237 -72 250 -231 190 -40 12 93 244 -235 -141 -210
3467b10N02j74k9Q5r5P9k15J38j71Q5k8N6j06L00l4l84j89M54K45q6l2k61k6O3
$$ -210 292 118 89 174 79 158 -57 81 -90 -5 -33 23 -83 217 183 -201 -390 64 309 223 191 -70 -96 -33
3491c3R5J69k41N8j71K35o8M5j89J06K32k63Q5j15j94R3J53k8P0j16K74j86k5
$$ -33 62 231 -10 48 -123 112 44 89 -100 6 238 -25 60 -55 -249 -156 -3 -31 39 -77 197 11 -14
3514a4p9k4k5J89l55O55j48l23J66R3m18J32M6J04k20K61M4o6j30O7n2J40n6j67
$$ -14 -93 -117 -142 47 -308 347 199 -124 42 135 -283 -151 -105 -1 -221 40 84 18 -112 -45 -97 43 -13 -180
3538a80K73k20N7K7J75k1m7j27N7j11K79m12M6K04J9j47K93k75J89JL91o52J79
$$ -180 93 -127 -70 -43 132 111 64 -63 -6 -117 162 -250 -204 0 19 -128 165 -110 79 80 471 -181 -2
3561bK81k54O5k76J01R2Rk22L23m2J81l00Q6J33l05Q1JK15k95J37J85l01M6k3
$$ -2 279 25 90 -186 -85 7 16 -206 117 75 256 -44 42 175 -130 -49 -48 167 -128 9 194 -107 -61 -84
3585h4J0j2J18P3j87J46K0J44k60J17j01k33J21Q7K4J69j38j15j02L75l15j79
$$ -84 -74 -86 32 105 -82 64 84 228 -32 85 -16 -249 -128 -41 -17 152 14 -101 -203 172 -143 -322
3607c22L96j56k2J41k6j98l0O3J19n6r9j05o3N75k95Q5OJ40k70M13k64j23Q9J13
$$ -322 74 -82 -104 37 11 -187 -217 -154 -35 -91 -190 -295 -358 217 -78 7 13 153 -117 296 32 -91 -2 111
3631A11L4k59M4K36K87n84R6N8K61o2k54k94P65k77m1j24k21K98L8o8r0p8L57
$$ 111 145 -114 -70 166 453 -131 -35 23 284 222 -32 -326 439 162 121 -3 -224 74 112 44 -46 -124 233
3654B33kk78K04j04j15K8pKJ52L4j57j87K19Lk0k5L50m38L19Oo2k26L45k96Q8
$$ 233 231 -47 157 53 -62 -34 -41 -39 113 147 -10 -197 22 25 5 -20 330 -108 211 217 155 -71 274 -22 66
3679F6L3n1k43J80j47Q7K03k16o4L33k97K30l24J98L4J29j5l54J10q9K57j07P3
$$ 66 99 48 -195 -15 -162 -75 128 -88 -152 181 -116 114 -210 -12 22 151 136 -218 -108 -197 60 -47 26
3702B6n2m6j0L02k03j16K97l25KM01j41r8L5N4K53l49k78L15Kj76J19Q9j07q8
$$ 26 -26 -72 -82 220 17 -99 198 -127 -125 276 135 37 72 126 379 30 -248 67 69 -107 12 101 -6 -94
3726i4J31n0k21J68M2j94Q2M54j35j62k41L79j52K8l8j25M04r6J23m78K18j17
$$ -94 37 -13 -234 -66 -24 -218 -136 318 183 21 -220 159 7 35 -3 -128 276 180 303 -175 43 -74
3748g4J13j51R3P8j02n0J93m9N6l01J11N7k8Q6j01J53l81K78K13m06R3j0L05J4
$$ -74 39 -112 -19 59 -43 -93 100 51 107 -194 -83 -26 -54 32 -69 84 -297 -19 194 -212 -119 -129 176 190
3772A90k3k9o4k21J21m1k6J12o7j2J22J06k45L31n29J72jPJ4O2J37j49n1K82l17
$$ 190 167 138 74 -147 -26 -67 -93 19 -48 -60 62 168 -77 254 -275 -103 -104 -97 -83 -21 116 -33 -84 198 -119
3797a19M17q9k27k1m29N33j32J6Q6j10o3K60j65j40K97J3m08L71k97K63K81j48
$$ -119 298 209 -18 -39 -468 65 -67 -51 35 -75 -138 122 -43 -183 114 127 -281 90 -207 56 337 189
3819A89j11K4j12K36j69j4J95j74j19K8O3k56M39r9N2R5l70q8K73q9j96J51P5
$$ 189 78 102 -10 226 57 43 238 64 -55 -27 36 -220 219 120 172 267 -103 -191 82 -7 -203 -52 23
3842B3J03j39k16K60k52M8K39j05j7j4J74O1j92j63J73j26J17k16J51J02k9n2
$$ 23 126 -13 -229 31 -221 -173 66 -39 -56 -70 104 165 -27 -190 -17 -143 -26 -242 -91 11 -18 -70
3864g0Q1j8Q3j40j87L13k23J09L11j09k29K71k92K15n80N95J94l21J33j32K34
$$ -70 11 -7 76 -64 -251 62 -161 -52 259 150 -79 192 -100 115 -465 130 324 3 136 4 238
3885B38p5m1R8n1Q6m29L30r2r8Q3k74M05k71J08k01O4o7K6n1K98O2k75L39o8k00
$$ 238 163 122 220 169 255 -174 156 64 -34 49 -225 180 -91 17 -184 -120 -187 -161 -212 86 148 -127 212 144 -56
3910e6M2J40Q5k78K6O0K74p5j98r0k77M89k80N27j75j71j78Q6J3J42l93J93n8
$$ -56 -14 126 211 -67 -41 19 293 218 20 -70 -347 142 -138 389 214 43 -135 -49 -36 106 -287 -94 -152
3933a52L2j38K38M9p3J49k06J39j28L74k43j03j59J24J06N5k4l60Q6M53q1k54
$$ -152 -120 -258 -20 29 -44 105 -101 38 -90 284 41 -62 -221 -97 9 64 40 -320 -234 219 138 -116
3955a16q8K94k15k9M1j03K70l04L77r5L12l56L5J20K1R9l39MK09l05J42J26j85
$$ -116 -204 90 -125 -154 -113 -216 54 -250 127 32 344 -12 23 143 164 263 -76 -72 137 -168 -26 100 -85
3978h5J73o7j05L2mK0J15R9l10K73r2O0r2Q5j60k23L59N4k57L13n2n2m48N16m8
$$ -85 88 21 -84 -52 -56 -36 79 178 -132 141 49 109 17 102 -58 -281 78 132 -125 188 136 84 -364 152 104
4003A04l63L89k03L92m39J33l5L77l71R0k81J17J26l03P25l23m9j86J45Mj64J87
$$ 104 -259 130 -73 319 -120 13 -22 355 -16 74 -207 -90 36 -267 458 135 86 -100 45 49 -115 72
4025G2k59L56k28K8J45J53k98r1q6LM8Q6j1L17Oj91L9j30J63m14J91J44p1K96
$$ 72 -187 169 -59 -31 114 267 -31 -122 -208 -205 -157 -71 -82 235 241 50 89 -41 122 -292 -101 43 -28 268
4049B68j06P6j27J14n46J61K28l58N72m14jJ25J1r1K20l20Q7J49Q9k08K6J52l30
$$ 268 162 238 111 225 -321 -160 68 -290 282 -132 -133 -8 3 -88 132 -188 -101 48 137 -71 -45 107 -223
4072b23K25K56j91K3r1P3k60J89J94Q5l43j44K54J37k02J67q2k85K54jM4k49R7
$$ -223 2 258 67 90 -1 72 -188 1 195 280 -63 -207 47 184 -18 149 67 -218 36 35 79 -170 -73
4095g3j98L73J4J65j86m6P2q2o4K7n2j12k51J32L30j39J67j0l11M93l44l5J68
$$ -73 -271 102 116 281 95 49 121 39 -25 2 -50 -162 -413 -281 49 -90 77 67 -244 249 -95 -130 38
4118C8k16N28k89j24k14K54L6r1K58j01n2J4mj34K28m02K28k51L83j46k3J69M1
$$ 38 -178 350 61 -63 -277 -23 13 -78 180 79 27 41 37 -97 131 -271 -43 -294 89 -57 -80 89 130
4141A30j30pJ76k04Q1J81k32k46K93J21j59qj03qL4M79k69j23J44k75N95m18N9
$$ 130 0 -7 169 -35 46 227 -5 -251 42 163 4 -4 -107 -115 -81 398 129 6 150 -125 470 52 111
4164A11j80j1pLM6k27K11K36l19q5K26J7P6k04K34k5l86L26K24l74Q5J6J5K3l6
$$ 111 -69 -80 -87 -84 -38 -265 -54 182 -137 -222 4 21 97 -107 127 102 -284 42 266 -108 -23 -7 8 31 -5
4189eo1O3o2k29q4M60P3j08J70l05q1JJ31K10j55m6m2j45K06j07O3L05k89j32
$$ -5 -66 -3 -65 -294 -378 82 155 47 217 -88 -169 -168 -37 173 18 -28 -70 -215 -9 -116 -53 252 -37 -169
4213a69K14m6m3r2N8k43O15k31Q1n02K20L66k08K92k30j05j94K44k10K20l43L50
$$ -169 45 -1 -44 -136 -78 -321 294 63 144 -358 -138 228 20 312 82 -23 -217 27 -183 37 -306 44
4235D4q8O5l37L97j58p5M11k13p3n0j48J5K58k97L53J80P3j24l08J69j37K2O4
$$ 44 -44 21 -316 81 -77 -152 259 46 -27 -77 -225 -210 48 -249 104 284 357 233 -75 94 -43 -21 43
4258D3L5J9m11L29J6m2R6L2m09J47K88k82q2M7K69L8k03j7K77j93k67J10J51p0
$$ 43 78 97 -314 15 31 -11 85 117 -292 -145 143 -139 -221 -174 95 133 -70 -87 190 -3 -270 -160 -9 -79
4282g9j12j4L72j44L06n85Q4O4R4p3J48j85J91o4j39p1K03m3j28J07M36n96K03
$$ -79 -191 -205 167 23 329 -256 -172 -108 -14 -87 61 -124 67 3 -136 -207 -4 -47 -175 -68 368 -228 -25
4305b5n2K32j63j26N06m71P6J3J62j61Q9M4k05m8J73N6R6M8j46K4L5j24q7j73
$$ -25 -77 155 -8 -134 372 -99 -23 -10 152 -9 80 124 -81 -129 44 100 196 244 98 122 157 33 -54 -227
4329b27L32N2j85Q4o9J17m42N36j28j60l2J90J41q3j95l83N42k57L70lk37K65
$$ -227 105 157 -28 56 -13 104 -338 198 70 -90 -122 68 209 126 -69 -452 90 -167 203 200 -37 228
4351B28k42O3J01j80M2M9P0j5l29J61J01kJ32k79Q9J17n1O7j93J92J40n21M08
$$ 228 -14 49 150 -30 12 61 131 116 -213 -52 49 47 179 -100 -11 106 55 122 -71 121 261 -260 148
4374A48j73j4R7p2J71j32m5j23R6J88k8k7k55L24k23J31J25m74K26J53j71J84
$$ 148 -25 -39 58 -14 157 25 -20 -143 -47 141 113 86 -169 155 -68 63 188 -286 -60 93 -78 106
4396A06j26L8J28m33L28N2r6Q4j49P1J43p9n1K2N8o8R5k69OJ80O3kj76L21l51
$$ 106 -20 18 146 -287 41 93 -3 81 -68 3 146 67 16 38 96 28 123 -146 -140 40 103 101 -75 246 -105
4421a05j17K36j0k7l0Q4Lj21n6Q6q3K58k01m55N19j10J33p6k0k7K05o8j28P9J1
$$ -105 -222 14 4 -23 -53 31 34 -87 -143 -57 -140 118 -83 -538 -19 -129 4 -72 -92 -119 86 18 -110 -31 -20
4446b0K64k86m3r5K56m1p1N2j11J54j94k1K90OrL7j35k22K3J30K04l91K09K4O6
$$ -20 244 -42 -85 -180 76 35 -36 16 -95 59 -135 -156 134 140 131 168 33 -189 -166 -36 168 -223 -14 10 76
4471G6N3l24J94L02k31j4n5L4j26J08Q5n5J3P3k69J82k43N3K15l1L08n52R7r7
$$ 76 129 -195 -1 301 70 56 1 35 -91 17 102 47 60 133 -136 46 -197 -144 71 40 348 -204 -107 -204
4495b04j44k2L42o6k58N45k6j42k2K24l02j06L58j72J12k37K00K75n83J04j05
$$ -204 -348 -370 -28 -94 -352 193 167 25 3 227 -75 -181 177 5 117 -120 80 355 -228 -124 -229
4516b29L79k82K47k56R5L4j2j12J07K2l2J21l6m1k51L30n1o8K49j07l3q8L4o7
$$ -229 150 -132 115 -141 -46 -12 -24 -136 -29 -7 -39 82 46 5 -246 84 33 -35 214 107 74 -14 20 -47
4540d7Ko9J28J18j36q8L1nN5K9l26K95j26Q5J7l4J37j53N9M18l27k17M2K06k16
$$ -47 -45 -114 14 132 -4 -92 -61 -66 -11 18 -308 -13 -139 -54 -37 -71 66 -87 -28 390 63 -154 -112 94 -122
4565a22J1J50K63j51P2jj26q0J45l91K86k55M2K07j2L1l53M31M37l30j84M8k38
$$ -122 -111 39 302 151 223 222 96 16 161 -230 56 -199 -157 50 38 69 -284 147 584 254 70 118 -120
4588a20J80k51K19K56m77K57j82r1M09k33K34j85J19k15L18k03K36l8q0K5j71
$$ -120 60 -191 28 284 -193 64 -118 -209 200 -33 201 16 135 -80 238 35 271 233 153 178 7
4609GJ01m24L51mj82L00l29K19j84J07J77k05RJ47k03J10n87M05J11O4m5J19K79
$$ 7 108 -316 35 31 -151 149 -180 39 -145 -38 139 -66 -57 90 -113 -3 -590 -185 -74 -10 -55 64 343
4632C43m30j67J08J40q5J33k3r8J28J48l15M77n40M65j78l10KQ5j39L68M1k75
$$ 343 -87 -254 -146 -6 -91 42 19 -79 49 197 -118 359 -181 284 106 -204 -202 -117 -256 112 153 -122
4654a22p7J72r9J40j67P6Q6L6o3K78j23n4P3K02k93M4l76M25k05J87M1k37J6K53
$$ -122 -199 -27 -126 14 -153 -77 9 45 -18 260 137 83 156 358 65 109 -267 158 -47 140 181 -56 -40 213
4678B13j00k24K53k01L7j60J04L92k59j30M4J03j70J07R4j69K60j04j22m0N4K59
$$ 213 113 -111 142 -59 -22 -182 -78 314 55 -75 -31 72 -98 9 103 -66 194 90 -32 -72 -18 241
4700B41r7l21L16m33M66K52l92p7N8k99J82Q1J81l9k56M7nO9Q9K24n11M53rj93
$$ 241 144 -177 139 -294 172 424 32 -45 13 -286 -104 -23 158 119 -137 -90 -95 -26 63 287 -224 229 220 27
4724B7J18k28O4k4O9l10J35K20N2r0K3M5K72m19J00J21kk51P0j64J84R7M8k6J06
$$ 27 145 -83 -19 -43 26 -284 -149 71 123 33 56 101 373 -46 54 175 173 -78 -8 -172 12 109 157 131 237
4749B37l26j05J42J27J61k64Q0L1l7l2N9r3RK6K14j41j22o7K04j58K87k66J70
$$ 237 -89 -194 -52 75 236 -28 52 83 46 14 73 -20 -11 15 229 88 -34 -101 103 -55 232 -34 136
4772A36j21J4k30P1K61j27p4J03L8j90M29k82QJ32k01k02K97j44J82j95J08Q7
$$ 136 15 29 -201 -130 131 4 -70 33 71 -119 310 28 36 168 -33 -235 62 -82 100 -95 13 100
4794A00j74K09m2J24j08k83Q0j20M22l32P0k0m7K01q8r7m6K28j20K28j90o8L00
$$ 100 -74 135 93 217 109 -174 -94 -214 208 -124 -54 -74 -121 80 -8 -105 -151 77 -43 185 -5 -73 227
4817B27K0k91K50p3l42L01k74K03N7L0J88k24N2l23r2K13L4M5m22M04N6j22j0
$$ 227 247 -44 206 133 -209 92 -182 21 78 108 296 72 124 -199 -291 -78 -44 1 -421 -17 39 -83 -93
4840i3K59n6q9M4J68n9j34j20L0L62k90k78J46L36l95J84k06J73JJ01j7M4l07
$$ -93 166 110 21 65 233 174 40 -80 -50 312 22 -256 -110 226 -169 15 -191 -18 -17 84 67 111 -196
4863a96j4K71J05k29K1r3K42k43N7P7LK93k79K9j06J00j26K52K2m94J27j48L68
$$ -196 -210 61 166 -63 -42 -135 107 -136 -79 -2 1 294 15 44 -62 38 -88 164 186 -308 -181 -329 39
4886C9k33K36J8m21J72J28l0J12l58K82j78r8L41L25n24L09n11M04K6M7n2J3j88
$$ 39 -194 42 60 -361 -189 -61 -91 21 -337 -55 -233 -331 10 335 -189 120 -391 13 39 86 34 47 -141
4909a41k12M48K49j21r6O7l5k15L8P2ll31L53O4M7l8p5O1j95K07q0j77Q2R0m3
$$ -141 -353 95 344 223 127 194 159 -56 -18 54 51 -280 73 137 184 146 71 132 -63 144 64 -113 -31 59 16
4934A6J62k09pK5L9J19j32K13J1J2l3k56J8n2j65L02Rj4qr1J70k98K17r0RJ53
$$ 16 178 -31 -38 -13 26 145 13 226 237 249 216 -40 -22 -74 -239 63 72 58 50 -41 129 -169 48 -42 -33 120
4960A20l5n1Q9l62K97J00k15p9J19n3J90j10k26L36l12J65J67k35j2j45L25J4
$$ 120 85 34 123 -239 58 158 -57 -136 -17 -70 120 10 -216 120 -192 -27 140 -95 -107 -252 73 87
4982H7PN8r1N2l9J79l22M66l84qJ64k74J70j0k49N0m3K85l15L83k02j5l1J69j98
$$ 87 94 152 61 113 74 253 -69 397 13 5 169 -105 65 55 -194 -144 -187 98 -217 166 -36 -51 -82 87 -111
5007a11M8K22k00K10j33m1J15k73L50p9k58K22l2L6r3P1j67L13k96QK42j68K00
$$ -111 -63 159 -41 169 36 -5 110 -163 187 108 -150 72 40 76 -17 54 -113 200 -96 -88 154 -14 186
5030A86j03m27M67k36j99J02K49k25K72K18k59K4Rj7j81K56j21O7k14J37o8o4
$$ 186 83 -344 123 -113 -312 -210 39 -186 86 304 45 69 78 61 -120 136 15 82 -132 5 -63 -127
5052a27K66o0n39L26K95l58L73j15J8j08J28N7O6O0l44lO6q5J13K2K76k62k66
$$ -127 139 79 -460 -134 161 -197 176 61 79 -29 99 156 222 282 -62 -65 1 -84 29 51 327 65 -201
5075b01L25j81O9mK04n89M71J89k91j37J93J35j08j60R1n3q3J64K01k15J00l37
$$ -201 124 -57 12 8 212 -377 94 283 -8 -145 48 183 75 -85 6 -47 -130 34 235 20 120 -217
5097b17K36l68L23K9J00n8j25J9K53J75m16K76l87K08K13q1l94K81j77J31j98
$$ -217 19 -349 -26 3 103 45 -80 -61 192 367 -49 227 -160 48 261 180 -214 67 -110 21 -177
5118a77J09j42K10r5n4K29j45k08L64N7L4k93J25J9j32n2K06Q8k41J64j66n9K08
$$ -177 -68 -210 0 -95 -149 80 -65 -273 91 148 182 -111 14 33 -99 -151 55 143 -98 66 -100 -159 49
5141D9J16M0j47j4j96j6M57m65J12K74m84J87J93K13j40Pk16J70j33m0o6K16j50
$$ 49 165 205 58 44 -152 -168 289 -176 -64 210 -274 -87 106 319 179 186 -30 140 7 -33 -99 117 -33
5164c3k03L52j36k45O81n67L92r9q2J90l38j35L82m48M25k65P2j45J95L2l06M53
$$ -33 -236 116 -20 -265 416 -151 241 142 60 250 -88 -223 159 -289 136 -129 -57 -202 -7 25 -281 172
5186A72j91j89K37N5k41M37j13j08m9J95n99L63J04j24M8j04J92j11j12N1j79
$$ 172 -19 -208 29 84 -157 280 167 59 10 205 -394 -31 73 -51 -3 -107 85 -26 -138 -87 -266
5207b66M58k60j06R1J22k3n7J67q9j64J39K2N2k7J82l63m7J57j74M08no1j84Q6
$$ -266 192 -68 -174 -83 39 16 -41 126 37 -127 12 34 86 59 241 -122 -169 -12 -186 222 217 156 -28 58
5231E8R5l96K16o4J12j9R8k18L04K06n17K52J3j88K23l37k3K14j9m5P5J17k77
$$ 58 153 -243 -27 -91 21 2 100 -118 186 392 -125 127 140 -48 175 -162 -185 29 10 -35 40 157 -120
5254a20R0N11n32j45O73o00K29j3p1j63K79j99j47Q8J80K9j45J13J4J25j05j53
$$ -120 -30 481 -51 -196 477 -123 106 93 22 -141 138 -61 -208 -120 60 89 -56 57 71 196 91 -62
5276f2k15Q4L32k42O6K10j18q5j0J39m0j09O7l5j45K84J5k66OK14j17J23J4k65
$$ -62 -277 -193 139 -103 -37 173 55 -30 -40 99 59 -50 17 -18 -163 121 136 -130 -124 90 -27 96 110 -155
5300a55K22K16l90P4l6L80j32l09K8K19j72J82o4J95j10q6Qk59K26j71K51R0m15
$$ -155 67 283 -107 -33 -69 311 179 -130 -102 117 -55 127 63 258 148 62 70 -189 37 -134 117 207 -208
5323b08j32N55m07K27j81J43q6J17n4R3j81J20K80k78o2J05kn3l8J96j55Q2k69
$$ -208 -340 215 -192 35 -146 -3 -89 28 -26 67 -114 6 286 8 -54 51 49 -4 -42 154 -1 81 -188
5346a88J27R2k94J39m4M18j40N4m63L41k38J83n8j07j19O6L65l88M08k71J74J76
$$ -188 -61 31 -263 -124 -168 250 110 164 -299 42 -196 -13 -71 -178 -297 -231 134 -254 154 -117 57 233
5368B33j00j19J8j40L03k68J16Q5j4j20m0K92J0l74J33O2k33J00m1k97K94K08
$$ 233 133 14 32 -108 195 -73 43 128 114 -6 -46 246 256 -118 15 77 -156 -56 -97 -394 -100 108
5390A08j61J16l94L11q4O1j01R2Q9k27J47oJ47K5K8N0l88K5j62P4kK06q0n7L26
$$ 108 -53 63 -331 -20 -104 -43 -144 -52 37 -190 -43 -49 98 123 151 201 -187 -162 -324 -250 -252 -46 -126 -183 143
5415A43JN9j25j23m07N63pm38K67L09k16P5n3k49K50n5J31k13J58m53J45J81L19
$$ 143 144 203 78 -45 -452 111 104 -334 -67 242 26 101 48 -201 49 -6 125 -88 70 -383 -238 -57 262
5438B62j96R7l09j4J39J62j25R5K05m35J65J57k79n6l5R1j21K38j41L68k23N1
$$ 262 66 163 -146 -160 -21 141 16 111 316 -119 46 203 -76 -132 -167 -76 -197 41 -100 268 45 96
5460I6j9j25J34p0k67K73r0K4J09K34l89k7J7K8r6J26J11J9o1j40O3L17k03Pk83
$$ 96 77 -48 86 16 -251 22 -68 -44 65 299 -90 -117 -100 -72 -168 -42 69 88 27 -113 -50 267 64 71 -212
5485b12Q1p4L30r1j84L40O1l00J06L51m51q4K7J62p2J72l08K88j17p8Q7k6l36
$$ -212 -131 -205 125 34 -150 190 251 -49 57 408 -43 -127 -100 62 -10 162 -146 142 25 -53 34 8 -328
5508c28L55j18L14j91j75K24m59K89J42k38J77J8q6K56l9J28l45N6N3O1j20m1
$$ -328 27 -91 223 32 -143 81 -378 -89 53 -185 -8 10 -76 180 141 269 -76 -20 33 94 -26 -67
5530f7q9R6m8J32k40J76R6k28J73J76k79L38k40L8j9k22K05R3m5o8K23l23L88
$$ -67 -156 -60 -108 24 -216 -40 56 -172 1 177 -102 236 -4 34 15 -207 -2 91 46 -22 201 -122 266
5553B66j78k3k21J65n5k40N41Q0m09P7j66O4K48k53k01J36J14N0r7J81K86k91
$$ 266 88 65 -156 9 -46 -286 255 335 -74 3 -163 -99 149 -104 -305 -169 -55 -5 -102 79 365 74
5575G4Q3j85J35l44L08r1K35n30K31o0J55km17K93M2K72k66J37N0k9j60k2p0L0
$$ 74 157 -28 107 -237 71 -20 215 -315 -84 -144 11 9 -408 -115 -73 199 -67 70 120 91 -69 -91 -161 -131
5599a31J23J49j70j6J09K45k39o5j54o4L17j25l8%K9K05r6k86K50r3M5M0j01Q
$$ -131 -8 141 -29 -45 64 309 70 5 -149 -213 104 -21 -59 -59 -30 175 79 -207 43 -50 -5 35 -66 -58
5623e8J30J56l49L72l70K68l37N9L25l02q7K96np5j19j8K46K1j57J4k04PJ67J46
$$ -58 72 228 -121 251 -119 149 -188 -129 196 -106 -193 103 98 23 -96 -114 132 153 -4 10 -194 -187 -20 126
5647A26n08K72J63J37m47K88j85K3J97m2n3P5p7j45M03l21J20l5k70L7M16j69
$$ 126 -382 -110 53 190 -257 31 -154 -131 66 24 -29 46 -31 -176 227 -94 26 -9 -279 -242 174 5
5669ER8Kn1k56L9L5J79M6o6k89K50L9K6o9J53P5k84lL4J3j28L8k0J43j2q5k5O7
$$ 5 103 105 54 -202 -163 -128 51 97 31 -258 -8 31 57 -12 141 216 -68 -71 -37 -24 -152 -114 -134 9 -3 -88 -113 -46
5697d6Nk18p0K79J97L2k4k50J29L5j11L06k20j26J75K17k69k3l62N69q3q3P4k70
$$ -46 -41 -259 -329 -50 147 179 155 -95 34 69 -42 264 44 -82 93 310 41 18 -344 225 142 59 133 -137
5721a37J42J56j40k10K17J67k41R6l6J41m80K74j89J53j53J78Q6k17R8M61l74
$$ -137 5 161 21 -189 28 195 -46 50 14 155 -325 -51 -240 -87 -240 -62 24 -193 -95 366 -8
5742ho1K7RJ39k00K62j33j88J85K84l86Q7j4J51K0l23N5MN7J96l84K33J96m99
$$ -8 -69 -42 -33 106 -94 168 35 -153 32 316 -70 17 3 154 174 -149 -94 -90 -33 163 -221 12 208 -291
5766b91N76n10J00L26l30J23P7M6l64N00k99q9Q4Q7op9J8P8j13P7J7k29L96l93
$$ -291 285 -225 -125 201 -129 -6 71 117 -247 253 -46 -135 -51 36 30 -49 -31 47 -66 11 28 -201 195 -198
5790a98J31K54k46oK58k78o6J31L4k4j66O3QK11k18N15l77J32n1l69L71K55l24
$$ -198 -67 187 -59 -65 193 -85 -151 -20 14 -10 -176 -113 -105 106 -112 403 26 158 107 -262 109 364 40
5813D0k65L66k29m9m0P5KJ18k17L79j08k2k02K44j50K64j59j08J92j7j36O7j85
$$ 40 -225 141 -88 -137 -177 -102 -100 18 -199 180 72 50 -152 92 -58 206 47 -61 131 114 -22 45 -140
5836a40J46Q3J55k64R6j76J40j87K65L9k76j24K62j39L58k61k16K95L6q1K74k87
$$ -140 6 89 244 -20 76 -100 40 -147 118 157 -119 -243 19 -120 238 -23 -239 56 92 11 285 -2
5858bk9m9q8M23k27M4k20K82j72P5P4j23M0k18n4L21j5k82L35j21J62m14k92M15
$$ -2 -31 -80 -168 255 28 72 -148 134 -38 37 111 -12 28 -190 -244 77 62 -220 115 -6 156 -258 -550 -135
5882a35K30k79M29j27l2l97j50L92L2j08J77K76l19J37r7P8j61l2J50RJ92n44
$$ -135 95 -184 245 118 86 -311 -461 -69 -37 -145 32 308 -11 126 29 107 -54 -86 64 73 265 -279
5904b79K05O3q4N6J1k93N25k74J31J99k85J6J14p7o0m7K7oq4J54k03J86k39M41
$$ -279 -74 -11 -95 -39 -28 -321 204 -70 61 260 -25 -9 105 28 -32 -79 -52 -58 -142 12 -191 -5 -244 197
5928A97n36K90J75l54L14J1k1j57K49l02M48n34L54l4k6L9j00J02P4n6k25j05
$$ 197 -339 -49 126 -228 86 97 76 -81 168 -134 314 -220 134 100 74 113 13 115 189 133 -92 -197
5950a97L77P6o26N06l05J97J54j65k85L14k36O5p5K18J05l86M12j27L5m1P4l66
$$ -197 180 256 -370 136 -169 28 182 17 -268 46 -190 -125 -200 18 123 -263 149 22 57 16 90 -276
5972b76K49J93K0m32P9J17j34N75m70J18j73lJ32j99l6J77J75l09K00O4J12O8
$$ -276 -27 166 186 -246 -167 -50 -184 391 -79 39 -134 -137 -5 -204 -240 -63 112 -197 3 67 179 247
5994B47q3m57J98M3M5K8J91j76m3J68L0j40n2J55k04J50K25l33j35N5j18J50P7
$$ 247 164 -293 -95 -52 -7 21 212 36 -7 161 191 51 -1 154 -50 100 325 -8 -143 -88 -206 -56 21
6017B1o5O7j77L3K77r4O0J76o7r2Qj74j15K0Q5M8j21J45l27Q7L0J47J67r1l45
$$ 21 -44 23 -154 -121 156 62 122 298 231 139 147 -27 -142 -122 -37 11 -110 35 -292 -205 -175 -28 139 48 -297
6042b97K57J80k47J70j67L5R7j71J56m6j62K41J46k93K11m50M41k54%K19J40o44
$$ -297 -40 140 -107 63 -104 -69 28 -143 13 -33 -195 46 192 -101 110 -340 101 -153 -153 66 206 -438
6064d38O19j58l2O6OJ0k00m3J68k53K16j01J3K31j71L2J1J32j29J20N7j69L1l0
$$ -438 181 23 -9 57 63 73 -127 -170 -2 -255 -39 -140 -127 104 -67 -35 -24 108 -21 99 156 -13 18 -12
6088a2P7j6J27j76m9M15n29K24m76L61L8L4J04j25oP6r4j61K19J69p8J51n24L30
$$ -12 65 49 176 0 -49 366 -163 61 -415 -54 -16 18 122 -3 -9 67 -27 -188 31 200 122 273 -251 79
6112G9r4J6o8j70K97j00p1J59j60K53l55J12K85n7l1n4k12J60J09j71J37j36K5
$$ 79 -15 1 -67 -237 60 -40 -111 48 -112 141 -214 -102 183 126 95 41 -171 -11 98 -73 64 -72 -47
6135d7M1l3j2J92n4j56j15k64N98l02J97j0J90m87K15j27m1M66k44J00k22M71
$$ -47 -6 -39 -51 141 87 -69 -184 -448 150 -152 45 35 225 -262 -47 -174 -215 251 7 107 -115 356
6157C56l50J75j13j8K6J59m26M37k30l5M1q6nj87J57o7nL42k47j84K69Q3L5p1
$$ 356 6 181 68 50 76 235 -191 246 16 -19 22 -64 -69 -256 -99 -166 -171 171 -76 -260 9 92 127 56
6181E6J13l84Q3N5j3r5K22l26P4L20nr8j69L5K2q6J35j9J77o1J2j31j92L87k31
$$ 56 169 -215 -132 -77 -90 -185 37 -289 -215 105 100 2 -167 -132 -110 -196 -61 -80 97 36 48 -83 -275 112 -119
6206a19J26m3J8K54k8l23R2m2K12l68J49J92k8l74K81K11k27JL79l49j29J66l20
$$ -119 7 -36 -18 236 208 -115 -23 -65 147 -221 -72 120 92 -282 -1 210 -17 -16 363 14 -115 51 -269
6229b69K4P4K86O7m09R9K22j6qj07k4L3K03j39j29J2j78N77k20O0n0k01K3j15
$$ -269 -245 -171 115 182 -227 -128 94 78 70 -37 -61 -28 175 36 -93 -81 -259 318 98 158 108 -93 -70 -185
6253a85N9J65j75J77l93N97k48j32O0r9M22m66M32l02J27Q8o8l06J64pN96o02
$$ -185 -126 39 -136 41 -352 245 -3 -135 -75 -174 248 -218 214 -88 39 127 59 -247 -83 -90 506 -96
6275i6K84j22k77J73J68l5k21L38k61K96k61J70m55K79R7n4j04J56j46J60j82
$$ -96 188 66 -211 -38 130 95 -126 212 -49 247 -14 156 -299 -20 77 23 -81 75 -71 89 -93
6296i3j56N23k38N8j53NJ11O4j69K9M8j81J94K9j49Q8j45L00p3m11O6L46k17L32
$$ -93 -249 274 36 94 -59 -54 57 121 -48 -19 29 -152 42 71 -78 10 -135 165 92 -319 -253 93 -124 208
6320B08n06l5K81K3j09J4J57L7p7j21J55M8k0n9j89J07J5j5N2L37l34n1J86o0
$$ 208 -298 -333 -52 -29 -138 -124 33 70 -7 -128 27 75 55 -4 -193 -86 -71 -86 -34 303 -31 -82 104 44
6344D4l16K13j1J61K0m22K31K34k98l8J14P4J39l5j27M1J12j02J24j6k53J30q6
$$ 44 -272 -59 -70 91 111 -311 -80 154 -144 -182 -68 6 145 110 -17 24 136 34 158 142 -111 19 -67
6367f7Q2j93J92M0k38L55k61J84n2n0q9j40J76p3j03M7mR7K1n7J83r0j93J35m3
$$ -67 15 -178 14 54 -184 171 -90 94 42 -8 -97 -237 -61 -134 -237 -190 -194 -97 -76 -133 50 -40 -233 -98 -141
6392a41J83o0Q1j49J43m74L85O4K43k68J94o9k20j60L71l7R0k31J21J45qk90R1
$$ -141 42 -18 63 -86 57 -417 -32 32 275 7 201 132 -88 -248 123 86 176 -55 66 211 203 -87 4
6415Dm9K7j00J77L56m27M9j30K08Q7k45K01k47N9K06l97L5J1K70kJ25l56J65k3
$$ 4 -45 -18 -118 59 415 -12 37 -93 115 202 -43 158 -89 -30 176 -221 -186 -175 95 93 218 -138 27 4
6439DK6k51K05J50k46L30k59J15K00k88pk1J22K65k81n1j66J49J20O5p1j10k12
$$ 4 30 -221 -16 134 -112 218 -41 74 274 -14 -21 -42 80 345 64 13 -153 -4 116 181 110 0 -212
6462b12L59P1K5j21n14L16J35j94Q0R6j48RM4N4j49j10O6M08j69j93K81k46L9
$$ -212 147 218 243 122 -392 -76 59 -135 -55 41 -107 -98 -54 0 -149 -259 -193 215 46 -147 134 -112 -73
6485g3K32R3M1n49K85j17Q9M36p15M8K1n4J82M7J54l78K98J20l84M77l34K16j18
$$ -73 159 252 293 -256 29 -88 1 437 -278 -230 -209 -263 -81 -34 120 -258 40 160 -224 253 -81 135 17
6508A7l2O8k35Q0J67M0n1k98Q6K15k43J63N4p4o4K28J08j87J38l28K58r4j36J13
$$ 17 -15 53 -182 -102 65 105 54 -244 -158 57 -186 -23 31 -43 -107 121 229 42 180 -148 110 16 -120 -7
6532gm7j93K74J31j58K32l37O0R9o3J94k62j9L67l68J11jJ21k34l4r8J10K12l29
$$ -7 -54 -247 27 158 0 232 -105 -45 54 -9 185 -77 -96 271 -97 14 13 134 -100 -134 -232 -122 90 -239
6556b39L77N9j84k01J58J17Q1n3l46L56K46k80o1K27j84j78j6j01M38l1l23j6
$$ -239 138 197 13 -188 -30 87 168 115 -231 125 371 91 30 257 73 -105 -121 -222 216 185 -138 -154
6578a54R1r0K05l70L36j18j4K45j46q1J87p3PJ21l76K73j87M16lP3j03n0J80m15
$$ -154 -63 -153 52 -318 18 -100 -114 131 -15 -96 91 18 25 146 -230 43 -144 272 269 342 239 189 369 -46
6602d6K16j01J22lj06k21M62j4l02nO2j45O3j49J35J39K28j74j90J58k61L21k26
$$ -46 170 69 191 188 82 -139 323 309 7 2 64 -81 -18 -167 -32 107 335 161 -29 129 -132 189 -37
6625c7K05q7l81N10j24j51lj23K46j38J68j77K50k1j68R4k26J75o4Q3j96K43n
$$ -37 168 81 -300 210 86 -65 -68 -191 55 -83 85 -92 158 137 -31 63 -163 12 -52 31 -165 78 73
6648G3m88L35L85n78L14j43j75M33j60L2k9k7l2K8Q5n8K24k73K04r6Q4j86j26
$$ 73 -415 -80 305 -273 41 -102 -277 156 -4 28 -1 -28 -60 -32 53 -5 219 -54 150 54 138 -48 -174
6671a74J60Kk10L08j67k1j5K19o8P7k19R7L21p9k13lK15o9k38J44K48l96J89Q2
$$ -174 -14 -12 -222 86 -81 -102 -117 102 34 111 -108 -11 310 231 18 15 230 161 -77 67 315 -81 108 190
6695A90k59J04o1k87J80m2K69l85J59J73k13L40j92j94k8Q7p5L23p7k05m5O7J62
$$ 190 -69 35 -26 -313 -133 -175 94 -291 -132 41 -172 168 -24 -218 -246 -159 -234 89 12 -193 -238 -171 -9
6718iJ42k11P7J09m1n6J1J42l22R6J4k23J15K18k83K57m3j14l6N81n04K13P1j24
$$ -9 133 -78 -1 108 67 11 22 164 -158 -62 -48 -271 -156 62 -221 36 -7 -121 -157 424 -80 133 204 80
6742H0j67K11k78K46j58J90K11l83J42l75N11j42r9J18J06o7l69K88N0j73K5N7
$$ 80 -87 124 -154 92 -66 124 335 -48 94 -281 230 88 -11 107 213 146 -223 65 115 -58 -33 24
6764B4l56L86JQ6j90J4Mj80j24P00m21L79l5m65K5J86O9p3q1K41l70R6k28j26
$$ 24 -332 54 55 141 -49 -35 -31 -211 -335 365 -56 323 288 -177 -152 34 103 30 -51 190 -180 -84 -312 -438
6788d38M96j21R6J0k20K38j37O6J60k03K58k69o2k3K58j54l05N33jj30L8j4k49
$$ -438 58 -63 33 43 -177 61 -76 -10 150 -53 205 -64 -126 -149 109 -45 -350 183 182 52 90 76 -173
6811a73k4L89p2j93K10l06k58M64M8p7j03K26j93Q2K2l17M50l52J1L4j3k2M78
$$ -173 -197 192 120 -73 137 -169 -427 37 85 8 -95 131 -62 20 42 -275 175 -177 -166 -132 -145 -167 311
6834C11l90J1O3J1j4j72L57j5J7k3l25L9oL9K37n8k24o3R6J23N6n4M9j99l34N93
$$ 311 -79 -68 -5 6 -8 -180 177 162 179 156 -169 -130 -136 -97 140 82 -142 -205 -109 14 70 16 65 -134 -468 125
6860A25n24L82k65K40j72J38K50l6k82J87j74n1L70k07p9p4J8J83J01j13O9k03
$$ 125 -399 -17 -282 -42 -214 -76 174 138 -144 43 -131 -182 188 -19 -98 -172 -154 29 130 17 86 -117
6882a17m6K88l13K41q8K16j66j48M32j97k06J41j09P5L16k28K12l73P8o7MK31
$$ -117 -163 125 -188 53 -35 181 15 -133 299 102 -104 37 -72 3 319 91 303 -70 8 -59 -55 176
6904A76j33J1P5j01r0J00j74J8K52j15K6J25l35j9O7j7J74p8K00r7J09rr4l63
$$ 176 43 54 129 28 -62 38 -136 -118 134 19 45 170 -165 -184 -117 -134 40 -38 162 65 174 165 71 -292
6928b92j56L19J53J25j63O3k02L53j97k6J13J3J38r4qr2q2K56j22k89J32J81l8
$$ -292 -448 -129 24 149 -14 49 -153 200 3 -23 90 103 241 147 139 47 -35 221 99 -190 -58 123 85
6951H5qk46J54j18K64k9R1k05K66k71qP6j45K83o11L51N5M65n18K16k70l4J61
$$ 85 77 -169 -15 -133 131 102 193 -12 254 -17 -25 51 -94 189 -422 -71 -16 449 -69 147 -123 -157 4
6974DJ80k58J28l47K41n3Q1L12k75m9L9J32l75J10l25J12L28J1O2j70K20p8J72
$$ 4 184 -74 54 -293 -52 -105 -24 288 13 -36 3 135 -240 -130 -455 -343 -15 -4 58 -112 108 30 202
6997B02k63j71J96l19J21L45j91K12j75N0M1m9J02j44J4k57J01K82k12J90k05
$$ 202 -61 -232 -36 -355 -234 111 -80 132 -43 7 48 -1 101 -43 -29 -286 -185 97 -115 75 -130
7018a30J71j04M9N7j53J49j30L0J9L5J35j10q1J86l27K41j05O7K01k36M2LJ54
$$ -130 41 -63 -14 43 -110 39 -91 -61 -42 -7 128 18 -63 123 -204 37 -68 -1 200 -36 6 9 163
7041A63qq6j69J68K1q7j1q0m8L2n1K96m69M46ml64J21K30q6l33K80J01MJ3m9k4
$$ 163 155 69 -100 68 89 2 -9 -89 -137 -105 -156 140 -329 117 113 -251 -130 100 14 -319 -39 62 66 79 30 6
7067Fj57j51L66q2N02o46m9J47M01j51k48j08RK12p2J84k84K10J38j81j07K5j00
$$ 6 -151 -302 64 -18 484 -162 -211 -64 337 186 -62 -170 -161 51 -21 163 -121 89 227 46 -61 -36 -136
7090a36M2M52l11J01n0j05l48L14J20j7o7K0j43L07j78K59k25P4j16r8K00j86
$$ -136 -94 358 47 148 98 -7 -355 -41 79 62 -5 15 -128 179 1 260 35 109 -7 -105 95 -91
7112i1L39k16j7j22K56L8k14j97K97l30K70J90r3j73K49k72k4J59o0m3j10M38
$$ -91 248 32 15 -107 149 187 -27 -224 73 -257 13 203 110 -63 186 -86 -110 49 -11 -54 -164 274
7134B74j97j70K31j10j00J47L4J2k71K09M8j01J30n9J11j16j28J44j69J35j45
$$ 274 77 -93 138 28 -72 75 109 121 -150 59 107 6 136 77 188 72 -56 88 -81 54 -91
7155i1L25k95m5j79K58Q8j79K31j5k33J09K09k76Q9J98m35L50Q8j76J58N6j27
$$ -91 234 -61 -106 -285 -27 61 -118 113 98 -135 -26 183 -93 -4 194 -241 109 197 21 179 235 108
7177A08j67J6J22k4j1m26K24J60r2p4K26m2J96m18M81k83l18N32l07J15J03k92
$$ 108 -59 -43 79 55 44 -382 -158 2 -90 -164 62 20 216 -202 279 -4 -322 210 -97 18 121 -171
7199a71J0J67L4L9j24L06k91R5N6l07J34n4j75N20m06J32k25J08K67r7Nm9L28
$$ -171 -161 6 40 79 -45 261 -30 65 121 -186 -52 -106 -281 239 -167 -35 -260 -152 115 18 23 -26 302
7222C02j79j84J47j38K7Q1k30M0J05Q6j26J81k84J93R7q2m8J58J9l79K67R2j31
$$ 302 123 -61 86 -52 -25 56 -174 -134 -29 57 -69 112 -172 21 118 36 -12 146 165 -214 53 145 14
7245A4Q5J9n7n5J31k98J2J01K86k25P4o1j93L07l68K14j68L1J32P2j74R6k1n8
$$ 14 99 118 61 6 137 -161 -149 -48 238 13 87 26 -167 140 -228 -14 -182 -151 -19 53 -121 -25 -46 -104
7269a04j10JM01l74L25j84L6j29j34N36o6j61j30K97j95q9N8j5p7M07l41j13J34
$$ -104 -214 -213 188 -186 139 -45 -9 -138 -272 264 198 37 -93 204 9 -80 -22 -37 -114 293 -48 -161 -27
7292b7O3lj36J41Lm2J60j44k88J06M1k38L7L31j12J1J6J36K1l00M73k85j38J29
$$ -27 36 33 -103 38 41 -1 159 15 -273 -167 -126 -364 -327 4 -108 -97 -81 55 76 -224 249 -36 -174 -45
7316d5j05N6L09l32M00m46K05O5m29J28K40k15J76k38P07l50j07J8j64j31K97
$$ -45 -150 -94 215 -117 283 -163 42 107 -322 -194 46 -169 7 -231 476 126 19 37 -127 -258 39
7337C9j01K79J3j13k69O9K22L3j84j13R1r2J05O2o6J68J06m13L69j50k70L68k45
$$ 39 -62 217 230 117 -152 -83 139 172 -12 -125 -34 -126 -21 41 -25 143 249 -164 205 55 -215 153 -92
7360i2M1J88l11Q6n6J90m57J90L30k36L52qk71L3J99J19l63o2J66j19p6j22L89
$$ -92 -51 137 -174 -88 -144 46 -411 -221 109 -127 225 217 -54 -21 178 297 -66 -128 38 -81 -157 -279 110
7383A10J47Pm45J75j08M56m75m9L43n43M42m1Q6J36k16j79M59k15j93J27p0K57
$$ 110 257 264 -181 -6 -114 342 -133 -182 161 -382 60 19 105 241 25 -154 305 90 -103 24 -46 211
7405B11l32o9K85j38J27n2k34R4j10J96J29l4k38J98j76L28k27k27M15l2j78J00
$$ 211 -121 -190 95 -43 84 32 -202 -108 -218 -22 107 73 -165 33 -143 185 -42 -269 146 114 -64 36
7427C6J74o2j18l18K70K73R0j96r0K73k28O1J26l21J65k46Q1M2J45J02m31K02
$$ 36 210 148 30 -288 -18 255 345 149 59 332 104 165 291 -30 135 -111 -30 12 157 259 -172 30
7449C0%l49M36j01j24Jn9J46L8o1K07j16m41M20n6J95l43J12J62k58L48k35j46
$$ 30 30 -319 117 16 -108 -107 -166 -20 18 -43 164 48 -393 27 -29 166 -177 -65 97 -161 187 -48 -194
7472a94J65k2K46k65OK36j33l41L74K31k44o9M7K21k01M2P4j52J2M4R6Q2O0l57
$$ -194 -29 -51 195 -70 -64 172 39 -302 72 303 59 -10 37 258 57 99 173 21 33 77 173 255 315 -42
7496d2j57QL62j72L9J22n65M18oNQ0k63J48o0k3M6O2k1J5J43j9j36rJ37p2j44
$$ -42 -199 -191 171 -1 38 160 -405 13 7 12 92 -171 -23 -83 -106 -60 2 -19 -4 139 120 -16 -25 112 40 -104
7522a04J01J12j53J53j17K07q3n93P56l50J17J04k64J36Q8l73K18o4J8j38K83
$$ -104 -3 109 -44 109 -8 199 116 -477 279 -71 46 150 -114 22 110 -263 -45 -109 -91 -229 54
7543E4p0L32m32Q9K15p2n6J88k39n8j67L73L0k07J08Q0r0O7j06Rl15L75J31l0
$$ 54 -16 316 -116 -27 188 116 60 248 9 -49 -216 157 187 -20 88 168 78 145 39 48 -267 108 239 209
7567B09k11O1J83k15l7j39J39J74r4n17O22l04K64j03Pk1J95l42L08m13L33n4
$$ 209 -2 59 242 27 -10 -149 -10 164 70 -447 175 -129 135 32 39 18 213 -129 179 -234 99 45
7589D5k4j22J63j0l57L45QK25m16L48Qk99K02j02L29l13k47J68k43L97l18M69
$$ 45 21 -101 62 52 -305 40 48 273 -143 205 213 -86 116 14 343 30 -217 -49 -292 105 -213 256
7611B56l00j88K08M6l26M45M9l14M9j58J88k55N52r4l38J38j14Q0N1N3R6j35P9
$$ 256 -44 -232 -24 22 -304 141 190 -124 -75 -233 -45 -300 252 158 -180 -42 -156 -76 -25 28 124 -11 68
7634F8j26J09j29j1j74o6J17J22J07O3j8l49K81K21k29j22R5K67l53K73l6j35
$$ 68 -58 51 -78 -89 -263 -329 -212 -90 17 80 62 -287 -6 215 -14 -136 -41 226 -127 146 110 -25
7656b5J86j96Q7o6K3K7P7j09J29k95J80J6j00j19O8L23m48J22K21j94j56L76j63
$$ -25 161 -35 52 -14 9 36 113 4 133 -162 18 34 -66 -185 -117 206 -242 -120 101 -93 -249 127 -36
7679c6k04L97l55K83j7P2j42J68j9j27P7j69N8JJ02K9j04j51R4J93k21K43k42
$$ -36 -240 157 -198 85 68 140 -2 166 147 20 97 -72 -14 -13 89 118 14 -137 -43 150 -71 172 -70
7702g0L06l36K33M1j33q0l1K61L1j59j27J21p8j2jr4J49L2J08j12J43l06J76K02
$$ -70 236 -100 133 174 41 -39 -70 191 222 63 -64 57 -21 -33 -34 -128 21 53 161 49 192 -114 62 264
7726B64J27m90o1K90j01J87m01j7L38J66n18%L47j06k22K1K72K1j2j06N7k02J72
$$ 264 391 -99 -160 130 29 216 -185 -202 136 302 -216 -216 131 25 -197 -176 96 117 105 -1 56 -146 26
7749B6j35J61J82n03L93l9j08K47k54N3l38L32j95J10j03M86j70k8L34n47K08
$$ 26 -109 52 234 -269 124 85 -23 224 -30 23 -315 17 -178 -68 -171 315 145 117 451 -96 112
7770A12k26K68m9p2l84L85j63Q8J66J72k80q8O2O4K1j67j29KJ18l4K53j01N4k40
$$ 112 -114 154 105 33 -351 34 -129 -41 125 297 17 -71 -9 55 76 -91 -220 -218 -100 -134 119 18 72 -168
7794a68q4K58KO2k2j66J07J2k26J21m6O2p4K90m9%P2l65L37j18K15l03oP5j43
$$ -168 -252 6 8 70 48 -118 -11 1 -225 -104 -150 -88 -162 128 79 79 151 -214 123 5 220 -83 -89 -14 -157
7819a57J15n2j59J92j42L6J25K64k17j11N1j09Q3j70K42J09k02P7m1J04M7k56
$$ -157 -42 -94 -253 -61 -203 -167 -42 222 5 -106 -55 -164 -81 -251 -9 100 -102 -25 -66 38 85 -171
7841a71N7N5K96l64m3J19J89p9nl3M6j90K13j12K09k7l11j7K42k17L7j07N8J14
$$ -171 -114 -59 237 -127 -170 -51 138 59 54 21 67 -123 90 -22 187 160 -151 -168 74 -143 -106 -213 -155 -41
7865d1O2J20j45j76q9K64M8j9j71Q0J76k31L88l12p0j4J36KJ95k80k4M27l75n0
$$ -41 21 141 -4 -180 -269 -5 43 24 -147 -67 109 -122 266 -46 -116 -130 6 8 203 -77 -101 326 -49 -99
7889i9l0J02P1J4j94J92p1l29L33m6J79l98K61k6M7J06j71k1j03K20M5j4Q3r2
$$ -99 -129 -27 44 58 -136 56 -15 -344 -11 -57 122 -276 -15 -41 6 112 -59 -80 -183 37 82 68 151 59
7913E9r6j89K66j09J00ll92P12n55K24k8j49J60k7K8L8Nl68L22j14n1K67J40l30
$$ 59 -37 -226 40 -69 31 28 -364 348 -207 17 -11 -160 0 -27 1 39 44 -324 -2 -116 -167 100 240 -90
7937i0J39m67L59R2n9J4l0J10NP1l63L99r6l09J87k4p9K66j49J95j67q8j02K89
$$ -90 49 -418 -59 33 -26 -12 -42 68 73 144 -219 180 84 -225 -38 -62 -141 125 -24 171 4 -84 -186 103
7961A03m26L01O6k33l4K56J0j7k1J83p9M7j25M3R2n08L57J67k30L22J37m15j92
$$ 103 -323 -22 44 -189 -223 33 43 26 5 188 109 156 31 74 166 -342 15 182 -48 274 411 -4 -196
7984a96L26k85LK46j90K24j85K54o6k76K06L4kK2j38Qj9J83j83j6k7J6r4J09K06
$$ -196 130 -155 -152 94 -96 128 -57 197 131 -145 61 95 93 115 -23 -15 -34 149 -34 -50 -77 -61 -155 -46 160
8009A60j31Nl3k03q3M30J22k03q9L41k92kL30m24P8Q2l33K67J83l19K7q5k1K77
$$ 160 29 34 1 -202 -285 145 267 64 -25 316 24 22 352 -72 6 88 -245 22 205 -114 -87 -172 -193 84
8033H4j9k68J38J10N4j36L14q3k87M4J10k62J68K17Oj67K47k65N43k22m37q7j27
$$ 84 65 -203 -65 45 99 -37 277 194 -93 -49 61 -201 -33 184 190 23 270 5 548 326 -111 -198 -325
8056c25J30J50J20O5j21L02l94l8J25K81k10m20K93k8J11J99j3l17R1J2k35K63
$$ -325 -195 -45 75 140 19 321 -73 -111 14 295 85 -335 -42 -70 41 240 227 -90 1 13 -222 41
8078D1j51L53m67J37J73r4O3N4r2o1R3N3Q0l07L0K00K9l31J93j49K66M2l31J93
$$ 41 -110 243 -224 -87 86 -8 55 109 17 -44 49 102 182 -125 -95 105 134 -197 -4 -153 113 155 -176 17
8102A7L4j94R6RK02j51O3j74N3j04Q2J08j13K01j95J36k18J92m8K7j48Q7L11n48
$$ 17 51 -143 -47 -38 164 13 76 -98 -45 -149 -67 41 -72 129 -66 70 -148 44 -4 23 -125 -38 273 -275
8126b75K98j02R9l52M76j56j02J57j18m2J36j41ML51j98N3p1j50M77k30K6n3o2
$$ -275 23 -79 20 -332 144 -12 -114 43 -75 -117 19 -122 -118 233 35 88 17 -133 344 114 140 87 25
8149B5p4r3L31j99j54K12j75K13O6k04OK48l71M2j6j31N89l05m8K89l95J4J60
$$ 25 -49 -142 189 -10 -164 48 -127 86 152 -52 -46 202 -169 -127 -143 -274 315 10 -38 251 -144 -130 30
8172C0l4m7L11k94k17j83O53k20l29K16j97O19n33L96l06J11O8O7j60
$$ 30 -4 -51 260 -34 -251 -434 219 -1 -330 -114 -311 308 -225 171 -135 -24 44 111 -49
8191d9
$$ Imaginary data points
##PAGE= N=2
##DATA TABLE= (X++(I..I)), XYDATA
0@%%%%%%%JrJ6j6J6k4L2l2M0m9N7o9P9r2J08j24J43j65J90k15K42k77L14l53L95
$$ 0 0 0 0 0 0 0 0 1 -8 8 -8 8 -16 16 -16 24 -25 32 -37 42 -50 58 -66 77 -88 102 -113 129 -148 166 -187 208
32B08m44M99n55O17o88P66q47R38j041J152j277J415j566J737j930K149k401K695
$$ 208 -236 263 -292 325 -363 403 -444 494 -547 605 -672 743 -823 914 -1016 1133 -1268 1427
50A427l042L455l962M604n441O584q250J0911j5840K7990j09397k05888J63008
$$ 1427 -1615 1840 -2122 2482 -2959 3625 -4625 6286 -9554 18436 -90961 -296849 -133841
63a33841J16499o3054o1925P2538j4088r1016N1057J64422j8557j49211l771J18982
$$ -133841 -17342 -80396 -142321 -69783 -83871 -174887 -123830 40592 22035 -127176 -130947 -11965
75a1965q382p4135M8890O2956r9913q1846J20296J23843q5561j10353N1216O3032
$$ -11965 -20347 -94482 -45592 17364 -82549 -164395 -44099 79744 -5817 -116170 -64954 -1922
87a922m7978M838J01539j6913j53714j7219J56862N5378j06424l7557O3701j5276
$$ -1922 -49900 -45062 56477 39564 -114150 -131369 25493 80871 -25553 -63110 591 -14685
99a4685o0420O8597R7382p6145j26090N1665J18531k3618p1075L8488L4050p6879
$$ -14685 -75105 -6508 90874 14729 -111361 -59696 58835 35217 -35858 2630 36680 -40199
111d0199k1835J20153N1226j21117p4276Q3611N5003n4141m016O1722m1433j03354
$$ -40199 -62034 58119 109345 -11772 -86048 -2437 52566 -1575 -5591 56131 14698 -88656
123h8656M4206J36281p994j15978o730P5122j1298l9181O0072M5305r1203p0780
$$ -88656 -44450 91831 83837 -32141 -38871 36251 24953 -14228 45844 91149 -54 -70834
135g0834Q7568Q5024o0370o5756M4273K6000n5411P513R1173n508j12768j7426
$$ -70834 16734 101758 41388 -24368 19905 45905 -9506 -1993 89180 83672 -29096 -46522
147d6522J00047K9546o2889o043M0418l8141n2279O5056Q2125n3861r1394K9644
$$ -46522 53525 83071 20182 14139 54557 16416 -35863 29193 111318 57457 -33937 -4293
159d293O9741k1996l4635M0378J3558p1533k1344Q3260L4933p5222m1559N0114
$$ -4293 65448 43452 8817 49195 62753 -8780 -30124 53136 88069 12847 -28712 21402
171B1402J8226m0242J2182N2060l2680p6351K2142Q2612n392o4400J419L2849
$$ 21402 39628 -614 11568 63628 30948 -45403 -23261 59351 53959 -10441 -9022 23827
183B3827k6244k4871N2239L2585o4976n1754M9861M8383l5919l1023L0051L000
$$ 23827 -2417 -27288 24951 57536 -7440 -59194 -9333 39050 3131 -27892 2159 5159
195E159m6383N869O1944j645o8707j1146N2068P166l5054J0294K9211l2474m0150
$$ 5159 -41224 -35355 26589 24944 -43763 -54909 -2841 4325 -30729 -20435 8776 -23698 -63848
208f3848L9148N1633k9590m8522J7743L0890k0499j2763L3770O587n0546j4760
$$ -63848 -24700 26933 -2657 -51179 -33436 -2546 -23045 -35808 -2038 4549 -45997 -60757
220f0757N0155K0583l9921j6363K7998J286k6375J5148L7422j6704m1733J3605
$$ -60757 -10602 9981 -29940 -46303 -18305 -17019 -43394 -28246 9176 -7528 -49261 -35656
232c5656M2560m889k6679J1056J8748k0463j3346L3619K2147l1612k3231K6363
$$ -35656 6904 2015 -24664 -13608 5140 -15323 -28669 4950 27097 -4515 -27746 -1383
244a383K0963j7015o203K2814j717k7857N113L5247K043k9601j949K4390q94j6033
$$ -1383 19580 2565 -3638 19176 17459 -10398 -5285 29962 32005 2404 455 24845 23951 7918
258G918J1772J7246j6705j9669J9048K4290j2436j8168J1758J2058j2152l364
$$ 7918 19690 36936 20231 562 19610 43900 31464 13296 25054 37112 24960 21596
270B1596K1119M747k3518p170K1084O681j6733l498J2702l939j5713O694J7381
$$ 21596 42715 47462 23944 16774 37858 44539 27806 24308 37010 33071 17358 24052 41433
283D1433p830j8749N461J5395n146j1215O614O097j2232q298J2349P684j3737
$$ 41433 33603 14854 20315 35710 30564 19349 25963 32060 19828 11530 23879 31563 17826
296A7826r592Q635L805j0113k364Q993k442j3772o19J0416k482j2142p12P036
$$ 17826 8234 16869 20674 10561 8197 17190 14748 976 357 10773 8291 -3851 -4563 2473
310B473l953p838M425M971p103q574N212O160o427n862L244J434p180k468N540
$$ 2473 -1480 -9318 -4893 78 -7025 -15599 -10387 -4227 -10654 -16516 -13272 -11838 -19018 -21486 -15946
325a5946J035p049k113N341N37n337l15M346j881m890J666M618k561m806J312
$$ -15946 -14911 -21960 -24073 -18732 -18195 -23532 -23847 -19501 -21382 -26272 -24606 -19988 -22549 -27355 -26043
340b6043L691j405k188K738J742k128j869L034J975k093k27K943J209j372L05
$$ -26043 -22352 -23757 -25945 -23207 -21465 -23593 -25462 -22428 -20453 -22546 -22773 -19830 -18621 -19993 -19688
355a9688L122K39q38J396L303N97q70J668J835j71K59J889K133M44jJ758J359
$$ -19688 -16566 -16327 -17165 -15769 -12466 -11869 -12739 -11071 -9236 -9407 -9148 -7259 -5126 -4682 -4683 -2925 -1566
372a566N77R95J268K012N53N65J204P24N13P85J685J141N44O64Q87L43N57J154
$$ -1566 -989 6 1274 3286 3839 4404 5608 6332 6845 7630 9315 10456 11000 11664 12551 12894 13451 14605
390A4605L92R72J49R04n0R9N30M09P73M04M39M10j10K71K94K8r8l8j56n71n43
$$ 14605 14997 15969 16118 17022 16972 17071 17601 18010 18783 19187 19626 20036 19926 20197 20491 20519 20421 20383 20227 19656 19113
411A9113j093p81m07p91p45m01n39o32l80l05n01m06k4k24p48j115p18n87j092
$$ 19113 18020 17239 16832 16041 15296 14895 14356 13724 13344 13039 12538 12132 12108 11884 11136 10021 9303 8716 7624
430G624j945q31L12j631j518o20k18j293j370l33o8j050j080k5k64j807j492P79
$$ 7624 5679 4848 5160 3529 2011 1391 1173 -120 -1490 -1823 -1891 -2941 -4021 -4046 -4310 -6117 -7609 -6830
448f830j5k132j427K58o31j803n82J137o52k621RJ903q30k462M88J226j091k263
$$ -6830 -6845 -8977 -10404 -10146 -10777 -12580 -13162 -12025 -12677 -15298 -15289 -13386 -14216 -16678 -16190 -14964 -16055 -18318
466a8318J370K251k215k701J717J982k016j675K306R97k829n20L777J280l384
$$ -18318 -16948 -14697 -16912 -19613 -17896 -15914 -17930 -19605 -17299 -16302 -19131 -19651 -15874 -14594 -17978
481a7978k31M413Q66k516J386L803p66l351K517N271q13l942J827M210k148k155
$$ -17978 -18209 -13796 -12930 -15446 -14060 -10257 -11023 -14374 -11857 -6586 -7399 -11341 -9514 -5304 -7452 -9607
497i607M698L703m162k659O278M058l904j587N124J195m208J311P242k14o790
$$ -9607 -4909 -1206 -5368 -8027 -1749 2309 -1595 -3182 1942 3137 -1071 240 7482 7268 478
512D78P96P644r9m449K597N047l636m658N817P161n536o374N169N338m141k876
$$ 478 1274 8918 8819 4370 6967 12014 8378 3720 9537 16698 11162 4788 9957 15295 11154 8278
528H278O122J559p899j185J0151K416q988k504O904r1o328L148P218n361r725
$$ 8278 14400 15959 8060 6875 17026 19442 10454 7950 14854 14763 8435 11583 18801 13440 3715
543C715L917R679l184q185L328M484o638l648Q423L826j0840o862R090N040p515
$$ 3715 7632 17311 14127 5942 9270 13754 7116 3468 11891 15717 4877 -1985 7105 12145 4630
558D630l600O203j487j0091K362J1991k536j3909m73R758j386p676L946N668r414
$$ 4630 1030 7233 5746 -4345 -1983 10008 7472 -6437 -6910 2848 1462 -6214 -2268 3400 -6014
573f014r059R640R887q926j0285N659N853p637k103J0396j70j5222k307J5021
$$ -6014 -15073 -5433 4454 -4472 -14757 -9098 -3245 -10882 -12985 -2589 -2759 -17981 -20288 -5267
587e267L817j2434l014Q787k378q737P407J1800q778j4639N990J3719l840q680
$$ -5267 -1450 -13884 -16898 -8111 -10489 -19226 -11819 -19 -8797 -23436 -17446 -3727 -7567 -16247
601a6247N376M728j0712l430J5390P147j5294q327J1729O618p798k93J0113m192
$$ -16247 -10871 -6143 -16855 -20285 -4895 2252 -13042 -21369 -9640 -3022 -10820 -11113 -1000 -5192
615e192j3873N311J8391j202j5621K57J1412k186o013R827P097j2888j1049J3686
$$ -5192 -19065 -13754 4637 3435 -12186 -11929 -517 -2703 -8716 1111 8208 -4680 -15729 -2043
629b043J4088q993r711P069L914q885J400J5671l3j8118k873J7054M920j0597
$$ -2043 12045 3052 -6659 410 4324 -4561 -3161 12510 12477 -5641 -8514 8540 13460 2863
643B863n9Q076n940r846J1468J5284j0019j6952N977J3481l851o321Q294K516
$$ 2863 2804 10880 4940 -4906 6562 21846 11827 -5125 852 14333 10482 4161 12455 14971
657A4971j5204l933J8468Q499j5875r400J0681L758q512L329J2095p905j7792
$$ 14971 -233 -4166 14302 22801 6926 -2474 8207 11965 3453 6782 18877 10972 -6820
670f820N320J9019j545j5015Q03P405o139n548J3167P840j6833j3272J3156J2604
$$ -6820 -1500 17519 15974 959 1762 9167 3028 -2520 10647 18487 1654 -11618 1538 14142
684A4142q307p379P059j003j2269K938J7414m30j9874m127J4281K926q972K965
$$ 14142 5835 -1544 5515 4512 -7757 -4819 12595 12165 -7709 -11836 2445 5371 -3601 -636
698f36O437j0389j1448J2032J5616q923j5880M359Q923n011l215J1138R25j7465
$$ -636 5801 -4588 -16036 -4004 11612 2689 -13191 -8832 91 -4920 -8135 3003 3928 -13537
712a3537m858J7686P944j3187o442P645k35q147O572J3097p757j7649L815J7007
$$ -13537 -18395 -709 7235 -5952 -12394 -4749 -4984 -13131 -6559 6538 -1219 -18868 -15053 1954
726A954p44j0431K687N015r353m562J4321R454j4608j2112J0812R294o237k624
$$ 1954 1210 -9221 -6534 -1519 -10872 -15434 -1113 8341 -6267 -18379 -7567 1727 -4510 -7134
740g134Q039k786j3522L522J7801J058j5740l168J0713M04o030O760P562j1172
$$ -7134 905 -1881 -15403 -11881 5920 6978 -8762 -11930 -1217 -813 -6843 -83 7479 -3693
754c693j1569J1311J4181o526j0917M821M614o329k9J2380J534j5368m749J3822
$$ -3693 -15262 -3951 10230 3704 -7213 -2392 2222 -4107 -4136 8244 9778 -5590 -10339 3483
768C483O603q481k889O190k981p828P110J2634n888j4270K690J1540j117n700
$$ 3483 10086 1605 -1284 4906 1925 -5903 1207 13841 7953 -6317 -3627 7913 6796 1096
782A096M694L036r896m630J2839Q209j0728q713O840M659m818O08P900l634j2192
$$ 1096 5790 8826 -1070 -5700 7139 15348 4620 -4093 2747 7406 2588 3196 11096 7462 -4730
797d730J565J3939Q39j0669j256N875k511m398O851O788r713r515P021R526m172
$$ -4730 -3165 10774 11613 944 -312 5563 3052 -1346 5505 12293 2580 -6935 86 9612 5440
812E440o721M079J203p150r3J0886J169j1993l965Q746L045n462K46M632m976
$$ 5440 -1281 2798 4001 -3149 -3242 7644 8813 -3180 -7145 1601 4646 -816 -570 4062 -914
827i14p308N561R684m648r372J476O186k353l371N318J809q581m261R319N053
$$ -914 -8222 -2661 7023 2375 -6997 -5521 665 -1688 -5059 259 2068 -6513 -10774 -1455 3598
842C598o382m654M070P48m195J761O913k756r148J367Q325L24o069O20L652l535
$$ 3598 -2784 -7438 -3368 -2620 -6815 -5054 1859 -897 -10045 -8678 -353 -29 -6098 -5478 -1826 -5361
858e361l317O023N189n989o057M201N063k571k456L889R9n945M78P721J225o705
$$ -5361 -8678 -2655 2534 -3455 -9512 -5311 -248 -2819 -5275 -1386 -1287 -7232 -6754 967 2192 -4513
874d513j691M691P99k686J947L717l693m755L638O330k187m906J774L222k366
$$ -4513 -6204 -1513 -714 -3400 -1453 2264 -1429 -6184 -2546 3784 1597 -3309 -1535 1687 -679
889f79j119M331J928n477k394N000L563l557j613K789j88k909J679M750j382n110
$$ -679 -1798 2533 4461 -1016 -3410 1590 5153 1596 -17 2772 2584 -325 1354 6104 4722 -388
905c88O70M469k24k874J596J769k904j858L702K874l206l070K243K166j786r09
$$ -388 282 4751 4527 1653 3249 5018 2114 256 3958 6832 3626 556 2799 4965 3179 2270
921B270K534k37l158m28L863N08l233n04K174n29j949J265K284k222k647J290
$$ 2270 4804 4567 1409 981 4844 5352 2119 1615 3789 3260 1311 2576 4860 2638 -9 1281
937A281K689j266k375J261J018j632j321K631M24k691j148J788O93j803m48J428
$$ 1281 3970 2704 329 1590 2608 976 -345 2286 2710 19 -1129 659 1352 -451 -899 529
953E29l50k120O37K091p98k245J80J710p95j222J191Q09k071q63J509J202j616
$$ 529 179 -1941 -1304 787 -11 -2256 -2076 -366 -1161 -2383 -1192 -383 -2454 -3317 -1808 -606 -2222
970b222r40P28O67j280lJ262r7j930J47J567n0p96K5O46l41r67Q85J167n93j182
$$ -2222 -3162 -2434 -1767 -3047 -3050 -1788 -1885 -3815 -3668 -2101 -2151 -2947 -2922 -2276 -2617 -3584 -2699 -1532 -2125 -3307
990c307P53R94k88j011R39L46p15qO92M35n68k05P89L36l87l0O17p3l63J91Q55
$$ -3307 -2554 -1560 -1848 -2859 -1920 -1574 -2289 -2297 -1605 -1170 -1738 -1943 -1154 -818 -1205 -1235 -618 -691 -1054 -863 -8
1011hJ31m51kP52j34k60O17L73l03j71M49L44R3l65L31j72j86K35N84p2j69q6
$$ -8 123 -328 -330 422 288 28 645 1018 715 544 993 1337 1430 1065 1396 1224 1038 1273 1857 1785 1616 1530
1033A530N48M0j68NM2j65L49k76O87m70k54M00Qk48k18J55L40l09l25N47k16l29
$$ 1530 2078 2118 1950 1955 1997 1832 2181 1905 2592 2122 1868 2268 2276 2028 1810 1965 2305 1996 1671 2218 2002 1673
1055A673L6L00j84k83p1p1Ok01J9j70k37PnR4m03K02l55jn9j36k5K23l67m78J81
$$ 1673 1709 2009 1825 1542 1471 1400 1406 1205 1224 1054 817 824 819 913 510 712 357 356 297 161 136 359 -8 -486 -305
1080c05j21q9q7K8m16L26l77K67j23l67K09j69o7m26M58k44j71RO0j18K04j05
$$ -305 -426 -515 -602 -574 -990 -664 -1041 -774 -897 -1264 -1055 -1224 -1291 -1717 -1259 -1503 -1674 -1665 -1605 -1723 -1519 -1624
1102a624k23L78j80j2K12m52P4N8o5J84j55j62M05j60j09L20l6p8P4N02l64J07
$$ -1624 -1847 -1469 -1649 -1661 -1449 -1901 -1827 -1769 -1834 -1650 -1805 -1967 -1562 -1722 -1831 -1511 -1547 -1625 -1551 -1049 -1413 -1306
1124a306j48K37O0J8P1K24J6Q1P4K82j88L1q2L73J99k43J25M10j82K1J07L41r7
$$ -1306 -1454 -1217 -1157 -1139 -1068 -844 -828 -747 -673 -391 -579 -548 -630 -257 -58 -301 -176 234 52 73 180 521 424
1147D24J2K41J76j77j25L17L50j14k54L19k2j17P3M28j06m10J43P75m26k68k82
$$ 424 436 677 853 676 551 868 1218 1104 850 1169 1147 1030 1103 1531 1425 1015 1158 1933 1507 1239 957
1168I57N38J5k31K94K47k76n44O21P3m55L1M81k00m37J56N16j36q96K48N74l62
$$ 957 1495 1510 1279 1573 1820 1544 1000 1621 1694 1239 1270 1751 1551 1114 1270 1786 1650 754 1002 1576 1214
1189A214p63J96M80j74n07L15J29k26k61NM01n22j35N61L1q45l86P77J78p06k10
$$ 1214 451 647 1127 953 446 761 890 664 403 408 809 287 152 713 744 -101 -487 290 468 -238 -448
1210d48K44k76m14N19M19o92n85K27Q40k94m91J12L77o12k01O49M54q35p00M98
$$ -448 -204 -480 -894 -375 44 -648 -1233 -1006 -166 -460 -951 -839 -462 -1074 -1275 -626 -172 -1007 -1707 -1209
1230a209L80l05k99Q43k01r18L98J106o78o62K16M90k80l83P93N67q55n38M95
$$ -1209 -829 -1134 -1433 -590 -791 -1709 -1311 -205 -883 -1545 -1329 -839 -1119 -1502 -709 -142 -997 -1535 -1040
1249a040Q22m14q79Q82J36m48M8Q21j7r65n15J437N91p11j47O61n05l82N02J234
$$ -1040 -218 -632 -1511 -629 -493 -941 -893 -72 -89 -1054 -1569 -132 459 -252 -399 262 -243 -625 -123 1111
1269A111r60j198Q09J360n49n81P54j5p76l09J306O02j205m86O01L44l27j51J426
$$ 1111 151 -1047 -238 1122 573 -8 746 731 -45 -354 952 1554 349 -137 464 808 481 330 1756
1288A756p13j188K81J496M9j151k24J110m25m58M51J341j466q39R43R04o83n97
$$ 1756 1043 -145 136 1632 1681 530 306 1416 991 533 984 2325 859 20 963 1867 1184 587
1306E87N85K13j346L41J189K16j776j8J153K43j032L54K81o62q83O29J806r91
$$ 587 1172 1385 39 380 1569 1785 9 -9 1144 1387 355 709 990 328 -555 74 1880 889
1324H89j397M06P04k13p08Q54L37j825l99J621O81j126o32Q57j27o64L54J376
$$ 889 -508 -102 602 389 -319 535 872 -953 -1352 269 950 -176 -808 49 -78 -742 -388 988
1342I88o23j713j00J659j13r28K99M69m74r77J076Q99j274j163R60J127n81m56
$$ 988 365 -1348 -1448 211 98 -830 -531 -62 -536 -1513 -437 462 -812 -1975 -1015 112 -469 -925
1360i25Q82k10j533O36J340j0j257p60J216J89p30M42R18p87j528J215J454m48
$$ -925 -43 -253 -1786 -1150 190 180 -1077 -1837 -621 -432 -1162 -720 198 -589 -2117 -902 552 104
1378A04j166p8R44p35j19J391J64j575l93J463M49n79l13Q52l62j106J059J266
$$ 104 -1062 -1140 -196 -931 -1050 341 505 -1070 -1463 0 449 -130 -443 409 47 -1059 0 1266
1396A266l80j676L61R98Q7n79L45K85q21p87J590Q60r59r52R30L6m50N0J070m31
$$ 1266 886 -790 -429 569 656 77 422 707 -114 -901 689 1549 590 -362 568 604 154 204 1274 843
1416H43j329J3J713R5r06m58Q13L25q46L52J061r68j412P93J403n39o10K18M33
$$ 843 -486 -473 1240 1335 429 -29 784 1109 263 615 1676 708 -704 89 1492 953 343 561 994
1435I94j062j8J445K73j797l79J106M76p35J35M78p93q40O39J383l03j406J82
$$ 994 -68 -86 1359 1632 -165 -544 562 1038 303 438 916 123 -717 -78 1305 1002 -404 -222
1453b22N82k87o0K85K96r44o07J268N36o79j013P12L16j004O67O19k12j307r2
$$ -222 360 73 13 298 594 -350 -957 311 847 168 -845 -133 183 -821 -154 465 253 -1054 -1146
1472a146J494M6p62j25L75j46r02J015N47p96q00N18Q13n72O6J76j18n48k39Q50
$$ -1146 348 394 -368 -493 -118 -264 -1166 -151 396 -400 -1200 -682 131 -441 -375 -199 -317 -865 -1104 -254
1492b54N52j003m64R40m7m14L49M41n86m74L99P65j81r89K47O42k11k94M40M25
$$ -254 298 -705 -1169 -229 -276 -690 -341 100 -486 -960 -561 204 23 -966 -719 -77 -288 -582 -142 283
1512B83o97n73P69O91o57j12K91%k41OO25K2r52j36Q71J08n25J33O27n72n79Q32
$$ 283 -414 -987 -218 473 -184 -296 -5 -5 -246 -240 385 407 -545 -681 190 298 -227 -94 533 -39 -618 214
1534B14N62k31r50N35M43r6j93L25J06o21p8P04K6n11j00P4J17j70J57M40k03
$$ 214 776 545 -405 130 573 477 284 609 715 94 16 720 746 235 135 209 326 156 313 753 550
1555E50m40p3O72k28l53M77k25K8k89J44L05l12n10O50P9k61j04M76l10l59R6
$$ 550 110 37 709 481 128 605 380 408 119 263 568 256 -254 396 475 214 110 586 276 -83 13
1576A3K22K44k25o05N88j50k6p2J72j88l82N73k8j25j60J52p2j83J72K99Po37
$$ 13 235 479 254 -351 237 87 61 -11 161 -27 -409 164 136 11 -149 3 -69 -252 -80 219 226 -411
1598d11J82L95k04l00J8M12k67J11o4K6J31p70J28P90k36k80L68j81n11j41N70
$$ -411 -229 166 -38 -338 -320 92 -175 -64 -128 -102 29 -741 -613 177 -59 -339 29 -152 -663 -804 -234
1619b34J54m30Q1%L51l25O8N64m78j27L9K69k92J91r4k5J42J9j3J00k62J00j19
$$ -234 -80 -510 -429 -429 -78 -403 -335 229 -249 -376 -337 -68 -360 -169 -263 -288 -146 -127 -140 -40 -302 -202 -321
1642c21K60N7l61L15k0J99p2Q9j04j62j25L0O31m76k61N13k28K13J78j46j4Kk76
$$ -321 -61 -4 -365 -50 -70 129 57 146 42 -120 -245 -215 416 -60 -321 192 -36 177 355 209 195 197 -79
1665g9K26P9j52R1r1oL36l78K46n3RN4k06K95j84Q0j4j92K36k16L80m36K07k05
$$ -79 147 226 74 165 74 68 404 26 272 219 228 282 76 371 187 267 253 61 297 81 461 25 232 27
1689B7L49m37M02N2p3j8O9j6p9l61L04K9j65o2j33J41l8K85Lq0m4L75l87K56l50
$$ 27 376 -61 341 393 320 302 371 355 276 -85 219 248 83 21 -112 29 -9 276 279 199 155 530 143 399 49
1714D9j69P5L35j86m2j30j09j5K25L4k31J81m5l9N5m3Q3k94R1Q9j06QoJ9%k62
$$ 49 -120 -45 290 104 62 -68 -177 -192 33 67 -164 17 -28 -67 -12 -55 28 -266 -175 -86 -192 -184 -190 -171 -171 -433
1740d33O7K67k33l10K60K78j09O6QN7j97K35j4L2j39J29J58j46j07J46j87L6l
$$ -433 -366 -99 -332 -642 -382 -104 -213 -147 -139 -82 -279 -44 -58 -26 -165 -36 122 -24 -131 15 -172 -136 -139
1763a39k5J34j7j67o5o8M09j79r4k60N02lN3n7O1j14J15n1K40p6k16M31l17N8
$$ -139 -164 -30 -47 -214 -279 -347 62 -117 -211 -471 31 28 81 24 85 -29 86 35 275 199 -17 414 97 155
1787A55k13L36j11k86J45O9K05j65P1K98k79L0l44J50J16k1L0K7J55j19k01K52
$$ 155 -58 278 167 -119 26 95 300 135 206 504 225 255 -89 61 177 156 186 213 368 249 48 300
1809C00m79L12M1o3j12j5K03Q6j12j2j83J78J5j70K12k13K73l58o0K59N1l56K64
$$ 300 -179 133 174 111 -1 -16 187 273 161 149 -34 144 159 -11 201 -12 261 -97 -157 102 153 -203 61
1832F1R0j91J2J04l2l9J45j56r6M2n3M2j98J09L74m61J56P7l3j95m6L00j07q3
$$ 61 151 -40 -28 76 44 5 150 -6 -102 -60 -113 -71 -269 -160 214 -247 -91 -14 -47 -242 -288 12 -95 -178
1856a78K72k44J24o5j07J29K82j93l65J29j7N4J23N6Rn4J44j79J89k43J17K4R8
$$ -178 94 -150 -26 -91 -198 -69 213 20 -345 -216 -233 -179 -56 0 9 -45 99 -80 109 -134 -17 7 105
1879A05l8l86L1J52M86n92K47P5l8J25Rk38j66M96m10J38k24L19o4j59K7L66l31
$$ 105 67 -319 -288 -136 350 -242 5 80 42 167 176 -62 -228 268 -142 -4 -228 91 27 -132 -105 261 -70
1902g0J75p3k15K42m96O41k01Q5k31J18J0j54K71j35J88J13j98Q5q7nN2p6P2L5
$$ -70 105 32 -183 59 -437 204 3 88 -143 -25 -15 -169 102 -33 155 268 70 155 68 63 115 39 111 146
1926A46l11L33J8o7K06k60Q0j78J29o9j5r8M60m56L41j94n2J15j09M6o6K40k84
$$ 146 -165 168 186 119 325 65 145 -33 96 27 12 -86 374 -82 259 65 13 128 19 65 -1 239 -45
1949d5K4K75N5k86n3K26l49j37M09j72J55o3m8k17K06k49K93m6N4j51K98k31J24
$$ -45 -21 254 309 23 -30 196 -153 -290 119 -53 102 39 -9 -226 -20 -269 24 -22 32 -119 179 -52 72
1972G2m33M07N0k40K15k36N9M8k9k0o9J22j82N04k21j65M4J21k27r2N94j62k71
$$ 72 -361 46 96 -144 71 -165 -106 -58 -87 -107 -176 -54 -236 268 47 -118 -74 47 -180 -272 322 160 -111
1995a11Q3m04M25k50N18m97K25J59l0J24l62k23K71k64K45j87K92j66j41L23k10
$$ -111 -28 -432 -7 -257 261 -236 -11 148 118 242 -120 -343 -72 -336 -91 -278 14 -152 -293 30 -180
2016a80K39L0J11L6k84P2N2l38LP6K98J24m90oK04K76k28J98L4j25l92K30K93
$$ -180 59 89 200 236 -48 24 76 -262 -259 -183 115 239 -251 -257 -53 223 -5 193 227 102 -290 -60 233
2039B33j07l86N30l93J65j27M08k05R2l80K21J12Q0j81L5O2K1J9j91L2J04k82
$$ 233 126 -260 270 -123 42 -85 323 118 210 -170 51 163 243 62 97 159 180 199 8 40 144 -138
2061a38K54j1L2l1j94NL0M48m35J39l94L96k7k38J15O5P1k34J39L0k8j13O4RK1
$$ -138 116 105 137 106 -88 -83 -53 395 -40 99 -295 101 74 -164 -49 16 87 -147 -8 22 -6 -119 -55 -46 -25
2086b5k45L05n1P7j47r1o6K90J0j39J56j56K96l13K87l56j25J02M82l43m6QJ8
$$ -25 -270 35 -16 61 -86 -177 -243 47 57 -82 74 -82 214 -99 188 -168 -293 -191 291 -52 -98 -90 -72
2109g2j04r1Q9n7L67o7J5k4j11J18q3N1l89L11K69j92O1l5j39k2j42K60q4p2l13
$$ -72 -176 -267 -178 -235 132 65 80 56 -55 63 -20 31 -358 -47 222 30 91 56 -83 -105 -247 13 -71 -143 -456
2134d56N08J26k81k70M2K91k3J52K6k72J98j32J85R0j1k50K98m31O2K62j58j42
$$ -456 52 178 -103 -373 -331 -40 -63 89 115 -157 41 -91 94 184 173 -77 221 -210 -148 114 -44 -186
2156a86K18r0R2J46j01J38k55P4m12O66l88L13k28N2M4j56L56m7l68P0n3J46J63
$$ -186 32 -58 34 180 79 217 -38 36 -376 290 -98 215 -13 39 83 -73 283 236 -132 -62 -115 31 194
2179A94m5k80O7J98l50K87J2k26j64L99K82l02j10R6L41qm55J16J5j88K14K5j84
$$ 194 149 -131 -64 134 -216 71 83 -143 -307 92 374 72 -38 58 399 391 -64 52 67 -121 93 118 -66
2202f6K63n23N51l01QK5J34j37L7J42m5Nk59O8K58k17K45j03n6j24j67J58J85
$$ -66 197 -326 225 -76 -68 -43 91 -46 -9 133 88 93 -166 -98 160 -57 188 85 29 -95 -262 -104 81
2225H1K04K15n20j13j32O1M54l67p9J49R3q6J70j19L0k6k65L81k93L8K39k99K23
$$ 81 285 500 -20 -133 -265 -204 250 -117 -196 -47 46 -40 130 11 41 15 -250 131 -162 -124 115 -184 39
2248C9j93K68j58J56k26p2M60o36O06j19j60j5k66J95O9j24J9K64l05j20J76J50
$$ 39 -154 114 -44 112 -114 -186 274 -362 244 125 -35 -50 -316 -121 -52 -176 -157 107 -198 -318 -142 8
2270Hj63J47J12k07J23p1l8q7M43k55N8j11K2R9k77K05j11O5j27K46j04K63j59
$$ 8 -155 -8 104 -103 20 -51 -89 -176 267 12 70 -41 -19 80 -197 8 -103 -38 -165 81 -23 240 81
2293H1n6r2Q2pK84j15j39j23K38j02P3K08j17mm41J11L68K56m24j53K55o7r8P0
$$ 81 25 -67 15 8 292 177 38 -85 153 51 124 332 215 211 -230 -119 249 505 81 -72 183 116 18 88
2317H8j44r4R8J42p2J57k30J67N2k55K54%k67j68L75j93j48j2L15o6j85J50K14
$$ 88 -56 -150 -52 90 18 175 -55 112 164 -91 163 163 -104 -272 103 -90 -238 -250 65 -1 -186 -36 178
2340A78o1j26k0O3K26k59j41J17N1j83J75M3m1J7J20j32J58K70l06k99L11n6N5
$$ 178 117 -9 -29 34 260 1 -140 -23 28 -155 20 63 22 39 159 27 185 455 149 -150 161 105 160
2363A60k43N9J84k72K46k01J44k66r2L40J51l31J28K1j53J50l47M37k92J43n15
$$ 160 -83 -24 160 -112 134 -67 77 -189 -281 59 210 -121 7 28 -125 25 -322 115 -177 -34 -549
2384e49O83q0j37P6J2J31j70k35L91k20O3n3j7K28j5M9m12O7K61P3J38l86L66
$$ -549 134 54 -83 -7 5 136 -34 -269 122 -98 -35 -88 -105 123 108 157 -255 -188 73 146 284 -102 264
2407B64k29k55J38P7L07m4m46J95K56l12J76k44K5J11j46K40j16j26m5L38k86
$$ 264 35 -220 -82 -5 302 258 -188 7 263 -49 127 -117 -92 19 -127 113 -3 -129 -174 164 -122
2428a22K0m2K57k04j79K95n3k3k6q9J70J37K09l69k11M65m43J45N0M0m1n2J68
$$ -122 -102 -144 113 -91 -270 25 -28 -51 -77 -166 4 141 350 -19 -230 235 -208 -63 -13 27 -14 -66 102
2451A02j38QJ27L7l72K79L4J26m8k15l4J84J00m67j03K29L99k71N2p5j3K26j29
$$ 102 -36 -28 99 136 -236 43 77 203 155 -60 -94 90 190 -277 -380 -151 248 -23 29 -46 -59 167 38
2474C8j91K25p7L03n63N25n25M75l03L54j63O1j07J42n19O2L93M8l27J51r4L5
$$ 38 -153 72 -5 298 -265 260 -265 210 -93 261 98 159 52 194 -325 -263 130 178 -149 2 -92 -57
2496e7R4N3j13k21nL49K88n16J93r7O1J51j66lJ38k77K26k2J0l25O9j04L00j57
$$ -57 37 90 -23 -244 -249 100 388 -128 65 -32 29 180 14 11 149 -128 98 76 86 -239 -170 -274 26 -131
2520a31L93q6m5j54L39j63j29q2O3K32k75j5j8M8m6m1k3M42k36j5n5M0j58M38
$$ -131 262 176 131 -23 316 153 24 -58 5 237 -38 -53 -71 -23 -69 -110 -133 309 73 58 3 43 -115 323
2544C23ml05J19k76K38j23j65J06J11j21K6j32J72p1N4J38J13l16K65k83j7J99
$$ 323 319 14 133 -143 95 -28 -193 -87 24 -97 -71 -203 -31 -102 -48 90 203 -113 152 -131 -148 51
2566E1j1j40n5J89q9j54q8K32L5J65k11K01r7l86M34k11m3L26l29M2J86k26J22
$$ 51 40 -100 -155 34 -55 -209 -297 -65 -30 135 -76 125 28 -358 76 -135 -178 148 -181 -139 47 -179 -57
2589e7K93Q4m52o0K45L0L4o2J4r0J03N6J7j35J0o3J0J1m6J03j40N1L03j19Mm1
$$ -57 236 320 -132 -192 53 83 117 55 69 -21 82 138 155 20 30 -33 -23 -12 -58 45 -95 -44 259 140 144 103
2615A03j64o6j95M18k34L35k96K74o2j30J9j00L48l66J07L18n37M73j28j78K52
$$ 103 -61 -127 -322 96 -138 197 -99 175 113 -17 2 -98 250 -116 -9 309 -228 245 117 -61 191
2636A91l53L16k63K83k49q4J66K84k77K11j7m92K17PK55k33R4k03K19n2l2P1j31
$$ 191 -162 154 -109 174 -75 -159 7 291 14 225 208 -284 -67 -60 195 -38 56 -147 72 20 -12 59 -72
2659g2JJ10M4J90k03p7K0j43M26k27R4j6l50R0J44j66J43k41K00j03rJ70r5M1
$$ -72 -71 39 83 273 70 -7 13 -130 296 69 163 147 -203 -113 31 -135 8 -233 -33 -136 -145 25 -70 -29
2683b9r2L88n11L64l31K61nK04l11M07l14p2j6M5J89j24j39K35m6k33j49K13k4
$$ -29 -121 267 -244 120 -211 50 45 249 -62 345 31 -41 -57 -12 177 53 -86 149 103 -130 -279 -66 -90
2706i0J9r1LK50m9n2j90Q4K85k17J87k66K29J20l18J58r1m5j3n5N9K07J8j98j3
$$ -90 -71 -162 -159 91 42 -10 -200 -116 169 -48 139 -127 102 222 -96 62 -29 -74 -87 -142 -83 124 142 -56 -69
2731f9l00M66K25k46k79M97l89k2N6R4P6o1J6k39qL69l4k51N1p1J82m6j65K82
$$ -69 -369 97 322 76 -203 294 -95 -117 -61 33 109 48 64 -175 -183 186 152 -99 -48 -119 63 17 -148 134
2755A34j48o6J28k3L19o72J99J29j12J04K56L6l43J42k8Q0K4j94J10R2k81J1M38
$$ 134 -14 -80 48 25 344 -328 -129 0 -112 -8 248 284 -59 83 55 135 159 -35 75 167 -114 -103 335
2778C35m33J51k80K18L2o7J16k24R4N9Q5r3k48L14ol51K38K98k81n6M4j50K51
$$ 335 -98 53 -227 -9 23 -44 72 -152 -58 1 86 -7 -255 59 53 -298 -60 238 -43 -99 -55 -205 46
2801D6N7j41j83M3J58M5J33j71j83K81M3j96Q2k16m5K54N3j8k47n5L75k42N32
$$ 46 103 -38 -221 -178 -20 25 158 -13 -196 85 128 -68 14 -202 -247 7 60 42 -205 -260 115 -127 405
2824D05k69r4k70R0J12j78L51k83K66m9k7l46L82k12m2K74k33L69l72P1k73M06
$$ 405 136 42 -228 -138 -26 -204 147 -136 130 81 54 -292 90 -122 -164 110 -123 246 -126 -55 -328 78
2846G8J57k81JJ2k18L15j22J42J75m84M75l66n3K60j6j52L68k43M1k78K71k9r3
$$ 78 235 -46 -45 -33 -251 64 -58 84 259 -225 250 -116 -169 91 75 -77 291 48 89 -189 82 53 -40
2869d0MK5K8NK16k42j14o5K24pj08j7L49k08p8n1K21j94k55L12J7m1K7J3k2j51
$$ -40 -36 -11 17 22 238 -4 -118 -183 41 34 -74 -91 258 50 -28 -79 142 -52 -307 5 22 -19 8 21 -1 -152
2895a52J37J92l61P8M19j90k40LK66l49K48k37M68j60M3j45J3J81j94M7j12J44
$$ -152 -15 177 -184 -106 313 123 -117 -114 152 -197 51 -186 282 122 165 20 33 214 20 67 -45 99
2917I9K03k48M1j63p2R7l9P3j06M45n48K47j67pJ04K9M8Q5j46l76L15L57k29K26
$$ 99 302 54 95 -68 -140 -43 -82 -9 -115 330 -218 29 -138 -145 -41 -12 36 121 -25 -401 -86 271 42 268
2941B68j67k51J79QJ11j71J73n6K53l82J10j66J20J00k96Q9j45Q0M02n99N64k55
$$ 268 101 -150 29 37 148 -23 150 94 347 -35 75 -91 29 129 -167 -78 -223 -143 259 -340 224 -31
2963c1J5J19j02J24j57r3J5j04J80K36k54K47k02Q3k8rk28K25k10l6J76P1k46
$$ -31 -16 103 1 125 -32 -125 -110 -214 -34 202 -52 195 -7 76 48 39 -189 36 -174 -210 -34 37 -209
2986b09K97J54j91l15P5K05j65K46Q3M1J9k49m7l8p9J01r2J54j12K92J7P2k91
$$ -209 88 242 51 -264 -189 16 -149 97 180 221 240 -9 -56 -94 -173 -72 -164 -10 -122 170 187 259 -32
3009c2M0n4m8L03k44J98K96m22J29k98j30J02M8J41R9k54J65K8J44j95r2o5J7
$$ -32 8 -46 -94 209 -35 163 459 37 166 -132 -262 -160 -112 29 128 -126 39 67 211 16 -76 -141 -124
3032a24L08l53J16J21l09J91j08P6K14K2n2J73m86K16k0l7j19K21k4P4k76L04
$$ -124 184 -169 -53 68 -241 -50 -158 -82 132 154 102 275 -211 5 -15 -52 -171 50 26 100 -176 128
3054A28j53p8K20l73O0J92J01R9k4k70K3j87K39L28l09O2K15k2k98J63nk77K73
$$ 128 -25 -103 117 -256 -196 -4 97 196 172 -98 -75 -262 -23 305 -4 58 273 251 -47 116 111 -166 107
3077A07p2p5O7l02K98j83J09M52j50k97j14J81j92L67j08j95K96q9j82QJ47k95
$$ 107 35 -40 27 -275 23 -160 -51 401 251 -46 -160 21 -171 196 88 -107 189 100 -82 -74 73 -222
3099b22K65k57K06j7Q0l48N14k81J9J20j94J74j79J27P3j22o3k45K86K77l15R5
$$ -222 43 -214 -8 -25 55 -293 221 -60 -41 79 -115 59 -120 7 80 -42 -105 -350 -64 213 -102 -7
3121gL3j35R0j03J8J23q9J57j82L2J31j32K07O7j55J35k80O1K7J10k51pK89j28
$$ -7 26 -109 -19 -122 -104 19 -70 87 -95 -63 68 -64 143 210 55 190 -90 -29 -2 108 -143 -150 139 11
3145A1J33p6m8K51k58K3P6k14J35j40J00k36K47P5P1o1j5N1m28L43k98J64k02
$$ 11 144 68 20 271 13 36 112 -102 33 -107 -7 -243 4 79 150 89 74 125 -303 40 -258 -94 -296
3168b96L55Rj1k5J56j16k12K00M7p5k13L28j08l3k15J32Q7m9p1K53o5j89J38J24
$$ -296 59 68 57 32 188 72 -140 60 107 32 -181 147 39 6 -209 -77 10 -39 -110 143 78 -111 27 151
3192A51p1r6m88M36J46k97K72J14k96N5J48J09j55p5K30j51k51L28j32J23J27
$$ 151 80 -16 -504 -68 78 -219 53 167 -129 -74 74 183 28 -47 183 32 -219 109 -23 100 227
3213B27j52k34L57o1P7l69J73j41j98L96N0j5k54L58k10j32R9J73o0l38J92l7
$$ 227 75 -159 198 137 214 -155 18 -123 -321 75 125 110 -144 214 4 -128 -29 144 84 -254 -62 -99
3235i9J55j68o7L36r8m3O3K09j05j42N2Qk64J67k12M19k34J30LJ35k27mj50J27
$$ -99 56 -112 -179 157 59 16 79 288 183 41 93 101 -163 4 -208 211 -23 107 110 245 18 14 -136 -9
3259iK92l15q5J36J43k56K14O5l18Q8j44j11M43j78J4R5q0j4K0R0j92l61M28L16
$$ -9 283 -32 -117 19 162 -94 120 185 -133 -45 -189 -300 143 -35 -21 74 -6 -20 0 90 -102 -463 -35 281
3283B81m00j4K20k59Q8L49j6l34J72k33J49M1K01j39m1j85K43n3j84J73l63J68
$$ 281 -119 -133 87 -172 -84 265 249 -85 87 -146 3 44 245 106 65 -120 123 70 -114 59 -304 -136
3305a36K39j9j11J9o1O8Oj00L3K30l9l37J49J17K5j33lJ90l43M73o4m40K29K67
$$ -136 103 84 -27 -8 -69 -1 5 -95 -62 168 129 -208 -59 58 83 -50 -53 137 -206 267 203 -237 -8 259
3329B59l86K26J43k30j23m4K64q7L13m39N54j78l72K21j41K4J55k28K68k66J95
$$ 259 -127 99 242 12 -111 -155 109 22 335 -104 450 272 -100 121 -20 4 159 -69 199 -67 128
3350A28l82J95J41k65L38l06j8M14k14l09L86p5k0K12N1j30k8r0r3j31K85k11
$$ 128 -254 -59 82 -183 155 -151 -169 245 31 -278 108 33 13 225 276 146 118 28 -65 -196 89 -122
3372a22L92l9q6J3p1P8l12J52K10j47p5L6L8o1J8k94J3L96J2k03j75K18J2J40
$$ -122 270 231 145 158 87 165 -147 5 215 68 -7 29 67 6 24 -270 -257 139 151 -52 -227 -9 3 143
3396A43J7k03l08N34m93L24m2k06L04l24J39K62J75l55K85j49R3O0k64o9L48k31
$$ 143 160 -43 -351 183 -310 14 -28 -234 70 -254 -115 147 322 -33 252 103 196 256 -8 -77 271 40
3418D0M6o4k07L84k36o6J31L1m30M84k31L42l68J67l03M97k21k5N7k80J46m32
$$ 40 86 22 -185 199 -37 -103 28 59 -371 113 -118 224 -144 23 -280 217 -4 -29 28 -252 -106 -538
3440e38L62J71j62M1J21J29m8k18M03k13l51J77K00n4k70l3L09O7N6k04j53K94
$$ -538 -176 -5 -167 -126 -5 124 76 -142 261 48 -303 -126 74 20 -250 -283 26 93 149 -55 -208 86
3462H6jk7k30j10L05l7K01j99j59L74k45L37k20pj5Po8j33J89k0j71J46p1K25
$$ 86 85 58 -172 -282 23 -14 187 -12 -171 203 -42 295 75 68 53 60 -8 -141 48 28 -143 3 -68 157
3486A57j42l98M99j08J57L4k95j49J61P9K51m70R5l5K52j72nK06Ln6q3O7r3m3
$$ 157 15 -383 116 8 165 199 -96 -245 -84 -5 246 -224 -129 -164 88 -84 -89 117 120 64 -19 48 -45 -88
3510h8J38J22l47K42J35k09J46J02m04L27l8p5K18l12J95j47pQ7j82o3J99P6Q0
$$ -88 50 172 -175 67 202 -7 139 241 -163 164 126 51 269 -43 152 5 -2 85 -97 -160 39 115 195
3533A95j26j03J41p7l53M92l47K39m3n6k59O5R7L11P7j92j13J37j05p5J66Oj4
$$ 195 69 -34 107 30 -323 169 -178 61 18 -38 -297 -232 -135 176 253 61 -52 85 -20 -95 71 77 63
3556F3j73K41j5r2k70K04O4k25L79j6l9M4j46k36J83n3K52k42J61j50mk1J86o2
$$ 63 -110 131 116 24 -246 -42 22 -203 176 160 121 165 19 -217 -34 -87 165 -77 84 -66 -70 -91 95 33
3580C3P6r5k84J51p0J66J95m14Q4J75l27J75LK3J19J3m5o9J79j34P0J76J25j54
$$ 33 109 14 -270 -119 -189 -23 172 -242 -158 17 -310 -135 -132 -109 10 23 -22 -91 88 -46 24 200 325 171
3604A71j62j11K26L8j53J4Q3j22j35L45r1l93K52P4J64j35K7j65J42j05K84j87
$$ 171 9 -102 124 162 9 23 106 -16 -151 194 103 -290 -38 36 200 65 92 -73 69 -36 248 61
3626F1j56J96r5J9M5j21J52L12n19qN4Q6q5M1L7J95l04L00j52O4j35m0M2j1j22
$$ 61 -95 101 6 25 70 -51 101 413 -106 -114 -60 26 -59 -18 19 214 -90 210 58 122 -13 -53 -11 -22 -144
3651a44J21j6n0J44K0Rn8p4L0j29Q6j3L9qj28j61K64J11j15K48K41m33J85J21
$$ -144 -23 -39 -89 55 75 84 26 -48 -18 -147 -61 -74 -35 -43 -171 -332 -68 43 -72 176 417 -16 169 290
3675B90k45j12P9J58q8K41l42J94j31p2L63P9m89J82J4k76M60k01J85l73K23J42
$$ 290 45 -67 12 170 82 323 -19 175 44 -28 335 414 -75 107 121 -155 305 104 289 -84 139 281
3697B81m7l36L22q0QJ41l05J72r1j01J80k55J16J20k44M44m50p2R4K1M7R6J85
$$ 281 234 -102 220 140 148 289 -16 156 65 -36 144 -111 5 125 -119 325 -125 -197 -103 -82 -35 61 246
3720B46r4p3r4K49k03Lk33L7R4j47K30O1j03r2R7j03l1L33k21p6n8L73m8J15l3
$$ 246 152 79 -15 234 31 34 -199 -162 -68 -215 15 76 -27 -119 -22 -125 -156 177 -44 -120 -178 195 147 262 229
3745B29l5o9k72Q6N4k1pK57k83J55k0N0K7l70K34j02P7K5L4n10O86j81p9j64K22
$$ 229 194 125 -147 -61 -7 -28 -35 222 -61 94 74 124 151 -219 15 -87 -10 15 49 -461 225 44 -35 -199 23
3770B3N7k77J91k82J27K86k91j78K56K14L9k58L9j21J20j94L30L0r4k23P7n1J56
$$ 23 80 -197 -6 -288 -161 125 -166 -344 -88 126 165 -93 -54 -175 -55 -249 81 111 17 -206 -129 -180 -24
3793b4j22L80R5m32rO8J05k20k19O73l55j39J76K84m9l12q9K54j4p2LqM0j14%
$$ -24 -146 234 329 -103 -112 -44 61 -159 -378 295 -60 -199 -23 261 212 -100 -189 65 51 -21 -18 -26 14 -100 -100
3818a00R2q6N9nJ36m5k09J59k30K93j93r1J41k1J13J90k97P8j23J86r1L37l02
$$ -100 -8 -94 -35 -40 96 51 -158 1 -229 64 -129 -220 -79 -100 13 203 -94 -16 -139 47 -44 293 -9
3841ik05K36O0O6r9l14J99Lp9L58k83l4J05K82l81RJ79p8j79J74j69O9o0J91K13
$$ -9 -214 22 82 148 49 -265 -66 -63 -142 216 -67 -101 4 286 -95 -86 93 15 -164 10 -159 -90 -150 41 254
3866B54k75j91K94k73J81m5J7J91P3m83K07o6j66J48J54K10k56k5r5L44k64j56
$$ 254 -21 -212 82 -191 -10 -55 -38 153 226 -257 -50 -116 -282 -134 20 230 -26 -51 -146 198 -66 -222
3888b22L44L51m92J3L45j83n58M23j21Q5k1j3Rj61K04L6l38j54L90J14j3l8l65
$$ -222 122 473 -19 -6 339 156 -402 21 -100 -15 -36 -49 -40 -201 3 39 -299 -453 -63 51 38 0 -365
3911c65P07n99K47j02j27K60K50j35j11J60l69J46R6K88m50O0M4O6k05J30o4N9
$$ -365 342 -257 -10 -112 -239 21 271 136 25 185 -184 -38 58 346 -104 -44 0 66 -139 -9 -73 -14
3933a4K05k87j11J91N8OP0J16l55K92l01K59l32N70m78P7O1k21k46L82r6J76j35
$$ -14 191 -96 -207 -16 42 48 118 234 -121 171 -130 129 -203 367 -111 -34 27 -194 -440 -58 -154 22 -113
3956a13o8K74n4nj2j14O7q8K97l30j27K76o9J45j54K05q7O3L7r8O4J14k66J45
$$ -113 -181 93 39 34 22 -92 -25 -113 184 -146 -273 3 -66 79 -75 130 43 106 143 45 109 223 -43 102
3980A02j51M5j57k5J82j01j44L50k47J09J82l04L48o1r5j10J36l9J46r6j62k14
$$ 102 -49 -4 -161 -186 -4 -105 -249 101 -146 -37 145 -159 189 128 33 -77 59 20 166 70 -92 -306
4002c06K06p8lJ19l8K90o9m56M07j3p5o3L8L04m63RK59Q4k53L39j54k55K04o8
$$ -306 -100 -178 -181 -62 -100 190 121 -335 72 59 -16 -79 -41 263 -200 -191 68 152 -101 238 84 -171 33 -35
4026c5J4j73N7Q2N8M9l67K87k4Q9J9k3j94rJ63k67J52K94j17o2j50K32J9j83J39
$$ -35 -21 -194 -137 -55 3 52 -315 -28 -52 37 56 33 -161 -170 -7 -274 -122 172 55 -7 -157 75 94 -89 50
4051E0l28M22j36l08L33j43j22J53K61k19R3p8j85L40r2o2J09k14J69m62N49m10
$$ 50 -278 144 8 -300 33 -110 -232 -79 182 -37 56 -22 -207 133 41 -21 88 -126 43 -419 130 -280
4073b80J30P3R3k00P1L21m64Q5j49N56j50Nj28J75k35L19j84K02j43j87R3J14
$$ -280 -150 -77 16 -184 -113 208 -256 -171 -320 236 86 91 -37 138 -97 222 38 240 97 -90 3 117
4095A17m9m42J95K45l26L09J16n8j2j97Q4q1L38j98r5QP8J3k58M27j56J41m22
$$ 117 68 -374 -179 66 -260 49 165 107 95 -102 -18 -99 239 41 -54 -46 32 45 -213 214 58 199 -223
4118b23K5J60k07M93j08k56L85l62J35O9j80k20J66J58J12j15M5p3P9j60m8J5
$$ -223 -198 -38 -245 248 140 -116 269 -93 42 111 -69 -289 -123 35 147 32 77 4 83 -77 -125 -110
4140a10Q2j4j51J57J7M11k18n43L50J64q1j1Q0j65KJ98j71M1k9N6l20r1L32l8
$$ -110 -28 -42 -193 -36 -19 392 174 -369 -19 145 64 53 133 -32 -30 168 -3 38 9 65 -255 -346 -14 -52
4164e2L37j15m85P07l55l05K22O2j24K43p3Mk62K80k78m0M27k44j26J63J52l99
$$ -52 285 170 -315 392 37 -268 -46 16 -108 135 62 66 -196 84 -194 -234 193 -51 -177 -14 138 -261
4186b61M19j94J72k86L09j43R0R7k03K23l21m6P4oL48j17m23K97J7k04J77j16
$$ -261 158 -36 136 -150 159 16 106 203 0 223 -98 -144 -70 -76 272 155 -268 29 46 -158 19 -97
4208i7P2J0j06J37J9k39J30J62k17O3j62L35K24n41J94N0J16l16L37k34R9r4K1
$$ -97 -25 -15 -121 16 35 -204 -74 88 -129 -66 -228 107 331 -210 -16 34 150 -166 171 -63 36 -58 -37
4231c7K86j77J51m10J78j84Q6J90O1k88K76l7j99j42O14l96k47K69j38K9K91j22
$$ -37 249 72 223 -187 -9 -193 -107 83 144 -144 132 95 -104 -246 368 -28 -275 -6 -144 -115 176 54
4253E4k00M05l85k10M06k43L45L1j98n1Pj21R1M8k77L76j2k06M36l43LN0j4J03
$$ 54 -146 259 -126 -336 70 -173 172 203 5 -46 -39 -160 -69 -21 -298 78 66 -140 296 -47 -44 6 -8 95
4277I5m2Q8k47K5j97P7o8j1N27l7r5q7l44L36M7J0j94K97m7j22j06QP1J38o4N3
$$ 95 53 141 -106 -81 -278 -201 -269 -280 247 210 115 28 -316 20 67 77 -117 180 133 11 -95 -87 -16 122 58 111
4303A11j08J49l01J35m3j40J43J2J84j20K26k7j00j56jq3m7L29M2k93Rk0J46l00
$$ 111 3 152 -149 -14 -57 -197 -54 -42 142 22 248 221 121 -35 -36 -119 -166 163 205 -88 -79 -99 47 -253
4327b53L39Nj21j01J7q9m2M05m85N8R7J97O6l27L85j61O6r3Mq5R8K95q2k28J31
$$ -253 86 91 -30 -131 -114 -203 -245 160 -325 -267 -170 27 93 -234 151 -10 56 -37 -33 -118 -20 275 193 -35 96
4352I6j8R1Q0p8J4l13J30K3j06M11k3l15L7k31R6K08K0J18l37J52K7q7j88K87
$$ 96 78 169 249 171 185 -128 2 25 -81 330 307 -8 29 -202 -106 102 122 240 -97 55 82 -5 -193 94
4376I4l32M20l88K76j48J33J90k48K83k97l6J88j21k10J86l3J31j3K72l70J65
$$ 94 -238 182 -206 70 -78 55 245 -3 280 -17 -53 135 14 -196 -10 -43 88 75 347 -23 142
4397A42k31QL68n25K00j60Q4L33m96L76k03K10j80J63L5K14l75J73N1k09k23K03
$$ 142 -89 -81 287 -238 -38 -198 -114 219 -277 99 -104 106 -74 89 124 338 -37 136 187 -22 -245 -42
4419d2P9o2K32M3j01J1k18J45j58R5J5l96M26J39m56J93p8J23M7r5J54j0m3j50
$$ -42 37 -25 207 250 149 160 -58 87 -71 24 39 -357 69 208 -248 -55 -133 -10 37 -58 96 86 43 -107
4443a07j79o3Q7K89j23l34J83L57l15L0K60j77K4O7J74k06K20l15J57L02k33p1
$$ -107 -286 -349 -262 27 -96 -430 -247 110 -205 -175 85 -92 -68 -1 173 -33 187 -128 29 331 98 27
4465B7m1o9J30j94J98J87m82M13k17M8o0m2N2j77J75k20J54j1N8j91L38q9J7P9
$$ 27 -14 -83 47 -147 51 238 -244 169 -48 0 -60 -102 -50 -227 -52 -272 -118 -129 -71 -262 76 -13 4 83
4489H3k35K84lk15%K17l03K76j63k72L59K22m03K53J59J09r6l25J5l5J52O1j34
$$ 83 -152 132 129 -86 -86 131 -172 104 -59 -331 28 250 -153 100 259 368 272 -53 -38 -73 79 140 6
4512FP8J12k34M3k58p2J99L38m0q5k62R2N4M1l9K17r4N4l27K48K4j73k2J6N5J22
$$ 6 84 196 -38 5 -253 -325 -126 212 172 87 -175 -83 -29 12 -27 190 96 150 -177 71 95 -78 -100 -84 -29 93
4538I3m5N2O3k06K99k76n2K32j06l7q8P5p7J22j7J27k75m5O5J43k84M7J13J45
$$ 93 48 100 163 -43 256 -20 -72 160 54 17 -71 4 -73 49 32 159 -116 -161 -96 47 -237 -190 -77 68
4562F8k12K32j56N9K9k70J18J94RJ65j81m9m9l6K6j35j28K45J57QL8k59N0K15
$$ 68 -144 88 -68 -9 20 -250 -132 62 71 236 55 6 -43 -79 -53 -188 -316 -71 86 94 132 -127 -77 138
4586A38O5R8m38l2L31R1k93J23O8k10J29k54M92j07n13K46K92j43m7o0J09j92
$$ 138 203 301 -137 -169 162 253 -40 83 151 -59 70 -184 308 201 -312 -66 226 83 36 -24 85 -107
4608a07K09j27J70q6l30J97p8O1Rj11J08n6J17r7Q0J0K5N7K6k92L18kj59j81J6
$$ -107 102 -25 145 59 -271 -74 -152 -91 -82 -193 -85 -141 -24 -121 -41 -31 -6 51 77 -215 103 101 -58 -239 -223
4633b23M67l21M29l21P8n59M73K4k87K51Q1J51j43Nl91M16n4r5n6k9N4J31r0M65
$$ -223 244 -77 352 31 109 -450 23 47 -240 11 92 243 100 105 -286 130 76 -19 -75 -104 -50 81 -9 456
4657D56n04p6k0J18J26l45K46Jj35J44O5j95K20l06M20j66J15J9j53j42j22K10
$$ 456 -48 -124 -144 -26 100 -245 1 2 -133 11 76 -119 101 -205 215 49 164 183 30 -112 -234 -24
4679b4L50n85R1N44m66j48K30j15m2K25j3J24l3k26K7K46k61m0k3j01L02J45j23
$$ -24 326 -259 -168 376 -90 -238 -8 -123 -165 60 47 171 138 -88 -61 185 -76 -116 -139 -240 62 207 84
4702H4j8k74Q4j05J52P4J21M4j53k45K74J74m21Q3j49L45j44k2J59J65j83k24
$$ 84 66 -208 -124 -229 -77 -3 118 162 9 -236 38 212 -209 -126 -275 70 -74 -96 63 228 45 -179
4724a79L05N7Q7l05J68j92Q1Q5j26p5K56o9N3l10J54%m8p9P8k40L02J86j79J62
$$ -179 126 183 270 -35 133 -59 22 107 -19 -94 162 93 146 -164 -10 -10 -58 -137 -59 -299 3 189 10 172
4748A72l05R1j36K42j66n0J57J67P7k03k62J61l4J31nL93l88n9J08j32P7K08l75
$$ 172 -133 -42 -178 64 -102 -152 5 172 249 46 -216 -55 -89 42 37 430 42 -17 91 -41 36 244 -131
4771a31K31l85LL69j32R2J11r2r1j43K05q2j74L50j25O8j69J48j73J4M08k37k53
$$ -131 100 -285 -282 87 -45 47 158 66 -25 -168 37 -45 -219 131 6 74 -95 53 -120 -106 302 65 -188
4794a88j6p1K46J92k11N9j5k4j38l4K77l29Q3K04k1n0J82j99M0nK06l37K60n9
$$ -188 -204 -275 -29 163 -48 11 -4 -28 -166 -200 77 -252 -169 35 14 -36 146 -53 -13 -18 188 -149 111 52
4818E2j49j21J53Q6K16k25j04K04k57j19J76K76j19Mk5K42k16j67J59N5j72K50
$$ 52 -97 -218 -65 21 237 12 -92 112 -145 -264 -88 188 69 73 48 290 74 -93 66 121 -51 199
4840A99l71L75l43K18l6j60L86l13J2j68L24m2J04m9k65L76j9K53m39mK3k50J16
$$ 199 -172 203 -140 78 42 -118 268 -45 -33 -201 123 81 185 136 -129 247 228 481 42 38 61 -189 -73
4863g3R4l8J18q0k5n05P63k3l40J84p5O0L1qK80n14K04j37J74J00j51rR6l52J20
$$ -73 21 -17 101 21 -4 -509 254 231 -109 75 0 60 91 83 363 -151 53 -84 90 190 39 30 126 -226 -106
4888a06J30j36J76o8K2r9R0J49P5O6j87l19K34N6k34R2J78J17j63R1k34j7m2L78
$$ -106 24 -112 64 -4 18 -81 9 158 233 299 112 -207 27 83 -151 -59 119 236 73 164 -70 -87 -129 249
4912B49k11k02Mj38J54J06J8k82M17j91L5J06j77kJ27K9r6Pl4L76k12k97J63J7
$$ 249 38 -164 -160 -298 -144 -38 -20 -302 115 -76 -41 65 -112 -114 13 42 -54 -47 -81 295 83 -214 -51 -34
4936c4o4p4J33K52j33k1l55L79j40j65J49J53k93J01k9K95m66K35p1N25k43m6
$$ -34 -98 -172 -39 213 80 59 -296 83 -57 -222 -73 80 -213 -112 -141 154 -312 -77 -148 377 134 88
4958H8j07K56l12j66K87l1J90m51J85j5J26L30l68j34jJ73k88J60k3l0Rp9K26
$$ 88 -19 237 -75 -241 46 15 205 -246 -61 -76 50 380 12 -122 -123 50 -238 -78 -101 -131 -122 -201 25
4981B5j8K30n1j97l2J52p2l25K49K61lm52L36o9j47J04K30j95l71J94k94J08L82
$$ 25 7 237 186 -11 -43 109 37 -288 -39 222 219 -233 103 34 -113 -9 221 26 -345 -151 -445 -337 45
5004D5J05j86J12n8J55l1k67K25j27j76L78k91K32k8N8j89o9Q9J44J9P6k57J28
$$ 45 150 -36 76 18 173 142 -125 100 -27 -203 175 -116 116 88 146 -43 -112 -23 121 140 216 -41 87
5027H7l72L03J03k38K05j57k7j86K92K2lj10K1m1Oj64R2N77l16O4Pj79k5J82r0
$$ 87 -285 18 121 -117 88 -69 -96 -282 10 32 29 -81 -60 -101 -95 -259 -167 410 94 158 165 -14 -39 143 53
5052E3kr7L3J33j16l09J11L3qJ00j30M4K15J57n29K81O6J54j18J80j47N2p2j55
$$ 53 51 -46 -13 120 4 -305 -194 -161 -169 -69 -199 -155 60 217 -312 -31 35 189 71 251 104 156 84 -71
5076g1R6k24M34l73J92n6J57k59n0L0K37j76j26N7J88j62J6N3L07m46J54L9l12
$$ -71 25 -199 235 -138 54 -2 155 -104 -154 -124 113 -63 -189 -132 56 -106 -90 -37 270 -176 -22 17 -295
5099b95K65j73L32j67J87O9k92J5q5J35K42k58l12N02P4k80K00j14j13R6j72N9
$$ -295 -30 -203 129 -38 149 218 -74 -59 -144 -9 233 -25 -337 165 239 -41 159 45 -68 28 -144 -85
5121h5r5L58k85L66k81J22K77k48j30k13L65k71K30n2K97j97p0m27K20qj10Q1
$$ -85 -180 178 -107 259 -22 100 377 129 -1 -214 151 -120 110 58 355 158 88 -339 -119 -127 -237 -156
5143a56L48j45k56K09o6J32j01p3J07J17l42J73J26J76Q6r0j61o1j29k15K37K33
$$ -156 192 47 -209 0 -66 66 -35 -108 -1 116 -226 -53 73 249 335 245 84 23 -106 -321 -84 149
5165A49j49R8K51m41L15k95j26M5j39L07p9J15n3R8j75o3l2Q7j1j48K00q3L56
$$ 149 0 98 349 -92 223 -72 -198 -153 -292 15 -64 51 -2 96 -79 -142 -174 -87 -98 -246 -46 -129 227
5188B27l05m9J39J3j92j24K19o2L8J62q5K4J18l19j60L91r3N3K52k27J6q9Q7p8
$$ 227 -78 -127 12 25 -167 -291 -72 -134 -96 66 -19 5 123 -196 -356 35 -58 -5 247 20 36 -53 34 -44
5212d4k19K64K03j80j5J09q5j5p3o7L9P1r0K54r4n9rj47L7K61j36n2J66j67L8
$$ -44 -263 1 204 24 9 118 33 18 -55 -122 -83 -12 -102 152 58 -1 -10 -157 -120 141 5 -47 119 -48 -10
5237a0k0K14r3j35M84l56L8p8l6pk29O62l53J3K18j70L4k53j50K59k80L70l18
$$ -10 -30 184 91 -44 440 84 122 44 8 1 -228 434 81 94 312 142 176 -77 -227 32 -248 122 -196
5260a96p5L16k14L27k22Np8KQ1K17j39l67N01j83j57M5J8l25K98J6k42M60j26
$$ -196 -271 45 -169 158 -64 -59 -137 -135 -54 163 24 -343 158 -25 -182 -137 -119 -444 -146 -130 -372 88 -38
5283c8j34J74J03j19l26M08K3j45kJ61j60r5L86l35K86j31L0k81L35m55N20m07
$$ -38 -172 2 105 -14 -340 68 91 -54 -56 105 -55 -150 236 -99 187 56 86 -195 140 -315 205 -202
5305b02J80r8L31j57K6j35J3K37l27P0L46k54j28j04K17K2k81O05k60J23k37J05
$$ -202 -22 -120 211 54 80 -55 -42 195 -132 -62 284 30 -98 -202 15 37 -244 361 101 224 -13 92
5327I2l8M8j31r7P9lRj48K88N2j5j21o2M1j78L92j57j53l4L95k37L0j35L01j74
$$ 92 54 102 -29 -126 -47 -50 -41 -189 99 151 136 15 -47 -6 -184 208 51 -102 -136 259 22 52 -83 218 44
5352D4O9R9j79R6k41K38J06l06J73r3J97l80K01R2l46O04m94LL6j05J90K17l1
$$ 44 113 212 33 129 -112 126 232 -74 99 6 203 -177 24 116 -230 374 -120 -117 -81 -186 4 221 190
5375A90j83j16K00k6Kk58NJ19p6Jk60L18L2J39J08k3n62M55J11m01J46L3k2k58
$$ 190 7 -109 91 65 67 -191 -186 -67 -143 -142 -402 -84 -52 87 195 172 -390 65 176 -225 -79 -46 -68 -326
5399c26K69j21J62j80J9J5J46J38o6j35R0k6k12L76m01L5J78j35J40l8J06j4P7
$$ -326 -57 -178 -16 -196 -177 -162 -16 122 56 -79 11 -15 -227 149 -252 -217 -39 -174 -34 -72 34 20 97
5422I7Q0qk76j75Q4K73J23j97L13j98j70l7l6K51R2k29%J07j22J06j91J27m0J12
$$ 97 177 169 -107 -282 -198 75 198 1 314 116 -54 -91 -127 124 216 -13 -13 94 -28 78 -113 14 -26 86
5446H6O5j21M9j55j75J56PL02j05R4j17rn4N2k05K75j83R2O3m00R8L24J6j85O8
$$ 86 151 30 79 -76 -251 -95 -88 214 109 203 86 77 23 75 -130 145 -38 54 117 -283 -185 139 155 -30 38
5471C8O0Ql55J72J48j61Q7j25K15k3k92K50p0k0K00j81p7J43k79L95j68L32m01
$$ 38 98 106 -249 -77 71 -90 -3 -128 87 64 -228 22 -48 -68 132 -49 -126 17 -262 133 -35 297 -104
5494a04K43k66j3L49k75j09J40l6j94j7J75K31l6L6P0l7R2k70M2k69K09Q2l01
$$ -104 139 -127 -140 209 -66 -175 -35 -71 -265 -282 -107 124 88 124 194 157 249 -21 21 -248 -39 43 -258
5517b58L06k89L35m9NJ60j03k09M39m96L23l01K2J04pm1J52l19R2J24O5J61l61
$$ -258 48 -241 94 45 50 210 107 -102 337 -159 164 -137 -115 -11 -18 -59 93 -226 -134 -10 55 216 -145
5540a45J96j6o4L77m48K37j13J86l98L5N82m49K39k70jJ72j57m1L38m88K45j73
$$ -145 51 35 -29 348 -100 137 24 210 -188 -153 429 -20 219 -51 -52 120 -37 -78 260 -228 17 -156
5562a56J60n4j45O24o31J37j74K07J32k58K0J66j60K63l53K07k91L19L07j81k69
$$ -156 4 -50 -195 429 -202 -65 -239 -32 100 -158 -138 28 -132 131 -222 -15 -306 13 320 139 -130
5583a30J36J65j15j28j2j26J01K19j21k32K65J12j14j85K29j40K60j26M1j38m7
$$ -130 6 171 56 -72 -84 -210 -109 110 -11 -243 22 134 20 -165 64 -76 184 58 99 -39 -86
5604h6J13pN8j75O2J47j07K10j16r6Q0j16m35L38L06n2l62P8K82k80J95k45K19
$$ -86 27 20 78 -97 -35 112 5 215 99 3 83 -33 -468 -130 176 124 -238 -160 122 -158 37 -208 11
5627A1L7k5J44n54O24l16Q8M9j13J56j0k67K79p2r0j25K24m7J4J26J15j62j30
$$ 11 48 23 167 -387 237 -79 9 58 -55 101 91 -176 103 31 -59 -184 40 -7 7 133 248 86 -44
5650d4J32Q3l79J45j4l81N49or8k0J2K32k12K6m12L18q7J72L7r8l47M29j86J73
$$ -44 88 171 -208 -63 -77 -458 91 85 -13 -33 -21 211 -1 25 -387 -69 -156 16 53 -45 -392 37 -149 24
5674B4k38m6J80r2J20k42l0L89j96M6K23j09K17l12M7J9j63J47K55l57P5J7J63
$$ 24 -214 -260 -80 -172 -52 -294 -324 65 -131 -85 138 29 246 -66 -19 0 -163 -16 239 -118 -43 -26 137
5697A37n3k13L61k80MP5R6j45j75p1Q3L15l9K28k78o9J96k81J72R8k69J82K4L6
$$ 137 84 -129 232 -48 -44 31 127 -18 -193 -264 -181 134 95 323 45 -24 172 -109 63 161 -108 74 98 134
5721A34k7l2P9k44L3M15n41J95k28r5M78j82Q2j70K22j13j11M7q2K57l29J67J09
$$ 134 107 75 154 -90 -57 358 -183 12 -216 -311 167 -15 67 -103 119 6 -105 -58 -140 117 -212 -45 64
5744F4j51K11j90J06p3M08n15L59j94k18K22O6m6k52L65j56p9j67M8l7K22Q3O7
$$ 64 -87 124 -66 40 -33 375 -140 219 25 -193 29 95 49 -203 162 6 -73 -240 -192 -229 -7 76 143
5767A43j32j40L54l55M21j91j00j19j11M20j8l29J90j50qL36m26m5J45k23M28
$$ 143 11 -129 225 -130 291 100 0 -119 -230 190 172 -157 33 -117 -125 211 -215 -260 -115 -338 90
5788I0j84J43m79M99pl46L09j64M4J22Q4J07mm83J56K6M8L22m50J33p3R2O8l23
$$ 90 -94 49 -430 69 62 -284 25 -139 -95 27 111 218 214 -269 -113 -87 -39 283 -167 -34 -107 -15 53 -270
5812b70L16J54l64R3j15J11J90j68K08o9J52m5j95j82K38j31o1J37N4Q4k72K61
$$ -270 46 200 -164 -71 -186 -75 115 -53 155 86 238 193 -2 -184 54 -77 -138 -1 53 137 -135 126
5834A26K50n66J71J3K2O3J44j26j23J48k51K52r2m78M95j04J21k68L06n3l96J58
$$ 126 376 -190 -19 -6 16 79 223 97 -26 122 -129 123 31 -447 48 -56 65 -203 103 50 -346 -188
5856a88L92k20m4L14m36pM03k49L32j84p0J13l39R0J57k05R1J87M9k05r4K26j99
$$ -188 204 -16 -60 254 -182 -189 214 -35 297 113 43 156 -183 -93 64 -141 -50 137 186 -19 -113 113 -86
5879h6n8J82R5j1J36k93J44l44K50l8J2J45k96r0K5J68K63n05K53p2K48r3qpj56
$$ -86 -144 38 133 122 258 -35 109 -235 15 -23 -11 134 -162 -252 -227 -59 204 -301 -48 -120 128 35 27 20 -136
5904a36K08n2j59J94n3J12j89p9M17k92M0j80J31k00J40k05M35j61j98K91n0j31
$$ -136 72 20 -139 55 2 114 -75 -154 263 -29 11 -169 -38 -238 -98 -303 132 -29 -227 64 14 -117
5926a17J86M1k14O7k39J36O29k43j58q0p3J37m9J5j87L76j81k37L38j33l5r1J00
$$ -117 69 110 -104 -37 -276 -140 489 246 88 8 -65 72 23 38 -149 227 46 -191 147 14 -21 -112 -12
$$ [...]
8191A98
##END NTUPLES=NMR FID
##END=
