##TITLE=1H_SA_42.199
 CDCl3, 8 sc, 
 1.6.2020
##JCAMPDX= 6.0         $$ Bruker NMR JCAMP-DX V2.0
##DATA TYPE= NMR FID
##DATA CLASS= NTUPLES
##ORIGIN= UXNMR, Bruker Analytische Messtechnik GmbH
##OWNER= root
$$ XWIN-NMR		Version 3.5
$$ Mon Jun  1 12:26:17 2020 Russian Standard Time (UT+4h)  she@DPX200
##.OBSERVE FREQUENCY= 200.1315
##.OBSERVE NUCLEUS= ^1H
##.DELAY= (6, 6)
##.ACQUISITION MODE= SIMULTANEOUS
##.ACQUISITION SCHEME= undefined
##.AVERAGES= 8
##.DIGITISER RES= 18
##SPECTROMETER/DATA SYSTEM= spect
##.PULSE SEQUENCE= zg30
##.SOLVENT NAME= DMSO
##.SHIFT REFERENCE= (INTERNAL, DMSO, 0, 15.7039)
##AUDIT TRAIL= $$ (NUMBER, WHEN, WHO, WHERE, WHAT)
$$ ##TITLE= Audit trail, XWIN-NMR		Version 3.5
$$ ##JCAMPDX= 5.01
$$ ##ORIGIN= Bruker BioSpin GmbH
$$ ##OWNER= she
$$ F:/spectra/data/she/nmr/H-F/1/audita.txt
$$ ##AUDIT TRAIL=  $$ (NUMBER, WHEN, WHO, WHERE, WHAT)
(   1,<2020-06-01 12:25:24.04 +0400>,<she>,<DPX200>,
      <created by zg, POWCHK disabled, PULCHK disabled
       configuration hash MD5:
       00 E9 B6 7A A2 85 ED C7 34 08 36 98 17 FE 4E 26
       data hash MD5: 16K
       F0 EA 87 BE D3 47 64 35 3D 01 32 68 31 71 C8 99>)
$$ ##END=
$$ 
$$ hash MD5
$$ 9D 9C 0D 6B AF DA 40 03 6B 23 78 23 4D 81 08 36
##$RELAX= 
##$RELAX= 
##$RELAX= 
##$RELAX= 
##$RELAX= 
##$RELAX= 
$$ Bruker specific parameters
$$ --------------------------
##$DU= <F:/spectra>
##$EXPNO= 1
##$NAME= <H-F>
##$PROCNO= 1
##$TYPE= <nmr>
##$USER= <she>
##$AMP= (0..31)
100 100 100 100 100 100 100 100 100 100 100 100 100 100 100 100 100 100 
100 100 100 100 100 100 100 100 100 100 100 100 100 100 
##$AQSEQ= 0
##$AQ_mod= 1
##$AUNM= <au_zg>
##$AUTOPOS= <>
##$BF1= 200.13
##$BF2= 200.13
##$BF3= 200.13
##$BF4= 200.13
##$BF5= 200.13
##$BF6= 200.13
##$BF7= 200.13
##$BF8= 200.13
##$BYTORDA= 1
##$CFDGTYP= 0
##$CFRGTYP= 5
##$CHEMSTR= <none>
##$CNST= (0..31)
1 1 145 1 1 1 1 1 1 1 1 1 1 1 1 1 1 1 1 1 1 1 1 1 1 1 1 1 1 1 1 1 
##$CPDPRG= <>
##$CPDPRG1= <>
##$CPDPRG2= <>
##$CPDPRG3= <>
##$CPDPRG4= <mlev>
##$CPDPRG5= <mlev>
##$CPDPRG6= <mlev>
##$CPDPRG7= <mlev>
##$CPDPRG8= <mlev>
##$CPDPRGB= <>
##$CPDPRGT= <>
##$D= (0..31)
0 1.2 0 0 0 0 0 0 0 0.06 0 0.03 0 0 0 0 0.0002 0 0 0 0 0 0 0 0 0 0 0 0 
0 0 0 
##$DATE= 1590999923
##$DBL= (0..7)
120 120 120 120 120 120 120 120 
##$DBP= (0..7)
150 150 150 150 150 150 150 150 
##$DBP07= 0
##$DBPNAM0= <>
##$DBPNAM1= <>
##$DBPNAM2= <>
##$DBPNAM3= <>
##$DBPNAM4= <>
##$DBPNAM5= <>
##$DBPNAM6= <>
##$DBPNAM7= <>
##$DBPOAL= (0..7)
0.5 0.5 0.5 0.5 0.5 0.5 0.5 0.5 
##$DBPOFFS= (0..7)
0 0 0 0 0 0 0 0 
##$DE= 6
##$DECBNUC= <off>
##$DECIM= 24
##$DECNUC= <off>
##$DECSTAT= 4
##$DIGMOD= 1
##$DIGTYP= 9
##$DL= (0..7)
0 120 120 120 120 120 120 120 
##$DP= (0..7)
150 150 150 150 150 150 150 150 
##$DP07= 0
##$DPNAME0= <>
##$DPNAME1= <>
##$DPNAME2= <>
##$DPNAME3= <>
##$DPNAME4= <>
##$DPNAME5= <>
##$DPNAME6= <>
##$DPNAME7= <>
##$DPOAL= (0..7)
0.5 0.5 0.5 0.5 0.5 0.5 0.5 0.5 
##$DPOFFS= (0..7)
0 0 0 0 0 0 0 0 
##$DQDMODE= 0
##$DR= 18
##$DS= 0
##$DSLIST= <SSSSSSSSSSSSSSS>
$$ [...]
##$SUBNAM2= <"">
##$SUBNAM3= <"">
##$SUBNAM4= <"">
##$SUBNAM5= <"">
##$SUBNAM6= <"">
##$SUBNAM7= <"">
##$SUBNAM8= <"">
##$SUBNAM9= <"">
##$SW= 24.9337058887773
##$SWIBOX= (0..15)
0 0 2 0 0 0 0 0 0 0 0 0 0 0 0 0 
##$SW_h= 4990.01996007984
##$TD= 16384
##$TD0= 1
##$TE= 0
##$TE2= 300
##$TE3= 300
##$TEG= 300
##$TL= (0..7)
0 120 120 120 120 120 120 120 
##$TP= (0..7)
150 150 150 150 150 150 150 150 
##$TP07= 0
##$TPNAME0= <>
##$TPNAME1= <>
##$TPNAME2= <>
##$TPNAME3= <>
##$TPNAME4= <>
##$TPNAME5= <>
##$TPNAME6= <>
##$TPNAME7= <>
##$TPOAL= (0..7)
0.5 0.5 0.5 0.5 0.5 0.5 0.5 0.5 
##$TPOFFS= (0..7)
0 0 0 0 0 0 0 0 
##$TUNHIN= 0
##$TUNHOUT= 0
##$TUNXOUT= 0
##$USERA1= <user>
##$USERA2= <user>
##$USERA3= <user>
##$USERA4= <user>
##$USERA5= <user>
##$V9= 5
##$VALIST= <valist>
##$VCLIST= <CCCCCCCCCCCCCCC>
##$VD= 0
##$VDLIST= <DDDDDDDDDDDDDDD>
##$VPLIST= <PPPPPPPPPPPPPPP>
##$VTLIST= <TTTTTTTTTTTTTTT>
##$WBST= 1024
##$WBSW= 4
##$XGAIN= (0..3)
0 0 0 0 
##$XL= 0
##$YL= 0
##$YMAX_a= 59665
##$YMIN_a= -37378
##$ZGOPTNS= <>
##$ZL1= 120
##$ZL2= 120
##$ZL3= 120
##$ZL4= 120
##$ABSF1= 10
##$ABSF2= 0
##$ABSG= 5
##$ABSL= 3
##$ALPHA= 0
##$AQORDER= 0
##$ASSFAC= 0
##$ASSFACI= 0
##$ASSFACX= 0
##$ASSWID= 0
##$AUNMP= <proc_1d>
##$AZFE= 0.1
##$AZFW= 0.1
##$BCFW= 1
##$BC_mod= 2
##$BYTORDP= 1
##$COROFFS= 0
##$CY= 11.3945322036743
##$DATMOD= 1
##$DC= 2
##$DFILT= <>
##$DTYPP= 0
##$F1P= 16.9975609425685
##$F2P= -3.02152046262296
##$FCOR= 0.5
##$FTSIZE= 0
##$FT_mod= 4
##$GAMMA= 1
##$GB= 0.15
##$INTBC= 1
##$INTSCL= 1
##$ISEN= 128
##$LB= 0.24
##$LEV0= 0
##$LPBIN= 0
##$MAXI= 10000
##$MC2= 0
##$MEAN= 0
##$ME_mod= 0
##$MI= 1.114404
##$NCOEF= 0
##$NC_proc= 0
##$NLEV= 6
##$NOISF1= 3.799351
##$NOISF2= 2.8
##$NSP= 1
##$NTH_PI= 0
##$NZP= 0
##$OFFSET= 15.70392
##$PC= 1
##$PHC0= -9798.753
##$PHC1= 29.20082
##$PH_mod= 1
##$PKNL= yes
##$PPARMOD= 0
##$PSCAL= 0
##$PSIGN= 0
##$REVERSE= no
##$SF= 200.130013532006
##$SI= 16384
##$SIGF1= 3
##$SIGF2= 2
##$SINO= 400
##$SIOLD= 16384
##$SREGLST= <1H.CDCl3>
##$SSB= 0
##$STSI= 0
##$STSR= 0
##$SW_p= 3612.71676300578
##$SYMM= 0
##$S_DEV= 0
##$TDeff= 0
##$TDoff= 0
##$TI= <>
##$TILT= no
##$TM1= 0
##$TM2= 0
##$TOPLEV= 0
##$USERP1= <user>
##$USERP2= <user>
##$USERP3= <user>
##$USERP4= <user>
##$USERP5= <user>
##$WDW= 1
##$XDIM= 8192
##$YMAX_p= 0
##$YMIN_p= 0
$$ End of Bruker specific parameters
$$ ---------------------------------
##NTUPLES= NMR FID
##VAR_NAME=  TIME,          FID/REAL,        FID/IMAG
##SYMBOL=    X,             R,               I
##VAR_TYPE=  INDEPENDENT,   DEPENDENT,       DEPENDENT
##VAR_FORM=  AFFN,          ASDF,            ASDF
##VAR_DIM=   8192,          8192,            8192
##UNITS=     SECONDS,       ARBITRARY UNITS, ARBITRARY UNITS
##FACTOR=    0.0002004,     1,               1
##FIRST=     0,             0,               0
##LAST=      1.6414764,     0,               0
##MIN=       0,             -37378,          0
##MAX=       1.6414764,     59665,           0
$$ Real data points
##PAGE= N=1
##DATA TABLE= (X++(R..R)), XYDATA
$$ [...]
2053b45Q42M27k20o26M8N10l76k61M23o7j02j20K07j49k01J25M9J66n15J56K66
2074C37l54K88k68p8l5J47j06J62p7J26j96k64l12K38N38l63k37L41R9r7k86L79
2096a8j24n27M88j39J04j94k32M23p6o16K82O70j40j057K11P06l68l64L63L72
2116b36m83m8Q52j69n52j9L70L31o03j11O60j97m38J94L76M20o13j50O48K5n00
2137b43R7N93j76m68j18P55m48j84L57M21p27R5K49k3j03J78r7K26q0op5P1J75
2160D69l4n3q8r4N5K18k29J42M59k73l04K00L59j23l06RJ51J27j9k80J50N7l11
2183B82J45P9k73j70P81o3r33M33K42l29l40K10M18k60o09K22M57j24m83L37N15
2204E37o16n62R71Kl98m14K92K76l16q2J64J07m19oN09Ln74M9L87r5k07K6q4q7
$$ plain form
2053 -245 597 1024 804 178 226 736 360 99 522 455 353 233 440 291 90 215 264 430 -85 71 337
2074 337 -17 271 3 -75 -110 37 -69 93 16 142 -54 -318 -630 -392 146 -217 -454 -113 -14 -111 -397 -18
2096 -18 -142 -669 -181 -320 -216 -410 -642 -219 -295 -911 -629 41 -99 -1156 -945 -239 -607 -971 -608 -236
2116 -236 -719 -767 85 -84 -636 -655 -285 46 -557 -668 -8 -205 -643 -449 -73 347 -266 -416 232 257 -243
2137 -243 -146 447 271 -197 -315 440 -8 -192 165 586 -141 -46 203 180 77 255 158 384 304 298 223 294 469
2160 469 435 382 294 200 255 473 244 386 845 572 268 468 827 704 398 407 558 685 666 386 536 593 282
2183 282 427 506 233 63 844 781 -152 281 523 194 -146 64 482 222 -387 -165 292 168 -315 22 537
2204 537 -79 -641 330 332 -66 -480 -188 88 -228 -310 -146 -39 -458 -464 45 48 -526 -477 -90 -185 -392 -366 -450 -537
2228e37K83N1j40p2k50j50M51K88l54O0n7k19M42k00j74K00K18n8k34M28M3m24
2250d05k5nK01J92p09M96K74k78l98L34L33j08k93K29M17m76l1Q5M06k41k51L77
2272A24M2r5r9K16O1l92K7J33O17p65L27K43j93k1l6L20R5J66m05r5L63m42J62
2295C53L18m51O3j52M74MO5k76K03j87m08L00P0q1K31o0j41j37K33m76M06k49
2317A02K70k28J70j51K6J23k89L06k28k01K44J1j13m7K05K6j88m4K39j30J9l43
2339b21N2L63m46K56j60k30N6j38n5L24K02o41J37L68k47k48K42L64l63N8k26
2360e53L67j64k87M36k9k83J14m8K85n06J33R3L14l53k19K96J90j83k07M22Pk27
2382d02k20L14jJ12l3J83l40J60j13P4j17M10k26M0J40L0r6J43j09J48K29L3l3
$$ plain form
2228 -537 -254 -203 -343 -415 -665 -815 -364 -76 -430 -370 -427 -646 -204 -404 -578 -378 -160 -218 -452 -24 19 -405
2250 -405 -430 -435 -234 -42 -751 -255 19 -259 -657 -323 10 -98 -391 -162 255 -221 -252 -167 239 -2 -253 124
2272 124 166 71 -28 188 249 -143 -116 17 634 -131 196 439 246 225 189 509 604 770 365 270 633 191 353
2295 353 671 220 283 131 605 609 674 398 601 414 6 306 376 295 526 466 325 188 421 -55 351 102
2317 102 372 144 314 163 189 312 23 329 101 -100 144 155 42 -5 200 226 38 -6 233 103 122 -221
2339 -221 -169 194 -252 4 -156 -386 -330 -468 -523 -199 3 -638 -501 -133 -380 -628 -386 -22 -385 -327 -553
2360 -553 -186 -350 -637 -201 -230 -513 -399 -447 -162 -668 -535 -442 -128 -481 -700 -404 -214 -397 -604 -182 -175 -402
2382 -402 -622 -308 -309 -197 -230 -47 -387 -227 -340 -266 -383 27 -199 -159 -19 11 -85 58 -51 97 326 359 326
2405C26l5L7r5K02j5j15r0R1M5O0k29K22N6k29ML19l4l90q1J99r8K0K61J73j83
2430D21l8r1J77k7k58n1M39j40r4q2K38J49k60n8K18o2r5m87M85J95m92K66m0
2453C13k9k63L09p2mk77J97n8j53J18Q6o6j58j68N8K18m16R8J71J36n61R2P2M17
2477F0k45o9j39k12K53j30K48o4P4k89j16O80l29l4j89M76n49J17r4L39l2j27
2499c71J59l96M27j00O1R2j7j14l0J76k04Kj97K37J39p1j96L57Q6J17l56R8L7
2522f4l7j60M12k70MJ07PJ94k25R9L45q8n34L66K07N2n35M14k36J88J85l18M17
2545E30m83KK66n6K55m40J08J29j44J11j08L33k53J28j86K39O2k09k22J84J29
2566C75K80l82j05L11l37K69M0j37Pm09L93p1K92l53J16j19J32j83K58Kl61O7
$$ plain form
2405 326 291 328 233 435 420 305 215 306 351 411 182 404 460 231 235 554 520 130 49 248 150 170 431 604 421
2430 421 383 292 469 442 184 133 572 432 338 256 494 643 383 325 543 481 386 -101 384 579 87 353 313
2453 313 284 21 330 258 254 -23 174 116 -37 81 167 101 -57 -225 -167 51 -365 -267 -96 40 -521 -429 -357 60
2477 60 -185 -254 -393 -605 -352 -482 -234 -298 -224 -513 -629 51 -278 -312 -501 -25 -574 -457 -551 -212 -244 -371
2499 -371 -212 -608 -181 -281 -220 -128 -145 -259 -289 -113 -317 -315 -512 -275 -136 -207 -403 -46 40 157 -199 -101 -64
2522 -64 -101 -261 151 -119 -115 -8 -1 193 -32 67 412 324 -210 156 363 415 -120 294 58 246 431 113 530
2545 530 47 49 315 259 514 74 182 311 167 278 170 503 250 378 192 431 493 284 62 246 375
2566 375 655 273 168 479 142 411 451 314 321 -88 305 234 526 173 289 170 302 119 377 379 18 85
2588H5M96k82l53k34K27J63j06q6k51N63q8j10r0L3k38J06o7L18l23k46K56J72
2610e5l47L2K40J60k86K2Q2J31n34L27m7j54o6K10J01K4k57m3mL17o5j73K10k3
2634a98j86J81J82l08j85J53j37J69J84k14p2Q1l2n2K36P4O4Nk33J53K34k28k48
2657c77M36M58p78J67J51l8l2J33k07K30k43L34K89m61j58J18M14j39k64L04j33
2678B04J79l32M06M3m04L0M6J41K9K1l19M27l58K55j51J18k0l02J65J27k99J84
2700A90K49j70m1j61K43N3j77k8lJ28j63J60l33K19m6L2o0J4P0M5j86o1L23j73
2724A24k23o1J44N1j26N9K39l96k64K46K02J73j98k22L15l15j14J35Q3l42J2M45
2746c3k88o8N6K71p6j71j61M35N0j52l55L67Q3o33K06J97K96n37O7K49o2l8J7
$$ plain form
2588 85 581 299 -54 -288 -61 102 -4 -90 -341 222 134 24 -66 -33 -271 -165 -232 86 -237 -483 -227 -55
2610 -55 -402 -370 -130 30 -256 -234 -152 -21 -555 -228 -275 -429 -495 -285 -184 -160 -417 -460 -464 -147 -212 -385 -175 -198
2634 -198 -384 -203 -21 -329 -514 -361 -498 -329 -145 -359 -431 -350 -382 -434 -198 -124 -60 -55 -288 -135 99 -129 -377
2657 -377 59 517 -261 -94 57 19 -13 120 -87 143 -100 234 523 62 -96 22 436 297 33 337 204
2678 204 383 51 457 500 96 126 172 313 342 363 44 471 113 368 217 335 315 13 178 305 6 190
2700 190 439 269 228 67 310 363 186 158 155 283 120 280 -53 166 120 152 92 106 176 221 35 -26 297 124
2724 124 -99 -160 -16 35 -91 -32 207 -189 -453 -207 -5 168 -30 -252 63 -252 -366 -231 -148 -490 -478 -33
2746 -33 -321 -389 -333 -62 -138 -309 -470 -35 15 -137 -492 -125 -42 -675 -469 -272 24 -513 -446 -197 -259 -297 -280
2769b80J87j31K7K7N0m3l14N81m8k00J53k1oK27k62k58M13l6j30m7J89l4P5J5
2793A34j20J05l13M70l13J83K78k73n6K76J0n45K1M70j04R2Q9l49M98m13LJ71
2815C14J87k86j06J82r6J10l65M30j03j76j22M96k87M4n9J81m15q5O32o9k64K37
2837C80k60k11J62j47K34n8j61k05N07k74J17j85m8K87j43j5j47L6o0J67k43L17
2859E0l49K64j78j1O6P3n1K06j99l80M8K33p0L0K4l07K58j81K37j12J06k99M61
2882h1r7k00K55l15K47j16l20p8M24L0l1l82L96r8j36K16J57nj63J16K9j14M21
2905A55m35K76j03p4N7J20j15j24K41N5k07O1J97o4J18k97J93K03J09q1k20K38
2927C03j79L47o53K64J50m6Oj37j0Jk57K88J65Q1m5PK06l99L57N4l85J40lj83
$$ plain form
2769 -280 -93 -224 -197 -170 -120 -163 -477 104 56 -144 9 -12 -18 209 -53 -311 102 66 -64 -111 78 44 119 134
2793 134 14 119 -194 276 -37 146 424 151 95 371 381 -164 -143 327 223 315 404 55 553 140 143 314
2815 314 501 215 109 291 195 305 -60 370 267 91 -31 465 178 222 163 344 -71 -156 476 407 143 380
2837 380 120 -91 71 -76 158 100 -61 -266 241 -33 84 -101 -149 138 -5 -20 -167 -131 -191 -24 -267 50
2859 50 -299 -35 -213 -224 -158 -85 -136 70 -129 -509 -461 -228 -298 -268 -244 -551 -293 -474 -237 -349 -243 -542 -81
2882 -81 -178 -378 -123 -438 -191 -307 -627 -705 -281 -251 -282 -664 -268 -366 -502 -286 -129 -134 -297 -181 -152 -266 155
2905 155 -280 -4 -107 -181 -124 -4 -119 -243 -2 53 -154 -93 104 40 158 -139 54 257 366 285 65 303
2927 303 124 471 -182 82 232 186 192 55 45 46 -211 77 242 323 278 285 491 92 449 503 118 258 255 72
2951G2J80M20l10J24P2l91L17m28J15J25j1J69l90J19m8k07J89r9j0n7L40l68
2973g7K11m27K13M9j99K21m1n6jK00q4k0P7j84K39j54j61O4Q4J3Q2j43MM2O3k76
2999b61K93k49l25M70k00n1K95L4k90n9j46M10m7k61K16j74K41k89J81K48j87
3020a51m5K07j32J69j7k58K63k44q3J33J33rk40J64j11O9J16j56K99l53K27K38
3042B19j12O4OM7l79M5J48j95P7J62L2k21n7O23l33J60K3k41N7M4j52N11l94L61
3066D95l6j22J1o1j44J43k28RJ95j58K40n60M68K23m23J54J44n2j6Nqp8R4j67
3090A28J36k50J33J03J93j05j45n1K58m74L37j57j39K27j80L49k58K34m85j6O3
3111i9M9N0o8O3J0L6k50J52j32k1r9J86k16M49k39Lj45l5K15m0K9k56rK53Q4m58
$$ plain form
2951 72 252 672 362 486 558 167 484 56 171 296 285 454 64 183 135 -72 117 18 8 -49 291 -77
2973 -77 134 -293 -80 -31 -230 -9 -50 -106 -107 93 9 -11 66 -118 121 -33 -194 -130 -46 -33 49 -94 -90 -48 15 -261
2999 -261 32 -217 -542 -72 -272 -323 -28 6 -284 -343 -489 -79 -126 -387 -171 -345 -104 -393 -212 36 -151
3020 -151 -196 11 -121 48 31 -227 36 -208 -291 -158 -25 -34 -274 -110 -221 -152 -36 -192 107 -246 -19 219
3042 219 107 171 177 224 -155 -110 38 -157 -80 82 114 -107 -164 459 126 286 309 68 125 169 17 528 134 495
3066 495 459 337 348 287 143 286 58 67 262 104 344 -216 252 475 52 206 350 298 282 287 279 201 295 128
3090 128 264 14 147 250 443 338 193 142 400 -74 263 106 -33 194 14 363 105 339 -146 -162 -99
3111 -99 -50 0 -68 -5 5 41 -209 -57 -189 -210 -309 -123 -339 110 -129 -126 -271 -306 -91 -131 -102 -358 -367 -114 -30 -488
3137d88L11M1J6r1On5j87L68j40P4j21q2J78j67j30P6K82P8n6n0R4j58L4P5K5
3162f7l18J79J73j67J12j30P8k12J37P2j80K63N1M6q0j06M0K63k65K05j62Mm0
3185a04Q4Q6l92M75k73J78mJ58m5j63j74J29L34Q9r4M2k2l55J3J06O1N9r1L82
3209D79m10J53K06k20J13k06K08R9j68K01k32r5PM3J53j02k45OJ99j18o8N6j82
3232a23N4k7K32l8l44jj37M54J43l92L56l36J66J7j71J57k40O4K31Qk32K84j61
3255c6L04k81Qj22k38j01L00j6K2K76m1k85K70j40l95K29L9j23K44o3k4MK99k33
3279a03k90N73m62Nk9N12l20j35K05n1O4j57K09j50p0rJ43J20j48J76l75K81O7
3302E6k1J52l1k9L6j65Ok18N4L68p5o0j33k4J54K3J97L0j36j93j13K04L12j62
$$ plain form
3137 -488 -177 -136 -120 -211 -205 -260 -447 -79 -219 -145 -266 -348 -170 -337 -467 -391 -109 -31 -87 -137 -43 -201 -167 -92 -67
3162 -67 -385 -206 -33 -200 -88 -218 -140 -352 -215 -143 -323 -60 -9 37 -43 -149 -109 154 -111 94 -68 -64 -104
3185 -104 -20 66 -326 149 -124 54 50 208 163 0 -174 -45 289 378 284 326 304 -51 -38 68 129 188 97 479
3209 479 69 222 428 208 321 115 323 422 254 455 223 128 135 178 331 229 -16 -10 189 71 3 59 -123
3232 -123 -69 -96 136 98 -246 -247 -384 70 213 -179 177 -159 7 24 -147 10 -230 -166 65 73 -159 125 -36
3255 -36 268 -13 -5 -127 -365 -466 -166 -182 -160 116 75 -210 60 -80 -475 -246 -207 -330 -86 -149 -173 -169 130 -103
3279 -103 -393 180 -282 -277 -306 206 -114 -249 -44 -95 -31 -188 21 -129 -199 -208 -65 55 -93 83 -292 -11 56
3302 56 35 187 156 127 163 -2 4 -214 -160 208 133 73 -60 -84 70 93 290 320 184 -9 -122 82 394 232
3326B32l76K03L32l91L35m26J58Q7K03j85J3K8J34k37K2J7j52j56L63k47K79j01
3348A35M0O7K27k03P2r3Q0n2k04p7Lj39K28m0K30l23r7O7K14J08k29J77m99p0
3372c78M43J2j2l63J94J45k61K14j76R4k78J86q4L40j86M5j66J52NqJ02l05K52
3395c3j80L32m39Q2k56K90K04k25L00Np14L07L02l44K90j6N0j80Q8NJ43n2l51
3418c92L81j29J95k68r8K97J3k66J91J72k50J95K7l17K37J76k83K34l07K49k7
3439C0J51l42L52o4l91K29j48J62J30j03K43j45K1jo5N3J14J02j84J75l17K55
3461B57L0j32j63J10R0j7o5J75K08n40k9L31p3P7J07k2j13j9n32O52k52j6K12
3484B76p8J6j55Q9k20J07J61l50J62j81J75K62k94l19O23m95K14k39M21l91K66
$$ plain form
3326 232 -144 59 391 0 335 -91 67 154 357 172 185 213 347 110 132 149 -3 -159 204 -43 236 135
3348 135 175 242 469 266 338 245 325 273 69 -8 -5 -144 84 44 274 -49 -146 -79 135 243 14 191 -308 -378
3372 -378 65 77 65 -298 -104 41 -220 -6 -182 -88 -366 -180 -264 76 -110 -65 -231 -79 -74 -82 20 -285 -33
3395 -33 -213 119 -320 -238 -494 -204 0 -225 75 80 -634 -327 -25 -369 -79 -95 -45 -225 -137 -132 11 -41 -392
3418 -392 -11 -140 55 -213 -311 -14 -1 -267 -76 96 -154 41 68 -249 -12 164 -119 115 -192 57 30
3439 30 181 -161 191 127 -264 -35 -183 -21 109 6 249 104 125 124 59 112 226 328 144 319 2 257
3461 257 287 155 -8 102 192 175 110 285 493 -47 -76 255 182 259 366 344 231 212 -320 332 80 64 276
3484 276 198 214 59 148 -72 35 196 -154 8 -173 2 264 -30 -349 274 -221 -7 -246 175 -216 50
3505E0o5j39Q2o8O2j65PJ78k46M18j10m14J69K52l02L0J74r3J17j25J17k34J41
3528a64k10K02J28k4j41L93k67lj76J8J86k87L96r7K70l01O9n8j20M62l81J39
3550C4j8k32L29l20K58k38L89L1m62J48r3J34kJ82l56K43j32J92j89O7j59K59
3572F5J08l22n4P5J13P1N6j98N0J04J13J82j01r0m2j01K64k70J47kj0J73l19K25
3596B37j54J91k27P2k96K67J08K37l48j03J15J7J9K79l34l7J56J71l68K45k66
3617a9N8J94q4Q2k40K05j66q9K24j64j45L02j86K31k52K0j92J13k08N1K12j21
3639a74J2K92l13K60m60L09J74k35P0k03L5M7q5R9n7r8M25k39J70l21L1l5M9N3
3663a94J5M4j53K34m42J66J29K02l45K50k49K40OJ50k85K79l0o4r8j0k3J16L4
$$ plain form
3505 50 -15 -154 -72 -140 -78 -243 -236 -58 -304 114 4 -410 -241 11 -291 -261 -87 -180 -63 -188 -71 -305 -164
3528 -164 -374 -172 -44 -68 -209 184 -83 -86 -262 -244 -58 -345 51 -46 224 -77 -8 -66 -186 276 -105 34
3550 34 16 -216 113 -207 51 -187 202 233 -229 -81 -174 -40 -42 140 -216 27 -105 87 -102 -35 -194 65
3572 65 173 -149 -203 -128 -15 56 112 -86 -36 68 181 363 262 172 130 29 293 23 170 168 158 331 12 237
3596 237 83 274 47 119 -177 90 198 435 87 -16 99 116 135 414 80 43 199 370 2 247 -19
3617 -19 39 233 149 231 -9 196 30 -59 165 1 -144 158 -28 203 -49 -29 -221 -108 -316 -265 -53 -174
3639 -174 -162 130 -183 77 -383 -74 100 -135 -65 -268 -233 -186 -271 -172 -229 -327 98 -141 29 -292 -261 -296 -247 -194
3663 -194 -179 -135 -288 -54 -496 -330 -201 1 -344 -94 -343 -103 -97 53 -232 47 17 -47 -145 -155 -178 -62 -28
3686b8j64j72J94R6J02j18m8k1k9J6J08J30p2K69k80K31n4p5Q6l85K65k17N35
3709C69k38K67j96j15r7J18k05M45m13K25J00j27l3J59j90J34k15J41k80K95j92
3730d8j28L8K18L2k53L17j97J35n5J67j61O5k80L76k88j60K35J5J24oj70J4K6
3753A6o1J89p3J25m52K11K13l39OM1J75j40%L19k87n7O3M5j49J81j76R8j47K36
3777C7k64J37J07o3k77K15N4K32k68j06j76J28J63j78K52q9j05o1K23p9k42K17
3799a43k1K88l32K43R2q8K7p8J70l93Q7J95n06J28K01k9J49J92k44K75l28MK02
3822I1j30R5P9K20Jj84k04J50J56J7l75J5K67j52j6n4P1Q5P3j86K83nN2j46n6
3847A47Q3j43k26L93J8J8p4j55j11K89n6j46K25l54J62J08j59k49L7N41k22k10
$$ plain form
3686 -28 -192 -364 -170 -74 28 -90 -138 -159 -188 -172 -64 66 -6 263 -17 214 160 85 171 -214 51 -166 369
3709 369 131 398 202 87 -10 108 -97 348 -65 160 260 133 100 259 69 203 -12 129 -151 144 -48
3730 -48 -176 -138 80 112 -141 176 -21 114 59 226 65 130 -150 226 -62 -222 13 28 152 146 -24 -10 16
3753 16 -45 144 71 196 -256 -45 168 -171 -165 -124 51 -89 -89 230 -57 -114 -51 -6 -155 26 -150 -52 -199 37
3777 37 -227 -90 17 -46 -323 -108 -54 178 -90 -196 -372 -244 -81 -259 -7 -96 -201 -262 -39 -118 -360 -143
3799 -143 -164 124 -208 35 127 39 66 -12 158 -235 -148 47 -459 -331 -130 -159 -10 182 -62 213 -115 -111 91
3822 91 -39 56 135 355 356 172 -32 118 274 291 -84 -69 198 46 30 -24 47 132 205 19 302 297 349 203 147
3847 147 230 87 -139 254 272 290 216 61 -50 239 183 37 262 -92 70 178 19 -230 -193 348 126 -84
3869h4K90mj78j83N28k83o7K67k92Q6k54J61j24J78r2K20j18j09Q0n2j98Q5J65
3892B2O6j53o0j02L69n00K39n1o4K39q4q3j66J02K52j71Lk2J34J02m0J9n27L75
3916a01k23J32J54L37n42K15j93R0P5r9kp6P4j01J37Q8M8k44O5K0L43l09K11k03
3940a04K03K9m4J12m97J5M74k29M3j27J65p7j18J54k41K76j35R0j36L82K1j61
3962I5l1L25m31K58k23K88k36j37k73K04K95j79L6O3K79m98L18J65k15o5J2j43
3984i3K95j08q9L50k46J03k63K37k07J81p9J02l39K13N6l53M03O9k34J56k04P7
4006B7P5j25N34n38J16J02o13J78K85j1R7j91o5J61q9j02n0l3O60m61k10K51k50
4029b52J4J57j53J34o1K57j70l09M98j26j77M70n04J30q0j00L40k06K53m27M9
$$ plain form
3869 -84 206 202 24 -159 369 86 19 286 -6 80 -174 -13 -137 41 -51 169 51 -58 22 -30 -228 -143 22
3892 22 88 -65 -125 -227 142 -358 -119 -170 -234 5 -79 -162 -328 -226 26 -145 -142 -164 -30 72 32 51 -476 -101
3916 -101 -324 -192 -38 299 -243 -28 -221 -131 -56 -155 -157 -233 -159 -260 -123 -35 13 -231 -166 -146 197 -112 99 -104
3940 -104 99 128 84 196 -301 -286 188 -41 2 -125 40 -37 -155 -1 -242 34 -101 -11 -147 235 256 95
3962 95 64 389 -42 216 -7 281 45 -92 -365 -161 134 -45 -9 54 333 -165 153 318 103 38 50 -93
3984 -93 202 94 5 355 109 212 -51 186 -21 160 81 183 -156 57 113 -240 163 232 -2 154 -50 27
4006 27 102 -23 511 -27 89 191 -422 -244 41 30 127 -64 -129 32 -57 -159 -209 -242 418 -43 -253 -2 -252
4029 -252 -238 -81 -234 -100 -161 96 -74 -383 115 -11 -188 282 -222 -92 -172 -272 68 -138 115 -312 -263
4050b63J05k37M21p1j99K21k72M25P9n5j47l59L88J22J79k81K23l74j07M67l85
4071a20J50k47K15O3k52K83J87l52J76Q5k74rk0L70k45O0K44m94J38r6PK99l30
4094a62J93L3J28q3k96j0L76l23L59k80M93m12k36L04l0k40Q5N1J71j23n3M43
4116C88l52K09j8k58L1R9K69j94N6n1j80j25P6q0K42Mp0P8j42l9R0lL00l15L0
4141D5j6j67M24K10k06n31K62M3j00K03l63J89J95k32R4K96m18J21m44J76J15
4162a04J94k07n5L3q1J2K58J50k43L0N4k49J25j0K9q4J0M8K70l85J2K78N2j71
4186c4l95K80m0K7J69J58k83k7j1K09k78L26n7Q8K57l11n7k33N24k49j33K32M7
4209B09q8r2j9j90J88L30j99n1J6M8l2j51OK2K70K8k51J86l16M46j75R2j60J70
$$ plain form
4050 -263 -158 -395 26 -45 -244 -23 -295 130 209 154 7 -352 36 158 337 56 279 -95 -202 265 -120
4071 -120 30 -217 -2 61 -191 92 279 -73 103 188 -86 -95 -115 255 10 70 314 -180 -42 -138 -131 168 -162
4094 -162 31 64 192 109 -187 -197 179 -144 215 -65 428 16 -220 84 54 -186 -101 -50 121 -2 -55 388
4116 388 36 245 227 -31 0 99 368 174 230 179 -1 -126 -50 -130 112 116 46 124 -18 -57 33 30 330 15 45
4141 45 29 -138 286 496 290 -241 21 64 -36 167 -196 -7 188 -44 50 346 -72 49 -395 -219 -104
4162 -104 90 -117 -172 -139 -220 -208 50 200 -43 -13 41 -208 -83 -93 -64 -148 -138 -90 180 -205 -193 85 137 -34
4186 -34 -429 -149 -189 -162 7 165 -118 -145 -156 53 -225 101 44 132 389 78 21 -212 312 63 -70 162 209
4209 209 121 29 10 -180 8 338 139 88 104 152 120 -31 -25 -3 267 295 44 230 -86 360 185 277 117 287
4233B87o22M77q6k53M28k55o0L35l48L23k85J75L3l05L91k77L99n17J31L54l61
4254c6J41J71j67R9k44p1k9L4P4j56K68Qk17j52M93l10Mj05J22J8O0j23O8r7L57
4279B10k46J94l92J97J13l01Q2j01L96n04K84j18M9j01J13k9m8kJ24J4Q4o1m0
4302h3J28j30P4Q8q4N5j76l32N41l74K06j14J01j21J68o7M74m72oJ86k74o9K79
4325bJ54k14J4J14K48m86L44j9j66n7Q6n4j24J79j62L28kl3N2J21m40RL69p3R4
4350B80l00J70K09l48K8%N2q1L5j8Q5j64qL44k84J49j02J1K54m02L22L0r9k48
4374h5p9L33l6k5R7j06j0K1K26l77K51k74Q9P9L4j60K05q1j59J25j45P0K43n5
4398A81j95L74n43K41k94M93k61j38K92l1k00J97l85L78k01l6P9K36j15j44K08
$$ plain form
4233 287 -335 142 56 -197 231 -24 -84 251 -97 226 -59 116 149 -156 235 -42 357 -160 -29 325 -36
4254 -36 105 276 109 208 -36 -107 -136 -102 -28 -184 84 92 -125 -277 216 -94 -90 -195 -73 -55 5 -118 -50 -147 210
4279 210 -36 158 -234 -37 76 -225 -143 -244 152 -352 -68 -186 -137 -238 -125 -154 -202 -204 -80 -66 18 -43 -83
4302 -83 45 -85 -11 77 -7 48 -128 -460 81 -293 -87 -201 -100 -221 -53 -120 354 -118 -124 62 -212 -281 -2
4325 -2 152 -62 -48 66 314 -172 172 153 -13 -70 16 -38 -162 17 -145 183 181 148 200 321 -119 -110 259 186 280
4350 280 -20 150 359 11 39 39 91 10 45 27 112 -52 -60 284 0 149 47 58 312 -90 232 262 163 -85
4374 -85 -164 169 133 108 205 99 89 110 336 -41 210 -64 25 104 138 -22 183 102 -57 68 -77 -7 236 181
4398 181 -14 360 -183 58 -236 257 -4 -142 150 119 -81 116 -269 109 -92 -128 -49 187 72 -72 136
4419A36k11k12L52K2l1o0J23k88J11K04j63k03J00j41K4K51M5k30R9j32Q1j01
4441b24K26p6m4J8l75M42N6j56K93O6o9l22R4o7J98l38K48j90N04l80N1Rk14k7
4465b77L18J45k90J62JO3Q6j00j33K11j87K01r5k55K08O2k24O9K0R7L06k26k17
4488e5O1M6p5q7M00n11L32L57k82k17P8k4M8lo7J87j43p5J05j49J39j35M19k80
4512F9m7J25J50k33J11k45j8j78K61k34K81o2N7J9N7k01K46L6k37k68J94K3J59
4535F5o0j28R9m9l45J87J23L6K37k26q9J07P6J75j16qo1j8q7J09J17l31N0J92
4559E5l05J81j75J4M09q1l15K81q3l7L10q1l42L18m64K54R2L6j59j9J33k11L20
4582A31k14K82j48m5N0p4k1L0l25L47J83J97o14L19k90J47J06j04j13P3J5lJ82
$$ plain form
4419 136 -75 -287 65 87 56 -4 119 -169 -58 146 -17 -220 -120 -261 -237 14 59 -171 -72 -204 -123 -224
4441 -224 2 -74 -118 -100 -475 -33 23 -133 160 226 157 -165 -71 -138 60 -278 -30 -220 284 -96 -45 -36 -250 -277
4465 -277 41 186 -104 58 59 122 208 108 -25 186 -1 200 105 -150 58 120 -104 -35 -15 82 388 162 -55
4488 -55 6 52 -23 -110 290 -221 111 468 186 -31 47 23 71 68 1 188 45 -30 75 -74 65 -70 349 69
4512 69 22 147 297 64 175 -70 -88 -266 -5 -239 42 -20 37 56 113 -88 158 194 -43 -311 -117 -94 65
4535 65 5 -123 -24 -73 -418 -231 -108 -72 165 -61 -150 -43 33 208 92 84 23 5 -82 27 144 -187 -137 55
4559 55 -250 -69 -244 -230 179 98 -217 64 -19 -56 254 173 -169 149 -315 -61 31 67 -92 -111 22 -189 131
4582 131 -83 199 51 6 56 -18 -39 -9 -334 13 196 393 -221 98 -192 -45 61 -43 -156 -83 -68 -71 111
4605A11q9M2J11k91K44q8j62L25l6p4M3Q8l00K68N5k8j94p7J70j14J21j36kk7
4629d0J16J22k9m10K19LO5P3j90J06l4j14P3N9J70k8j32L7k1q0J64Mk4J78k86
4654AR6j82m2q2J16R4k26K07J93l73J62P7j14Ok2L6j45K04K54j19J75o08R7K31
4678C6j69K79k33P7o9J13m29N04l96J35rL30j45q6J12j78J87l75K57q2lo9O2j06
4702b57J18L58l52J06o1k16L37J24l40K04J03j36L7j36M6J70j02L06r3L4l68J64
4724D6l4J77m0j53P0j9l82K86j21L0J77N19o89N35k31k73J5J66l0j57K92m90L63
4747E7p1O1P9Q8k32K38k34J35k02J38J59m08Q4k50N03n2N3kk27N2n5J50k30J42
4771b4o5K86j96j65K73j70O0K31q6J7j48l5l53O30m06J62L7j58Q8j25L15j35J56
$$ plain form
4605 111 22 64 175 -116 128 40 -122 203 167 93 136 224 -76 192 247 219 25 -52 118 4 125 -11 -13 -40
4629 -40 76 198 169 -241 -22 -19 46 119 -71 35 1 -113 -40 19 189 161 29 66 45 -35 129 133 109 287 1
4654 1 97 -85 -127 -209 -93 1 -225 -18 175 -198 -36 41 -73 -67 -89 -53 -198 6 260 141 316 -292 -195 36
4678 36 -133 146 -87 -10 -79 34 -395 109 -287 -152 -161 169 24 -62 50 -128 59 -316 -59 -141 -144 -213 -151 -257
4702 -257 -139 219 -133 -27 -88 -304 33 157 -183 21 124 -12 25 -111 -65 105 3 309 216 250 -118 46
4724 46 12 189 149 -4 66 47 -335 -49 -170 -140 37 556 -133 402 171 -102 -87 79 49 -108 184 -306 57
4747 57 -14 47 126 214 -18 220 -14 121 -81 57 216 -192 -108 -358 145 93 146 144 -83 -31 -86 64 -166 -24
4771 -24 -89 197 1 -164 109 -61 -1 230 144 161 13 -22 -375 255 -151 11 48 -110 -22 -147 168 33 189
4794A89k59L85m95M26j94j93J2k09M27J29k11l01K18j12J45P1j39J74%k7j8j42
4816a24m3J0K5l5M05k88k10qJ30K33O9j67J77l56Mp0K60j58J81R0k92m0J66m8
4840h9P4J68l51L19mj35J18kO7j38J01j4k3J69l82L1j19M02k9j26r5l38L15j93
4864b74J33K30j10%J0K74l43J86J63m99L76p8k0k0j50M07j2m26r3M70j14l7J57
4887B30j72Oj05J77Q8k10K79l01l22M66rk11J11J76n0j89rr1j04R0oR0j5J25j4
4912C0j48M80l15k06L85j85j71j70j01K21J82k15L69k66j0J42Lm06L21r3K45j47
4934e5k7R7q5J65P5j10l3l05L79J75o39K94n5p2R6r2L19k08m3J85j13M4N4K6k01
4959a29P1j01L07p6m2P9J07m00K65j40K5j09o1M77m30j6N8j31J84k8j5K65j47
$$ plain form
4794 189 -70 315 -180 246 52 -141 -129 -338 89 218 7 -294 -76 -188 -43 28 -111 63 63 36 18 -124
4816 -124 -167 -157 -132 -167 238 -50 -260 -268 -138 95 164 -3 174 -182 -178 -248 12 -146 35 125 -167 -207 -41 -89
4840 -89 -15 153 -198 121 117 -18 100 98 165 27 128 114 91 260 -122 -91 -210 192 163 37 -58 -396 -81 -274
4864 -274 -141 89 -21 -21 -11 263 -80 106 269 -230 146 68 48 28 -122 285 273 -153 -246 224 110 73 230
4887 230 58 64 -41 136 224 14 293 -8 -330 136 127 -84 27 203 153 -36 -45 -136 -240 -150 -156 -66 -81 44 30
4912 30 -118 362 47 -159 226 41 -130 -300 -401 -180 2 -213 156 -110 -120 22 25 -381 -60 -153 92 -55
4934 -55 -82 15 -70 95 170 60 27 -278 101 276 -363 -69 -124 -196 -100 -192 127 -81 -124 61 -52 -8 46 72 -129
4959 -129 -58 -159 148 72 30 109 216 -184 81 -59 -34 -143 -204 273 -157 -173 -115 -246 -62 -90 -105 160 13
4982A3J9K37l02R6Q8j01q4J99k13L36j12k56J27J11m5p8j08Q3K10p3N3l38M06
5005B68J81p89N52k02L45k45k30K3J99n0j77K00K04j37k47K26l0j91j5J68M2j14
5027a9P4p3K69j65q6J58j99J79k69K33j07o8n6J40J23k16J38L87l60M7j41qK09
5050A90k76k3m2k5k9j9J94J8j33r6K02J39j66K36j49l6k47J85M1J78O8N7o5l77
5074a75K87Q3k40Q8o2N8P8J87j70j50J90j85L76m89K86K8k43J09j92J88j8L15
5096C49l66j68M13m35J38J11p2J96n16J14M69l06K8j65M2K26l3nl6Q0j80L86k73
5119cL55l37k40K14O6J49l2k04K53j55K5m15K92j01L29k24J2K40k93j31L00j0
5141I0j08M6k9l5L47k28k68K95qo6K38l58J44rp5J7j46K02R3k33M1q5j71J27K93
$$ plain form
4982 13 32 269 -33 63 151 50 -34 165 -48 288 176 -80 47 158 113 35 -73 10 220 147 200 -138 268
5005 268 449 -340 212 10 355 110 -120 -97 102 52 -125 75 279 142 -105 121 91 -100 -115 53 95 -19
5027 -19 55 -18 251 86 0 158 -41 138 -131 102 -5 -73 -129 11 134 -82 56 443 83 130 -11 -19 190
5050 190 -86 -109 -151 -176 -205 -224 -30 -12 -145 -241 -39 100 -66 170 21 -15 -262 -77 -36 142 210 267 202 -175
5074 -175 112 195 -45 43 -19 39 117 304 134 -16 174 -11 365 -124 162 190 -53 56 -136 52 34 349
5096 349 -17 -185 228 -207 -69 42 -30 166 -350 -236 233 -73 -45 -210 -168 58 25 20 -16 64 -116 270 -3
5119 -3 352 15 -225 -11 55 204 172 -32 221 66 91 -324 -32 -133 196 -28 -16 224 -69 -200 100 90
5141 90 -18 28 -1 -36 311 83 -185 110 102 36 274 -84 60 51 -24 -7 -153 49 142 -91 -50 -135 -306 -179 114
5166A14K18k44k4l0OM01m50L9J94J17n47M02k89k2K5n4J2j63L39J7J2l03J85L43
5190B98k50k56K44O6m34K54J53l94K58PJ8j02K20l21L39j74j21J21j12J14N5J33
5212A16l2J08m76M75j96j26J04J30j55j67O0J51j01j42M98j69r2N2L10m47J8N8
5234b3q0J66J54J10j99j28o2J11k7J1j68l6L10l38N20n1l16p8J20o0J21J14j34
5257C7k83J38K94j38m15L83O7K50j27j1p6Q2j09p4J14Q2j16k39K89j02q8J24K32
5280C14k85j10M47j16k95pR9k34Q1K37j14n7k5L45l65j06K23l27K98J08n4k25
5302a68J65pM8J4l37K62J00J00j64p2K5qJ06j70J49ok29L49k47N6P2q8J18j06
5326c8K17l44J69j15J46Q7l75J31M04k89k22L43k14JJJ29L2o6k21q0N88m27J90
$$ plain form
5166 114 332 88 64 34 40 441 -9 30 224 341 -206 196 -93 -115 -90 -144 -132 -295 44 61 73 -230 -45 298
5190 298 48 -208 36 102 -332 -78 75 -319 -61 -54 -36 -138 82 -239 100 -74 -195 -74 -186 -72 -17 116
5212 116 84 192 -284 191 -5 -131 -27 103 -52 -219 -159 -8 -109 -251 247 78 -14 38 348 -99 -81 -23
5234 -23 -103 63 217 327 128 0 -62 49 22 33 -135 -171 139 -199 321 270 -46 -124 -4 -64 57 171 37
5257 37 -246 -108 186 48 -367 16 83 333 206 195 119 201 92 18 132 214 98 -141 148 46 -42 82 314
5280 314 29 -81 366 250 -45 -52 47 -187 -106 131 17 -40 -65 280 -85 -191 32 -295 3 111 57 -168
5302 -168 -3 -10 38 52 -285 -23 77 177 13 -59 -34 -42 64 -106 43 37 -192 157 -90 -34 38 -50 68 -38
5326 -38 179 -165 4 -111 35 122 -253 -122 282 -7 -229 114 -100 -99 -98 31 63 -3 -224 -304 284 -143 47
5349D7j69K8J88l6j41K14Ok09P9J59j67j17M63m74J40P2k0q7J60qo3m8R3jn17
5374d08M02k84L51NN1m8q8J81j5p1Q6q6k31N50l25K1j3j28J10P7j0M1r0K0J72
5399B70Om88k5K70L13m68J45O3J90l05q0M97k27JL8j6k36L8J89k41j64J13J65
5422D8l0Q8O9j52N7j02M1J16j41j54J01Lk40L31j59Q9l2K23j57J16J06j61j71
5445a11K8j87L0J76K53J1j81oR6jR0j88j31K61n40N89j06l37K5N46k57k81K29
5468Hp9J55j47k1k31M95l8l96L56j69k10M9K99J64m36L24j16j97J7k5L58k54P1
5491b3K02k92J50J48j71j83K22J46k18l3q0M03j90N0J18k17k02J51M2J97J04m28
5513a04j25J49j1J18J96k84L28m27M27k64j84J65K7Q6j82P3r4L19k29m9J46J31
$$ plain form
5349 47 -122 -94 94 58 -83 131 137 -72 7 166 -1 -118 345 -129 11 83 63 -24 136 128 65 17 110 109 -408
5374 -408 -6 -290 61 66 117 69 -19 162 147 76 162 76 -155 395 70 91 78 -50 60 137 127 168 78 98 270
5399 270 276 -212 -237 33 346 -122 23 86 276 -29 -109 388 161 162 200 184 -52 -14 175 -66 -230 -117 48
5422 48 18 106 175 23 80 -22 19 135 -6 -160 -59 -56 -296 35 -124 -35 -67 156 -1 115 221 60 -111
5445 -111 -83 -270 -240 -64 189 200 19 13 109 108 198 10 -121 140 -400 189 83 -254 -229 317 60 -221 8
5468 8 -71 84 -63 -84 -315 180 142 -254 102 -67 -277 -228 71 235 -201 123 7 -190 -173 -198 160 -94 -23
5491 -23 179 -113 37 185 14 -169 53 199 -19 -52 -132 271 81 131 249 32 -170 -19 23 220 324 -104
5513 -104 -229 -80 -91 27 223 -61 267 -160 267 3 -181 -16 11 97 -85 -12 -106 213 -16 -65 81 212
5535B12j41K79o41L15L38k96R3l24L46j11n2J80k90K33R6j96K61m07J84Om0j34
5557h9K02j88K62j39k67K51p8K15k28n1l4J70q9J8P3k06L4k22J74M30j46K05m14
5580a17rJ53PJ63j67l46O0L02P0k22O8k69J55K14J86p7k16j82L48j97L3j6j23
5603a82L13j67m1n1J73nR7k30J72q6k37K24q1J93jJ97l51k4O1l17M83k10M1j20
5627a49L06l22K88k12O0J30Pl05K06m3K39j98j11P0J31j05nK67j82j7o3%k82M49
5651A59M2n9j33O7R7r0k17L9K39k82R1P4o7K26n3m6K73m94k7j04L53m4M4K57j59
5676A86j89j0O4l8J2J21k00N7j60N3J22k64L36m04N04l0n6j89J17j20l6J0K80
5699A66k83L9m4j68P9L62k33K79k39L1j01n3J99J29j80J28j86j06O1J53m3j37
$$ plain form
5535 212 71 350 -291 24 362 66 159 -165 181 70 18 198 -92 141 237 41 302 -105 79 85 45 -89
5557 -89 113 -75 187 48 -219 32 -46 169 -59 -110 -144 26 -63 -45 28 -178 -144 -366 -192 238 92 297 -117
5580 -117 -126 27 34 197 30 -316 -256 46 116 -106 -38 -307 -152 62 248 171 -45 -227 121 -76 -43 -59 -182
5603 -182 131 -36 -77 -128 45 40 137 -93 79 -7 -244 -20 -101 92 91 288 -63 -87 -26 -343 140 -70 -29 -149
5627 -149 157 -165 123 -89 -29 101 108 -197 9 -34 205 7 -104 -34 97 -8 -13 254 72 55 -8 -8 -290 159
5651 159 201 142 9 76 173 83 -134 -95 144 -138 -47 27 -40 186 133 87 360 -134 -161 -265 88 44 88 345 186
5676 186 -3 -13 51 13 25 146 -54 3 -157 -104 18 -246 90 -314 190 160 104 -85 32 -88 -124 -114 166
5699 166 -117 -78 -122 -290 -211 151 -82 197 -42 -11 -112 -165 34 163 -17 111 -75 -181 -120 33 -10 -147
5721a47J82RP2j03L6l9M6l48K20J23J45j72M03l77K80n30L45R6j17m25m5K57M1
5744d8J54l12K82J12j80j89j0L55J4Lm91K95J40l5P8J02l21K62p7k91J63J8L61
5767C85j01l74N7J20N8l76K74j08K92k04J54j90J19L6r7k14j59K86j90L34Q7j65
5789B4j13J06N2j6r3J84j86j79J13K58L7k65M26j06o2k05j13L20m69N15j65k08
5811a45J88j62p7r2K05N7j74j98K91o9L7R8j1n4k13M56k86L19n92M30k08J2K60
5834G2j08J65k15k3k40L80J08p1M8m73M27o7l11M79k39J76k40n5p8nJ15J65n1
5857d1K05k28K79l13q6L47N7j50j26j34K89j33r5J37L2n3K5o6K78J0j33j01k94
5880b94K60OP7m9jR7m2J69j56K48l95K96j30PN5j50j7j9J05j72K52R8l25m6j13
$$ plain form
5721 -147 35 44 116 13 49 10 56 -292 -72 51 196 24 427 50 330 -200 145 241 124 -301 -346 -89 -48
5744 -48 106 -206 76 188 8 -181 -191 164 178 181 -310 -15 125 90 168 270 -51 211 134 -157 6 24 385
5767 385 284 -90 -33 87 145 -231 43 -65 227 23 177 -13 106 142 45 -169 -328 -42 -232 102 189 24
5789 24 -89 17 69 53 -40 144 -42 -221 -108 150 187 -78 348 242 180 -25 -138 182 -287 228 63 -145
5811 -145 43 -119 -196 -288 -83 -26 -200 -398 -107 -176 -139 -41 -52 -106 -319 137 -149 170 -422 8 -200 -188 72
5834 72 -36 129 -86 -109 -349 31 139 68 116 -357 70 3 -308 171 -68 108 -132 -187 -265 -270 -155 10 -41
5857 -41 164 -64 215 -98 -184 163 220 70 -56 -190 99 -34 -129 8 40 -13 12 -54 224 234 101 0 -294
5880 -294 -34 -28 49 0 -1 96 54 223 67 315 -80 216 86 93 148 -2 -19 -38 67 -105 147 245 -80 -126 -239
5905b39L62k36n9M3J95k90J78o4OJ14m4J73J75k95J29k22p0J14J35k60J95r2K51
5928A99k13j04l2P5J2q3K4K2j33J20lP4K4M3LJ53k09L21l21k7l6J16p2j3k11P4
5954a97K53k75K93l0J2j25J8j16j4K1Q0l2j00MM16j87j58M6L48k88K42j28k52
5977a69L03j41n9J1J81p4r2R2l59M44K38n04J45l9k63K85J65M2o37K73M38j38
5999A42j20k33K3K63J1j78J16j13n8J63K73m51L34j96m7LJ09M0o1k38J82j28M69
6022C05j79J48l20J62j45k31K63Q5K2j15O4m5J42k84J12J33k94J38J69j94J57
6043I3o8L7l8k36O1J82N3o5p7J1KJ9j5l6R9N1Qm4j25R3j41k28L12k6K18l15O8
6070a07QP9K8j63J94m28K74J97m1l51L24QoJ35m81J45J97j5l02L15N9m45K75K98
$$ plain form
5905 -239 123 -113 -172 -129 66 -224 -46 -110 -104 10 -34 139 314 19 148 -74 -144 -30 105 -155 40 -52 199
5928 199 -14 -118 -150 -75 -63 -146 -122 -100 -233 -113 -116 -42 -18 25 28 181 -28 293 -28 -55 -91 25 -47 -60 -271 -197
5954 -197 56 -219 74 44 56 -69 -51 -167 -181 -160 -80 -112 -212 -208 208 21 -137 -91 257 -31 211 83 -169
5977 -169 134 -7 -66 -55 126 52 -40 52 -307 137 375 -129 16 -23 -286 -1 164 206 -431 -158 280 142
5999 142 22 -211 -188 75 86 -92 24 -89 -147 16 289 -162 172 -24 -71 -68 41 81 20 -218 -36 -164 305
6022 305 126 274 -46 116 -29 -260 3 88 110 -5 59 14 156 -128 -16 117 -177 -39 130 -64 93
6043 93 25 62 24 -212 -151 31 84 19 -58 -47 -45 -26 -41 -77 22 73 81 37 -88 5 -136 -364 -52 -78 140 -175 -107
6070 -107 -99 -20 8 -155 39 -389 -115 82 41 -310 14 22 16 151 -330 -185 12 -3 -305 10 69 -376 -101 197
6094A97k51j08N9J62j0k20J82K11k8m02M25o9l01J29j35L37J5j47L35m14oj2l3
6117h4pL12j36J34k11j66K28P5q2r6R3j79J26K45k89L7%m9J4K31l95J64K13O3
6141B41m22J20J62r3J60k48j59K48J92k61K92m6k22l6K05j88J83m7K0n7j84L56
6163B16P8k68J28p0NL3o1k17M25k39m0K57m09M85j59K5j62Q8%j01N7J03k27L2
6187b1o0K28k6k69L8K46k90K67k33k4J42P3L61n68P9J06O8j78m3o0K0L02l18p
6211a67J73k52L91k40O0J01j39J69j89N9J25q0l3J78k52J93J3k18J84k45J35m4
6233g8P9J7j33J65k50L39n7L1R8j0Pk02L2J29j33k0j59O4J11l16K84R4j60j08
6257a76L40J09N6m14K17j48J74K15n60K84L7R7j70j1q9J3r4R1J15j23K86K0j0
$$ plain form
6094 197 -54 -162 -103 59 49 -171 11 222 194 -208 217 148 -153 -24 -159 178 193 46 381 -33 -39 -51 -84
6117 -84 -91 221 85 219 8 -158 70 145 63 -33 60 -119 7 252 -37 0 0 -49 -35 196 -199 -35 178 241
6141 241 -181 -61 101 8 168 -80 -239 9 201 -60 232 186 -36 -72 133 -55 128 81 101 44 -140 216
6163 216 294 26 154 84 89 122 61 -156 269 30 -10 247 -162 323 164 189 27 115 115 14 71 174 -53 -21
6187 -21 -81 147 121 -148 -110 136 -154 113 -120 -144 -2 71 432 -136 -57 49 117 -61 -104 -164 -144 158 -160 -167
6211 -167 6 -246 145 -95 -35 66 -73 96 -93 -34 91 11 -22 156 -96 97 110 -108 76 -169 -34 -78
6233 -78 1 18 -115 50 -200 139 82 113 211 201 208 6 38 167 34 14 -145 -81 30 -286 -2 92 -68 -176
6257 -176 164 273 329 -85 132 -16 158 373 -187 97 134 231 61 50 -39 -26 -120 -29 86 -37 249 269 259
6280B59n5j65l22K44K31k17J67l4L16l94p1k48N10k42L7J2J93j28k67L32k81J31
6302HJ66j48j56J61J95m42L40P7j85J08J60l47P2NJ26L35l13p6K8m41J97L70j76
6325F4j78j7M5L07m43J25l1o0K83r9O6J85l6j58N7l0l68L53M7j71K48m23M63q6
6349A43k28j20K55j15O2P4K87l60j59j45L13J00j11J5Jp3J08j85M6J54L3j5L06
6372C86k21q5J41jL2k37J17n5j16N3J39m3m7m02L05Q7K02k75j31K05j05L8P7K01
6396B65j88j06J13k46J90j85k61N84J67l42J10j07K6K00j00j64O6J32j16k03K50
6417H5m6l10N00l8p5n2j57L93q6n68J63J29L33j73j69K66m6j03k46K12p4K95j26
6440A07jK25l44R5j01J85l40K57K68j3k86r9K37k76O9q8P0J02K30n1l96j65K62
$$ plain form
6280 259 204 39 -283 -39 192 -25 142 108 424 30 -41 -289 221 -21 16 28 221 93 -174 158 -123 8
6302 8 174 26 -130 31 226 -216 124 201 16 124 284 -63 9 14 140 475 162 86 114 -327 -130 240 64
6325 64 -114 -131 -86 221 -222 -97 -128 -188 95 -4 62 247 211 53 110 80 -288 65 112 -59 189 -234 229 143
6349 143 -85 -205 50 -65 -3 71 358 -2 -161 -306 7 107 -4 11 12 -61 47 -138 -92 62 95 80 386
6372 386 165 80 221 220 252 15 132 77 -39 14 153 110 63 -339 -34 53 255 -20 -151 54 -51 -13 64 265
6396 265 77 -29 84 -162 28 -157 -418 166 333 -9 101 -6 20 220 120 -44 22 154 38 -165 85
6417 85 39 -271 229 191 116 64 -93 300 214 -354 -191 -62 271 98 -71 195 149 46 -200 12 -62 233 107
6440 107 106 331 -13 82 -19 166 -174 83 351 338 52 -47 190 -86 -17 -105 -35 67 297 246 -150 -315 -53
6463e3L9j55J71L5M7K28o07M74k86K7L62m94J87J55Q1j40k05q9L00j01k28J78
6485g4q7J42K02k79R0K6k53K00k47L8R9J33j49L73j05l8j7k36J83J36p6K05l32
6508f6lm8N26k91q7j92j9J61J71Nk09K59k94J68P6l98M48l17J09J23JoJ92j66
6532A43L0K07l73L9K04k03P8J8m31M88l07k35M20o0j26K60n6q8J50j22j26J82
6554I2K66n0J89n86j61J53r3K69j18J07j20K7K8N9l43M40j85op6j04j75L56n1
6577h2Q5R5l20M21j41n29K43N8N1N4K76j66n2R1j70O8o7o5L37l7j05r9j1j01L14
6602A48l43J69K25l17r6K99l54J07nJ71J90k82N1l4j78L34l60K06J26j38r5J4
6624a62K19j40j21J68o8R6O9J83l80J41n7K10M2k21k3j11K25j98J45K75k26j28
$$ plain form
6463 -53 -14 -169 2 37 84 312 -295 179 -107 -80 282 -212 -25 130 211 71 -134 -223 77 -24 -252 -74
6485 -74 -161 -19 183 -96 -6 20 -233 -33 -280 -242 -143 -10 -159 214 109 71 54 -182 1 137 61 266 -66
6508 -66 -69 -117 409 118 31 -161 -180 -19 152 157 -52 207 -87 81 157 -241 207 -110 -1 122 123 117 309 143
6532 143 173 380 7 46 250 47 125 143 -288 200 -107 -342 78 18 -108 152 96 8 158 36 -90 92
6554 92 358 308 497 -89 -250 -97 -190 79 -39 68 -52 -25 3 62 -281 159 -26 -32 -108 -212 -387 -31 -82
6577 -82 3 98 -222 199 58 -471 -228 -170 -119 -65 211 45 -7 84 -86 -18 -85 -150 187 150 45 -54 -65 -166 148
6602 148 -195 -26 199 -118 -214 85 -269 -162 -167 4 194 -88 -37 -71 -249 85 -275 -69 57 -81 -176 -162
6624 -162 57 -83 -204 -36 -104 -8 61 244 -136 5 -52 158 200 -21 -44 -155 70 -128 17 292 66 -62
6646f2K8J77J91l65P3k78J77lmK22J89k77m8J45N5m1o7J44j73L86o11j20J71L59
6670B68l45M5j03M23j27j51R2q5j50K29j20M0l44O6L83nq3L9r0J95j21k40K39
6693E5m49J74K93k83M16J0k40K25k49J26M4k95J98L0j16O4n3PK12l63o0L76m3
6716G9j5k09P2J76k68J38m4J17k44J28Rj04L29lk91m0R2o5J68j09J55J02k60J15
6740B8J22j55q5K88k40k8j3l1j9J99q0j19J95J78l64j42M03o2j15m8K53k01J59
6763A23k71K43k33J23J2j21J69k24J16O6J99k49j80J9K96J21k54k26J07K61J95
6784B92l08N45l90R0k10N4l67J85K49jm88K95J79j40k5O2k7R6l69O04k24kl46
6807b46L67J5k92J89m3j67K16l75L30K27lk66J98j12j72K35k40J66Q5j7p5J79
$$ plain form
6646 -62 -34 143 334 -31 42 -236 -59 -62 -66 156 345 68 20 165 220 179 112 256 83 469 -142 -262 -91 268
6670 268 -77 -32 -135 288 161 10 102 17 -133 96 -24 16 -328 -262 121 116 33 72 -18 177 56 -184 55
6693 55 -394 -220 73 -210 206 216 -24 201 -48 78 122 -173 25 55 -61 3 -50 -43 169 -194 -254 122 79
6716 79 64 -145 -73 103 -165 -27 -71 46 -198 -70 -61 -165 164 161 -130 -170 -78 -143 25 -84 71 173 -87 28
6740 28 150 -5 -90 198 -42 -70 -83 -114 -133 66 -14 -133 62 240 -124 -266 137 75 -40 -88 165 -36 123
6763 123 -148 95 -138 -15 -3 -124 45 -179 -63 3 202 -47 -227 -208 88 209 -45 -271 -164 97 292
6784 292 -16 529 139 229 19 73 -294 -109 140 139 -349 -54 125 -15 -40 22 -5 91 -278 326 102 100 -246
6807 -246 121 136 -156 33 -10 -177 39 -336 -6 221 218 -48 150 38 -134 101 -139 27 112 95 20 199
6829A99m05L60k90M52k22j68K4p2J74j55K25k05J51k3l34Q6J77J06k14K09j11
6850c6J78j81M7m8J49j25P6o5k44K61r6L79m01P8L09k65j05n2J91K08q1r5j04
6873b2J90k61M11m81K8J27j81J27J28j98J23l08K47K24oM6j37n0k83J98N4ml47
6896c75M39J24o8L1j91J54m0k11J91J70l25R7K48r1R4k22K6J89k38Nm9N2K48m51
6920a93R4R4N6P3n2k2k54j1K20Q8j71o6K98J63n8l39R0r6o8K52m32L36l29M02
6944G5j76Q2j55P2Q4K43k79J33r1k36M20j60j6j50J45o1J65k11K02q0m4K05k43
6967g6L7k06k1K05p2P5n2K32j17L08k46p8R5j89k7o2O1K88j25j00L0J02l07k67
6991e12M22j60K0K85r9k46J70K34K9K3k79J7k51K99J89j67K00j14j82J49k0k03
$$ plain form
6829 199 -206 154 -136 316 94 -74 -50 -122 52 -103 122 -83 68 45 -289 -203 -26 80 -134 75 -36
6850 -36 142 -39 8 -40 109 -16 60 -5 -249 12 -84 295 -106 -28 281 16 -89 -141 50 258 177 82 -22
6873 -22 168 -93 318 -163 -135 -8 -189 -62 66 -132 -9 -317 -70 154 148 194 57 7 -276 -78 -24 -28 -375
6896 -375 64 188 120 151 -40 114 74 -137 54 224 -101 -4 244 153 247 25 51 240 2 7 -42 10 258 -193
6920 -193 -99 -5 51 124 72 50 -204 -215 5 93 -78 -144 154 317 259 -80 10 -86 -154 98 -334 2 -327 75
6944 75 -101 -19 -174 -102 -18 225 -54 79 -12 -248 172 12 -4 -154 -9 -70 95 -116 86 6 -38 167 -76
6967 -76 -39 -245 -266 -61 -133 -58 -110 122 5 313 67 -11 84 -105 -132 -194 -133 155 30 -70 -40 62 -245 -512
6991 -512 -90 -250 -230 55 -44 -290 -120 114 143 166 -113 -96 -347 -48 141 -26 174 60 -122 27 7 -196
7013a96M6Q3P4jK15j41k06M33n33J89J09J18j59j39J8K40l05J58K42l36L6M0K05
7036A90k03K61j06k41K18J31j14j12L0j50J1K94j45P8l69J0K49k18K54n7j72L32
7058A71P5j79L73m72Mm9K33q8N3j91J38j73K95l23J17J18j99n8K25p7J3j96J84
7081fJ95j11j68k2J87l20K83ok27K96j20J50l99K19K14k16k85M43L4l07J49j12
7103a29J73k24J31j90J06K16L1m1l07J34K79m37L98l82L57k90J50R5jj06J36l45
7125b46M41j1k14K36j46r1o1j5p6L06k77J37L11j62l11L20j48K56k26j13L22l88
7147a56J76j15J26QM9J64j72k76K37j5J14jl06P0K93j83K27k93K8L40j02k79k1
7170h7J62k04q2J02L10k43J35j19l7J76j4J10j65k58J79K87l20K77k73L1Q8n8
$$ plain form
7013 -196 -150 -67 7 6 221 80 -126 307 -226 -37 72 190 31 -108 -90 150 -155 3 245 -91 -55 -15 190
7036 190 -13 248 142 -99 119 250 136 24 54 -96 -85 209 64 142 -227 -217 32 -186 68 11 -161 171
7058 171 246 67 440 -32 -28 -77 156 68 121 -70 68 -105 190 -133 -16 102 -97 -155 70 -7 6 -190 -6
7081 -6 189 78 -90 -112 75 -245 38 32 -195 101 -19 131 -268 -49 165 -51 -336 107 141 -166 -17 -129
7103 -129 44 -180 -49 -239 -133 83 114 73 -234 -100 179 -258 140 -242 115 -175 -25 70 69 -37 99 -246
7125 -246 195 184 -30 206 60 -31 -92 -107 -183 123 -154 -17 294 132 -179 141 -7 249 23 -90 232 -156
7147 -156 20 -95 31 39 88 252 80 -196 41 26 140 139 -167 -97 196 13 240 -53 -25 315 213 -66 -87
7170 -87 75 -129 -211 -109 201 -42 93 -26 -63 113 99 209 44 -214 -35 252 -68 209 -64 -33 55 -3
7192cL25k93n5q8r8R5J98K6J35k03l87K52J71on8J58l5K2l43J68J9l7k69L3K09
7217f4j84L39l7n8r6J01k51K89m8J6j51K64O0k28l5K38k89r4K89l66J98M9O6m6
7241c8j66J16k14J61J62K97l78Q9l6j62M05k01j83L64k43k14L99k6kk46L58l80
7263a38ln0K90M4J02l37K27o3P0l6k32L16k12J55j43K82k25p2J10j04J52l55L50
7286A28m47K55j18N56k74J59l04j32L71k64K06M3O2l99k4K71p9R3k94K85J67k29
7308C2J43j8j23j49K71p3J78k89Q8Rm3k08J62L2P%O2p1L4j55j18K66k22K96q5
7333B6j07J30R0J32k28k06L54k37k80M81m62K05k91L7N55J54l03L3P3r1m3%r2
7356g0J20P0j99k31K23mJ71k18q5L97l71j55J02L89k88K11j48j83M66l15J88k00
$$ plain form
7192 -3 322 29 -26 -114 -212 -117 81 107 242 39 -348 -96 75 69 11 169 134 156 -187 -19 0 -37 -306 -273 -64
7217 -64 -248 91 54 -4 -100 1 -250 39 -9 7 -144 120 180 -48 -83 155 -134 -228 61 -305 -107 -58 8 -38
7241 -38 -204 -88 -302 -141 21 318 -60 29 -7 -169 236 35 -148 216 -27 -241 158 132 130 -116 242 -138
7263 -138 -141 -191 99 143 245 -92 135 72 142 106 -126 190 -22 133 -10 272 47 -25 85 -19 133 -222 128
7286 128 -319 -64 -182 374 100 259 -45 -177 194 -70 136 179 241 -158 -182 89 10 103 -191 94 261 32
7308 32 175 157 34 -115 156 83 261 -28 60 69 26 -182 -20 12 19 19 81 10 44 -111 -229 37 -185 111 26
7333 26 -81 49 139 271 43 -163 191 -46 -326 155 -307 -102 -393 -356 199 353 50 83 156 65 22 22 -70
7356 -70 50 120 -79 -310 -87 -91 80 -138 -223 174 -197 -352 -250 139 -149 62 -86 -269 197 -118 70 -130
7378a30L2K06m36M78l27K29l15O0J71N3k14K8J97L8km4j1Q4o0J57j88l83L43N9
7402B5k32M8J9L9J12J03j76j48J97J77j98J32k6M5l61J42M2J33q4n2J4R4RQ4j37
7427AJ28j37J31j65k09L95l13j07M34J51n37L67j97J53k00K67l9j31j30K0q8J09
7449i7Q0k2k5j13M29k03J97l38M05k02j48K27m3k83K4J0J85K5k8k62J54r0r5K22
7473IQ0j73J05k45O2P4q6M02m99J74l7K07M9j70P6m3K52L6k81j30J94N5J08n76
7497c57M41J5l03L15k76o0J49q8J24L2m26N95o9k05l08O07j17j84J24q3J06P7
7519A09l51J3L55j50J89j90K2N1kJ68l01j29L31j11k8k82N62k00j23j20R7L76
7541B86k56q9Q4j18J23j55J35j27J29m23N82k62K47l44J15L12j88j46k2J48O6
$$ plain form
7378 -130 -98 108 -328 150 -177 52 -263 -203 -32 21 -193 -165 32 70 68 24 13 97 37 194 6 -377 -34 25
7402 25 -207 -159 -140 -101 11 114 -62 -210 -13 164 -34 98 72 117 -244 -102 -60 73 -11 -63 -49 45 54 138 1
7427 1 129 -8 123 -42 -251 144 -169 -276 158 309 -228 139 -58 95 -105 162 123 -8 -138 -118 -206 -97
7449 -97 -17 -39 -64 -177 252 49 246 -92 313 111 -37 190 147 -136 -112 -102 83 108 80 -182 -28 -118 -213 9
7473 9 89 -84 21 -224 -162 -88 -174 228 -271 -97 -134 73 122 -48 28 -15 237 273 -8 -138 56 111 219 -357
7497 -357 84 99 -204 111 -165 -225 -76 -164 -40 -8 -434 161 92 -113 -421 186 69 -115 9 -74 32 109
7519 109 -242 -229 126 -24 165 -25 -3 48 46 214 -87 -216 115 4 -24 -306 256 56 -67 -187 -90 286
7541 286 30 -59 25 -93 30 -125 10 -117 12 -411 171 -91 156 -188 -73 239 51 -95 -117 31 97
7562I7j18RJ15J2k86J27K60j76k55L84j01K3k34J61m7K26Oj62J29p8L03k65j81
7585e1L31l65k7k36N31J38l19K17p1%l6j70J6j46J49J77l31K05J33p5m03K19o5
7608a79J94K22J77l52oj2l4R9k32j46K61J64Pk83J87J7j96p2j7J27j70K66Q6n30
7632d22P35k95Pl2j07J19M2k53q7M49l93N03m29k39L50n3N7k02K33o0O9MK38j20
7656A14m17L24r0J22k0j5P1m5pJ73j11j55J30j53P5o7J32M5j30J33l4r9O9j40
7680i5pl5J37NQK00J16l31k78J72k5J83J10p0J08j30J3n2O3J20j20o6o7j21j53
7705c15J33L98l45L0K27k44J3L14j95K7J18j81Q4r9p3M51n69L89k12q5K56R8j74
7728D6k66K74P8m94L60k37J20J60M5j37K92k84J62k06R8J6j1n4K19l41O1jJ14
$$ plain form
7562 97 -21 -12 103 115 -171 -44 216 40 -215 169 68 91 -143 18 -29 197 203 41 170 92 395 130 -51
7585 -51 280 -85 -112 -348 183 321 2 219 148 148 112 -58 -42 -188 -39 138 -193 12 145 70 -333 -114 -179
7608 -179 15 237 414 62 56 44 10 109 -123 -269 -8 156 163 -120 67 84 -112 -184 -201 -74 -244 22 108 -422
7632 -422 313 18 25 -7 -114 5 47 -206 -293 156 -237 266 -163 -402 -52 -105 -48 -250 -17 -77 -8 -4 234 114
7656 114 -303 21 -69 53 33 18 89 44 37 210 99 -56 74 -79 -4 -71 61 106 -24 109 75 -24 45 -95
7680 -95 -102 -137 0 5 13 213 329 -2 -280 -108 -133 50 160 90 198 68 81 29 92 212 92 26 -41 -162 -315
7705 -315 -182 216 -129 -99 128 -116 -103 211 16 43 161 -20 64 -35 -108 343 -226 163 -49 -134 122 220 46
7728 46 -220 54 132 -362 -2 -239 -119 41 86 -51 241 -43 119 -87 11 27 16 -38 181 -160 -99 -100 14
7751A4j63K98j47k67L41P5j42o0j48M2K88l29J27j47K17o5K64k05j11K16k89K62
7773G1k60Q4J00L3O0l98N25j27k83N76n64P5K97j87j13K68k15j47k5J72O8m21
7795d11M04N3j39L2q0R0k27J63k27L08O7Q1L3k91P04l27k77kQ7L59l96M6o9j3
7819c2K4K14k65O6J51j5k97K25o2J58j60L59n79R0L86k21R9l58o1K35J99j43j05
7842i2j24J78J69J6l8k9j0q1j24J19j59J77k53J10j75M54J24l56L4M5J34j94O9
7865fj3K32m22L63k18Q2J58qj41m0J11n52O67j08R4l43oJ33O6J02l7lk27J28j5
7890cJ39l38K58k05J93m3N3j78J19K2q4j45j07L08l0K48k01j47JM3j1o7o1N82
7914C46m83L48k83K32k27r0J16J97m99N01l28L54k79j34L35q0Ok78M08k85J46
$$ plain form
7751 14 -149 149 2 -265 76 151 9 -51 -199 -157 131 -198 -71 -218 -1 -66 198 -7 -118 98 -191 71
7773 71 -189 -105 -5 28 88 -310 215 88 -195 381 -183 -108 189 2 -111 157 -58 -205 -230 -58 10 -411
7795 -411 -7 46 -93 -61 -141 -51 -278 -115 -342 -34 33 114 147 -144 560 233 -44 -46 41 400 4 50 -19 -32
7819 -32 -8 206 -59 7 158 143 -154 71 9 167 7 366 -213 -123 263 42 141 -217 -278 -43 156 13 -92
7842 -92 -216 -38 131 147 109 80 70 -11 -135 -16 -175 2 -251 -141 -316 138 262 -94 -60 -15 119 -75 -6
7865 -6 -19 213 -209 154 -64 18 176 168 27 -13 98 -454 213 105 199 -144 -150 -17 49 151 114 111 -116 12 -3
7890 -3 136 -202 56 -149 44 1 54 -124 -5 17 -67 -212 -319 -11 -41 207 6 -141 -140 -97 -108 -175 -236 346
7914 346 -137 211 -72 160 -67 -157 -41 156 -343 158 -170 184 -95 -229 106 26 32 -246 162 -123 23
7935B3k29J23J83j7J51k94k20L6P9K34j70J94nj90K92k64K64l65J39l1L7j9l7
7958h6M05k58l6J5ol72K97p7Q0Q1J81k03p4K5j64M12l39P0K32k23J84N1j06l78
7982b89K35J79k33N6N3j79L92j71j6o1p7K79k56n4J46K8l04N20j26k97M1K68j88
8005e4P6J03k38K44L2l87L15k9j4j47J6j94L52L6r8J03j30j29j2J83P1k82K44
8028F1j99J49N1J25k40O2j13k50J89L10J25j33J03p0o4k78K43R5j40K30k6k40
8050a0OR5J6m27N67N4m67L37k94J28k02K02J55k71J07P3r5J84n1J5Pq3J6J47m35
8075b26K88k8j80O8J2L96l82L13j16k18K08j14J09l81K45o6JKK99j72k49J71l79
8098c99M58j72M26n46L03j58J48K09j74J15j60pl38K21O4K0k58K66j1P3K2j93
$$ plain form
7935 23 -206 -83 100 83 234 -60 -280 -244 -165 69 -101 93 88 -102 190 -74 190 -175 -36 -67 -30 -49 -86
7958 -86 319 61 25 40 34 -338 -41 -118 -38 43 224 21 -53 -28 -192 220 -119 -49 183 -40 144 195 89 -289
7982 -289 -54 125 -108 -52 1 -178 214 43 27 -34 -111 168 -88 -142 4 32 -272 248 122 -175 -134 134 -54
8005 -54 22 125 -113 131 163 -224 91 62 48 -99 -83 -277 75 111 13 116 -14 -143 -155 28 99 -183 61
8028 61 -138 11 62 187 -53 9 -104 -354 -165 145 270 137 240 170 106 -172 71 166 26 256 230 -10
8050 -10 -4 91 107 -320 247 301 -166 171 -123 5 -197 5 160 -111 -4 69 -26 158 107 122 129 46 62 209 -226
8075 -226 62 34 -146 -78 -66 330 -52 261 145 -73 135 21 130 -251 -6 -72 -71 -69 230 58 -191 -20 -399
8098 -399 59 -113 313 -233 70 -88 60 269 95 210 50 43 -295 -74 -10 10 -248 18 7 80 102 -91
8120i1J47K41k06P6k75J67K6j60J92j5K1j85K09L6j78r3R4r5O0K7j90Q7j39r1
8144c35K20J64K8l64L11M5l3j42L69j57j84J02m5o9rK0Q2k45J10M4J24J51k58
8167g1o2L97j20q3k67O9M01l19L56m48m2j3J66m3L36l09J91K1k47r7J66p1K86
8190A97k88
$$ plain form
8120 -91 56 297 91 167 -108 59 85 -75 117 102 123 -62 147 183 5 -88 6 -89 -29 -2 -192 -105 -244 -335
8144 -335 -115 49 77 -287 24 69 36 -106 263 106 -78 24 -21 -90 -99 -79 3 -242 -132 -88 36 187 -71
8167 -71 -133 264 144 61 -206 -137 264 -55 301 -147 -189 -202 -36 -79 257 -52 139 160 -87 -184 -18 -89 197
8190 197 -91
8191i1
$$ Imaginary data points
##PAGE= N=2
##DATA TABLE= (X++(I..I)), XYDATA
0@%%%%%%%%%%%qJ6j6J6j6K3l1L2l9M7n2O0p1Q2r1J03j18J35j53J73j96K19k45
34a30K75l05L38l77M18m61N13n69O30o97P70q55R49j055J179j322J490j689J931
53A033k235K628l157L913n092P204j2147M4450K3068q2051j81M9212R022m8066
67a2399K242L9414p19m5236k103L5993P743k8492n288J6656J217j5455K903J2831
81I307j687j0347K016O104k073l239L813K101l548k097K208q35m92K058J240k621
97A908l421j660J155M198K195n792p997K578P278k823n468M537M670j0294r175
112a8111J2139J3683j0635j5960P625J4595p334j1261J0622J0392j3424j2034
124a9703J5817J3326j3617j3241J2756J1100j2467q310J3857O933j3837p112J4709
$$ plain form
0 0 0 0 0 0 0 0 0 0 0 0 0 -8 8 -8 8 -8 15 -16 16 -23 24 -28 32 -39 43 -48 55 -63 72 -81 92 -104 115 -130
34 -130 145 -160 178 -199 219 -242 271 -298 332 -365 405 -450 499 -556 623 -699 791 -898 1033
53 1033 -1202 1426 -1731 2182 -2910 4294 -7853 36597 59665 -22386 -22567 26645 35667 -12399
67 -12399 -10157 29257 28538 -16698 -18801 17192 24935 -3557 -8845 7811 9028 -6427 -3524 9307
81 9307 7620 -2727 -711 5393 3320 81 3894 5995 2447 350 2558 1723 1231 3289 4529 1908
97 1908 -1513 -3173 -2018 2180 4375 -1417 -9414 -6836 442 -2381 -7849 -3312 1358 -8936 -18111
112 -18111 -5972 7711 -2924 -18884 -11259 3336 -3998 -15259 -4637 5755 -7669 -19703
124 -19703 -3886 9440 -4177 -17418 -4662 6438 -6029 -14339 -482 6451 -7386 -14498 211
137B11O275j4270n640J4094N871j3359m312J1916L034j1224o75J2370M72j3024
151h261j968J1793L974r409k395O526Q81n198J33O139l24o865n64O522K633m519
167i02k958L428J584k344l87M410L7n176j993N640N452m318n718L085N838l021
183B657n228M344N992n523p291N666R175n438r727L942J0118l625j0011L209J0042
198H302l523j0595L036J1254k559j1215K189J1127j335j0395J129Q931q64p603
212b121K218P842l280q004L147Q857k598q371J470P588k462o825K856P139l964
227C492q544L709Q061k833q136J876O728k773n554L290N548l956o188L125O878
242D723k717o531J931O147j841n812J746N246j725n493J434M973j142n518M68
$$ plain form
137 211 6486 -7784 -13424 670 6541 -6818 -11130 786 3820 -7404 -8079 4291 4763 -8261
151 -8261 -10229 1564 5538 -3871 -6266 260 1141 -4057 -3924 2215 1891 -4974 -5538 984 3617 -902
167 -902 -3860 -432 1152 -1192 -1579 2831 2868 -2308 -4301 1339 6791 2473 -3245 -160 5678 2657
183 2657 -2571 1773 7765 2242 -5049 617 9792 4354 -5373 -1431 8687 5062 -4949 -1740 8302
198 8302 4779 -5816 -2780 8474 5915 -5300 -3111 8016 6681 -3714 -2585 6346 5482 -2121
212 -2121 97 7939 4659 -3345 -198 8659 6061 -2310 -840 6748 4286 -2539 317 7456 3492
227 3492 -5052 -1343 6718 3885 -4251 -2375 4353 1580 -3974 -684 4864 908 -5280 -2155 4723
242 4723 2006 -4525 -2594 3553 1712 -4100 -2354 2892 1167 -4326 -2892 2081 939 -4579 -4111
257d111M656j55m727o09M243l37m372L33M324l91n525j6N858M68n313j030N698
274a006L51m753j84N612N81o163r07O695J823n787j836N492J501n427r68O168
290A192J009o097j473O038J765n896j196N833P20n691q80O112J157n217j289N852
306A939J400n404j108O258J655n711j456N782J632m846j161N629R83n435n41N684
322E300J008m997j274M737J302m811r96N420Q40n042k150M796K004m132k322M770
338D453Q52m233j658M340K002m143j909L320J794l587j813M078K290m773k763
353a750L991L244m108k816L251K508m227k659M039L214l900l871K962K697k663
368h8k907K936K862m139k959L135L192l269l138K712K863l579k739L341L524l750
$$ plain form
257 -4111 545 390 -4337 -4946 -703 -1040 -5412 -5079 -755 -1146 -6671 -6687 -829 -361 -5674 -6704 -1006
274 -1006 -655 -5408 -5592 20 601 -5562 -6469 226 2049 -3738 -5574 -82 1419 -4008 -4976 1192
290 1192 2201 -3896 -5369 669 2434 -3462 -4658 1175 1895 -3796 -4676 1436 2593 -2624 -3913 1939
306 1939 3339 -2065 -3173 3085 4740 -971 -2427 3355 4987 141 -1020 4609 5592 157 -384 5300
322 5300 6308 1311 37 4774 6076 1265 269 5689 6529 1487 -663 4133 6137 2005 -317 4453
338 4453 5305 1072 -586 3754 5756 1613 -296 3024 4818 1231 -582 3496 5786 1013 -1750
353 -1750 2241 5485 1377 -1439 1812 4320 93 -2566 1473 4687 787 -3084 -122 2575 -88
368 -88 -2995 -59 2803 -1336 -4295 -1160 2032 -1237 -4375 -1663 1200 -2379 -5118 -1777 1747 -2003
384b003l796K983L352k650l410L113L228l149l714K573L966k176l647K320K887
399a23k310l261L383L387k918l990K789L392k285k966K406L541l119l435K673
414b836M462k153l834J920L892j879l597K619M145k422l740J814L851j437k911
429b106J719L107j871l648K087M368j443l954J376L831j243l850J801M148j388
444B934m227J448M074n02l779Q55L715j197l248J279L625j158l671Q88M109j429
460C716l497J090L864j363m004J052L863q82l962Q82L339j017l515N59L761r57
476B929l388M21K967k03l265O10K965r56l571R23L606n93l796N4L394l14k898
493a115p5K762k80l465j87L084O22l632j220K890R36k991j058L058K84l185o54
$$ plain form
384 -2003 -5799 -2816 536 -2114 -5524 -2411 817 -2332 -6046 -3473 493 -1683 -5330 -3010 -123
399 -123 -2433 -5694 -2311 1076 -1842 -5832 -3043 349 -1936 -4902 -2496 1045 -2074 -5509 -2836
414 -2836 1626 -527 -4361 -2441 1451 -428 -4025 -1406 2739 317 -3423 -1609 2242 805 -2106
429 -2106 -387 2720 849 -2799 -712 3656 2213 -1741 -365 3466 2223 -1627 174 4322 2934
444 2934 -1293 155 4229 3727 -52 803 4518 3321 73 1352 4977 3819 148 1036 5145 3716
460 3716 219 1309 5173 3810 -194 858 4721 3839 -123 759 4098 3081 -434 125 3886 2929
476 2929 -459 -38 2929 2726 -539 71 3036 2080 -1491 -568 3038 2445 -1351 -1297 2097 1783 -1115
493 -1115 -1190 1572 1292 -2173 -2360 724 1346 -2286 -3506 -616 320 -2671 -3729 -671 -387 -3572 -4226
510d226L205J016l476r68L292J345l555j299L990J252l442j240L723J258l748
525b873j698M371J585m039j828L593J685l708j040L554O64m287m68M757J061m025
541b696j647M204J049l437k68M078K61m054k27M553J191k990j465L097O95k013
557C31k59K609L55k190r20K661P03j940j031J699R42j554j206J588N71j346n59
574D54J144J090j589j846J776K074p67k282Q49K109n78k004J577J897j873k585
590e54K290L159j452l832J046L283j468k761J389L087k793l708K887L623k763
605A433l821J424L338k234k612K250J707k982k043L167K433l565k240L067K129
620A451l472j484L631J087m047r98M417J464m421k045L935K131l055j753K207
$$ plain form
510 -4226 -1021 -5 -3481 -4449 -1157 188 -3367 -4666 -676 576 -2866 -4106 -383 875 -2873
525 -2873 -4571 -200 1385 -2654 -4482 -889 796 -2912 -3952 -398 266 -4021 -4489 268 1329 -2696
541 -2696 -4343 -139 910 -2527 -2795 1283 1544 -2510 -2737 1816 3007 17 -1448 1649 2344 331
557 331 72 2681 3036 846 -74 2587 3290 1350 319 2018 2960 1406 200 1788 2359 1013 454
574 454 1598 2688 1099 -747 1029 3103 2336 54 903 3012 2434 430 2007 3904 2031 -554
590 -554 1736 4895 3443 -389 657 3940 2472 -289 1100 4187 1394 -2314 573 4196 1433
605 1433 -2388 -964 2374 140 -2472 -222 1485 -1497 -3540 -373 2060 -1505 -3745 -678 1451
620 1451 -2021 -3505 126 1213 -2834 -3832 585 2049 -2372 -4417 -482 1649 -1406 -3159 -952
635i52J304k422j032K893J159k340j965J524K254q30j698J83J158j9j416Q50J218
652a31o46j923m1K264R39k315j410J736J190j393j175K035N19k408o00L155J508
669A304l597o23L410R55k894m84L387M65l477R6M618M39m701r54M746J450m280
686a40r61L272P99l300m90L334l05l616m67L276K93k562m68K048o95j601J450
703a33K168j959j990J596K677j200j328J553J054j520p17K565Q36k111j060K293
719B724J245j352j341J159M99j103m83Q42K66q44j378M01P63k69j278l28M76M90
737D89l96q05L05K57m76j23J247N01j466j012J008J843r24j274J066P11j659n61
755a269K721Q37l099k099L342J575l364j641L104J059l673j591L702J614m579
$$ plain form
635 -952 352 -2070 -3102 -209 950 -1390 -3355 -1831 423 -407 -2105 -1922 -764 -783 -2199 -1349 -131
652 -131 -777 -2700 -2741 -477 462 -1853 -3263 -1527 -337 -1730 -2905 -870 -351 -2759 -3359 -204 1304
669 1304 -2293 -2916 494 1449 -1445 -1929 1458 1923 -1554 -1458 3160 3599 -1102 -2056 2690 4140 -140
686 -140 -1101 2171 2970 -330 -820 2514 2209 -1407 -1874 1402 1695 -867 -1335 713 18 -1583 -133
703 -133 2035 76 -1914 -318 2359 1159 -169 1384 2438 918 201 2766 3602 1491 431 2724
719 2724 3969 2617 1276 2435 2934 1831 1348 2190 2456 1612 234 635 1398 1129 -149 -477 -1 489
737 489 93 -712 -407 -150 -626 -749 498 999 -467 -1479 -471 1372 448 -826 240 951 -708 -1269
755 -1269 1452 2289 -810 -2909 433 2008 -1356 -2997 107 1166 -2507 -4098 -396 1218 -3361
770c361j842M060K316l854k396L432J782l221j349L355Q72l187j124L609R26l276
786c258p39K869P88k576k96K377r5k339J87K337K84k042n44J398O32o92l25J317
804g17l45j211M68J655j84n39m97O28P57N7k98l04O78N93q35r9J433L50j515m57
824c82J901N67j561n14J394P86j613k22J573M33k228L25K487j99k213L28K418
841C280m19k372Q96K681j331k865J868K419j167k749J504K309j575k118J409K133
857C903k191j635J946J915k433j851K316J251j983j617K371J044k489r24J982
872A605J018k007j030J709O41j793n68R50L58r59p86J003L97j018o43O39L55m80
890f09q03N43K92K3q68j78N56L23q13p24R62Q76j024o03R06N74j066q78J626Q59
$$ plain form
770 -3361 -5203 -1143 1173 -2681 -5077 -1645 137 -3084 -4433 -1078 -206 -3393 -4517 -908 18 -3258
786 -3258 -3997 -1128 -340 -2916 -3212 -835 -930 -3269 -3082 -745 -461 -2503 -3047 -1649 -1017 -1709 -2034 -717
804 -717 -1062 -2273 -1805 -150 -334 -873 -1370 -742 15 72 -226 -530 148 741 -94 -193 1240 1590 75 -382
824 -382 1519 2086 525 11 1405 2191 578 356 1929 2362 134 459 2946 2747 534 862 3280
841 3280 2861 489 1385 4066 2735 -130 1738 4157 2990 241 1745 4054 2479 361 1770 3903
857 3903 1712 77 2023 3938 1505 -346 1970 3221 1238 -379 1992 3036 547 -377 1605
872 1605 2623 616 -414 1295 1936 143 -425 525 883 -76 -862 141 538 -480 -1123 -484 -129 -609
890 -609 -1412 -869 -577 -554 -1422 -1600 -1044 -721 -1534 -2258 -1296 -420 -1444 -2047 -1141 -567 -1633 -2511 -885 -26
910b6j909o88J786N19j683m83J990L18k252m16K401M49k476m09K218N86k585J11
928b549K893n53k229K77K533l95k009M32K227k35j884P87J612n56j656O39K395
945A729j051j417M66J960p17q93K31J049k62j448O53J387m64j051k52J272L78
962A570o72o48J059P1p23m1O96L14p49l29Q91N54r77m65P10J014j091q02R92J014
982B388j162r31J214J005j299j391J174J081j084r77J133N02j180j262J687R21
998A819j752j077J400J034j506q81J250O23j460p24J052J215j142j039R24O65
1014D01p93m15N53M73r32m93J294M94j543o95J046J70l04q90P45O79r72m88M39
1033a231R40q74j216J043J093r98r75O65J006p43q12N77Q79m96q34Q94R09m10
$$ plain form
910 -26 -1935 -2623 -837 -318 -2001 -2484 -494 -176 -2428 -2844 -443 6 -2470 -2879 -661 -75 -2660 -2549
928 -2549 344 -209 -2438 -2161 372 -23 -2032 -1600 627 392 -1492 -705 907 351 -1305 -666 1729
945 1729 678 -739 -273 1687 970 77 308 1357 1095 -353 300 1687 1223 172 -80 1192 1570
962 1570 898 250 1309 1380 657 616 1312 1626 877 548 1439 1993 1016 551 1261 2275 1184 382 1374 2388
982 2388 1226 295 1509 2514 1215 -176 998 2079 995 18 1151 1653 473 -789 898 1819
998 1819 67 -1010 390 1424 -82 -963 287 910 -550 -1274 -222 993 -149 -1188 -264 401
1014 401 -392 -807 -254 219 -713 -1206 88 582 -961 -1656 -610 -440 -744 -1634 -889 -210 -1182 -1670 -1231
1033 -1231 -291 -1165 -2381 -1338 -245 -1243 -2218 -1553 -547 -1290 -2102 -1525 -646 -1142 -1976 -1082 -173 -583
1051e83j202M74J181o91o60P79J026j279p27J102R22o64q81P30P11l91q88O27
1069d14R06o51o82M76J221q82o60O46P91l55j041P01P47k35r03O22J161n05j119
1088a76N00J174r5j081K14Q43N4q43N31N94l90j086K76J496p46o69j03J214m77
1107A230q83L77J341p26j310N44J214m73j247K48J290k00j171K79P13k21p47J46
1125D04R13j87j088K96Q09l00j071p2R46J9j004m3J064m16r48P4Q36Q4j058k44
1145i86J093J15q36l63P17M00j301M1J088k55p03k44R89q3j127J50P37K63j269
1164a574p6Q06J63j025o1J165K32j116o00J239R0m93R7P31j85p80L41P77j1p04
1184i84P9Q75j17l82k13N23l7n32nO67j17n67n26R55K86j144K68N52Q6l04r6M61
$$ plain form
1051 -583 -1785 -1311 -130 -821 -1481 -702 324 -955 -1682 -580 342 -322 -1203 -473 238 -153 -1041 -414
1069 -414 492 -159 -841 -365 856 -26 -686 -40 751 396 -645 56 803 568 -335 287 1448 943 -176
1088 -176 324 1498 1403 322 536 1379 1433 590 1121 1715 1325 239 515 2011 1265 596 493 1707 1230
1107 1230 347 724 2065 1339 29 573 1787 1314 67 315 1605 1405 234 513 1226 1005 258 404
1125 404 1317 1130 42 338 1147 847 -224 -296 650 669 -335 -378 686 270 -678 -604 232 316 -742 -986
1145 -986 107 222 -614 -977 -260 140 -1161 -1120 -32 -287 -990 -1234 -245 -328 -1455 -1305 -568 -305 -1574
1164 -1574 -1650 -844 -681 -1706 -1767 -602 -370 -1486 -2086 -847 -757 -1250 -1153 -422 -607 -1387 -1046 -269 -280 -984
1184 -984 -905 -30 -147 -529 -742 -219 -256 -788 -793 -126 -243 -810 -1336 -381 -95 -1239 -971 -419 -333 -637 -733 -272
1206b72M62n34J77L81N49m31l64P05K84l21l05L10Q03m53l73K30R83p03q26P67
1226A069L90l54q27N17L83m33o21O45P45j205r02R12Q27n54q00O80N16r74m74
1245d60J392P11j347p39J130J228j206o46R74M74r94o31J366K31q37o09P66N78
1263A381j043m27L23L75q54j21J072p75j008L54R33k09m85l69N44nn88j83K69
1282h16J80n61J37K58L31k67l50O4KL24J70l74m0Q9j29k80J018k98n42j77J112
1303a49L47j066m66J091J13r64m6O82M77q31m24J306J32j377q5J122n3q61M30
1322f22J003o75j600J271J246o58j157L86J366o91r10J054Q72j039o65J059J748
1339A988j242r99R93Q13o36o61J155N99j078p85R82P39o47q11P18J81k24k33K30
$$ plain form
1206 -272 190 -344 -167 214 763 332 -32 673 957 636 331 641 1444 991 618 848 1831 1128 302 1069
1226 1069 1459 1105 278 795 1178 745 124 769 1514 309 -593 319 1146 592 -208 472 988 14 -460
1245 -460 932 1643 296 -443 687 1915 709 63 1037 1511 517 -114 1252 1483 646 37 803 1381
1263 1381 338 -89 234 609 -245 -366 706 -69 -1077 -723 210 1 -484 -853 -309 -314 -902 -1085 -816
1282 -816 -636 -1197 -1060 -802 -471 -738 -1088 -1024 -1022 -698 -528 -902 -942 -853 -982 -1262 -244 -542 -1084 -1261 -149
1303 -149 198 -868 -1334 -243 -130 -1094 -1140 -458 19 -812 -1236 70 202 -1175 -1260 -138 -191 -1052 -622
1322 -622 381 -294 -1894 -623 623 -35 -1192 -806 560 -131 -1041 13 885 -154 -819 240 1988
1339 1988 746 -253 740 1553 917 256 1411 2010 932 147 1129 1868 1221 410 1128 1309 1085 852 1082
1358A082J17n96k79L46jm9j8q6Q8M30j66m13J28J13K29k37L02K41j01n73K57R41
1380A755m97r28J63R48n60o29Q17M80q44j367J294R05j416j198J309Q34j439q08
1398a181J122P21j681m65J585K44j395n27J717j53r90r0J157j94j399K43J435
1415A49k75j292L53R07k65j263Q14Q36j134j36M10M24n48q33J082J33m85j52M55
1434h20J75m19l00P23j33j09Q5K62j09k86N79n59K60K76L05j2l86J75L8k7j13
1455c95L46R8q16M74N31K09o52n8O54k39n59Q8J149k54j099M91J199m59o93J77
1475A92R97l46o77N06J043r48q85Q55J035p70o89R75N25r86p08R44P70q10p63
1494B60N49O97j112m34R97K87p79l50P35L14n63k20N57j07o43L02J81k63K1l00
$$ plain form
1358 1082 1199 603 324 670 669 620 602 516 604 1034 868 455 583 696 925 688 990 1231 1130 557 814 1755
1380 1755 1258 330 493 1441 881 252 1069 1549 705 -662 632 1537 121 -1077 232 1066 -373 -1181
1398 -1181 -59 662 -1019 -1484 101 345 -1050 -1577 140 -13 -1003 -1093 64 -130 -1529 -1286 149
1415 149 -126 -1418 -1065 -158 -423 -1686 -872 -36 -1170 -1306 -896 -472 -1020 -1853 -771 -638 -1123 -1275 -820
1434 -820 -645 -1064 -1364 -641 -774 -883 -798 -536 -645 -931 -352 -911 -651 -375 -70 -82 -468 -293 -255 -282 -395
1455 -395 -49 49 -767 -293 238 447 -205 -263 391 152 -407 -319 830 576 -523 -32 1167 708 15 192
1475 192 1189 843 166 672 1715 767 -118 737 1772 1002 313 1288 1813 827 119 1063 1833 1023 260
1494 260 809 1506 394 -40 957 1244 465 115 850 1164 601 381 938 831 188 490 671 408 429 129
1514A29K44L35l62L66j99O5l14k55K28k22J85J32l39J70l3n04j15L21m5k33j52
1535e98M60j79j56j62L22L31p74j91M89o1m79j35M75J99n38l40P03L36j156J48
1555a306R62J70r44j00O90p0o85K98O84m59m96l6J364k50q42k88J162k49n75K09
1575g61P51m19o32N7O53K15p67M89M99n78n00O24P58o05m01M14M48J49r33K87
1595b52J35K53k20L04L55j48k50j17N21q2j88J33K62k26L15l94k01L11J63q2q2
1616E10L28k78k1q8N39l28l46J52M08n98K01M8O18n79n14K55O28k7p13M98J46
1637H39l06rO7N4m14p1N26K8m89k52M61K06n07m04Q34J33p33l85O14L21p95j77
1659d59L06j19n8l11M50K4n85L8L37K76n58l11L87K83l97K62N2j51k30j01L09
$$ plain form
1514 129 373 708 346 712 513 578 264 9 237 15 200 332 -7 163 130 -374 -489 -168 -213 -446 -598
1535 -598 -138 -317 -473 -635 -313 18 -756 -947 -458 -519 -998 -1133 -658 -459 -997 -1337 -634 -298 -1454 -1306
1555 -1306 -344 -174 -1118 -1218 -528 -598 -1283 -985 -301 -760 -1256 -1292 72 -178 -1020 -1308 -146 -395 -970 -761
1575 -761 -10 -429 -1061 -1004 -351 -136 -903 -414 85 -493 -993 -369 389 -216 -617 -203 245 394 -539 -252
1595 -252 -117 136 -84 220 575 427 177 60 581 499 311 444 706 480 795 401 200 511 674 592 510
1616 510 838 560 539 451 990 662 316 468 876 278 479 527 1145 566 52 307 935 908 195 693 839
1637 839 533 524 591 645 231 160 686 714 225 -27 434 640 133 -271 563 696 -37 -422 192 513 -282 -459
1659 -459 -153 -272 -330 -641 -191 -167 -752 -714 -377 -101 -659 -970 -583 -300 -697 -435 -383 -534 -764 -865 -556
1680e56K47l95R8k72M06J7k50J79p4N9k90P04k83l46m69L63J60kM9o9M69l77k04
1703h36L18K80j94n59M89M51n9n06J12K71K08m55K48O10k17m86P3N46j34k44K47
1724A63L50k47j51J44J46l55k05M31N26o50k29L78M34o54K03J97J6l33k5K92K45
1745F76j65j27K23L65l38j09J49M68m50j23K08J70M8p93N23O48m66j56l67O41
1765A025k01l77O9J78Ql29l04L94M7n14m0M41L08n72m7L70k36k97RM26l0n17O3
1788a26L32J54n13l42O72l74k69M28lP0m23P7K93l21p15Q07j08R0k30j83N29m85
1810f40O6q6M24l61k68J87N44Qq16K67J59j40k14m7L25m3k09J90K12J72m17J08
1832e79J8J52l7J95K32nn83K36J98J33k55L5L18K42j40k18k4L71j50n00L86L12
$$ plain form
1680 -556 -309 -704 -606 -878 -472 -455 -705 -526 -600 -541 -831 -127 -410 -756 -1225 -862 -702 -704 -655 -724 -255 -632 -836
1703 -836 -518 -238 -432 -991 -502 -51 -110 -616 -504 -233 -25 -480 -232 378 161 -325 -252 294 160 -84 163
1724 163 513 266 115 259 405 50 -155 276 802 152 -77 301 735 81 284 481 497 164 139 431 676
1745 676 511 384 607 972 634 525 674 1142 692 569 777 947 995 202 725 1373 907 751 384 1025
1765 1025 824 447 516 694 702 373 69 463 510 -4 -44 397 705 133 86 456 220 -77 -68 358 328 -189 -126
1788 -126 206 360 -153 -495 177 -197 -466 -38 -41 29 -394 -317 -24 -345 -1060 -253 -361 -271 -501 -684 -155 -640
1810 -640 -574 -660 -236 -597 -865 -678 -134 -126 -942 -675 -516 -656 -870 -917 -592 -635 -844 -654 -442 -270 -687 -579
1832 -579 -561 -409 -446 -251 -19 -24 -607 -371 -173 -40 -295 -260 58 300 160 -58 -82 289 139 -361 25 337
1854C37m49o4K79J36k89J49j69J20J10j91l5L64n9o66P50J11k14k25M05K75j34
1875E41j10J58M78m83mK78Om32K60nQ5j62k69O72j21n07l03Q56j28m97r3K31J2
1898D63l73K86j12Q4m36K77M7J09j43l52M84j55K64l64L37J1n26L76K0j22j84
1919ij81k36M90J81k02j86J66j7p3k31j32J99k09qJ50K2k76k45J72J36l7k73K95
1942e04k78j41M63J42j60m30L3M99P6m36K44O3k97l49O62J26k84L4k29M25N5m56
1964g42L95N62m90n42P72J76l15k32N24j73J15p9L15k48K29j54J03l97L32j77
1984b6L61l0k98M19pj93m27N04R4J29n37L37K05J16n7j98j85K59j42L73j57L4
2006E74L75l50k01N24l39l7Km1M32l39k24K87J44k90k15L84J42o38k65M14K48
$$ plain form
1854 337 -112 -176 103 239 -50 99 -70 50 160 -31 -66 298 239 -427 323 434 220 -5 400 675 541
1875 541 431 589 1067 584 580 858 864 432 692 687 772 610 341 1013 892 385 82 938 810 313 220 451 463
1898 463 90 376 264 348 -88 189 236 345 202 -150 334 179 443 79 416 427 -99 277 297 175 -9
1919 -9 -190 -426 64 245 43 -143 23 6 -67 -298 -430 -231 -440 -448 -298 -276 -552 -797 -625 -489 -526 -799 -504
1942 -504 -782 -923 -460 -318 -478 -908 -875 -376 -300 -736 -492 -429 -726 -1075 -413 -287 -571 -537 -766 -341 -286 -742
1964 -742 -347 215 -275 -817 -45 131 -184 -416 108 -65 50 -29 286 38 267 113 216 -181 151 -26
1984 -26 335 305 7 426 419 226 -201 303 397 526 -11 326 531 647 590 392 207 466 324 697 540 574
2006 574 949 599 398 922 583 546 548 507 939 600 376 663 807 517 302 686 828 190 -75 339 587
2027E87l46l82N25L24p95o0L45j26j41l04O37P6o73Q6K70o2l37J64N29k7j051
2048g61R36J27j88p59K88P44p80m24O25K94n50n23L72M73k86k51M20j8k01j77
2068f39m0K96j98k5m6J86l59J12L4J09k49M78j16l6k35pj04L9K39Q7p6m10Q21
2091a39m07R2j40J90J86M6n35N30K9m06J54O61k54m57J72O61m41l03M86M41l41
2112B25l14J89L11j81k17r0P60l87m52M15J78k38j97M58K55m35j0J49lp02M29
2133A43M72mj83J68J70o6m55J85K31j44LQ8O7j87j45L26kl94j2L45P4j71l02L32
2157E39J88o65M59l69J90k68Q9k11N7J30J42q5l88O4L54o3m86K12J75k06K6j85
2179c01K94n7m26L13M28p44o4P67m99k54J61P63m61p17N56J43Oo48M05J77P1q15
$$ plain form
2027 587 241 -141 384 708 -87 -147 198 72 -69 -373 264 340 -333 -247 23 -39 -376 -212 317 290 -761
2048 -761 175 302 114 -645 -357 387 -393 -817 -192 102 -448 -971 -599 -126 -412 -663 -243 -261 -462 -639
2068 -639 -679 -383 -581 -606 -652 -466 -825 -713 -679 -570 -819 -341 -457 -493 -728 -735 -839 -800 -561 -474 -550 -960 -139
2091 -139 -546 -454 -594 -404 -218 -172 -707 -177 -148 -554 -400 261 7 -450 -278 383 -58 -361 125 566 225
2112 225 -89 100 411 230 13 -77 683 296 -156 259 437 199 2 460 715 280 270 419 416 -286 143
2133 143 615 611 428 596 766 700 245 430 661 517 520 608 675 488 343 669 667 273 261 606 680 509 207 539
2157 539 727 62 521 152 342 74 163 -48 9 139 281 196 -192 -128 226 163 -323 -111 64 -142 -116 -301
2179 -301 -7 -64 -490 -177 251 -493 -557 210 -289 -543 -382 381 -80 -797 -241 -98 -92 -740 -335 -158 -87 -902
2201i02K48L72n06k68P94M6k77m65N66P0J17p01N75Pr8j87N02j95l89oN65K21
2223H9k22m82J94M58p04Q10k92L4j13O6j4m1J29k87J66K15k38K17n8K4L72l38
2245a5o5K94N2kn39L07N54k04k95L17R9Pk16L21m47J52j95L87O0l18K5K21K67
2268G67m15R0j9K26k43k65N68Q7l49j79M76k3o09K18J17J9n04K51K25K62l50l7
2290C13M59k93j76j95L58n4n32L99l0j39k22K1J27o8Lk2J62j96K46l48mn5N7K28
2314C9j21l52Q6Q7j41K32j19J03p5l2j28j77L44k7j35K4J48j01j41l8m5K37J09
2337b23k85j97M97k50n3N1O5k46o4K54K77l26j81P59k26k05J07L1j21n0J25J47
2359a14M0j65l2O8J14Q4m78K90L93o15N76k57j8J62j57J58K02k56Q9k49M21Ol05
$$ plain form
2201 -902 -654 -282 -788 -1056 -262 -216 -493 -958 -392 -322 -205 -906 -331 -324 -422 -609 -107 -302 -691 -697 -132 89
2223 89 -133 -615 -421 37 -667 143 -149 -115 -228 -162 -176 -217 -88 -375 -209 6 -232 -15 -73 -49 323 -15
2245 -15 -80 214 266 264 -275 32 586 382 87 404 503 510 294 615 168 320 125 512 572 254 279 500 767
2268 767 352 442 423 649 406 141 709 796 447 268 744 721 112 330 447 466 -38 213 438 700 350 313
2290 313 772 479 303 108 466 412 -120 279 249 110 -112 -91 36 -32 -29 -51 111 -85 161 -187 -191 -246 -189 39
2314 39 -82 -434 -348 -261 -402 -170 -289 -186 -261 -293 -421 -598 -254 -281 -416 -392 -244 -345 -486 -524 -569 -332 -223
2337 -223 -508 -705 -208 -458 -511 -460 -395 -641 -705 -451 -174 -500 -681 78 -148 -353 -246 -215 -336 -386 -261 -114
2359 -114 -74 -239 -271 -203 -89 -5 -483 -193 200 -415 161 -96 -114 48 -109 49 251 -5 84 -165 256 262 -43
2382d3L19j22Q4M6n4k95N93j41j15J00J3j84l17O21k90J63J91lp16L19N6M0m5
2405B20J16J37k16K48k28J06J5j08K3LJ13r7J63j84k85L68j92J62J63l41M4k97
2427f7K36j95o4R2M86l19l67JO8j19K06qL24k76l75L31m1j15L7O2N9j07m03L05
2451b49J48m29K16k26N52k05n0J32L5l40j11qL16j50j16K50k46L38k50K79p9q0
2473b73k30L35j69m7J46M3o6k32K28J60j45j70k2nK71M4k90j77J49N05o5o1p7
2496a48M17l22j07Q8J64j31k13L46j9K27p2J04J37l21J08L68k03j11j03K12J61
2517E82o63j11L25K27n5pL11j00q45O31L21n5k13j34J7mo7K49R3l33J80L9p4l30
2541a6K60k44r0N01j88J59j85O0O0k1L6J84n82K7M77l71k7L56k79P0m27L29L1
$$ plain form
2382 -43 276 154 238 284 230 -65 528 387 272 372 385 201 -116 505 215 378 569 566 -150 169 225 265 220
2405 220 336 473 257 505 277 383 398 290 313 316 429 332 495 311 26 394 202 364 527 186 230 -67
2427 -67 169 -26 -90 2 488 169 -198 -197 -129 -248 -42 -50 274 -2 -377 -46 -87 -202 -165 -103 -44 -151 -554 -249
2451 -249 -101 -530 -314 -540 12 -193 -243 -111 -76 -416 -527 -535 -219 -369 -485 -235 -481 -143 -393 -114 -193 -273
2473 -273 -503 -168 -337 -384 -238 -195 -261 -493 -265 -105 -250 -420 -442 -447 -176 -132 -422 -599 -450 55 -10 -71 -148
2496 -148 269 -53 -160 -72 92 -39 -252 94 75 302 230 334 471 150 258 626 423 312 209 421 582
2517 582 -81 -192 133 360 305 298 609 509 -336 295 616 561 348 214 231 227 160 409 502 169 349 388 314 -16
2541 -16 244 0 -90 411 223 382 197 257 317 296 332 516 -66 -39 438 67 40 396 117 187 -240 89 120
2564A20k87%r7K11k42K96l49n1N63m46J83j60J68k15J0L9lp2M2k05J02K23j71
2587c41J12K14r7q3j58K08j64oK72k27k1r8k9L40k13M0P2j09J67j62J78j74J22
2610a57p8O7O6m17L58K45k81r1j31M42k4k8Q6k2k7J34OR5m16K50j66n0L23L5J49
2635C68KJ63j86k3J3J62k99o6p7K84M1k27p7L83J2n18L24r8J49q3J36j26j08M4
2659A93l48N22k58L37oj31j58N1q6L20l46J29K31k0l63j27K72l08M32k89K63Q2
2681C92m05K37k4L26n00Qj14J27j93M4K82l6o18J17N09p5k50m8k7Q3j32K28j68
2704b37p8K40l89K38mr2j50j3J58k46J82K0K0o7l0O7m2K23Q6q2m19J93P3J59l06
2729d96M59m25r1P2L56j52j01Q4J77r0l23L77K12m29J09j8K75m17r0N35J67m51
$$ plain form
2564 120 -167 -167 -264 -53 -295 1 -348 -399 164 -282 -99 -259 -91 -306 -296 -257 -260 -332 -290 -495 -393 -170 -341
2587 -341 -229 -15 -112 -195 -353 -145 -309 -315 -43 -270 -291 -389 -418 -78 -291 -251 -179 -288 -121 -283 -105 -279 -157
2610 -157 -235 -168 -102 -519 -161 84 -197 -288 -419 23 -1 -29 57 35 8 142 148 243 -173 77 -89 -139 184 219 368
2635 368 370 533 347 324 337 499 200 134 57 341 382 155 78 461 473 -45 279 181 330 247 383 257 149 193
2659 193 -155 367 109 446 440 309 151 202 116 436 90 219 450 430 67 -60 212 -96 336 47 310 392
2681 392 -13 224 200 526 26 34 -80 47 -146 -102 180 144 -474 -357 152 77 -173 -221 -248 -165 -297 -69 -237
2704 -237 -315 -75 -464 -226 -230 -322 -472 -485 -327 -573 -391 -371 -351 -418 -448 -381 -423 -200 -114 -196 -615 -422 -349 -190 -496
2729 -496 -37 -462 -553 -481 -125 -277 -378 -294 -117 -207 -530 -153 59 -370 -261 -279 -4 -421 -511 24 191 -260
2751b60j76L83K46m40J67M2L11m10J56J07Q3n6j02K50j97j53M0L23j27J87k45
2772A29L60o94M74rJ89j39l77K55K58l45Q5K00j53L8j2Lj75J68K11l20K16r7j21
2795A44L47m66K77j89J30K9okQ9M1K17k08l00K18l26O7J77k24J07j58r1J26L99
2818C98k35J30m47R9J53l09L51J7k30j3j8r4n4j29J35K29j40j67Q0M6K1k82M22
2841c7l93L07j83J58M6J5l98L70J5o0k62J75lj96J29L5J09k66K48O5j29j33K58
2864a30J6Pp3o8m91N42q9J57L64m94j91L72q2j76o4L20j30J23k87M29j42K9J3
2887d5K0m4J77M4n8J6n4N2j55J00J89k2k62K26k41L86M7l10J78J62l21r2K98l62
2911g1K64p5J72j92k27L58K16k52j77J99J44j59p4J12K01L1l57K54n0l25k00M85
$$ plain form
2751 -260 -436 -53 193 -247 -80 -38 273 -137 19 126 209 153 51 301 104 -49 -9 314 187 374 129
2772 129 489 -205 269 260 449 310 -67 188 446 101 186 386 233 271 259 262 87 255 466 146 362 265 144
2795 144 491 25 302 113 243 272 266 264 353 394 611 403 103 321 -5 62 239 15 122 -36 -127 -1 398
2818 398 163 293 -154 -55 98 -211 140 157 -73 -86 -104 -198 -252 -381 -246 -17 -157 -324 -244 -198 -177 -459 -37
2841 -37 -430 -123 -306 -148 -102 -87 -485 -115 -100 -160 -422 -247 -250 -446 -317 -282 -173 -439 -191 -126 -255 -388 -130
2864 -130 -114 -107 -180 -248 -739 -197 -286 -129 235 -259 -450 -78 -160 -336 -400 -80 -210 -87 -374 55 -87 -58 -45
2887 -45 -25 -69 108 152 94 110 56 108 -47 53 242 220 -42 184 -57 329 376 66 244 406 85 -7 291 -71
2911 -71 193 118 290 98 -129 229 445 193 16 215 359 200 126 238 439 470 113 367 317 -8 -208 277
2933B77m0p6j08K91j06k42J72k25M62l04j64J6K51Om35K74J00o0r2K74n86O9M74
2956B28j71k01J15k56J36P5l13M47j64j95K47P2l19J86j53O6q4o2K74m04l6L95
2978a17k1lR6l23j72K41l06J29K69l32J36j20L24m71K03J9K6j76K18L19N5l25
3000c31L68j76q6j00J3M74o0j02J38m04J73P1j58j3K37l42O9L23m46L83J85O9
3022B85l58J77r2L78n00J50l23L62K25l03J53j74L27n1N7K05k00j61J46K00k71
3043B32J58P2l99J66j31j24M17m7r3r7j79M16l29P0Q0L8J58m67L2J95j42P5K2
3066A23J9k10q1J11K24R3m42K72L42j61j17r1N2l69Q3L03L8j07k23K11q9j81K03
3089Ck29J10K2k62j5L76k24l6J03P5j09o8n5J03j10J29llk69j22L00j38J66J28
$$ plain form
2933 277 237 161 53 344 238 -4 168 -57 405 101 -63 -47 204 210 -225 49 149 89 -3 271 -315 -246 228
2956 228 57 -144 -29 -285 -149 -74 -387 60 -104 -299 -52 20 -299 -113 -266 -200 -284 -346 -72 -476 -512 -117
2978 -117 -138 -141 -45 -368 -540 -299 -605 -476 -207 -539 -403 -523 -199 -670 -467 -448 -422 -598 -380 -61 -6 -331
3000 -331 37 -139 -225 -325 -312 162 102 0 138 -266 -93 -22 -180 -193 44 -298 -229 94 -352 31 216 285
3022 285 -73 104 12 390 -110 40 -283 79 304 1 154 -20 307 256 313 518 318 157 303 503 232
3043 232 390 462 63 229 98 -26 391 344 251 154 -25 391 62 132 212 250 408 -59 -27 168 26 101 123
3066 123 142 -68 -149 -38 186 279 -163 109 451 290 173 82 134 -235 -152 151 189 82 -141 70 -19 -200 3
3089 3 -226 -116 -94 -356 -371 5 -219 -255 -152 -77 -186 -254 -309 -206 -316 -187 -190 -193 -462 -584 -284 -422 -256 -128
3113a28J35l62N36n39J17Q9J02l06J58k1M2j12K09K31k73J26qk46J40M8R0m9O7
3136D6j75J47K55j31l63L58L2j68n6J23n9OJ93k23N04l07j16P1j54K54j95Q5K15
3159C42j47O8o3L8l17L63j80J14J59l20K45P0j15j11K81o1r5j7q8l7J15k22K99
3182C21l7j67P1j30M7j50K08l3n4k10J66j58K42j14jK72m2Qn4l02J02j54j59K14
3206a14L59j66n9J53j38J24Q8l01J06k21J46l0j75K78o2r9k06M74j26j39J51l24
3228b81J36mj12J30k76K09l3l52L31J48n05N94p2j84K53l2k03r4K76J41k67K30
3250C3k96P8K39m10K92Qk97K30K6k90L66k38K64M2l0j13M30k64K5m08L99j26j18
3273a58K45J3l09M78l09Q9k04j3L97l47J74j18j43K96l2j57J2J72R2RKk59L01
$$ plain form
3113 -128 7 -355 181 -358 -241 -152 -50 -356 -198 -219 -177 -289 -80 151 -122 4 -4 -250 -110 -62 28 -21 46
3136 46 -129 18 273 142 -221 137 169 1 -55 68 9 15 208 -15 489 182 66 137 -17 237 42 127 342
3159 342 195 263 200 238 -79 284 104 218 377 57 302 372 257 146 427 366 271 254 166 129 244 22 321
3182 321 284 117 188 58 105 -45 163 130 76 -134 32 -126 116 2 1 273 231 239 185 -117 -15 -169 -328 -114
3206 -114 245 79 20 173 35 159 247 -54 52 -169 -23 -53 -228 50 -12 -111 -317 157 31 -108 43 -281
3228 -281 -145 -149 -261 -131 -407 -198 -231 -583 -252 -104 -609 -15 -87 -271 -18 -50 -253 -347 -71 70 -197 33
3250 33 -263 -185 54 -356 -64 -56 -353 -123 -97 -387 -21 -259 5 47 17 -96 334 70 95 -313 86 -40 -158
3273 -158 87 100 -209 269 -40 49 -155 -168 229 -118 56 -62 -205 91 59 -98 -86 86 178 187 189 -70 231
3296B31p1q3Oj4k2j47K98R2j78K6L1J25k54K49K7k23MJ40k4O3n29L23n1K80mj10
3322A85j13N1J10k29K14m36pL86j52J88k59J6r5K61J63l57j9QK60l13L2R6m1Q3
3346C2k52L9L35k92Q1j73K44k75R9M42n64K71q2n6l0L5J05m4M6j56L6Nl54J80
3370c28KK14j20J61k9k27J12K81k90P1K8J63k71L38j38j81Q5N3j23j26K51j2m1
3393a27R4J83j81j28MK53m49L05j38L36j20Q3j73J47J16j26n3j48L18k29j99M35
3415B03l73K36Q8k25o4J59J54j92K78j92N3K41l19P9j99J81k67J60J52M0J14k1
3437B86K29k30M1j45k4K44m7k74M2p8J55k77N8K28J68j26o3k28l6L22k09k7M4
3460E3K26l61J69J8m7J25k1j95K09j19p0n1J09o5j31L31j42p8j46L57k17k14j12
$$ plain form
3296 231 160 77 83 69 47 -100 198 290 112 138 169 294 40 289 316 93 97 237 213 276 -253 70 19 299 295 185
3322 185 72 123 233 4 218 -218 -225 161 9 197 -62 -46 -141 120 283 -74 -93 -85 175 -138 -106 -10 -51 32
3346 32 -220 -181 154 -138 -57 -230 14 -261 -162 280 -284 -13 -95 -151 -181 -146 -41 -85 -39 -195 -159 -154 -508 -328
3370 -328 -326 -112 -232 -71 -100 -327 -215 66 -224 -153 -125 38 -233 105 -33 -214 -129 -76 -199 -325 -74 -86 -127
3393 -127 -33 150 -31 -159 -155 98 -351 -46 -184 152 32 115 -58 89 205 79 26 -122 196 -33 -232 203
3415 203 -170 66 154 -71 -135 24 178 -14 264 72 125 366 47 126 -73 108 -159 1 153 193 307 286
3437 286 515 285 326 181 157 401 354 80 122 44 199 -78 -20 208 376 250 187 -41 -77 245 36 9 53
3460 53 279 -82 87 105 58 183 162 -33 176 57 -13 -64 45 -20 -151 180 38 -40 -186 171 -46 -260 -372
3483c72K01J11j4j01K1p8r1K43o0K0Rl51L17m13N86m04O32l39q7l61N02k79j30
3506d38J75q8l8J02J30k23K90K02n7k41j41R4J96l96K59j2r0K56l15K97k6n3Q2
3529c5L4j58J56j40M0R1L86l21j19j50J8K31M58l83K3R4K83J4n00K13r4j74j62
3552a95M04j28j10R6K81k39R0k98L00j6k78L68l6O7l29K28j28j25K15j91m5L12
3574B43N6j75l26N36n5j12J68m8k42j9J95j80k15P3K59m11L30M5j59m8N0L9j3
3597il51N88r4L21l56j83N4l7Q8r2j04p5M3K2K23k57l23L58l8K58Q4m10P9r1L93
3622I1l29l40N89n7j84K67L29p25K17k35K27j0L10l80J61K5r0q9K63P6l59k06
3644d49L67R7k00M3n3K78m54J60J46K6j25K97P0l90K98m8k26J93j44J79L66n47
$$ plain form
3483 -372 -171 -60 -74 -175 -154 -232 -323 -80 -140 -120 -111 -462 -145 -558 28 -376 256 -83 -170 -531 -29 -308 -438
3506 -438 -263 -351 -389 -287 -157 -380 -90 112 55 -186 -327 -233 -37 -433 -174 -186 -276 -20 -335 -38 -64 -117 -35
3529 -35 -1 -159 -3 -143 -103 -12 374 53 -66 -216 -198 33 491 108 131 225 508 522 22 235 141 -33 -195
3552 -195 209 81 -29 67 348 109 199 -99 201 185 -93 275 239 306 -23 205 77 -48 167 -24 -69 243
3574 243 299 124 -202 334 279 167 335 287 45 26 221 41 -174 -101 158 -253 77 122 -37 -85 -35 4 -9
3597 -9 -360 228 134 455 99 -84 -30 -67 21 -71 -175 -250 -207 -185 38 -219 -542 -184 -222 36 120 -290 -211 -302 91
3622 91 -238 -578 11 -46 -230 37 366 -359 -142 -377 -150 -160 150 -230 -69 -44 -134 -223 40 116 -243 -449
3644 -449 -82 15 -185 -142 -195 83 -371 -211 -65 -39 -164 133 203 -187 111 63 -163 30 -114 65 431 -116
3666a16L72P8n80N07l96J11K00Q4j59K48m80j28M52j69O3L4m5J71k14q1J43R4
3688A89J5k33J15J30Pj40m0J53j49p7LJ02M3O9k51J56KN3P5j3q8o5l5m3L27k19
3714H6O1n2L33k43m26J98j14p3J35m8k8K54J11l42K08r0R9K21j59j55j6j31Ko2
3738b31J90K19l77J81j25M0j0J4o0J50j70PN54n58J30j74K32n8l2J20l04J80j05
3761a87L45k16jj10K87k04J9k24M77m65o0P7K26P4j80m4J23J89p7k39K24J29l70
3784b07L05k06j4j15K55j82L1P4k33M03j39L4J48k95J59m4K34N1k47K45k70J92
3806A79J20m77M96k07j53L6j94N45j38k06k7j96L20j17J44j22j53J54K04k89J9
3827f2K09j37J04L05j60kl78J1K09j81J25j03L70j29j03J88k3n27L57m0M8q7J45
$$ plain form
3666 -116 256 334 -246 261 -135 -24 176 260 101 349 -131 -259 193 24 87 121 76 247 33 -48 95 189
3688 189 204 -29 86 216 223 83 43 196 47 -30 -27 75 118 187 -64 92 94 147 222 209 121 56 21 -22 305 86
3714 86 147 95 428 185 -241 -43 -157 -230 -95 -143 -171 83 194 -148 60 -30 69 290 131 -24 -40 -171 -169 -231
3738 -231 -41 178 -199 -18 -143 -103 -113 -99 -159 -9 -179 -172 382 -176 -46 -220 12 -46 -78 42 -262 -82 -187
3761 -187 158 -58 -59 -169 118 -86 -67 -291 186 -279 -339 -262 -36 38 -142 -186 -63 126 49 -190 34 163 -207
3784 -207 98 -108 -122 -237 18 -164 -133 -59 -292 111 -28 6 154 -141 18 -26 208 259 12 257 -13 179
3806 179 299 -178 318 111 -42 -6 -200 345 207 1 -26 -222 98 -19 125 3 -150 4 208 -81 -62
3827 -62 147 10 114 419 259 257 -121 -110 99 -82 43 -60 310 181 78 266 243 -284 73 33 81 -6 139
3850A39j27j09K44l50O18n77Q2n6r5J96j43j9J87J89l59m6l5L88k95L05m4l32
3872b39r7J75K20K7n23O84j67k68n8J73m0k45K41n5J94k42l1J89j38J57k14K3
3894b34J44J42j93k93L88Q7o5p9P9k08J17j98R1r9L18L6o9J77p8Q3k46j41M09
3917A68l90J47M8n6J95j69P2k44L53o7j71L08Q9k60K74n5o3J11J73k56J1k06o3
3940e1R7k4l8K78o24K42L91k04q3J8o0k0K29N3n9j93K13J3J72k33L5n2P7j10M9
3965A16o4j82M25k17m8L08j59j99K20J7j65k4QK98o8o15K4K04J26J28k70K06k68
3988a99N4K2K51l46OK9K12k7o9k60M30J12m23j31J27M43l22j5l8j33r7L90J70
4011A86l16j49n1K88P0j06n1J63r6j55P7Nk55J17Q4q0l1K22J35j84p9L20j24J88
$$ plain form
3850 139 12 -97 147 -203 415 -162 -80 -136 -231 -35 -178 -197 -10 179 -180 -226 -261 127 -168 137 93 -239
3872 -239 -336 -161 59 86 -437 247 80 -188 -246 -73 -113 -358 -117 -172 22 -220 -251 -62 -200 -43 -257 -234
3894 -234 -90 52 -141 -434 -46 41 -24 -103 -24 -232 -115 -313 -222 -321 -3 33 -36 141 63 146 -100 -241 168
3917 168 -222 -75 -27 -83 112 -57 15 -229 124 57 -114 194 283 23 297 242 179 290 463 207 218 12 -51
3940 -51 46 22 -16 262 -362 -120 271 67 -16 2 -58 -78 151 204 145 -48 165 178 350 117 152 100 177 67 116
3965 116 52 -130 295 78 30 338 179 -20 200 217 52 28 36 334 266 -349 -325 -121 5 133 -137 69 -199
3988 -199 -145 -123 128 -218 -212 -183 29 2 -67 -327 103 215 -208 -339 -212 231 -91 -106 -144 -277 -374 16 186
4011 186 -130 -279 -330 -42 28 -78 -129 34 -62 -217 -140 -135 -390 -273 -189 -269 -300 -78 57 -127 -206 114 -10 178
4035A78j34q8o3q2p0J55L66l33l54L90k51N6P2R1M5J99l27J84q0K27p8L7Km7n8
4060C7L5k32K23J57k17K3J82j84p9M1K29Rj49J04k44nL86m94K14r3K08j1k69M67
4084C38k19k75J92K61l7j73N4k19n5J68K50m86J91J65N5k26j26N4Q8K39l67L5
4106i3L1K22o9o2K03Q9l50j05j50K59R8j97R3j60n6P1k6r1J56R1p5q3j9R2J45
4131A4K02r1l06P9k60pM63r3j42J30P9n5m6l25O03l35J81n25L12L5k14K66j21
4154a56K8L79k01j61J09J0J00MR9k40p4Pj59R3J51q5j16J79p6QP4l60M42p5L28
4179C08k64P4n6k78J29k5JJ45o2K81j3m78O1Q7K26O2m2l86M44J47r4l55J74N1
4203A37j91N2K03j92O4J17j09J2K2K5J19j29j15rj1K19k08r6K40k53K04m9m15
$$ plain form
4035 178 44 -44 -107 -189 -259 -104 262 -71 -425 -35 -286 -230 -158 -67 -22 177 -150 34 -46 181 103 140 142 95 37
4060 37 72 -160 63 220 3 26 208 24 -55 -14 215 224 75 179 -65 -70 316 -178 36 -57 151 140 -129 338
4084 338 119 -156 36 297 260 87 141 -78 -133 35 285 -201 -10 155 210 -16 -142 -88 0 239 -128 -93
4106 -93 -62 160 91 29 232 321 -29 -134 -284 -25 73 -124 -31 -191 -247 -176 -202 -293 -137 -46 -121 -204 -223 -131 14
4131 14 216 125 -181 -102 -362 -369 94 1 -141 -11 68 13 -33 -358 245 -90 91 -434 -122 -87 -301 -35 -156
4154 -156 -128 251 50 -111 -2 8 108 112 211 -29 -103 -96 -255 -162 -11 -96 -212 -33 -109 -101 -27 -387 55 -20 308
4179 308 44 118 62 -216 -87 -112 -111 34 -28 253 240 -238 -177 -90 136 198 156 -230 214 361 267 -88 86 137
4203 137 -54 -2 201 9 73 190 81 93 115 140 259 130 15 6 -5 214 6 -90 150 -103 101 52 -363
4226c63P12j57Kl14M08k53j06J41q7k3Q0k04J33k2J9m18L38J81l42M84q5J06k64
4249c4j03M9o4J39J76k00J26k43K17K35j05l13K17k75Q2K64m53L68j4k60J75M3
4271B7m6m0k51L67j71j62J8K18Q9p9L7r5K24l13K49R1j60j17O3K93n33J8Q0L15
4295A22l12K06J13l1l15M70k59O4m7j08M34o16K02J84q3Kr5Q6j00K12l06K98J42
4318B63m56K64J39p9j4k9j04k7J51r0J28j87J9J83k40J46j65J31N5j70J03M07
4340D28k78k31J81k97J10K7J69m8K03j87M2j47K5M9k1k2J87L9m4l09R9J91m87
4363c21K37n%K21J05l97J42N5n4P2k13K67J46k36j3k51J14m8L7J71l55L55j89
4386a60L71j58j77K18m05L52L5l30M56l20L12j92o2r3j8M20m04L7J92k02j22L78
$$ plain form
4226 -363 349 192 194 -120 288 35 -71 70 -17 -40 40 -164 -31 -53 -34 -452 -114 67 -275 209 124 230 -34
4249 -34 -137 -88 -152 -13 163 -37 89 -154 63 298 193 -120 97 -178 -96 168 -285 83 69 -191 -16 27
4271 27 -19 -59 -310 57 -114 -276 -258 -40 49 -30 7 -88 136 -177 72 163 3 -114 -51 242 -291 -273 -193 122
4295 122 -190 16 129 98 -217 253 -6 58 11 -97 337 -279 -77 107 24 26 -69 17 -83 129 -177 121 263
4318 263 -193 71 210 131 117 88 -16 -43 108 18 146 -41 -22 161 -79 67 -98 33 88 -82 21 428
4340 428 150 -81 100 -197 -87 -60 109 61 264 77 119 -28 -3 46 25 3 190 229 185 -124 -25 166 -321
4363 -321 -84 -89 -89 132 237 -160 -18 37 -17 55 -158 109 255 19 6 -245 -131 -179 -142 29 -326 29 -160
4386 -160 211 53 -124 94 -311 41 76 -254 202 -118 194 2 -60 -153 -171 249 -155 -118 74 -128 -250 128
4408A28K49j35m37O2Q9J44m5j20O4J25j09j88J43k2k69K5K42L4M9J01j47M3n1
4431b5j59kJ52R3m4K20k82K43k53RkJ40L5k52K03K16l55K11J83l79P6l3m1M3K66
4456B63j96K18j59n0j73R0K27J87k57l0j83j27M65j08r3K97l19o5q0K39qk06J78
4479A10K8K18j82k26O5o1L25l25j44L49k79J86J98m35L11K40m93l1J65O6j49J0
4501e4l33M73R2k41J3j13N18k73m1j81J24k34lK12j33J58j87L04k95K18oQ4l22
4524b20k1J88k1o0k89K67M6J69n4q0j63k05K15Q8JQ9j4n1K41Q8j50k69K69J14
4548A78j41jnQj2j64K93j87J8L9k54Q1K21k50K94k81J45j47K35m28N98m02r8r
4572b69M02k41j88L05o4M9P2m9j96M01p0k12L04o6J65j70k59J74O2k15K40J62
$$ plain form
4408 128 377 242 -195 -133 -44 100 55 -65 -1 124 15 -173 -30 -52 -321 -296 -54 -20 29 130 -17 26 -25
4431 -25 -184 -186 -34 59 15 235 -47 196 -57 -48 -50 90 125 -127 76 292 -63 148 331 -48 28 -5 -46 -3 263
4456 263 67 285 126 76 -97 -7 220 407 150 120 -63 -190 275 167 74 371 52 -13 -93 146 138 -68 110
4479 110 138 356 174 -52 13 -48 277 -48 -192 157 -122 64 262 -173 138 378 -115 -146 19 85 -64 -54
4501 -54 -387 86 178 -63 -50 -163 355 82 41 -140 -16 -250 -253 -41 -174 -16 -203 101 -194 24 18 102 -220
4524 -220 -241 -53 -74 -134 -423 -156 -110 59 5 -75 -238 -443 -228 -140 -139 -50 -64 -115 126 214 64 -205 64 178
4548 178 37 36 31 39 27 -137 156 -31 -13 26 -228 -147 74 -176 118 -163 -18 -165 70 -358 240 -162 -260 -269
4572 -269 133 -108 -296 9 -55 -6 66 17 -179 222 152 -60 244 178 343 173 -86 88 150 -65 175 337
4594C37l83J24l04M56j16k09K7Q6k89J55J45J73m80J83K92l67jj5K63P7p1M2l25
4617b00K32Pj7j19k57J61j39L56N7j8J3J85m00P0J80k97K41k55J1q2M7r4K55L74
4641C11n70o6M42j12k81M28l36M00j37J1k34q8M84j55l2m00P5Q7j44K25L02k10
4663@K7k42J72k10J98j29L79j62J44k09j3j69k07L16j38K53m03M42j64J9L1K50
4685A85J1l25Q6R0J09l73j42L61L29m21K04Q3L3j88J43k56M40m65Q2m0j71Q5Q7
4708e3J57k4l26J38L49l8j31j78m7J9K50j76j68J08q9J28J62j08K92l5k94M16
4730C52m44J49oj02K60j84K01l70L29J43l39j02L76m57K31K57l05N1k4m68K94
4751a58l5o6K31K37k39r1J68n8J69k22L45l53L31j51kJ53m31M7M8J3J2K6L06j14
$$ plain form
4594 337 -46 78 -226 230 114 -95 -68 18 -271 -116 29 202 -278 -95 197 -170 -171 -186 77 154 83 125 -200
4617 -200 32 39 22 -97 -354 -193 -332 24 81 63 76 261 -139 -69 111 -186 55 -200 -189 -271 -224 -318 -63 311
4641 311 -259 -325 117 5 -276 152 -184 216 79 90 -144 -232 252 97 65 -335 -260 -173 -317 -92 210 0
4663 0 27 -215 -43 -253 -55 -184 195 33 177 -32 -45 -214 -421 -105 -243 10 -393 49 -115 -96 -65 185
4685 185 196 -129 -43 47 156 -217 -359 2 331 -90 114 197 230 42 185 -71 369 -96 -14 -54 -225 -140 -53
4708 -53 104 80 -246 -108 241 203 72 -106 -153 -134 116 -60 -228 -120 -209 -81 81 -27 265 230 -64 352
4730 352 -92 57 51 -51 209 25 226 -144 185 328 -11 -113 263 -194 37 294 -11 40 16 -452 -158
4751 -158 -193 -259 -28 209 -30 -121 47 -11 158 -64 281 -72 259 108 106 259 -172 -125 -77 -64 -52 -26 280 166
4775A66m46J23L58l90O3o7r6K99p9J80j99K34l38q1K37j21R6j28K51k39K21o4
4797b0Mj24J74J35m23M08n45L86j11K70l3l37K71k21J80k74nL32JK69j83j47J61
4820A68j59J37l48L04K3j38J49n0j1K0j8k00Q2K70n94N87l27L8K10l21K13j79
4842a44J96p5oK7j29M7L40N7l95J81j03J12o4k63K92j41k6r3P5L9K3j40J84P9
4866G3q5o0K87j4l23K08J04j33m7K1j02N6J84R8l18p9l3L02r2q7J54j75j23N72
4890C88p7n20L50k66J11p5P0M0l1j13o1J77m97O07j26m6Rr9K84q1j31J42j78M48
4914C25n22O3j80N48j97k8O8j83O0l4L05l35j0L30m00J03Q9n2P5k86M08k39n9
4937a51lK18j84M82l86L49k88k22J56O0j12q7L71k18M2j09J24q8K31q0r4j67L31
$$ plain form
4775 166 -280 -157 201 -189 -126 -193 -289 10 -69 111 -88 146 -192 -273 -36 -157 -61 -189 62 -177 44 -20
4797 -20 -16 -140 34 169 -254 154 -391 -5 -116 154 121 -216 55 -166 14 -260 -265 67 68 337 154 7 168
4820 168 9 146 -202 102 125 -13 136 86 75 95 77 -123 -41 229 -365 222 -105 -67 143 -178 35 -144
4842 -144 52 -23 -29 -2 -131 -84 256 313 -82 99 -4 108 44 -219 73 -68 -94 -187 -112 -73 -50 -190 -6 73
4866 73 -12 -72 215 201 -122 86 190 57 10 31 -71 -15 169 267 -51 -130 -163 139 47 -40 114 -61 -184 388
4890 388 311 -209 141 -125 -14 -89 -19 21 -10 -123 -184 -7 -504 103 -23 -69 -60 -159 125 44 -87 55 -123 325
4914 325 -197 -134 -314 234 37 9 77 -106 -46 -80 225 -110 -120 210 -190 -87 2 -50 25 -261 147 -92 -151
4937 -151 -154 64 -120 362 -24 325 37 -185 -29 31 -81 -168 203 -15 27 -82 42 -46 185 105 11 -156 175
4960A75m16K50J85k06J95p9K49k83k16L57k25k81N44j81K5R6j6j62j41M04l52
4981g8J40J1k27L59l8j64N6k15J52J7P2nk58K61Lj3O7l93R5K54m5ML1j82R5L50
5007C49m93J37L1K5K09m57M66k15r1pk17J49k02K58j42K63l14M72r3l04n5L65
5029A34q8K5k92L36K60n08J61j11j30K93l13J89p5j07L33l2j97Q8J3jPR8j75o0
5053a52O1K97q7J75l17M2O1K03k81j78P4J43m6J35m25K14R7j45n2K71k17L29K36
5076D38m65k02L47J00l10K42j95Q6o4J45k36J2l3K22J73n90K53n3K23m32K13j4
5098a40r7K47L6p1j21J34j22k64O35m77N31J3l27N7P4q2J9n1j06N3j2MR0K83k85
5123B1J54j75j70J51j3J63p5J29k02J7L6J93k18Jj3o8p8p8N4J29k15K46j33k02
$$ plain form
4960 175 -241 9 194 -12 183 104 353 70 -146 211 -14 -295 249 68 93 189 173 11 -130 274 -78
4981 -78 62 73 -154 205 167 3 59 -156 -4 13 85 80 -178 83 86 73 140 -253 -158 96 51 55 86 -96 -1 349
5007 349 -144 -7 24 49 258 -199 267 52 -39 -46 -263 -114 -316 -58 -200 63 -251 221 128 -176 -231 134
5029 134 46 71 -221 115 375 -133 28 -83 -213 80 -233 -44 -119 -226 107 75 -122 -34 -21 -22 -15 83 -92 -152
5053 -152 -91 206 119 294 -23 19 80 283 2 -176 -102 41 -5 130 -295 -81 16 -129 -181 90 -127 202 438
5076 438 -27 -229 118 218 -92 150 -45 41 -23 122 -114 -102 -135 87 260 -330 -77 -130 93 -339 -126 -140
5098 -140 -237 10 46 -25 -146 -12 -134 -398 237 -240 291 304 -23 34 108 26 45 -6 -112 -59 -71 -67 23 306 21
5123 21 175 0 -170 -19 -32 131 56 185 -17 0 36 229 11 12 -1 -69 -147 -225 -171 -42 -257 -11 -144 -346
5147c46M1J51J6j9M3lj30J48N7L6j06q9j49L86j17K34j63k61K62j8K36n48R1R3
5171a55P4p3J80O5k17K45j37j84L25n9p3j96K26r0JM8j0r2j19J9k5N5Q3j33J36
5196a06K17o9npk47L13K09l49l7J78L1j03k68R3J58k36L41M3j67r4K33l3k79J44
5220d0M4J2k06j35L85m8K5R6j3r5j05l2n8L13o9j83J81O4k37j72M86m0l32J11
5244d8l3J68j17Q6L13k01l06N4o3L50O1l18nJ99J43j04j10J31k13M6K19k94q3
5267a25K43j50M0L3o9j96j95L87O1No5j55k7J65LK4K11m05M02k89M1J71n7n0k08
5292b05K06j15J15Oj68M67m19J85l12K47N2M3m0j09K58j38r1Q0j15j7j11L4j7
5315a64J06j71J99J07m3J59k70J85n1m24K89K25k27Q7q0rJ97j03n0J81K8j44M0
$$ plain form
5147 -346 -305 -154 -138 -157 -114 -117 -247 -99 -42 -6 -112 -201 -350 36 -81 153 -10 -271 -9 -27 209 -339 -248 -155
5171 -155 -81 -154 26 91 -126 119 -18 -202 123 64 -9 -205 21 -69 -68 -20 -30 -122 -241 -222 -247 -192 -109 -242 -106
5196 -106 111 42 37 30 -217 96 305 -44 -81 97 128 25 -243 -150 8 -228 113 156 -11 -105 128 95 -184 -40
5220 -40 4 16 -190 -325 60 12 37 133 120 25 -80 -112 -170 143 74 -109 72 136 -101 -273 213 173 -159 -48
5244 -48 -81 87 -30 56 369 168 -138 -84 -147 203 264 -54 -59 140 283 179 69 200 -13 33 252 -42 -125
5267 -125 118 -32 8 41 -28 -224 -419 -32 29 34 -31 -186 -213 -48 -45 -21 190 -215 187 -102 -61 110 53 3 -205
5292 -205 1 -114 1 7 -161 306 -113 72 -240 7 59 102 62 -47 211 73 -18 62 -53 -70 -181 -147 -164
5315 -164 -58 -229 -30 77 34 193 -77 108 57 -367 -78 147 -80 7 -73 -82 115 12 -38 143 171 27 67
5338F7j53L4l06K73L00o9O4k10q6K48qj05J57j70r7J12K47j64m9K6j63RM6n2P8
5363B9k2q1q9MK74k96J85J28K62m20J1N6L48k34m00K63o0L07k08P7j04M8p7k79
5387b78K70Q5l05L67K6k26J50O3j97k03J50M91p8j76j88J36O2j10r8o6J2K00K02
5410B89l18L04k42L7Jj38k5rK94J00n59L62k46j22J60p7L23k5J00l52J89m7J16
5433A15l81J87Q0j35J34j36Q7NK52l11oNK02o02M19J24rj0l10K45J56l38L42k2
5457I3n8k27kJ33l3L32j27k22L18k5k22M4L4J10j45j16Q5Q7%j97J65n0n2J93k58
5482a40J56J63Q4k53K82l33K9l6O2J13j23K37r7m1J35k65LL38m83K71j38P5J68
5505B07l00K18l07L28j83L0k17J87k7J45k13J21J18l22K99q6J48j96m8o7o5J29
$$ plain form
5338 67 -86 -52 -358 -85 215 146 210 0 -86 162 154 49 206 36 -61 51 298 134 85 111 -52 -43 3 -49 29
5363 29 7 -74 -163 -159 115 -181 4 132 394 -26 -15 41 389 155 -245 18 -42 265 57 134 30 78 1 -278
5387 -278 -8 77 -228 139 165 -61 89 152 -45 -248 -98 393 315 139 -49 87 149 39 -59 -125 -113 87 289
5410 289 -29 275 33 70 71 -67 -92 -101 193 293 -266 96 -150 -272 -112 -189 134 109 209 -143 46 -1 115
5433 115 -266 -79 1 -134 0 -136 -49 -44 208 -103 -109 -104 98 -504 -85 39 30 20 -290 -45 111 -227 115 93
5457 93 35 -192 -194 -61 -94 238 111 -111 207 182 -40 4 38 148 3 -113 -28 59 59 -138 27 -23 -75 118 -140
5482 -140 16 179 263 10 292 -41 -12 -48 14 127 4 241 144 103 238 -27 -24 314 -169 102 -36 39 207
5505 207 -93 125 -182 146 -37 -7 -224 -37 -64 81 -132 -11 107 -215 84 -2 146 -50 -98 -165 -230 -101
5527a01K1J08k27N4M8k26L46k38K50O7j35j27L84k65j23O3J5N0J49l12Q7J86J94
5550B68n44J9K06J39m95N33N6m66M12m34L61J22Q8k00j57L7Q6n0K82p97N84j86
5572a36J4M86m59l38P40j50p6N7j05J33j09l1q6K3p5J97n7J10k62M26k99r6Q5
5595hK00K3m11L04m7R0j57J3o7k21K45j13J89p8J33j40j97K76j32K0J16j23J18
5618C3j77q0K15k45Q2R0K22j5j06K0l61K75M4J6n6J13mK84j32k77M3L88j64n1
5642A57k78j1J95k10J20J9j90Q0K62k82m1K93j99J77N3m37R2J0K70j31j74K26
5664Ar9Q4J36k31J55l19J68P1p3J68n7k12K29o0q0J37k09K74r9o1J16r4k2J46
5688F9J77k46m9k70K28P1j64K62j59L09k15J33k50L2J3l6j0j05J48K78k51R2p4
$$ plain form
5527 -101 -80 28 -199 -145 -97 -323 23 -215 35 102 -33 -160 224 -41 -164 -101 -86 -36 113 -199 -112 74 268
5550 268 -276 -257 -51 88 -407 126 182 -284 128 -306 55 177 265 65 -92 -55 31 -19 263 -534 50 -136
5572 -136 -122 364 -95 -433 307 157 81 138 33 166 57 26 -60 -37 -112 85 28 138 -124 302 3 -93 -8
5595 -8 192 215 -196 108 61 151 -6 7 -60 -281 -36 -149 40 -38 95 -45 -242 34 -98 -78 38 -85 33
5618 33 -144 -224 -9 -254 -172 -82 140 125 19 39 -322 -47 -3 13 -43 70 66 350 218 -59 -16 372 208 157
5642 157 -121 -132 63 -147 -27 -8 -198 -118 144 -138 -179 114 -85 92 145 -292 -200 -190 80 -51 -225 1
5664 1 -98 -14 122 -109 46 -273 -105 -34 -107 61 4 -208 21 -39 -119 18 -191 83 -16 -77 39 -55 -77 69
5688 69 246 0 -49 -319 -91 -20 -184 78 -81 228 13 146 -104 -72 -59 -95 -105 -210 -62 216 -35 57 -17
5711a7J57j52J68o0q9r4J34K81l91K35P9m34J75l10J15K54M2N1j1l68K44J24O
5734A39j38j95M56k42k79M34j72K56m08J22L3P4j61O3L3j95K13j02K62k93J04
5755Dp3k6R7N06m80j71K02k1k8j04K02K3p2r8K72l19N8L95n53j51J80K7r0o5K74
5780a1j12J75q5k8K66j79k26J34J03o7N1o8j02J93l8Q2J37o56M81j6k39K20q6
5803g1O3q2L3L72l14l1oO8j81R1K7q0J34l4L03l14l44J77Q8m5L73m98L72k3o3
5828A5n7m9n9J55K10j97j0P2j12J53k75lK36l91M78k20L03k79J16j21J19J65j59
5851I0p5qQ5j44J75q1K49l10J55M8l61K87k78k2NJ40K50k71MJ22o7p3j37M03k05
5876a9r2R1J91j25j67J69k40N48ok35L8k10K32p0k48J72p2J79k10rj61J68j8m6
$$ plain form
5711 -17 140 -12 156 96 7 -87 47 328 -63 172 251 -183 -8 -318 -203 51 93 144 133 -235 9 133 139
5734 139 1 -194 262 20 -259 175 3 259 -149 -27 6 80 -81 -18 15 -180 33 -69 193 -100 4
5755 4 -69 -95 2 508 28 -143 59 38 10 -94 108 131 59 -39 233 -86 -28 367 -186 -337 -157 -130 -220 -285 -11
5780 -11 -123 52 -33 -61 205 26 -200 -66 37 -30 21 -47 -149 44 6 88 225 -431 50 34 -205 15 -71
5803 -71 -8 -90 -57 315 1 -30 -36 32 -149 -58 -31 -111 23 -11 292 -22 -366 -189 -101 -146 227 -271 101 78 15
5828 15 -42 -91 -150 5 215 18 8 80 -32 121 -154 -157 79 -312 166 -54 249 -30 86 -35 84 249 90
5851 90 15 7 92 -52 123 42 291 -19 136 184 -177 110 -168 -190 -185 -45 205 -66 -62 60 -7 -80 -217 186 -19
5876 -19 -111 -20 171 46 -121 48 -192 356 350 115 153 -57 175 105 -143 29 -43 136 -74 -83 -244 -76 -94 -140
5900a40O2q1J64J24R7k32K51j76q4J80j3k56N5K39m12K22K2p3M4j46K22k00J6
5923a15L33j65k36K07k2m0K93k25K1p5l6r6K22nj09K43l64J54n0k5L50k85q5R4
5947a6q3J66k9L4j72J51k75L72j29j1l8j30J89Lo0J04k59N77m22lj36Q1J13%k35
5972b08J66O3k53P50l15l68qL74r2O2L5k90J10r0j3J13j26K62L34l68r4K7n6J4
5996B9O7O2k57l81L06J74j48n4J64K04j54j29J88M0k28N2J05r4K16j53Q6l4ro6
6020a4l30J55L64j85j87K54l23K62k08J21L1J19j3k00L3J83j14j85N16k08o1K60
6042B70l91j74K19k42K89o4j99M65j46Q7j96j69K62K26m30J28j30K59L8J11rk02
6064Bkj78J22J61K7k17l1m4J70J59l46K86J71l25m0l76N45J66l23K06Lp9p1j80
$$ plain form
5900 -140 -78 -159 5 129 226 -6 245 69 -15 165 152 -104 -49 190 -222 0 22 -51 -7 -153 69 -131 -115
5923 -115 218 53 -183 24 2 -38 255 30 51 -24 -60 -156 66 61 -48 195 -169 -15 -65 -90 260 -25 -110 -16
5947 -16 -99 67 38 72 -100 51 -224 148 19 8 -30 -160 29 32 -28 76 -183 394 -28 -31 -167 -86 27 27 -208
5972 -208 -42 21 -232 518 203 -165 -173 201 109 171 206 -84 26 -64 -77 36 -90 172 506 138 44 71 15 29
5996 29 96 158 -99 -480 -174 0 -148 -202 -38 166 12 -117 71 111 -117 -65 40 -54 162 9 95 61 52 -14
6020 -14 -344 -189 175 -10 -197 57 -266 -4 -212 -91 -60 59 46 -154 -121 62 -52 -237 279 71 10 270
6042 270 -121 -295 -76 -318 -29 -93 -292 173 27 114 -82 -251 11 237 -193 -65 -195 64 102 213 204 2
6064 2 0 -178 -56 105 132 -85 -116 -160 10 169 -177 109 280 -45 -85 -461 84 250 -73 133 136 57 -14 -194
$$ [...]
8191G8
##END NTUPLES=NMR FID
##END=
