##TITLE=1H_SA_42.170
 CDCl3, 108 sc, 
 17.12.2019
##JCAMPDX= 6.0         $$ Bruker NMR JCAMP-DX V2.0
##DATA TYPE= NMR FID
##DATA CLASS= NTUPLES
##ORIGIN= UXNMR, Bruker Analytische Messtechnik GmbH
##OWNER= root
$$ XWIN-NMR		Version 3.5
$$ Tue Dec 17 14:52:01 2019 Russian Standard Time (UT+4h)  she@DPX200
##.OBSERVE FREQUENCY= 200.1315
##.OBSERVE NUCLEUS= ^1H
##.DELAY= (6, 6)
##.ACQUISITION MODE= SIMULTANEOUS
##.ACQUISITION SCHEME= undefined
##.AVERAGES= 108
##.DIGITISER RES= 18
##SPECTROMETER/DATA SYSTEM= spect
##.PULSE SEQUENCE= zg30
##.SOLVENT NAME= CDCl3
##.SHIFT REFERENCE= (INTERNAL, CDCl3, 0, 15.7039)
##AUDIT TRAIL= $$ (NUMBER, WHEN, WHO, WHERE, WHAT)
$$ ##TITLE= Audit trail, XWIN-NMR		Version 3.5
$$ ##JCAMPDX= 5.01
$$ ##ORIGIN= Bruker BioSpin GmbH
$$ ##OWNER= she
$$ F:/spectra/data/she/nmr/H-F/1/audita.txt
$$ ##AUDIT TRAIL=  $$ (NUMBER, WHEN, WHO, WHERE, WHAT)
(   1,<2019-12-17 14:50:21.89 +0400>,<she>,<DPX200>,
      <continue with go, POWCHK disabled, PULCHK disabled
       configuration hash MD5:
       00 E9 B6 7A A2 85 ED C7 34 08 36 98 17 FE 4E 26
       data hash MD5: 16K
       44 1D FA 10 6E CF 03 C8 78 DB A3 B9 19 40 EA A0>)
$$ ##END=
$$ 
$$ hash MD5
$$ C3 92 00 06 36 55 D0 11 43 12 6D 9A 08 22 7B 56
##$RELAX= 
##$RELAX= 
##$RELAX= 
##$RELAX= 
##$RELAX= 
##$RELAX= 
$$ Bruker specific parameters
$$ --------------------------
##$DU= <F:/spectra>
##$EXPNO= 1
##$NAME= <H-F>
##$PROCNO= 1
##$TYPE= <nmr>
##$USER= <she>
##$AMP= (0..31)
100 100 100 100 100 100 100 100 100 100 100 100 100 100 100 100 100 100 
100 100 100 100 100 100 100 100 100 100 100 100 100 100 
##$AQSEQ= 0
##$AQ_mod= 1
##$AUNM= <au_zg>
##$AUTOPOS= <>
##$BF1= 200.13
##$BF2= 200.13
##$BF3= 200.13
##$BF4= 200.13
##$BF5= 200.13
##$BF6= 200.13
##$BF7= 200.13
##$BF8= 200.13
##$BYTORDA= 1
##$CFDGTYP= 0
##$CFRGTYP= 5
##$CHEMSTR= <none>
##$CNST= (0..31)
1 1 145 1 1 1 1 1 1 1 1 1 1 1 1 1 1 1 1 1 1 1 1 1 1 1 1 1 1 1 1 1 
##$CPDPRG= <>
##$CPDPRG1= <>
##$CPDPRG2= <>
##$CPDPRG3= <>
##$CPDPRG4= <mlev>
##$CPDPRG5= <mlev>
##$CPDPRG6= <mlev>
##$CPDPRG7= <mlev>
##$CPDPRG8= <mlev>
##$CPDPRGB= <>
##$CPDPRGT= <>
##$D= (0..31)
0 1.2 0 0 0 0 0 0 0 0.06 0 0.03 0 0 0 0 0.0002 0 0 0 0 0 0 0 0 0 0 0 0 
0 0 0 
##$DATE= 1576579468
##$DBL= (0..7)
120 120 120 120 120 120 120 120 
##$DBP= (0..7)
150 150 150 150 150 150 150 150 
##$DBP07= 0
##$DBPNAM0= <>
##$DBPNAM1= <>
##$DBPNAM2= <>
##$DBPNAM3= <>
##$DBPNAM4= <>
##$DBPNAM5= <>
##$DBPNAM6= <>
##$DBPNAM7= <>
##$DBPOAL= (0..7)
0.5 0.5 0.5 0.5 0.5 0.5 0.5 0.5 
##$DBPOFFS= (0..7)
0 0 0 0 0 0 0 0 
##$DE= 6
##$DECBNUC= <off>
##$DECIM= 24
##$DECNUC= <off>
##$DECSTAT= 4
##$DIGMOD= 1
##$DIGTYP= 9
##$DL= (0..7)
0 120 120 120 120 120 120 120 
##$DP= (0..7)
150 150 150 150 150 150 150 150 
##$DP07= 0
##$DPNAME0= <>
##$DPNAME1= <>
##$DPNAME2= <>
##$DPNAME3= <>
##$DPNAME4= <>
##$DPNAME5= <>
##$DPNAME6= <>
##$DPNAME7= <>
##$DPOAL= (0..7)
0.5 0.5 0.5 0.5 0.5 0.5 0.5 0.5 
##$DPOFFS= (0..7)
0 0 0 0 0 0 0 0 
##$DQDMODE= 0
##$DR= 18
##$DS= 0
##$DSLIST= <SSSSSSSSSSSSSSS>
$$ [...]
##$SUBNAM2= <"">
##$SUBNAM3= <"">
##$SUBNAM4= <"">
##$SUBNAM5= <"">
##$SUBNAM6= <"">
##$SUBNAM7= <"">
##$SUBNAM8= <"">
##$SUBNAM9= <"">
##$SW= 24.9337058887773
##$SWIBOX= (0..15)
0 0 2 0 0 0 0 0 0 0 0 0 0 0 0 0 
##$SW_h= 4990.01996007984
##$TD= 16384
##$TD0= 1
##$TE= 0
##$TE2= 300
##$TE3= 300
##$TEG= 300
##$TL= (0..7)
0 120 120 120 120 120 120 120 
##$TP= (0..7)
150 150 150 150 150 150 150 150 
##$TP07= 0
##$TPNAME0= <>
##$TPNAME1= <>
##$TPNAME2= <>
##$TPNAME3= <>
##$TPNAME4= <>
##$TPNAME5= <>
##$TPNAME6= <>
##$TPNAME7= <>
##$TPOAL= (0..7)
0.5 0.5 0.5 0.5 0.5 0.5 0.5 0.5 
##$TPOFFS= (0..7)
0 0 0 0 0 0 0 0 
##$TUNHIN= 0
##$TUNHOUT= 0
##$TUNXOUT= 0
##$USERA1= <user>
##$USERA2= <user>
##$USERA3= <user>
##$USERA4= <user>
##$USERA5= <user>
##$V9= 5
##$VALIST= <valist>
##$VCLIST= <CCCCCCCCCCCCCCC>
##$VD= 0
##$VDLIST= <DDDDDDDDDDDDDDD>
##$VPLIST= <PPPPPPPPPPPPPPP>
##$VTLIST= <TTTTTTTTTTTTTTT>
##$WBST= 1024
##$WBSW= 4
##$XGAIN= (0..3)
0 0 0 0 
##$XL= 0
##$YL= 0
##$YMAX_a= 386130
##$YMIN_a= -228849
##$ZGOPTNS= <>
##$ZL1= 120
##$ZL2= 120
##$ZL3= 120
##$ZL4= 120
##$ABSF1= 10
##$ABSF2= 0
##$ABSG= 5
##$ABSL= 3
##$ALPHA= 0
##$AQORDER= 0
##$ASSFAC= 0
##$ASSFACI= 0
##$ASSFACX= 0
##$ASSWID= 0
##$AUNMP= <proc_1d>
##$AZFE= 0.1
##$AZFW= 0.1
##$BCFW= 1
##$BC_mod= 2
##$BYTORDP= 1
##$COROFFS= 0
##$CY= 11.3945322036743
##$DATMOD= 1
##$DC= 2
##$DFILT= <>
##$DTYPP= 0
##$F1P= 16.9975609425685
##$F2P= -3.02152046262296
##$FCOR= 0.5
##$FTSIZE= 0
##$FT_mod= 4
##$GAMMA= 1
##$GB= 0.15
##$INTBC= 1
##$INTSCL= 1
##$ISEN= 128
##$LB= 0.24
##$LEV0= 0
##$LPBIN= 0
##$MAXI= 10000
##$MC2= 0
##$MEAN= 0
##$ME_mod= 0
##$MI= 1.114404
##$NCOEF= 0
##$NC_proc= 0
##$NLEV= 6
##$NOISF1= 3.799351
##$NOISF2= 2.8
##$NSP= 1
##$NTH_PI= 0
##$NZP= 0
##$OFFSET= 15.70392
##$PC= 1
##$PHC0= -9792.384
##$PHC1= 25.20086
##$PH_mod= 1
##$PKNL= yes
##$PPARMOD= 0
##$PSCAL= 0
##$PSIGN= 0
##$REVERSE= no
##$SF= 200.130013532006
##$SI= 16384
##$SIGF1= 3
##$SIGF2= 2
##$SINO= 400
##$SIOLD= 16384
##$SREGLST= <1H.CDCl3>
##$SSB= 0
##$STSI= 0
##$STSR= 0
##$SW_p= 3612.71676300578
##$SYMM= 0
##$S_DEV= 0
##$TDeff= 0
##$TDoff= 0
##$TI= <>
##$TILT= no
##$TM1= 0
##$TM2= 0
##$TOPLEV= 0
##$USERP1= <user>
##$USERP2= <user>
##$USERP3= <user>
##$USERP4= <user>
##$USERP5= <user>
##$WDW= 1
##$XDIM= 8192
##$YMAX_p= 0
##$YMIN_p= 0
$$ End of Bruker specific parameters
$$ ---------------------------------
##NTUPLES= NMR FID
##VAR_NAME=  TIME,          FID/REAL,        FID/IMAG
##SYMBOL=    X,             R,               I
##VAR_TYPE=  INDEPENDENT,   DEPENDENT,       DEPENDENT
##VAR_FORM=  AFFN,          ASDF,            ASDF
##VAR_DIM=   8192,          8192,            8192
##UNITS=     SECONDS,       ARBITRARY UNITS, ARBITRARY UNITS
##FACTOR=    0.0002004,     1,               1
##FIRST=     0,             0,               0
##LAST=      1.6414764,     0,               0
##MIN=       0,             -228849,         0
##MAX=       1.6414764,     386130,          0
$$ Real data points
##PAGE= N=1
##DATA TABLE= (X++(R..R)), XYDATA
0@%%%%%%%%%%%%%%jM4j50K15k16K16k16K36l05L91m33M73n53O37p21Q18r22J033
$$ 0 0 0 0 0 0 0 0 0 0 0 0 0 0 0 -1 43 -107 108 -108 108 -108 128 -177 214 -219 254 -299 338 -383 435 -487 546
32E46j164J313j461J627j816K018k240K483k755L051l374L738m145M591n091N662
$$ 546 -618 695 -766 861 -955 1063 -1177 1306 -1449 1602 -1772 1966 -2179 2412 -2679 2983
48B983o312P061p931Q968j0217J1755j3708J6294j9920K5377l4697N5041k30134
$$ 2983 -3329 3732 -4199 4769 -5448 6307 -7401 8893 -11027 14350 -20347 34694 -195440
61a95440L12280R8702m34499r892L07141N5619l07783j3609K66370N0354k56977
$$ -195440 116840 215542 -218957 -228849 78292 133911 -173872 -187481 78889 129243 -127734
72a27734m5306K13269P9424j70836n0532J29553N0907j07773k2065Q7223K5251
$$ -127734 -173040 40229 119653 -51183 -101715 27838 78745 -29028 -51093 36130 61381
83F1381p2563p710N3696J9073l2970p198J3252L130m995N577O028q004j2131J0972
$$ 61381 -11182 -18892 34804 53877 20907 13709 26961 30091 25096 30673 36701 28697 16566 27538
97B7538K5761q936l9030Q762N1748J166o3009p678P0148J2622q1433j2530J01164
$$ 27538 53299 44363 5333 14095 65843 67009 4000 -3678 66470 79092 -2341 -14871 86293
110H6293K8835j16873n1910J26257P1423j26874p9710J26129P9458j35548q4563
$$ 86293 115128 -1745 -53655 72602 144025 17151 -62559 63570 143028 7480 -77083
121g7083J47733R1393j57137j06181J46441J11872j35487j19898J19731J07022
$$ -77083 70650 162043 4906 -101275 45166 157038 21551 -98347 21384 128406
131A28406j13546j10171J04118J05325r7310j06435P9804R1582p2382q3651N8798
$$ 128406 14860 -95311 8807 114132 16822 -89613 -9809 81773 9391 -74260 -15462
142a5462O0681n3865n2593M7753L5902m9931k9758M3797K3535m8766k7161L9261
$$ -15462 45219 -8646 -61239 -13486 22416 -27515 -57273 -13476 10059 -38707 -65868 -26607
154b6607K3105l9369k2037L6501J7927m0409j7182M0812J7959m8396k1025M7655
$$ -26607 -3502 -42871 -64908 -28407 -10480 -50889 -68071 -27259 -9300 -57696 -78721 -31066
166c1066K3939m7156k4265M9319L0085n3295l7432O0446N0424o4165o1815O0805
$$ -31066 -7127 -54283 -78548 -29229 856 -52439 -89871 -29425 20999 -43166 -104981 -44176
178d4176P5812n5719q0351N7989Q6706n3992r1481N0712R8428m3611r9078M1496
$$ -44176 31636 -24083 -104434 -46445 40261 -13731 -105212 -54500 43928 317 -98761 -57265
190e7265J02121l0608j00360K9180J05665j8337r8540J7187R6155r039q3584J1331
$$ -57265 44856 14248 -86112 -56932 48733 30396 -68144 -50957 45198 36159 -47425 -36094
202c6094Q3396m349p2527O858P0431l95n6555K404N0837j766m1549J0795M1312
$$ -36094 47302 42953 -29574 -22716 47715 47320 -9235 -6831 44006 42240 691 11486 52798
215E2798j2951m2528J9909M7492j8836m5894J9247M6570k3266m5117K7432N2706
$$ 52798 39847 -2681 17228 64720 45884 -10 19237 65807 42541 -2576 24856 77562
227G7562k9329n6544K7026O2623k0829o3103J8146O3598j8009o4785J9527O8809
$$ 77562 48233 -8311 18715 81338 60509 -2594 15552 79150 61141 -3644 15883 84692
239H4692k1024p4076J7581P4677j2843p8089M571P3704j441p5125n330O7876L808
$$ 84692 63668 -10408 7173 81850 69007 -9082 -4511 69193 67752 -7373 -12703 55173 58981
252E8981p0189o702O4118R974o9186j8212O1107J6032n7658j6565M8787R479m8145
$$ 58981 -11208 -17910 46208 56182 -13004 -31216 29891 45923 -11735 -28300 20487 29966 -18179
265a8179j0706M6998Q384m8261j3719M2149J1777m3226j1222L8127L027m0566
$$ -18179 -28885 18113 26497 -21764 -35483 6666 18443 -24783 -36005 2122 5149 -35417
277c5417l194M2980p51m8835l736M6199R43m6504l823M4025L08m8758n44M9171
$$ -35417 -38611 4369 3618 -45217 -48953 -2754 -1811 -48315 -52138 -8113 -7805 -56563 -57107 -7936
291g936N479n6631j0149N7854J1637n7207j3916N6968J5847n5936j5102N7370
$$ -7936 -2457 -59088 -69237 -11383 254 -56953 -70869 -13901 1946 -53990 -69092 -11722
303a1722J8727n5337k0484N4585K5991n0437k7208N0230L0610m5840k7937M8366
$$ -11722 7005 -48332 -68816 -14231 11760 -38677 -65885 -15655 14955 -30885 -58822 -10456
315a0456K9351m6414l0348M7122L3963m2447k7897M0817K8009l4072k2438L5031
$$ -10456 18895 -27519 -57867 -10745 23218 -19229 -47126 -6309 21700 -12372 -34810 221
327B21K2483l2878k0398L4550K6763l1550k2704L3626K2479l0952j6487L7361
$$ 221 22704 -10174 -30572 3978 30741 -809 -23513 10113 32592 1640 -14847 22514
339B2514J8194l7619j4569L8203J8937l3837j6938L6336J8582l5333j7105L9375
$$ 22514 40708 3089 -11480 26723 45660 11823 -5115 31221 49803 14470 -2635 36740
351C6740K2578l9297k5865L8630L1995l9209l0515L9087K9910l6970l0809L7423
$$ 36740 59318 20021 -5844 32786 64781 25572 -4943 34144 64054 27084 -3725 33698
363C3698L1306l5558l4759L3209L4784k8637l7763K4685L6867k4397l9589K5174
$$ 33698 65004 29446 -5313 27896 62680 34043 -3720 20965 57832 33435 -6154 19020
375A9020L7657k6295l9943K4423L7289k3748l8930K0641L2273k0021l1459J5722
$$ 19020 56677 30382 -9561 14862 52151 28403 -10527 10114 42387 22366 -9093 6629
387F629K7350j8499l2578J7212L1771j8229l5637J2366L2706j8619l2000J9224
$$ 6629 33979 15480 -17098 114 31885 13656 -21981 -9615 23091 4472 -27528 -8304
399h304K7864k3857l3134K3492L0530k3343l4049K0511K7744j9815l0389J9242
$$ -8304 19560 -4297 -37431 -13939 16591 -6752 -40801 -20290 7454 -12361 -42750 -23508
411b3508L0293k2668l5725K0580L8362k1192m2384J8552M0256j9749l8129J8010
$$ -23508 6785 -15883 -51608 -31028 7334 -13858 -56242 -37690 2566 -17183 -55312 -37302
423c7302L7623j8419l9128J4987L8639r684l9364P384L9137p036l6068N218L9117
$$ -37302 321 -18098 -57226 -42239 -3600 -13284 -52648 -45264 -6127 -13163 -49231 -44013 -4896
436d896n931l6537M222M0419j937l8403M534L7996j941l3123L942L2529j362l0449
$$ -4896 -10827 -47364 -43142 -2723 -4660 -43063 -38529 -533 -2474 -35597 -31655 874 -488 -30937
450c0937K241L3679J055l2316P94L5659l2l1478L119L4066k497l3117P106L7213
$$ -30937 -28696 4983 6038 -26278 -25484 10175 10143 -21335 -18216 15850 13353 -19764 -12658 24555
464B4555n589l2522O855L2172j230l0140N283L3457l893l3815N205L9892O58l8292
$$ 24555 18966 -13556 -6701 25471 24241 -5899 -616 32841 28948 -4867 338 40230 40888 2596
478B596m0L9198o86l4434K395L5916j253l6013J896L6543K526l6706n870L1841
$$ 2596 2556 41754 41068 6634 9029 44945 43692 7679 9575 46118 48644 11938 6068 37909
492C7909J0633l3313q548L2903O089l3801q749L4920Q867l3679j0316K8078J2304
$$ 37909 48542 15229 6681 39584 45673 11872 3123 38043 46910 13231 2915 30993 43297
505D3297k7388j2614K5957R689k6903j1093K5684J1216k6799j6811K5105J6503
$$ 43297 15909 3295 29252 38941 12038 945 26629 37845 11046 -5765 19340 35843
517C5843k8495j7093K5056R813k6930j2940K6938J1814l1579j5614K6595J3711
$$ 35843 7348 -9745 15311 25124 -1806 -14746 12192 24006 -7573 -23187 3408 17119
529A7119k8047j6665K5307J1250k8721j4498L1033J4357l6033j6784L2977J6032
$$ 17119 -10928 -27593 -2286 8964 -19757 -34255 -3222 11135 -24898 -41682 -8705 7327
541G327l2189j5653K7894J1920k8459j2334L0332J1698l0502j6938K7944J7161
$$ 7327 -24862 -40515 -12621 -701 -29160 -41494 -11162 536 -29966 -46904 -18960 -1799
553a799k7292j6564K1828J4302k3580j3321K3181J4830k5039j4195K0837J7839
$$ -1799 -29091 -45655 -23827 -9525 -33105 -46426 -23245 -8415 -33454 -47649 -26812 -8973
565h973j7871j6865J4457J7930j3296j5168J5346J9118j4663j7115J5483K1172
$$ -8973 -26844 -43709 -29252 -11322 -24618 -39786 -24440 -5322 -19985 -37100 -21617 -445
577d45j1685k0682J3836K3058j2684j7308J5445J9961j4367j9662J5830K5843
$$ -445 -12130 -32812 -18976 4082 -8602 -25910 -10465 9496 -4871 -24533 -8703 17140
589A7140j3000k5599J4264K6734j1119k3573J3431K6136j5185k3891J9538K6185
$$ 17140 4140 -21459 -7195 19539 8420 -15153 -1722 24414 9229 -14662 4876 31061
601C1061j5374k5371J7291K7912j4631k3524J5817K5043j4394k3418J6606K6766
$$ 31061 15687 -9684 7607 35519 20888 -2636 13181 38224 23830 412 17018 43784
613D3784j6759k4605J8392K4908j7105k2222J8403K1362j8311j9348J9505J9349
$$ 43784 27025 2420 20812 45720 28615 6393 24796 46158 27847 8499 28004 47353
625D7353j7608k1236J7216K0857j5319k3594J2757K2192j2801k3931J1773K1245
$$ 47353 29745 8509 25725 46582 31263 7669 20426 42618 29817 5886 17659 38904
637C8904j1946k3098R227K0037r083k1786M222J8787l179k2469M77J6795j031
$$ 38904 26958 3860 13087 33124 24041 2255 6477 25264 22085 -384 93 16888 15857
650A5857k0097l507K1127j421k4898l206K4454J332k5180l642K1355K940k2007
$$ 15857 -4240 -7747 13380 11959 -12939 -16145 8309 9641 -15539 -19181 2174 5114 -16893
663a6893l951K0264J309k2402k413K3365J612k6514m896K6279L979k9728k187
$$ -16893 -20844 -580 729 -21673 -24086 -721 891 -25623 -30519 -4240 -261 -29989 -32176
676c2176K6737k750k7729k584K9034m79l0016k813K6305M504k5055n119K2617
$$ -32176 -5439 -8189 -35918 -38502 -9468 -9947 -39963 -42776 -16471 -11967 -37022 -42141 -19524
689a9524J995k0484l121K4667L243k5295k497K6346N592k2236K57J9558K641j8195
$$ -19524 -17529 -38013 -41134 -16467 -13224 -38519 -41016 -14670 -9078 -31314 -31057 -11499 -8858 -27053
703b7053M454J9948j27k0266J555K1965L638j7426k288J6786K629j7548K347J9891
$$ -27053 -22599 -2651 -2778 -23044 -21489 476 4114 -13312 -15600 1186 3815 -13733 -11386 8505
717H505K86k2754J214K3045L968j9521k847J5725N406j2389l136J6850L390j5071
$$ 8505 8791 -13963 -12749 10296 14264 -5257 -8104 7621 13027 638 -2498 14352 17742 2671
731B671m531J7804J2689j7139q930J6183R003j1511n708J4468N222j4587n436
$$ 2671 -1860 15944 28633 11494 2564 18747 27750 16239 10531 24999 30221 15634 10198
744A0198J7295Q770j4194j3272J4885J2088j2721j0669J1983J0246j7106j0601
$$ 10198 27493 36263 22069 8797 23682 35770 23049 12380 24363 34609 17503 6902
756F902J8629J2917k1634j3845J8062J3215j8745j2796J7040J1370j9700j4458
$$ 6902 25531 38448 16814 2969 21031 34246 15501 2705 19745 31115 11415 -3043
768c043K0256J5776k1053j9962J8403J9369j6700k1838J5819J6316j7800j7658
$$ -3043 17213 32989 11936 -8026 10377 29746 13046 -8792 7027 23343 5543 -12115
780a2115J9412J4834k1992j6614J7925J4270j6616j6147J4261J2401j6693j4729
$$ -12115 7297 22131 139 -16475 1450 15720 -896 -17043 -2782 9619 -7074 -21803
792b1803J6820J3281j7974j5561J6277J2146j3043j5512J4793P867j3700q745
$$ -21803 -4983 8298 -9676 -25237 -8960 3186 -9857 -25369 -10576 -2709 -16409 -25154
804b5154J2462Q187j3020q938R446J0311r781r321N232R468o056q664N117J0092
$$ -25154 -12692 -4505 -17525 -26463 -17017 -6706 -16487 -25808 -20576 -11108 -17164 -25828 -20711 -10619
818a0619o296j0329N334J1032m275r350K864R897J82r849J272J2523J12j5070
$$ -10619 -16915 -27244 -21910 -10878 -15153 -24503 -21639 -11742 -11560 -21409 -20137 -7614 -7502 -22572
832b2572K094J7613k09j7443K986J7825j009j7591L603K0371l108j8406K359K2969
$$ -22572 -20478 -2865 -3074 -20517 -17531 294 -715 -18306 -14703 5668 2560 -15846 -13487 9482
846I482j089k1461L790K0432o55k1450M973K3383m703k1367O642K2991o272j9993
$$ 9482 8393 -13068 -9278 11154 10499 -10951 -5978 17405 12702 -8665 -2023 20968 14696 -5297
860e297R766K0456p745j8249Q854J9954q763j8130Q813J9357p292j6509O233J7373
$$ -5297 4469 24925 17180 -1069 7785 27739 18976 846 9659 29016 21724 5215 11448 28821
874B8821p571j4650Q422J4195o831j5108N701J3001m653j1042K611J1100l193
$$ 28821 21250 6600 15022 29217 22386 7278 12979 25980 21327 10285 12896 23996 20803
887B0803r890L165Q982k296j1062L4J0992Q57j0185l227Q868J983r996k843R172
$$ 20803 10913 14078 23060 20764 9702 9736 20728 21585 11400 8173 17041 19024 9028 6185 15357
902A5357K370j2831n122J0621O619j3499q272J0710O268j3857q157J4022N475
$$ 15357 17727 4896 -226 10395 17014 3515 -4757 5953 12221 -1636 -9793 4229 9704
915I704j7536p814J6405O533j8092p682J6110L659j7241n171J7085L025j7448
$$ 9704 -7832 -15646 759 7292 -10800 -18482 -2372 1287 -15954 -21125 -4040 -1015 -18463
928a8463o484J9123N952j8843p100J8235L840j8374l080J7424k9j7022j877J5293
$$ -18463 -24947 -5824 128 -18715 -25815 -7580 -3740 -22114 -25194 -7770 -7799 -24821 -26698 -11405
942a1405K737j4938l628J4531R77j1944l364J3046K485j1737j538J0353L847r739
$$ -11405 -8668 -23606 -27234 -12703 -11726 -23670 -27034 -13988 -11503 -23240 -24778 -14425 -10578 -20317
956b0317m096J1053N226j0474k920R341O094q760l551R525O425p333o201Q959
$$ -20317 -24413 -13360 -8134 -18608 -21528 -12187 -6093 -14853 -18404 -8879 -2454 -9787 -15988 -7029
970g029Q626p298p909J0450R328q443p296J0346R938r558q130R809Q799p478q225
$$ -7029 1597 -5701 -13610 -3160 6168 -2275 -9571 775 10713 1155 -6975 2834 11633 4155 -4070
985d070J0182J1304j0644j0131J1317J1290q195j0514J0934J0571j1203q344J1920
$$ -4070 6112 17416 6772 -3359 7958 19248 11053 539 11473 22044 10841 2497 14417
998A4417J0805j1125r712J1945R643q907q448Q787Q503p309q669P559R654p516
$$ 14417 25222 14097 4385 16330 25973 17066 8618 17405 25908 18599 9930 17489 27143 19627
1012A9627j0466P943R989p810r188O167P119o813o583N858O140p963p567N880
$$ 19627 9161 17104 27093 19283 10095 16262 23381 16568 9985 15843 21983 14020 6453 12333
1026A2333P963o590j0814M599R091m724j1437M571R690p093j1666N792J0235m934
$$ 12333 20296 13706 2892 7491 16582 11858 421 4992 14682 7589 -4077 1715 11950 7016
1040G016j1289K116J0266n464r803L669R217p178j1394L509J3430n708j3854K282
$$ 7016 -4273 -2157 8109 2645 -7158 -3489 5728 -1450 -12844 -9335 4095 -1613 -15467 -13185
1054a3185J2921o685j0613L696J1146q296j1275O234J1691o324j1949J436J2106
$$ -13185 -264 -6949 -17562 -13866 -2720 -11016 -22291 -16057 -4366 -10690 -22639 -21203 -9097
1067i097k442j0438L206Q480l932j1812N825J2445m111j2629K540J1549k004q593
$$ -9097 -11539 -21977 -18771 -10291 -14223 -26035 -20210 -7765 -11876 -24505 -21965 -10416 -12420 -21013
1081b1013K981Q316k240r320K765J1140j158r673p11J1095N14r291J290J0267
$$ -21013 -18032 -9716 -11956 -21276 -18511 -7371 -8529 -18202 -18913 -7818 -7304 -16595 -15305 -5038
1095e038n38q864K086J1650r96r430K93J1327P63p554O13R759O71r076J076J2216
$$ -5038 -5576 -14440 -12354 -704 -1700 -11130 -10837 490 1253 -6301 -5688 4071 4742 -4334 -3258 8958
1111H958P29j1123k63J3226O53q998M79Q804M08r533J823J0317M44r472m15J0840
$$ 8958 9687 -1436 -1699 11527 12180 3182 3661 12465 12873 3340 5163 15480 15924 6452 6037 16877
1127A6877K399r269j552R313K412r336j158J0508J537j0484k819J2503J609r983
$$ 16877 19276 10007 8455 17768 20180 10844 9686 20194 21731 11247 8428 20931 22540 12557
1141A2557k474J0250N01q628j787Q886J758r913l911R059L537r911l657Q407L872
$$ 12557 10083 20333 20834 12206 10419 19305 21063 11150 7239 16298 19835 9924 6267 14674 18546
1156A8546j1871k611Q421K278j1760k993Q487L852p757o454Q249K972q950m991
$$ 18546 6675 4064 12485 14763 3003 10 8497 12349 4592 -1862 6387 9359 409 -4582
1170d582Q757L995r694p609Q990M219q297n431P912J403q917l262P190L087r946
$$ -4582 4175 8170 -1524 -9133 -143 4076 -4221 -9652 -1740 -337 -9254 -12516 -5326 -2239 -12185
1185a2185m560O352M286q125m369O233M784q693m214Q803M164r583m052Q151M227
$$ -12185 -16745 -10393 -6107 -14232 -18601 -12368 -7584 -16277 -20491 -11688 -7524 -17107 -21159 -13008 -8781
1200h781p187l838N227M543n906l005N457M932n491p531O798P869m795p262M922
$$ -8781 -15968 -19806 -14579 -10036 -15942 -18947 -13490 -8558 -14049 -21580 -14782 -6913 -11708 -18970 -14048
1215a4048O993m640m260N170O010p165m687O487O177m216m773L410O947k927n776
$$ -14048 -7055 -11695 -15955 -10785 -4775 -11940 -16627 -10140 -3963 -8179 -12952 -9542 -2595 -5522 -11298
1230a1298N089R412n315p507O546J0417l592q624N822P448l783n495N387Q125
$$ -11298 -6209 3203 -2112 -9619 -3073 7344 3752 -4872 950 8398 4615 -880 4507 12632
1244A2632n045p394N859R988m272r297N414R412m701p038N471P816n908p615O610
$$ 12632 7587 193 6052 16040 11768 2471 7885 17297 12596 5558 11029 18845 12937 5322 11932
1259A1932Q799n660p825O162O438n496n548M790N173m663n697N693P362n577p756
$$ 11932 20731 15071 7246 13408 19846 14350 8802 13592 18765 14102 8405 14098 21460 15883 8127
1274H127L763O789m555n378L460M220l971m814M909K864l507n590J223N532j417
$$ 8127 11890 18679 14124 8746 12206 16426 12455 7641 12550 15414 11907 6317 7540 13072 11655
1289A1655n305r89N540k114o826J850M537j540o611o93O501j50p180l251N065
$$ 11655 6350 5361 10901 8787 1961 3811 8348 6808 197 -496 6005 5855 -1325 -4576 489
1304D89J927p210m142P004J485q932k958P559K88p708j116O234P13q877o7Q374
$$ 489 2416 -4794 -8936 -1932 -447 -9379 -12337 -4778 -4490 -12198 -13314 -7080 -6367 -15244 -15311 -6937
1320f937j709q077j40R526l57r477m96J0966r11j0463P23J0918j150j0821K600
$$ -6937 -8646 -16723 -16863 -7337 -7694 -17171 -17667 -6701 -7612 -18075 -17352 -6434 -7584 -18405 -15805
1335a5805R905k657j0165L835R036m496r247L624R159k051q684K164P506k25p948
$$ -15805 -5900 -8557 -18722 -14887 -5851 -10347 -19594 -15970 -6811 -8862 -17546 -15382 -7876 -8101 -16049
1350a6049J021Q347J69p253J327O755J439n422J834N477n17l402J326M882J209
$$ -16049 -15028 -6681 -6512 -13765 -12438 -5683 -4244 -9666 -7832 -2355 -2872 -6274 -4948 -66 1143
1365A143l095o36N423L963l595k878L593M050k763j616L226M448m297m862N962
$$ 1143 -1952 -2588 2835 6798 3203 325 3918 7968 5205 3589 6815 11263 6966 2104 8066
1380H066M932l842n466N035N967l268o718N623O434n272p511P286Q073o630p171
$$ 8066 12998 9156 3690 8725 14692 11424 4706 10329 16763 11491 3980 11266 19339 12709 5538
1395E538O264P779p270n082O941N153p116n974Q261M128q267m636O883N001p727
$$ 5538 11802 19581 12311 7229 14170 19323 12207 6233 14494 18622 10355 5719 12602 17603 9876
1410I876l419P444K129j0045l986J0072K798r693l970P221J372o710r25M633q62
$$ 9876 6457 13901 16030 5985 1999 12071 14869 5176 1206 8427 9799 3089 2164 6797 5935
1425E935n497r06M474K280o626k393L256K010l284m623L900J9n102L01K244J715
$$ 5935 438 -468 4006 6286 -340 -2733 523 2533 -751 -5374 -1474 -1455 -6557 -6256 -4012 -2297
1441b297k888m375Q42J998j74l208j156L840j958m326J870N262m262n279K333
$$ -2297 -5185 -9560 -8718 -6720 -6894 -10102 -11258 -7418 -9376 -13702 -11832 -6570 -10832 -16111 -13778
1456a3778N280j287n593O04N016j619m710J925P086k768p490K938Q193j697p969
$$ -13778 -8498 -9785 -15378 -14774 -9758 -11377 -16087 -14162 -7076 -9844 -17334 -14396 -6203 -7900 -15869
1471a5869K979P204l318o995M134Q896m688q905N272Q588l403p836M711Q309l479
$$ -15869 -12890 -5686 -9004 -15999 -11865 -2969 -7657 -16562 -11290 -2702 -6105 -13941 -9230 -921 -4400
1486d400o495M294Q385n121o164N497O969k513o482N584N383m029m061N512N472
$$ -4400 -10895 -6601 1784 -3337 -9501 -4004 2965 452 -6030 -446 4937 908 -3153 2359 7831
1501G831m381l501K555O116j611l616J824M766j543l747K392N823j662n141K149
$$ 7831 3450 -51 2504 8620 7009 3393 5217 9983 8440 4693 7085 12908 11246 6105 8254
1516H254M608o91l347J97L111M58l729J855K910P21m030k536P355j78m643k773
$$ 8254 12862 12171 8824 9021 12132 12590 8861 10716 13626 14347 10317 7781 15136 14958 10315 7542
1532G542O190M18n183k80M645r18o402R91M719O04m955k233M487jn005k307M756
$$ 7542 13732 14150 8967 8687 13332 12414 6012 7003 11722 12326 7371 5138 9625 9624 4619 2312 7068
1549G068R85o883O52N962K19p252k523O081J155n097j246L547p10n134k506N647
$$ 7068 8053 1170 1822 7784 8003 751 -1772 4309 5464 367 -879 2668 1958 -3176 -5682 -35
1565c5J619o234k640L539K352o734k055O851o66p912Q3N818J075o367k341N139
$$ -35 1584 -4650 -7290 -3751 -1399 -8133 -10188 -3337 -4003 -11915 -11832 -6014 -4939 -11306 -13647 -8508
1581h508J608n484p43L125K374o732j108N479L830o473k438N472J742m629r54
$$ -8508 -6900 -12384 -13127 -10002 -7628 -14360 -15468 -9989 -6159 -12632 -15070 -9598 -7856 -12485 -13439
1596a3439N696j167l815j089N583R57m096m66L736K471m121k46K412J915k978
$$ -13439 -7743 -8910 -12725 -13814 -8231 -7274 -11370 -11836 -8100 -5629 -9750 -9996 -7584 -5669 -8647
1611h647r36N204J614k870k763M858L046l382k334N374J317k633j111L701L039
$$ -8647 -9583 -4379 -2765 -5635 -8398 -3540 -494 -3876 -6210 -836 481 -2152 -3263 438 3477
1626C477k30l817K567L769j262l634K860M674l103j771L143M383k213m886M457
$$ 3477 3247 -570 1997 5766 4504 870 3730 8404 5301 3530 6673 11056 8843 3957 8414
1641H414L067k260l368L494M234l372m789M086M554k891m542K831N169k899m010
$$ 8414 11481 9221 5853 9347 13581 10209 5420 9506 14060 11169 6627 9458 14627 11728 7718
1656G718K730N203n632l005L890L587l296l982K961L225k911m264K993L623m683
$$ 7718 10448 15651 10019 7014 10904 14491 11195 7213 10174 13399 10488 6224 9217 12840 8157
1671H157l638L211K998m014m084M130K304l989k856J435K669l289l894L089K534
$$ 8157 4519 7730 10728 6714 2630 6760 9064 5075 2219 3654 6323 3034 -860 2229 4763
1686D763k443n400J917K742k847k934J164L420k923l929J834L214k730m002Q90
$$ 4763 2320 -3080 -1163 1579 -1268 -4202 -3038 382 -2541 -6470 -4636 -1422 -4152 -8154 -7264
1701g264L954k263k812M70L193q16n294J059M180j139n352l21O578j145n841J435
$$ -7264 -3310 -5573 -8385 -7915 -4722 -5538 -10832 -9773 -5593 -6732 -12084 -12405 -5827 -6972 -12813 -11378
1717a1378L869r42n112J499M977j789m445J335L447J029m306J090L646j350l714
$$ -11378 -7509 -8451 -13563 -12064 -7087 -8876 -13321 -11986 -8539 -7510 -11816 -10726 -7080 -8430 -12144
1732a2144J714O025j416m927J858N400j477l152K043L679j347m094L859K267N40
$$ -12144 -10430 -4405 -5821 -10748 -8890 -3490 -4967 -8119 -6076 -2397 -3744 -7838 -3979 -1712 -1172
1747a172m008N91N266J018m780Q91M102l68k587J201N003j233l478J265L243J932
$$ -1172 -5180 -4589 677 1695 -3085 -2194 1908 1540 -1047 154 5157 3924 446 1711 4954 6886
1763F886k515k1J833J732l045j07N238n06l941J342L755J925n804n71L264J187
$$ 6886 4371 4350 6183 7915 4870 4763 10001 9495 5554 6896 10651 12576 6772 6201 9465 10652
1779A0652k154J063K659N4m025j217M928K57k346k787L930J897m751k256O269
$$ 10652 8498 9561 12220 12274 8249 7032 11960 12217 9871 7084 11014 12911 8160 5904 12173
1794A2173K02n333j657L424K700n240k157M047P73m957m87K466P77l490j730L963
$$ 12173 12375 7042 5385 8809 11509 6269 4112 8159 8932 3975 3488 5954 6731 3241 1511 5474
1810E474l15l410k241L365J046m738o32K274M71l488j631J936J958l933j643K322
$$ 5474 5159 1749 -492 2873 3919 -819 -1451 823 1294 -2194 -3825 -1889 69 -3864 -5507 -3185
1826c185J065k938k309L463J50l966j266K690K082l617k191J733J694k932j169
$$ -3185 -2120 -5058 -7367 -3904 -3754 -7720 -8986 -6296 -4214 -7831 -10022 -8289 -6595 -9527 -10696
1841a0696K677J652k627l174J402L619j520m173J719L126k237k913M219J461k867
$$ -10696 -8019 -6367 -8994 -12168 -10766 -7147 -8667 -12840 -11121 -7995 -10232 -13145 -8926 -7465 -10332
1856a0332l041M689J638j019l030K407L074j310k550K797L578j373m569M173N048
$$ -10332 -13373 -8684 -7046 -8065 -11095 -8688 -5614 -6924 -9474 -6677 -3099 -4472 -9041 -4868 180
1871A80l249l622K375M023l747L3L317K408m507l72L121K070j025k353K842J894
$$ 180 -3069 -6691 -4316 -293 -4040 -4007 -690 1718 -2789 -3161 -40 2030 1005 -1348 1494 3388
1887C388q97k780L031M174l590k606M137M189l121j404J095J979q42j532K228
$$ 3388 2491 -289 2742 6916 3326 720 4857 9046 5925 4521 5616 7595 6753 5221 7449
1902G449J181q57j033J382L724j401k839J06K817q15k273K392P79j005k682Q93
$$ 7449 8630 7773 6740 8122 11846 10445 7606 7712 10529 9714 7441 9833 10612 9607 6925 7818
1918G818K586n67j716o11K066k53k191K76Q01o4k893n92M002j107n226L45M182
$$ 7818 10404 9837 8121 7510 9576 9323 7132 7408 8209 8145 5252 4660 8662 7555 2329 2674 6856
1935F856j204l371J525O24j099k078q20K810o23l308j067L522q83k130j414L342
$$ 6856 5652 2281 3806 4430 3331 1253 433 3243 2620 -688 -1755 1767 884 -1246 -2660 682
1951F82j624l304J664J823j113m551O50L416r82k174q43K263j52k936j187L740
$$ 682 -942 -4246 -2582 -759 -1872 -6423 -5773 -2357 -3339 -5513 -6356 -4093 -4245 -7181 -8368 -4628
1967d628l80m000j241M407r22m234Q02K827j560j834J191O2J076l159O77K146
$$ -4628 -5008 -9008 -10249 -5842 -6764 -10998 -10196 -7369 -8929 -10763 -9572 -9510 -8434 -11593 -10916 -8770
1983h770K52o54l82J496L54k107P52L109m05j279q40L286O50j388r13K844M8j641
$$ -8770 -8518 -9172 -9554 -8058 -7704 -9811 -9059 -5950 -6355 -7634 -8474 -5188 -4538 -5926 -6839 -3995 -3947 -5588
2001e588M97K685l4k079Q60J602K850k464j269K329J507k762J67L073J404k203
$$ -5588 -5091 -2406 -2440 -4519 -3659 -2057 793 -1671 -2940 -611 896 -1866 -1699 1374 2778 575
2017E75j393K909K581j502j852K617K329k688J320J245K906k428k388L748J529
$$ 575 -818 2091 4672 3170 1318 3935 6264 3576 4896 6141 9047 6619 4231 7979 9508
2032I508k849r99K164J851k867k85K375J601l618L92J744J103k505k12J496J491
$$ 9508 6659 5660 7824 9675 6808 6523 8898 10499 6881 7273 9017 10120 7615 7403 8899 10390
2048A0390l632R1L517O65m737p32L001J244l234k125L269P76m481k41K848J294
$$ 10390 6758 6849 10366 11031 6294 5562 8563 9807 6573 4448 7717 8493 4012 3771 6619 7913
2064G913l519j296J989M66k930j644K064J120l438j103K838M22l325j554J621
$$ 7913 4394 3098 5087 5553 2623 979 3043 4163 725 -378 2460 2882 -443 -1997 -376
2079c76Q94j282j240q85P77p08p87l13O17K34j995l23L204j247l262R08O17n24
$$ -376 518 -764 -2004 -2889 -2112 -2820 -3607 -3920 -3303 -3069 -5064 -5387 -2183 -3430 -6692 -5784 -5167 -5691
2097e691k605J922J166r51l642J10L948j308k150m20K060K94l066J733K069j509
$$ -5691 -8296 -6374 -5208 -6159 -9801 -9691 -5743 -7051 -9201 -9621 -7561 -7267 -10333 -8600 -6531 -8040
2113h040l397J984L488j401r95N02K100o5l056J830L905k309k775K293L969j504
$$ -8040 -11437 -9453 -5965 -7366 -8361 -7859 -5759 -5824 -8880 -7050 -3145 -5454 -8229 -5936 -1967 -3471
2129c471k806K331K809k260j731L628K943l891m09L232J059j404j552K707J472
$$ -3471 -6277 -3946 -1137 -3397 -5128 -1500 1443 -2448 -2857 375 1434 30 -1522 1185 2657
2144B657j707n5K647Q70k763k03J761K531j398o20P65Q42l28j81J621P03k97q65
$$ 2657 950 895 3542 4412 1649 1446 3207 5738 4340 3720 4485 5327 4999 4818 6439 7142 6845 5980
2162E980P3K073O54j978p77K029l92k78m57K660q27k217J58J960k3j540p99J137
$$ 5980 6053 8126 8780 6802 6025 8054 7662 7384 6927 9587 8760 6543 6701 8661 8638 7098 6299 7436
2180G436J959l363j046K567J454m982r03L891J687m826q6K448j166k027r20L636
$$ 7436 9395 6032 4986 7553 9007 4025 3122 7013 8700 3874 3788 6236 5070 3043 2123 5759
2196E759k297l101n45L254M57k495j795J906K23k827L66K491j655l175j24L729
$$ 5759 3462 361 -184 3070 3527 1032 -763 1143 1366 -1461 -1095 1396 -259 -3434 -3558 171
2212A71r84m054R11J111n12k268K122j51J17m194N03L037j782m20O16j70l02n97
$$ 171 -813 -4867 -3956 -2845 -3357 -5625 -3503 -3654 -3537 -7731 -7228 -4191 -5973 -6393 -5777 -5947 -6249 -6846
2230f846l19J342j151j020j64K063q85o06j43J62M88l85N0K60J193k088k6K299
$$ -6846 -7165 -5823 -6974 -7994 -8158 -6095 -6980 -7586 -7729 -7567 -7079 -7464 -7414 -7154 -5961 -8049 -8075 -5776
2248e776J978j893k514L112K336j537j123P22J122n94o75J868J879q97k072K98
$$ -5776 -3798 -5691 -8205 -5093 -2757 -4294 -5417 -4695 -3573 -4167 -4842 -2974 -1095 -1992 -4064 -3766
2264c766K652M44k812L451J152j815j251K657K428l067k180M087K050j443j855
$$ -3766 -1114 -670 -3482 -31 1121 -694 -1945 712 3140 73 -2107 1980 4030 2587 732
2279G32K322K854k847k88J787L187l296j315J173K822j659j167K301J284j246
$$ 732 3054 5908 3061 2773 4560 7747 4451 3136 4309 7131 5472 4305 6606 7890 6644
2294F644o79J851J045k423L51Q38k11m26m89J600j29l69j449m56J962j050j658
$$ 6644 5965 7816 8861 6438 6789 7627 7416 6990 6501 8101 7972 7603 6154 5698 7660 6610 4952
2311D952J467J385j552j463P65Q19j031j175P11P97j391k348R73J833j352k140
$$ 4952 6419 7804 6252 4789 5554 6373 5342 4167 4878 5675 4284 1936 2909 4742 3390 1250
2327A250L81J016K6k725J535L75r92j991J90R90k54j641j120J583n22k676M65
$$ 1250 1631 2647 2673 -52 1483 1858 866 -1125 -935 55 -199 -1840 -2960 -1377 -1899 -4575 -4110
2344d110K060q10k257n3J885n55j998j019K850j856k177J196K480j902j941J774
$$ -4110 -2050 -2860 -5117 -5170 -3285 -3840 -5838 -6857 -4007 -5863 -8040 -6844 -4364 -6266 -8207 -6433
2360f433J882k269j364J446J736k820k74J176K364q01k412N63J603l72j534P50
$$ -6433 -4551 -6820 -8184 -6738 -5002 -7822 -8096 -6920 -4556 -5357 -7769 -7206 -5603 -5975 -7509 -6759
2376f759J968r09r46P18J830n34j451K12K357R51j443m01J196l30J16J397J268
$$ -6759 -4791 -5700 -6646 -5928 -4098 -4632 -6083 -5871 -3514 -2563 -4006 -4407 -3211 -3541 -3425 -2028 -760
2393g60n80j284N51K523L00l26J00J368j01r81J083J798L72j600n68K969J082
$$ -760 -1340 -2624 -2073 450 750 424 524 1892 1791 810 1893 3691 4063 2463 1895 4864 5946
2410E946l346J488J120N98l117K850J739j790m67J1K084M59k127j45J642l27k64
$$ 5946 2600 4088 5208 5806 2689 5539 7278 5488 5021 5032 7116 7575 5448 5303 6945 6618 6354
2427F354j267K918j026j184M1K292o63j149m90k36J523j622n57P13J043n20k096
$$ 6354 5087 8005 6979 5795 5836 8128 7465 6316 5826 5590 7113 5491 4934 5647 6690 6170 4074
2444D074M38J483k284o00J143l37j618o07K703j045j531m59K324m10k535j68N1
$$ 4074 4512 5995 3711 3111 4254 3917 2299 1692 4395 3350 1819 1360 3684 3274 739 571 622
2461F22Q68k680l70J752p9k439j611K497J27j754m70J470q61j912K40P72P7j832
$$ 622 1490 -1190 -1560 192 113 -2326 -3937 -1440 -1313 -3067 -3537 -2067 -2928 -4840 -4600 -3828 -3751 -5583
2479e583K41k00J735j277j013M31Q94j367Mk99J637k171j248L138l71j363J63
$$ -5583 -5342 -5542 -3807 -5084 -6097 -5666 -4772 -6139 -6135 -6434 -4797 -6968 -8216 -5078 -5449 -6812 -6649
2496f649J49J210j589N97J477l48j169K04m70J417N6j799K067K79j149k09K317
$$ -6649 -6500 -5290 -6879 -6282 -4805 -5153 -6322 -6118 -6588 -5171 -5115 -6914 -4847 -4568 -5717 -5926 -3609
2513c609K95p73j454K784o7K81r97L72K180q89j464K623K022q94k081J998K687
$$ -3609 -3314 -4087 -5541 -2757 -2824 -2543 -3540 -3168 -988 -1877 -3341 -718 1304 410 -1671 327 3014
2530C014k375K5J233R70n19q24K825q87j182Q80O30J126j009o88Q32J760k12j078
$$ 3014 639 664 1897 2867 2348 1524 4349 3462 2280 3160 3790 4916 3907 3219 4051 5811 5599 4521
2548D521M7J794k029M36J205R00k87k113J769l07l01J547j077n01P05j295J942
$$ 4521 4568 6362 4333 4769 5974 6874 6587 4474 6243 5936 5635 7182 6105 5604 6309 5014 6956
2565F956L49M43l321N68J463j556K24m2K36k7k382J406J530p08k002K72K57O73
$$ 6956 7305 7748 4427 4995 6458 4902 5126 5084 5320 5293 2911 4317 5847 5139 3137 3409 3666 4339
2583D339j572q95J356j295j243K60J797j931k324J663N94j173j427O87m71j581
$$ 4339 2767 1872 3228 1933 690 950 2747 816 -1508 155 749 -424 -1851 -1164 -1635 -3216
2599c216j837J684J614j649j692L01R12N19j950Q10J65J08k202J610J55r05j43
$$ -3216 -5053 -3369 -1755 -3404 -5096 -4795 -3883 -3364 -5314 -4504 -4339 -4231 -6433 -4823 -4668 -5573 -5716
2616e716k44Q08j36o91j126K420j832o15J661P48j92k002K22Q53J961j654l68
$$ -5716 -5960 -5152 -5288 -5979 -7105 -4685 -6517 -7132 -5471 -4723 -4915 -6917 -6695 -5842 -3881 -5535 -5903
2633e903m18M99o03R67J329j235M55q46J342J137k58j602J253R47q28J32J655
$$ -5903 -6321 -5822 -6425 -5458 -4129 -5364 -4909 -5755 -4413 -3276 -3534 -5136 -3883 -2936 -3764 -3632 -1977
2650a977J579j068m77K112P17j450O90O72j51j067J13J996J222j711L45J826M86
$$ -1977 -398 -1466 -1943 169 886 -564 126 798 647 -420 -307 1689 2911 1200 1545 3371 3857
2667C857p06q31J037J443j349J81K717p85j753r8K363p72j286J081N45J200k229
$$ 3857 3151 2320 3357 4800 3451 3632 6349 5564 3811 3713 6076 5304 4018 5099 5644 6844 4615
2684D615j0K813j484j126j85K375p75j287J98N53k46r59M92J133p48j113O96K32
$$ 4615 4605 7418 5934 4808 4623 6998 6223 4936 5134 5687 5441 4482 4974 6107 5359 4246 4942 5174
2702E174J34j060O81p79M08k27j956J619n90r72m24J171N73k275J352q17p69o5
$$ 5174 5308 4248 4929 4150 4558 4331 2375 3994 3404 2432 2008 3179 3752 1477 2829 2012 1243 1178
2720A178j367M44L53r52q19l97O62m52r59o06Q94j386j041J406NJ52l380J848
$$ 1178 -189 255 608 -344 -1163 -1560 -898 -1350 -2309 -2915 -2021 -3407 -4448 -3042 -3037 -2885 -6265 -4417
2738d417P96j352k70l81J616k89j745N02J251k66k915K426J630j855k129K322
$$ -4417 -3621 -4973 -5243 -5624 -4008 -4297 -6042 -5540 -4289 -4555 -7470 -5044 -3414 -5269 -7398 -5076
2754e076Q8lj261J425Q83k767k53J957J104j054j141K485Kj552O56N54P13q89
$$ -5076 -4988 -4991 -6252 -4827 -3944 -6711 -6964 -5007 -3903 -4957 -6098 -3613 -3611 -5163 -4507 -3953 -3240 -4129
2772d129P6R05J134j442J526N28l21q07J554P67j220J383j600J677O51P70j153
$$ -4129 -4053 -3148 -2014 -3456 -1930 -1402 -1723 -2530 -976 -209 -1429 -46 -1646 31 682 1452 299
2789B99j74J912j522N87J520l40L11j404J487Q20N31q26k38M35J884q37j03J307
$$ 299 125 2037 515 1102 2622 2282 2593 1189 2676 3496 4027 3201 2963 3398 5282 4445 4342 5649
2807E649n72j150p5K770p46j393K66L90O04p78M8M19r81k00K63J729k99k074j437
$$ 5649 5077 3927 3852 6622 5876 4483 4749 5139 5743 4965 5013 5432 4451 4251 4514 6243 5944 3870 2433
2826B433K713J85j733Q40J221j294j293J398m00l10j328k80K161j932p43n96J562
$$ 2433 5146 5331 3598 4438 5659 4365 3072 4470 4070 3760 2432 2152 4313 2381 1638 1042 2604
2843B604q04q76K08J018K43l153K39J408j257q68M19j63k06j665O93K47k68j548
$$ 2604 1800 924 1132 2150 2393 -760 -521 887 -370 -1238 -819 -982 -1188 -2853 -2160 -1913 -2181 -3729
2861c729N75R08q70l06j822J867j15j939M92K096p93l96j661J611j499J449o80
$$ -3729 -3154 -2246 -3116 -3422 -5244 -3377 -3492 -5431 -4939 -2843 -3636 -4032 -5693 -4082 -5581 -4132 -4812
2878d812L74q57n34K30L72J538j737j103J554J99j815J094P37N43j015j65K296
$$ -4812 -4438 -5295 -5829 -5599 -5227 -3689 -5426 -6529 -4975 -4776 -6591 -5497 -4760 -4217 -5232 -5397 -3101
2895c101J6m76p20M7J181m88m23J806J233j682k79K699j058j368M50J415L79N4
$$ -3101 -3085 -3561 -4281 -4234 -3053 -3541 -3964 -2158 -925 -2607 -2886 -187 -1245 -2613 -2163 -748 -369 -315
2913c15k94J674J80j606L45K566J549k859p92J801Q09p27K74J722m91p36m03J538
$$ -315 -609 1065 1245 -361 -16 2550 4099 1240 448 2249 3058 2331 2605 4327 3836 3100 2697 4235
2931D235l20o73n47J773J008p63m91J035n07m74J83J592l87m60j623J280l45J196
$$ 4235 3915 3242 2695 4468 5476 4713 4222 5257 4750 4276 4459 6051 5664 5204 3581 4861 4516 5712
2949E712o52l41M39m81M39o05O52j769M44P64j011K25n58R8O14j546K1L47J148
$$ 5712 5060 4719 5158 4677 5116 4511 5163 3394 3838 4602 3591 3816 3258 3356 3970 2424 2445 2792 3940
2968C940j826o25J9J619k580J29l36M86M14k579M06J061J89j848l7R46J10j772
$$ 3940 2114 1489 1508 3127 547 676 340 826 1240 -1339 -933 128 317 -1531 -1568 -622 -512 -2284
2986b284m78J814j101m14p92K089k124p68J800N12q86j760N57L83k3q58PO61j64
$$ -2284 -2762 -948 -2049 -2463 -3255 -1166 -3290 -4058 -2258 -1746 -2632 -4392 -3835 -3452 -3475 -4333 -4326 -3665 -3829
3005c829r83k85J268o68j176R54R40j017m15L66J93p09K95Q32N80r84M84L34R34
$$ -3829 -4812 -5097 -3829 -4497 -5673 -4719 -3779 -4796 -5211 -4845 -4652 -5361 -5066 -4234 -3654 -4638 -4154 -3820 -2886
3024b886p71m7L07P19q01M29Q37N66J630k470N87q75R47N76j150K244p28M42M69
$$ -2886 -3657 -3704 -3397 -2678 -3479 -3050 -2213 -1647 -17 -2487 -1900 -2775 -1828 -1252 -2402 -158 -886 -444 25
3043B5O90j30j190N22J153m60M6M58J296o08Op35J869O87L49k015K081j600J472
$$ 25 715 585 -605 -83 1070 610 656 1114 2410 1802 1808 1073 2942 3629 3978 1963 4044 2444 3916
3062C916J25R59n1j109p53K069N92j993O81N69j85j99m56N90K6m9j559J100J154
$$ 3916 4041 5000 4949 3840 3087 5156 5748 3755 4436 5005 4820 4621 4165 4755 4781 4732 3173 4273 5427
3081E427j298L70m29O57j331k64J513P9k604J164Q84N09j099n17O53p16p61j185
$$ 5427 4129 4499 4070 4727 3396 3132 4645 4724 2120 3284 4168 4677 3578 3061 3714 2998 2237 1052
3099A052P90Q04q78j430K021j011j698m9J019o26q28M44N59j207O81q98N08k49
$$ 1052 1842 2646 1768 338 2359 1348 -350 -399 620 -6 -834 -390 169 -1038 -357 -1255 -747 -996
3117i96J14j046k98J261j422J069j847m62n44J47J284j26j915k2P21n05N92r14
$$ -996 -882 -1928 -2226 -965 -2387 -1318 -3165 -3627 -4171 -4024 -2740 -2866 -4781 -4803 -4082 -4587 -3995 -4909
3135d909m69R56L94n83Q87l52r24j086K001J53j166k1J819m77p53J51O61J069
$$ -4909 -5378 -4422 -4028 -4611 -3724 -4076 -5000 -6086 -4085 -3932 -5098 -5119 -3300 -3777 -4530 -4379 -3718 -2649
3153b649j203q44O81K196j699M51N58K20q81O22Q68J019j123l35J041N28J90m65
$$ -2649 -3852 -4696 -4015 -1819 -3518 -3067 -2509 -2289 -3170 -2548 -1680 -661 -1784 -2119 -1078 -550 -360 -825
3171h25J377O36p12p01J057K23O70p79n63N65J395l94J181k18m95j324K971j583
$$ -825 552 1188 476 -225 832 1055 1725 946 383 948 2343 1949 3130 2912 2417 1093 4064 2481
3189B481Q78j29j86J286J45o71J369m44j254K39J15P48M29o7q9m84M00j647K118
$$ 2481 3359 3230 3044 4330 4475 3804 5173 4729 3475 3714 3829 4577 5006 4939 4850 4366 4766 3119 5237
3208E237L30k278l7J331P97q28m62n44J11M15j130Q23j39r47O01j508Q81J81p39
$$ 5237 5567 3289 3252 4583 5380 4552 4090 3546 3657 4072 2942 3765 3626 2679 3280 1772 2653 2834 2095
3227B095j146P32o41k3J375p77j538r25O78L57o01P78j705Q07O01q69r04P08Q5
$$ 2095 949 1681 1040 1017 2392 1615 77 -848 -170 187 -414 364 -1341 -534 67 -802 -1706 -998 -913
3246i13j580n3q0J149p76l06N9n33q3j27j30o04j84j93J070m90j84j056R01M33
$$ -913 -2493 -2546 -2626 -1477 -2253 -2559 -2500 -3033 -3116 -3243 -3373 -3977 -4161 -4354 -3284 -3774 -3958 -5014 -4113 -3680
3266c680j323J417n54k27p49R78L98j386N22K68l17J168q81n24M15R11J04q75
$$ -3680 -5003 -3586 -4140 -4367 -5116 -4138 -3740 -5126 -4604 -4336 -4653 -3485 -4366 -4890 -4475 -3564 -3460 -4335
3284d335N94J581j445J05J795K97r70kO66k10J122J85J096j92r37J12J586K9j363
$$ -4335 -3741 -2160 -3605 -3500 -1705 -1408 -2378 -2380 -1714 -1924 -802 -617 479 287 -650 -538 1048 1077 -286
3303b86O48N40O42K72n30P44l61k93p71J975j197K90K47R42M53j01J62k7J351
$$ -286 362 902 1544 1816 1286 2030 1669 1376 605 2580 1383 1673 1920 2862 3315 3214 3376 3349 4700
3322D700k035l80M28J621j92p12N37Q01j150J95J028n8j605J203R56j206k1L1
$$ 4700 2665 2285 2713 4334 4142 3430 3967 4768 3618 3813 4841 4783 3178 4381 5337 4131 4110 4141
3340D141q76k31M63j075J663q68j153O72L35L0j266J47j95n50Q80l75L50j82n37
$$ 4141 3265 3034 3497 2422 4085 3217 2064 2736 3071 3101 1835 1982 1787 1237 2117 1742 2092 1910 1373
3359A373k79k02K56k32j083J384j124r20R39k018J806j106n42M54K81m94j303
$$ 1373 1094 892 1148 916 -167 1217 93 -827 112 -1906 -100 -1206 -1748 -1294 -1013 -1507 -2810
3376b810k05J902q93m8r10J056j043k29J22M41o83k62mj60j304M73j58R18j062
$$ -2810 -3015 -1113 -2006 -2054 -2964 -1908 -2951 -3180 -3058 -2617 -3300 -3562 -3566 -3726 -5030 -4557 -4715 -3797 -4859
3395d859J590j227R90p60m51K303o00o53n01J84p51L62M87J001p81J76Q24j074
$$ -4859 -3269 -4496 -3506 -4266 -4717 -2414 -3014 -3667 -4168 -3984 -4735 -4373 -3886 -2885 -3666 -3490 -2666 -3740
3413c740O71l83J588p80R73j424P65M31L28l64m8J473K46j409K164l31k45j40
$$ -3740 -3069 -3452 -1864 -2644 -1671 -3095 -2330 -1899 -1571 -1935 -1983 -510 -264 -1673 491 160 -85 -225
3431b25N37Q02j226M96J466l91o90O40j49J65M37l11J571q23R3N49J12L22N2P9
$$ -225 312 1114 -112 384 1850 1459 769 1409 1260 1425 1862 1551 3122 2299 2392 2941 3053 3375 3427 3506
3451C506j92P22p73N43k06N45l24M1p33L99J247r2j452J69J474p70j134J313J63
$$ 3506 3314 4036 3263 3806 3600 4145 3821 3862 3129 3528 4775 4683 3231 3400 4874 4104 2970 4283 4446
3470D446j009K78l76N52j37o35R97J40k107J44m15J243o92j083j15M67Q60j343
$$ 4446 3437 3715 3339 3891 3754 3119 4116 4256 2149 2293 1878 3121 2429 1346 1231 1698 2558 1215
3488A215p82J028j731K44P60r36o98O7M14K3Q3o92o42Q70Q33k023O8L1j1k01N55
$$ 1215 433 1461 -270 -26 734 -202 -900 -833 -419 -396 -313 -1005 -1647 -777 56 -1967 -1899 -1868 -1879 -2080 -1525
3509a525j517J117l44n70J43N95k16j003Q54m0j470M21k61J104J95j026rM03j368
$$ -1525 -3042 -1925 -2269 -2839 -2696 -2101 -2317 -3320 -2466 -2506 -3976 -3555 -3816 -2712 -2517 -3543 -3552 -3149 -4517
3528d517M09n10P96k85R45p86O69K45j061J584L21q96m32O12K30N5J23P40R4k233
$$ -4517 -4108 -4618 -3822 -4107 -3162 -3948 -3279 -3034 -4095 -2511 -2190 -3086 -3518 -2906 -2676 -2621 -2498 -1758 -1664 -3897
3548c897J354J99O50o8J206L01l48p99j78L26J429K72q99J127m38K23K0R69l57
$$ -3897 -2543 -2344 -1694 -1762 -556 -255 -603 -1402 -1580 -1254 175 447 -452 675 237 460 480 1449 1092
3567A092j126J127P52J041j126r26P75J278n25P80K03p76r6M58O80k67m7Q9O26
$$ 1092 -34 1093 1845 2886 1760 834 1609 2887 2362 3142 3345 2569 2473 2931 3611 3344 3297 3386 4012
3586D012m88j213J537m66M1k02n99J135K76q55Q00o12q00J547j763L94J456j126
$$ 4012 3524 2311 3848 3382 3423 3221 2622 3757 4033 3178 3978 3366 2566 4113 2350 2744 4200 3074
3604C074j188J136P00j474O91M6j117L97ml73K97m51j15p50J029j40j612o79J73
$$ 3074 1886 3022 3722 2248 2939 2985 1868 2265 2261 1888 2185 1734 1619 869 1898 1758 146 -533 -360
3623c60P93j972K515j739j012O78L95M14q28k14n30n77k32K32k5j79j57j68K92
$$ -360 433 -1539 976 -763 -1775 -1097 -702 -288 -1116 -1330 -1860 -2437 -2669 -2437 -2462 -2641 -2798 -2966 -2674
3642b674k24J77j59k9O01j161j63j79M76P0p63Q93j70r56J163L21L3l46j15N48
$$ -2674 -2898 -2721 -2880 -2909 -2308 -3469 -3632 -3811 -3335 -3265 -4028 -3135 -3305 -4261 -3098 -2777 -2744 -3090 -3205 -2657
3662b657o50j05p1Q36N08p90L18l04k52J695q32N83O20n66j029P12J20Q32J009
$$ -2657 -3307 -3412 -3483 -2647 -2139 -2929 -2611 -2915 -3167 -1472 -2304 -1721 -1101 -1667 -2696 -1984 -1864 -1032 -23
3681b3k076M42J413k63O23p79R77r96N62L15R07J5k86R71j084J864j143K21l5
$$ -23 -2099 -1657 -244 -507 116 -663 314 -682 -120 195 1102 1117 831 1802 718 2582 1439 1660 1625
3700A625J000j054P56M96R4j377J637p5j54L48O38l89j624P89k1J073q56o44J434
$$ 1625 2625 1571 2327 2823 2917 1540 3177 3102 2948 3296 3934 3545 1921 2710 2689 3762 2906 2262 3696
3719C696O9m0j374J794j115p9N34k44J264k228J864m77j240m36M91L54Jl02J83
$$ 3696 3765 3725 2351 4145 3030 2951 3485 3241 4505 2277 4141 3664 2424 1988 2479 2833 2834 2532 2715
3738B715r6L1j058K61L23l76j006J5J567j670j441J339m4p0n39o1J30j196Q17
$$ 2715 2619 2650 1592 1853 2176 1800 794 809 2376 706 -735 604 560 490 -49 -110 20 -1176 -359
3757c59q11L91k72N45j224j99M2M65j044r3R01O53j610k81q92J336l18k21K57
$$ -359 -1170 -779 -1051 -506 -1730 -1929 -1887 -1422 -2466 -2559 -1658 -1005 -2615 -2896 -3788 -2452 -2770 -2991 -2734
3776b734K86p88q65R49O58j260K72L26p67J244q9M39q20o03J769j207r9n24J279
$$ -2734 -2448 -3236 -4101 -3152 -2494 -3754 -3482 -3156 -3923 -2679 -2768 -2329 -3149 -3752 -1983 -3190 -3289 -3813 -2534
3795b534K44p45J070j119R06j49k05J009J67o41p6O95J00m73O93J10K05m9m75
$$ -2534 -2290 -3035 -1965 -3084 -2178 -2327 -2532 -1523 -1356 -1997 -2073 -1378 -1278 -1751 -1058 -948 -743 -792 -1267
3814a267P27m53J013n47J287q08M12O23q74J413j168J44J683k93k04R28K4j069
$$ -1267 -540 -993 20 -527 760 -48 364 987 113 1526 358 502 2185 1892 1688 2616 2640 1571
3832A571R91j41Q7P70j30m07n92J161q66L14j5n42l29P96Q30k50l28m66j05L96
$$ 1571 2562 2421 2508 3278 3148 2741 2149 3310 2444 2758 2743 2201 1872 2668 3498 3248 2920 2454 2349 2745
3852B745L59Q51j713J248K80o31j007J156j14j174O71j85q70R42N21l78j085k44
$$ 2745 3104 3955 2242 3490 3770 3139 2132 3288 3174 2000 2671 2486 1616 2558 3079 2701 1616 1372
3870A372l2L19k15j61l01l21J435j140m15m05N34j011N11J99k5q18O70q22j019
$$ 1372 1340 1659 1444 1283 982 661 2096 956 541 136 670 -341 170 369 344 -474 196 -626 -1645
3889a645k37P57p44l6L35n33J612j295j178R2n83M38K42L18p93J036o90p12O00
$$ -1645 -1882 -1125 -1869 -1905 -1570 -2103 -491 -1786 -2964 -2872 -3455 -3017 -2775 -2457 -3250 -2214 -2904 -3616 -3016
3908c016R24j678P71q71Q47L73J93n58M4o20N16J119n53r41P51N30o94k24K16
$$ -3016 -2092 -3770 -2999 -3870 -3023 -2650 -2457 -3015 -2971 -3591 -3075 -1956 -2509 -3450 -2699 -2169 -2863 -3087 -2871
3927b871J346O91j231Jj41J129l80p51m6L61M81j13P21N55j283J493r0m35l54
$$ -2871 -1525 -834 -2065 -2064 -2205 -1076 -1456 -2207 -2253 -1892 -1411 -1524 -803 -248 -1531 -38 -128 -563 -917
3946i17L49O61K94l28R87n05J130j137O78J285j150m92Q59M45Q98o49l89J088
$$ -917 -568 93 387 59 1046 541 1671 534 1212 2497 1347 855 1714 2159 3057 2408 2019 3107
3964C107r27J14M06n21J32k70K11L60O75m92K00k44K79r14L03k75P61O01r82J026
$$ 3107 2180 2294 2700 2179 2311 2041 2252 2612 3287 2795 2995 2751 3030 2116 2419 2144 2905 3506 2524 3550
3984C550o86j83j063J363r10j05R41j47O0p47M95o36q1O62j442J014m65l95K2
$$ 3550 2864 2681 1618 2981 2071 1966 2907 2760 2820 2073 2568 1932 1851 2513 1071 2085 1620 1225 1247
4003A247m68L22o99Q3j400J198k04l64M63R52j329n12j041J419r87l78N15l05
$$ 1247 779 1101 402 485 -915 283 79 -285 178 1130 -199 -711 -1752 -333 -1320 -1698 -1183 -1488
4021a488k32l07n6k20O76p54k64N20k16J00K177k226l24Q89j179p66R63n71Q25
$$ -1488 -1720 -2027 -2083 -2303 -1627 -2381 -2645 -2125 -2341 -2241 -64 -2290 -2614 -1725 -2904 -3670 -2707 -3278 -2453
4040b453k50o81p67N59J548o94r54M6j94J738j3q10J829k206J060J38J36O01k1
$$ -2453 -2703 -3384 -4151 -3592 -2044 -2738 -3692 -3646 -3840 -2102 -2115 -2925 -1096 -3302 -2242 -2104 -1968 -1367 -1388
4059a388l47l43q72J003K71R1m15N09O47l4k20J007J06k61M80r92k8P87j0J39
$$ -1388 -1735 -2078 -2950 -1947 -1676 -1585 -2000 -1491 -844 -878 -1098 -91 15 -246 234 -758 -786 1 -9 130
4079A30M69O57l37Jp45J052L55j044O85J254q23J189j11j214M83p55L99J353q52
$$ 130 599 1256 919 920 175 1227 1582 538 1223 2477 1654 2843 2732 1518 2001 1246 1645 2998 2146
4098B146J125j53k45J69r14O32P89k07n01p85R88j262N97J59N04r58K95k5K66
$$ 2146 3271 3118 2873 3042 2128 2760 3549 3342 2841 2056 3044 1782 2379 2538 3042 2084 2379 2354 2620
4117B620P21o91p38J205r89N81j462P37m46M49p25K11q51L33P52r11n62O04m90
$$ 2620 3341 2650 1912 3117 2128 2709 1247 1984 1538 1987 1262 1473 622 955 1707 796 234 838 348
4136C48K1j745L97J280K05l87j325N54r40M59J139m71M96m87j383L29J87k97j261
$$ 348 369 -1376 -979 301 506 119 -1206 -652 -1592 -1133 6 -465 31 -456 -1839 -1510 -1323 -1620 -2881
4155b881J463k17n33m12P48o05N81r43m64R21L96n79n45n51N80L94o70J31O35
$$ -2881 -1418 -1635 -2168 -2580 -1832 -2437 -1856 -2799 -3263 -2342 -1946 -2525 -3070 -3621 -3041 -2647 -3317 -3186 -2551
4174b551O01j331L53J78m02L97n65J142j248R41L78M32n17O54Q68j62o02N12k65
$$ -2551 -1950 -3281 -2928 -2750 -3152 -2755 -3320 -2178 -3426 -2485 -2107 -1675 -2192 -1538 -670 -832 -1434 -922 -1187
4193a187M4n53R73J214n52j484K012O3j346j20L22J051l15l16N24O35q89O93k05
$$ -1187 -1143 -1696 -723 491 -61 -1545 467 530 -816 -936 -614 437 122 -194 330 965 76 769 564
4212E64R54l32N22j45N16q45J546o19J0R3k91J33L68p5l46l61J411m90P10l00
$$ 564 1518 1186 1708 1563 2079 1234 2780 2161 2171 2264 1973 2106 2474 2399 2053 1692 3103 2613 3323 3023
4232C023l70K69P37o17o93O75p20O50J172o70j723N54o1P82r48k26Q44p07l98
$$ 3023 2653 2922 3659 3042 2349 3024 2304 2954 4126 3456 1733 2287 2226 3008 2060 1834 2678 1971 1573
4251A573O05j175N79P98j788Q55K17j502R59K2J50j063j3N86q99M31q01o45K85
$$ 1573 2178 1003 1582 2380 592 1447 1664 162 1121 1143 1293 230 217 803 -96 335 -466 -1111 -826
4270h26R57n52j074J503o70k53r9O76o1r91N93p3j831Q77N76l61J30j146P48J024
$$ -826 131 -421 -1495 8 -662 -915 -1014 -338 -399 -1390 -797 -870 -2701 -1824 -1248 -1609 -1479 -2625 -1877 -853
4290h53k53j788M70J25n73K6J57L21p3r93J708j431K713k055O45k83o6N49j801
$$ -853 -1106 -2894 -2424 -2299 -2872 -2846 -2689 -2368 -2441 -3434 -1726 -3157 -444 -2499 -1854 -2137 -2203 -1654 -3455
4309c455J577k10j37k70K31Mr74J416J60P62j17j12n91j91n25L286P3k57j857
$$ -3455 -1878 -2088 -2225 -2495 -2264 -2260 -3234 -1818 -1658 -896 -1013 -1125 -1716 -1907 -2432 854 927 670 -1187
4328a187K40N17Q60p31j67M71Q30j136r7K730r37l25m83K278j581r12J339M00
$$ -1187 -947 -430 430 -301 -468 3 833 -303 -400 2330 1393 1068 585 2863 1282 370 1709 2109
4346B109j690O26k1J306p01J49M54l9M42K2l83N48l95l82J04J544l13p83k69K1
$$ 2109 419 1045 1024 2330 1629 1778 2232 2193 2635 2657 2274 2822 2427 2045 2149 3693 3380 2597 2328 2349
4366B349j079n2K097j195k70k14P07R24l42j86n69o22k92K60J52J027o26m14j3
$$ 2349 1270 1218 3315 2120 1850 1636 2343 3267 2925 2739 2170 1548 1256 1516 1668 2695 2069 1655 1642
4385A642j67L17j020J042j026OJ086j483Q97p11o57L12L54l01j077r52Q12K35
$$ 1642 1475 1792 772 1814 788 794 1880 397 1294 583 -74 238 592 291 -786 -1738 -926 -691
4403f91Q7k34P49j567o90N83P32p6R5j853R14k71R6r55q6J038j040O18o28J163
$$ -691 -604 -838 -89 -1656 -2346 -1763 -1031 -1107 -1012 -2865 -1951 -2222 -2126 -3081 -3167 -2129 -3169 -2551 -3179 -2016
4423b016k10j442J479l14K36o16N55L54r00j24J104j031J147n16n56J672p16n98
$$ -2016 -2226 -3668 -2189 -2503 -2267 -2883 -2328 -1974 -2874 -2998 -1894 -2925 -1778 -2294 -2850 -1178 -1894 -2492
4441b492j46J85M52P31K48q79n54J41Q19J230N53k538L05K021m84o33J290j208
$$ -2492 -2638 -2453 -2001 -1270 -1022 -1901 -2455 -2314 -1495 -265 288 -2250 -1945 76 -408 -1041 249 -959
4459i59O09k01j19J323j029K42Q17m20R07j79n91O64j757R27J965o98m25M11O2
$$ -959 -350 -551 -670 653 -376 -134 683 263 1170 991 400 1064 -693 234 2199 1501 1076 1487 1549
4478A549J62j88n6O39m25J79N20l32M51J72M69j498J106n30P62n66Q11o02k0K15
$$ 1549 1711 1523 1467 2106 1681 1860 2380 2048 2499 2671 3140 1642 2748 2218 2980 2414 3225 2623 2603 2818
4498B818L74m84O7J17r7j690L86Q25L68j344qJ58l35M96n61N52J163q83n65L7
$$ 2818 3192 2708 2775 2892 2795 1105 1491 2316 2684 1340 1332 1490 1155 1651 1090 1642 2805 1922 1357 1394
4518A394p3j481P94M68j168O91m64L17L38j398N12M5L6j369L92N42J68q20k48
$$ 1394 1321 -160 634 1102 -66 625 161 478 816 -582 -70 -25 11 -1358 -966 -424 -256 -1076 -1324
4537a324K3q73Q98N63J79k40j37j408N98l77m70J075j068n74J149J380o35j195
$$ -1324 -1301 -2174 -1276 -713 -534 -774 -911 -2319 -1721 -2098 -2568 -1493 -2561 -3135 -1986 -606 -1241 -2436
4555b436l49K93o57J245r57J053k06J47l63p62N62O99j866J785K6L31j045R01
$$ -2436 -2785 -2492 -3149 -1904 -2861 -1808 -2014 -1867 -2230 -2992 -2430 -1731 -3597 -1812 -1786 -1455 -2500 -1599
4573a599j36P36j520M79K003j547k72M01k62Q83L78j075P59l41M4J501L00j426
$$ -1599 -1735 -999 -2519 -2040 -37 -1584 -1856 -1455 -1717 -834 -456 -1531 -772 -1113 -1069 432 732 -694
4591f94J217o26n48J552J47m66l83R53l0m41P25j442K203n47p00J9L02N95l60
$$ -694 523 -103 -651 901 1048 582 199 1152 1122 681 1406 -36 2167 1620 920 939 1241 1836 1476
4610A476O58p75N15m9N38R15j702O09R25m04M76o84p01J600j559M84n62P59j19
$$ 1476 2134 1359 1874 1825 2363 3278 1576 2185 3110 2706 3182 2498 1797 3397 1838 2322 1760 2519 2400
4629B400m49K40m70q05n80M55K42Q91j145J56Q99J54j027M62K86K5p33M99q80
$$ 2400 1951 2191 1721 916 336 791 1033 1924 779 935 1834 1988 961 1423 1709 1734 1001 1500 620
4648F20N75O5p3j353J349j722J26M54k8Q76q67mj466O88j24j77J41N44q80m20
$$ 620 1195 1260 1187 -166 1183 -539 -413 41 13 889 22 18 -1448 -760 -884 -1061 -920 -376 -1256 -1676
4668a676P1L52j414K407j709q04J766k62p21q70K010L21k035k20L39K48J347j728
$$ -1676 -1605 -1253 -2667 -260 -1969 -2773 -1007 -1269 -1990 -2860 -850 -529 -2564 -2784 -2445 -2197 -850 -2578
4686b578o31J049j483J227J26J059j010K33r07J434j41q4Q2K12r47M45J09l03
$$ -2578 -3209 -2160 -3643 -2416 -2290 -1231 -2241 -2008 -2915 -1481 -1622 -1706 -1624 -1412 -2359 -1914 -1805 -2108
4704b108P28J160L3j536kJ215l4m44J831j594o41J757o12l3N14L09m56L10N42
$$ -2108 -1380 -220 -187 -1723 -1725 -510 -544 -988 843 -751 -1392 365 -247 -280 234 543 87 397 939
4723I39o6p13J56Q38p98J979j891M50J550J97p50K51l67j64q64K98N71k91Q00
$$ 939 873 160 316 1154 356 2335 444 894 2444 2641 1891 2142 1775 1611 747 1045 1616 1325 2125
4742B125P71J09j127M55M79j242n38K245q05j53q93M29J5L90J9j436O90R72j175
$$ 2125 2896 3005 1878 2333 2812 1570 1032 3277 2472 2319 1426 1855 1870 2260 2279 843 1533 2505 1330
4761A330J31k05QJ87o83O71N92L41j519k15j58P88R5r2J30j002L93p78L03p97
$$ 1330 1461 1256 1264 1451 768 1439 2031 2372 853 638 480 1268 1363 1271 1401 399 792 14 317 -480
4781d80R20j046K71k80R67l93k97N78j833N00Q81M37j164n13J80l86q96J396j443
$$ -480 440 -606 -335 -615 352 -41 -338 240 -1593 -1093 -212 225 -939 -1452 -1272 -1658 -2554 -1158 -2601
4800b601J296k10l33l73m55J488m93o43Q75r02K27k04J57M51j206J638j26J3k41
$$ -2601 -1305 -1515 -1848 -2221 -2676 -1188 -1681 -2324 -1449 -2351 -2124 -2328 -2171 -1720 -2926 -1288 -1414 -1401 -1642
4819a642o66l58Q08N62m59k43p65M76Q33k31n04K43N70n50k55J689O08j633M9
$$ -1642 -2308 -2666 -1858 -1296 -1755 -1998 -2763 -2287 -1454 -1685 -2189 -1946 -1376 -1926 -2181 -492 116 -1517 -1468
4838a468m81J819p05r55J266j09O73J18o38N53k78Q75L98q66l38J073N22j345
$$ -1468 -1949 -130 -835 -1790 -524 -633 40 158 -480 73 -205 670 1068 202 -136 937 1459 114
4856A14L37l66J174p26R40j2p43J903m78j37l18k55J7o65P26J538q55N8j37p7
$$ 114 451 85 1259 533 1473 1461 718 2621 2143 2006 1688 1433 1450 785 1511 3049 2194 2252 2115 2038
4876B038j596J478o61J351m63o89N84k05n06Q3O48K77k057K805k593Q46K38R43
$$ 2038 442 1920 1259 2610 2147 1458 2042 1837 1331 1414 2062 2339 282 3087 494 1340 1578 2521
4894B521j117k25O23K01j108j97J247j304Q77q29K08m6Q69j408p51J296p81L3
$$ 2521 1404 1179 1802 2003 895 698 1945 641 1518 689 897 851 1720 312 -439 857 76 109
4912A09m95j86m36K4R09Q1l40J40n81L01j243R82P96r97R1j228J331j163O13j48
$$ 109 -386 -572 -1008 -984 -75 6 -334 -194 -775 -474 -1717 -735 61 -936 -845 -2073 -742 -1905 -1292 -1440
4932a440j167O79q50R26J031j439J880k069J25N02o48K53m93J146j019J15R14
$$ -1440 -2607 -1928 -2778 -1852 -821 -2260 -380 -2449 -2324 -1822 -2470 -2217 -2710 -1564 -2583 -2468 -1554
4949a554k30q53J002K08K01j446P58o28N03P50J5l16Q64m84J75p20P86o59J035
$$ -1554 -1784 -2637 -1635 -1427 -1226 -2672 -1914 -2542 -2039 -1289 -1274 -1590 -726 -1210 -1035 -1755 -969 -1628 -593
4968e93M64p21n41J685m89J019j582L6M69J249j700N92r90J921j87l8O00j297
$$ -593 -129 -850 -1391 294 -195 824 -758 -722 -253 996 -704 -112 -1102 819 632 594 1194 -103
4986a03J882j114N35P92n50N44j63r83J701j131J14N3L37J26m1k29r50J092M3
$$ -103 1779 665 1200 1992 1442 1986 1823 840 2541 1410 1524 1577 1914 2040 1999 1770 820 1912 1955
5005A955n14j6P33k8k16J24l43K104j943l88M59n2J07M78j225Q70p7j76J43o81
$$ 1955 1441 1425 2158 2130 1914 2038 1695 3799 1856 1468 1927 1875 1982 2460 1235 2105 2028 1852 1995 1314
5025A314J87o31J066l11K2o80k38P1P08n83M37k49n28j501J228P3k5j147O31O22
$$ 1314 1501 870 1936 1625 1647 967 729 800 1508 925 1362 1113 585 -916 312 385 360 -787 -156 466
5045D66j896M52J069n47K05j73K66j048M03J26Kj461J253l3k52j90k14K54n34
$$ 466 -1430 -978 91 -456 -251 -424 -158 -1206 -803 -677 -675 -2136 -883 -916 -1168 -1358 -1572 -1318 -1852
5064a852Q25k764J563p64J590j330K214j525M12n0K74L37P5j299M68r87J53J248
$$ -1852 -1027 -3791 -2228 -2992 -1402 -2732 -518 -2043 -1631 -1681 -1407 -1070 -995 -2294 -1826 -2813 -2660 -1412
5082a412q55R16l49O13o10p30P66o82J415Q02j739N50k28k80R40l38M91k52M55
$$ -1412 -2267 -1351 -1700 -1087 -1697 -2427 -1661 -2343 -928 -126 -1865 -1315 -1543 -1823 -883 -1221 -730 -982 -527
5101e27l20R1Q7q2N8P07K20J09L4J251j689K37K55R03j343J043J334k54j419Q42
$$ -527 -847 -756 -669 -751 -693 14 234 343 377 1628 -61 176 431 1334 -9 1034 2368 2114 695 1537
5121A537R9q92Q24L26j516N24j84M54Q01j105P87L41n14l16Q44l65j000J674n2
$$ 1537 1636 744 1568 1894 378 902 718 1172 1973 868 1655 1996 1482 1166 2010 1645 645 2319 2267
5140B267n69o8n71Q41o80J413r76p85J078j219Q27Q37j605O66m14M4O14j050Q84
$$ 2267 1698 1630 1059 1900 1220 2633 1657 872 1950 731 1558 2395 790 1456 1042 1086 1700 650 1534
5159A534j959J376j871J441M79R4N37j225p8p98J342j03o76o4M1j281J796q02
$$ 1534 -425 951 -920 521 1000 1094 1631 406 328 -470 872 769 93 29 70 -1211 585 -217
5177b17n63o15J016j76j54n06M72j33o01l8M87q95J433j013r14R20o5L4k07R54
$$ -217 -780 -1395 -379 -555 -709 -1215 -743 -876 -1477 -1515 -1028 -1923 -490 -1503 -2417 -1497 -1562 -1528 -1735 -781
5197g81j400O06n79L85L93L24o18K18K61p20MJ208m3o56n35J062n94L93J31l52
$$ -781 -2181 -1575 -2154 -1769 -1376 -1052 -1670 -1452 -1191 -1911 -1907 -699 -742 -1398 -1933 -871 -1465 -1072 -941 -1293
5217a293l98K08P04K93p92L9M22R08j803J105j22K04J225m06k67m33k90J037j35
$$ -1293 -1691 -1483 -779 -486 -1278 -1239 -817 91 -1712 -607 -729 -525 700 294 27 -406 -696 341 206
5236B06j231J652l40O6q45J041R06j596n34J388K73k61K00J36K67m63J60j40l45
$$ 206 -1025 627 287 353 -492 549 1455 -141 -675 713 986 725 925 1061 1328 865 1025 885 540
5255E40J456j153J457l58j010M38N17o11L54L83q47L04n18J480j425J202l40j49
$$ 540 1996 843 2300 1942 932 1370 1887 1276 1630 2013 1166 1470 952 2432 1007 2209 1869 1720
5273A720j97l85P14J87k3J40j709M37J433m46j54j411L82q5M85K2K40j379N79
$$ 1720 1523 1138 1852 2039 2016 2156 447 884 2317 1871 1717 306 688 603 1088 1110 1350 -29 550
5292E50Q63j495P69k8n00P46r84r7O61j450O5k68L99J28N84j014K81l64J403p71
$$ 550 1413 -82 687 659 159 905 -79 -176 485 -965 -900 -1168 -769 -641 -57 -1071 -790 -1154 249 -522
5312e22q26n84K00Jj5J341j355J68j48n1M60J70O33j380N39j462J031m91J965
$$ -522 -1348 -1932 -1732 -1731 -1746 -405 -1760 -1592 -1740 -1791 -1331 -1161 -528 -1908 -1369 -2831 -1800 -2291 -326
5331c26r83j197N71j77n19P61j55J10j32J53r12J212N94m85J296n52r07K37O02
$$ -326 -1309 -2506 -1935 -2112 -2631 -1870 -2025 -1915 -2047 -1894 -2806 -1594 -1000 -1485 -189 -741 -1648 -1411 -809
5350h09k35J02j84M9J01N59L27j8k11K20p03O96J86n2p2N48j42J53N67l92k37
$$ -809 -1044 -942 -1126 -1077 -976 -417 -90 -108 -319 -99 -802 -106 80 28 -44 504 362 515 1082 690 453
5371D53M0n41J490p58J9R32m05K71k07Q34j899R35KN32l95k3O29m47P35j403L35
$$ 453 493 -48 1442 684 703 1635 1230 1501 1294 2128 229 1164 1166 1698 1303 1280 1909 1462 2197 794 1129
5392A129J95J050j000j06Q30p94K74m59J53p21R09m67K96L05j730J20J159R2J273
$$ 1129 1324 2374 1374 1268 2098 1304 1578 1119 1272 551 1460 993 1289 1594 -136 -16 1143 1235 2508
5411B508j703L97K45J07l13o78M15l33K58q08P87j26j14K18m43r90J234j065j30
$$ 2508 805 1202 1447 1554 1241 563 978 645 903 95 882 756 642 860 417 -573 661 -404 -534
5430e34K01P28J6l18j391J197l1j211J216n23j268L92K39L02j45l01J77R92j711
$$ -534 -333 395 411 93 -1298 -101 -132 -1343 -127 -650 -1918 -1526 -1287 -985 -1130 -1431 -1254 -262 -1973
5449a973R17M99j019J616j169K92j035n10R66M97m79n29L3L50m94n58K57O16o51
$$ -1973 -1056 -557 -1576 40 -1129 -837 -1872 -2382 -1416 -919 -1398 -1927 -1894 -1544 -2038 -2596 -2339 -1723 -2374
5468b374L31R48p07Q31k29o29N87J294r18k55P4J140n64j437J188n42P79J23M96
$$ -2374 -2043 -1095 -1802 -971 -1200 -1829 -1242 52 -866 -1121 -1047 93 -471 -1908 -720 -1262 -483 -360 136
5487A36l27k21M96m66J61k14J346n2K62l89P0J085r72q68Q2O07q32m93J826j434
$$ 136 -191 -412 84 -382 -221 -435 911 859 1121 732 802 1887 915 47 129 736 -96 -589 1237 -197
5507a97J700p77j86P72M50j344O61M87K85j219M45l89J242n91J51n9N73q7qk19
$$ -197 1503 726 540 1312 1762 418 1079 1566 1851 632 1077 688 1930 1339 1490 1431 2004 1917 1909 1690
5527A690j31k95l33N21m09o35O53Q62p87k53R74m13m87p04Q04R05k797J284J395
$$ 1690 1559 1264 931 1452 1043 408 1061 1923 1136 883 1857 1444 957 253 1057 1962 -835 449 1844
5546A844k45j758J098n0j056L79q0O64m7j284J61N65o0J84k44m94r15M96n37Q05
$$ 1844 1599 -159 939 889 -167 212 132 796 749 -535 -374 191 131 315 71 -423 -1338 -842 -1379 -574
5566e74j095N41n37J493k41l56J81l86j095P67J233j062J49o62L36n54J385j141
$$ -574 -1669 -1128 -1665 -172 -413 -769 -588 -974 -2069 -1302 -69 -1131 -982 -1644 -1308 -1862 -477 -1618
5584a618M59j057K7R92l98l7Q44p38j86K02k57J841j30j609J309o14K77j015J199
$$ -1618 -1159 -2216 -2189 -1197 -1595 -1632 -788 -1526 -1712 -1510 -1767 74 -56 -1665 -356 -970 -693 -1708 -509
5603e09m07j104J270o83o86R56r69N71R32L94q2P15L17o37k99r2J163j825Q55
$$ -509 -916 -2020 -750 -1433 -2119 -1163 -2132 -1561 -629 -235 -317 398 715 78 -221 -313 850 -975 -120
5622a20N52o24j87O50R73M1j486n05Q75Q03P84j051n18o5J036q2Q83q86q80K7
$$ -120 432 -192 -379 271 1244 1285 -201 -706 169 972 1756 705 187 122 1158 1076 1959 1073 193 220
5642B20J482m02Q20j623P12L48l97Q80r26M37j544J970q37O85l22l62m65J08K08
$$ 220 1702 1300 2120 497 1209 1557 1160 2040 1114 1551 7 1977 1140 1825 1503 1141 676 784 992
5661I92p4j69O24K17J50l01q91j83J018O61k087J242q01K56l18M02M4N20L5j334
$$ 992 918 749 1373 1590 1740 1439 548 365 1383 2044 -43 1199 398 654 336 738 782 1302 1337 3
5681CP45r88L34j75L56M29k117P50O35K33Q22j600P42j115J336q28M2j14p35O45
$$ 3 748 -240 94 -81 275 704 -1413 -663 -28 205 1027 -573 169 -946 390 -438 -396 -510 -1245 -600
5701f00o26M57l22j56L85J5J94M02r99j39K86K80L1j329P73N83J39j306O52O25
$$ -600 -1226 -769 -1091 -1247 -862 -847 -653 -251 -1250 -1389 -1103 -823 -792 -2121 -1348 -765 -626 -1932 -1280 -655
5721f55p80K78K68j016j62P57J039p13j091K76O86o0J125L8J37j672Q19l00j99
$$ -655 -1435 -1157 -889 -1905 -2067 -1310 -271 -984 -2075 -1799 -1113 -1173 -48 -10 127 -1545 -726 -1026 -1225
5740a225m89J730q74Q06J140j382j10m36N87k94J153o58m92R0Q97k6L04m00m47
$$ -1225 -1714 16 -858 -52 1088 -294 -404 -840 -253 -547 606 -52 -544 -454 443 417 721 321 -126
5759a26R89q14J157o32J94k23K38Q67j066L41M35n35l80P30m03J22j4J243r03
$$ -126 863 49 1206 574 768 545 783 1650 584 925 1360 825 445 1175 772 894 880 2123 1220
5778A220o77J006O80l82J85r18O23o79Q2Q23r9j048J355j180P5m67M19m11NP61
$$ 1220 543 1549 2229 1847 2032 1114 1737 1058 1140 1963 1864 816 2171 991 1066 599 1018 607 612 1373
5798A373j438M89K97l54P28l00n91J41l37k31q0J46Q37o97L90J70k251J354O57
$$ 1373 -65 424 721 367 1095 795 204 345 8 -223 -303 -157 680 -17 373 543 -1708 -354 303
5817C03j071R73n14j97J1L01q6m73kn6K58N10j512O68k67M39j30k40P4J095j61
$$ 303 -768 205 -309 -506 -495 -194 -280 -753 -755 -811 -553 -43 -1555 -887 -1154 -715 -845 -1085 -1011 84 -77
5838g7j094P89r62J44r81m37R28LK69R97j91n31p5m66L43k2N08n06L61m9k12K01
$$ -77 -1171 -382 -1344 -1200 -2181 -2618 -1690 -1687 -1418 -421 -612 -1143 -1218 -1684 -1341 -1363 -855 -1361 -1000 -1049 -1261 -1060
5860a060K85j067N85Q78j29n20J215N1r50j52Q24K46k91N76o20n7N3m30J336j213
$$ -1060 -775 -1842 -1257 -379 -508 -1028 187 238 -712 -864 -40 206 -85 491 -129 -186 -133 -563 773 -440
5880d40N26K5n38J169n83N13n16k8J421j151l70M76j60L44O76O41k015K28M14
$$ -440 86 111 -427 742 159 672 156 128 1549 398 28 504 344 688 1364 2005 -10 218 632
5899F32N71r4J78j16J369r99p49J005n23j37L05P99j623P77p17p08K426q25l48
$$ 632 1203 1109 1287 1171 2540 1541 792 1797 1274 1137 1442 2241 618 1395 678 -30 2396 1571 1223
5918A223J379k052j05r30J203j02M40J0k34q53P15j65J76p80Q63l65j181J006
$$ 1223 2602 550 445 -485 718 616 1056 1066 832 -21 694 529 705 -75 788 423 -758 248
5936B48K24J063o29j512Q84j58p4P23q96J23P67j183J85o85o3N73m3m32j94J603
$$ 248 472 1535 906 -606 278 120 46 769 -127 -4 763 -420 -235 -920 -983 -410 -453 -885 -1079 524
5956E24j648m81M0J170j340P26M98l62K14p07J027n44j346O04L62N05j10J45l5
$$ 524 -1124 -1605 -1565 -395 -1735 -1009 -511 -873 -659 -1366 -339 -883 -2229 -1625 -1263 -758 -868 -723 -758
5975g58N94n39l41p95J9O72o09N61J367j754j91J153r73J689j386K75P2N67n53
$$ -758 -164 -703 -1044 -1839 -1820 -1148 -1757 -1196 171 -1583 -1774 -621 -1594 95 -1291 -1016 -944 -377 -930
5994i30P09k28l80n8O90o37M72R24j201NM44j60M63J44l45J04j77Q63j089N91
$$ -930 -221 -449 -829 -887 -197 -834 -362 562 -639 -634 -190 -350 113 257 -88 16 -161 702 -387 204
6014B04M96j52j42o68J336k54j21O84L07p96N3q65K60j03O01n40R03O47p21o71
$$ 204 700 548 406 -262 1074 820 699 1383 1690 894 947 82 342 239 840 300 1203 1850 1129 458
6034D58O01K02J205j984R22N91o84n48R4M54O91r15L68k14J22n22m74R30m55j09
$$ 458 1059 1261 2466 482 1404 1995 1311 763 857 1311 2002 1087 1455 1241 1363 841 367 1297 842 733
6054G33k14m34J320p65O29j020J49K79n93Q26J05q41Q32J40j91j66j62J82p36
$$ 733 519 85 1405 640 1269 249 398 677 84 910 1015 174 1006 1146 955 789 627 809 73
6073G3L77J93j019q20J841j656L71P59m14p68k79Q81Q40k273J685K12j966J127
$$ 73 450 643 -376 -1196 645 -1011 -640 119 -295 -1063 -1342 -461 379 -1894 -209 3 -1963 -836
6091h36l0J208j366n23P21l04N35j344J325Q6p87J553q72r40J21J097r00l69r4
$$ -836 -866 342 -1024 -1547 -826 -1130 -595 -1939 -614 -528 -1315 238 -634 -1574 -1453 -356 -1256 -1625 -1719
6110a719j39k21R46n77P72N74J11j66n61J203j159J67o41J74m50J377j47j20j74
$$ -1719 -1858 -2079 -1133 -1710 -938 -364 -253 -419 -980 223 -936 -769 -1410 -1236 -1686 -309 -456 -576 -750
6129g50Q7L40N36j14l44O0k09P49j017J538j088L21j21K85o92K65M5m93P33N3
$$ -750 -663 -323 213 99 -245 -185 -394 355 -662 876 -212 109 -12 273 -419 -154 -109 -602 131 184
6149A84O04n53n07J032n94MM23L47K26l11J021j47m32k42K46p72N52L50M1j21
$$ 184 788 235 -272 760 166 170 593 940 1166 855 1876 1729 1297 1055 1301 529 1081 1431 1472 1351
6169A351q30P49p02L67L61j92p46O11l97M58k54k30m34R53m19j42L91n48J094
$$ 1351 521 1270 568 935 1296 1104 358 969 572 1030 776 546 112 1065 646 504 895 347 1441
6188A441j013L17R8r20k25J295o06k70n56P32n96J093m24p46M94n19L01K84J12
$$ 1441 428 745 843 -77 -302 993 387 117 -439 293 -303 790 366 -380 114 -405 -104 180 292
6207B92L92l46l79o60k19L43m89l34J388j241O91Q14p28o73o05N88k79N02R78
$$ 292 684 338 -41 -701 -920 -577 -1066 -1400 -12 -1253 -562 252 -476 -1149 -1754 -1166 -1445 -943 35
6226C5k010J217M74j017J77n63L05m94J113p99R5M33o30O25q8n39J372m09o42
$$ 35 -1975 -758 -284 -1301 -1124 -1687 -1382 -1876 -763 -1562 -1467 -1034 -1664 -1039 -1127 -1666 -294 -703 -1345
6245a345L78M93Q53o81N41j137L20k08L70k21L32m9j136J007R21j64p08O84K77
$$ -1345 -967 -474 379 -302 239 -898 -578 -786 -416 -637 -305 -354 -1490 -483 438 274 -434 250 527
6264E27p32l07J468n90o3n22J062O0j350J595m87L14K096k609J524j859J18K07
$$ 527 -205 -512 956 366 303 -219 843 903 -447 1148 661 975 3071 462 1986 127 245 452
6282D52Q28Q2l00J163j537j588J626L95k03L9j03O21q40r40K33O97j029J350q29
$$ 452 1280 1362 1062 2225 688 -900 726 1121 918 957 854 1475 635 -305 -72 625 -404 946 117
6301A17J323q2o03R27k641J290O96L50q01k88M28J22J82j008j92L38J33k69Q47
$$ 117 1440 1358 755 1682 -959 331 1027 1377 576 288 716 838 1020 12 -180 158 291 22 869
6320H69l27n47L02j258J432M8o16j38l7m89J346j779J228o34q5L48k68O95j332
$$ 869 542 -5 297 -961 471 519 -97 -235 -272 -761 585 -1194 34 -600 -685 -337 -605 90 -1242
6339a242Q96n43j4M59J99r29M81q1r50Q76J40n87Q90k82j495J404k7n65J343p04
$$ -1242 -346 -889 -903 -444 -245 -1174 -693 -774 -1724 -848 -708 -1295 -405 -687 -2182 -778 -805 -1370 -27 -731
6359g31J88Q7J71j847J811M4n23j232O30N88o74K08N11o85K53k58o15J093O6J307
$$ -731 -543 -456 -285 -2132 -321 -277 -800 -2032 -1402 -814 -1488 -1280 -769 -1454 -1201 -1459 -2074 -981 -915 392
6379C92j096M0N24O88j206Q91r62L75q71N26M07k71k88Q52N36O23j690O90m16
$$ 392 -704 -664 -140 548 -658 233 -729 -354 -1225 -699 -292 -563 -851 1 537 1160 -530 160 -256
6398b56P15Q74m68j49p29K66J4K79l04k23P84j374Q76N84K41p95M48N59j361O53
$$ -256 459 1333 865 716 -13 253 267 546 242 19 803 -571 305 889 1130 335 783 1342 -19 634
6418F34J9M22L63o81m07R76m25j014KJ555K36j056J13N16j351J415m35L19J29
$$ 634 653 1075 1438 757 350 1326 901 -113 -111 1444 1680 624 737 1253 -98 1317 882 1201 1330
6437A330m17l51o16J720r74l64O12N43q20j300J817j183N12j28l79N73k03p1n66
$$ 1330 913 562 -54 1666 692 328 940 1483 663 -637 1180 -3 509 381 2 575 372 301 -265
6456b65k7j01P56k321J945m94p0K49k06K51k54l19N73j119J359j316J401O96j699
$$ -265 -292 -393 363 -1958 -13 -507 -577 -328 -534 -283 -537 -856 -283 -1402 -43 -1359 42 738 -961
6475i61J062o16o01J5J18J84J66j329L15OJ034j65k9m20N95N73j368r2J618j213
$$ -961 101 -515 -1116 -1101 -983 -799 -633 -1962 -1647 -1641 -607 -772 -801 -1221 -626 -53 -1421 -1513 105 -1108
6495a108o12P7N65Q54L32k72j128K84N26L1m76K5K94M9k78n79J084Jj32N93l77
$$ -1108 -1720 -1643 -1078 -224 108 -164 -1292 -1008 -482 -451 -927 -902 -608 -559 -837 -1416 -332 -331 -463 130 -247
6516b47n0L81P1j440M69R07J07K01q03K06N70l3M8p20j64O92J393q73p16K45o61
$$ -247 -297 84 155 -1285 -816 91 198 399 -404 -198 372 339 387 -333 -497 195 1588 715 -1 244 -417
6537d17L15J112L1n21n39J004p82Q22j268N33K48l62P25p74n88J454m53M33j234
$$ -417 -102 1010 1041 520 -19 985 203 1025 -243 290 538 176 901 127 -461 993 540 973 -261
6556b61J312K30j015K159j550J3k17J189j640k28Q14P1n75J0L85J043r53j661
$$ -261 1051 1281 266 2425 875 888 671 1860 220 -8 806 877 302 312 697 1740 787 -874
6574h74J584p68J037k93n27k54J393j590N1k06K29J027j741K69J065j012L56K7
$$ -874 710 -58 979 686 159 -95 1298 -292 -241 -447 -218 809 -932 -663 402 -610 -254 -227
6592b27k40L47n48J032J91q96j182J926r77P3P97n90q1M79l90N0K57o36J30j231
$$ -227 -467 -120 -668 364 555 -341 -1523 403 -574 -501 296 -294 -375 104 -286 -236 21 -615 -485 -1716
6612a716R92l82J021l31n33j28Q6L68J10J20j123J335r06J523j485P85m28M47
$$ -1716 -724 -1106 -85 -416 -949 -1077 -991 -623 -513 -393 -1516 -181 -1087 436 -1049 -264 -692 -245
6630b45%J11j076J030p82J052l69j182O37p82J241N62q62O39K93o69j011J719
$$ -245 -245 -134 -1210 -180 -962 90 -279 -1461 -824 -1606 -365 197 -665 -26 267 -402 -1413 306
6648C06j240J244j155P23n77J182n98R97o94R94l13j83M8j12k53j48l49Q02N8
$$ 306 -934 310 -845 -122 -699 483 -115 882 188 1182 869 686 734 622 369 221 -128 674 732
6667G32l01j14n83J033m49N90m33Q39o8j047P42L92O29p13p54M77m15j43o9J004
$$ 732 431 317 -266 767 318 908 475 1314 1246 199 941 1333 1962 1249 495 972 557 414 345 1349
6687A349p64n20Q06k22K66n06P5L23M4l66j72R29j546J557j200Q28p83M48j76
$$ 1349 585 65 871 649 915 409 484 807 851 485 313 1242 -304 1253 53 881 98 546 370
6706C70k6L08q97J16p14K4Q69K38q24o26K071j150L97L43j843K021p0p48j260
$$ 370 344 652 -245 -129 -843 -819 50 288 -536 -1162 909 -241 156 499 -1344 677 607 -141 -1401
6725a401R25q24l90Q98N72k83p8q68K544j919K97n33m07R91q05L31l40M02P09
$$ -1401 -476 -1300 -1690 -792 -220 -503 -581 -1449 1095 -824 -527 -1060 -1467 -476 -1281 -950 -1290 -888 -179
6744a79m89Q45n94k82l6J28k32k27N25j429J211m06P95p40P22l12j59j002J201
$$ -179 -668 177 -417 -699 -735 -607 -839 -1066 -541 -1970 -759 -1165 -370 -1110 -388 -700 -859 -1861 -660
6763f60N94o20J014j124k00J121r84O33q09j9M90K87O6j36J037q96J468q49j05
$$ -660 -66 -686 328 -796 -996 125 -859 -226 -1035 -1054 -564 -277 -211 -347 690 -206 1262 413 308
6782C08R13j298j90M07L07L23J24p35r02J278K08j0m88J277k49q53p6O24p47k71
$$ 308 1221 -77 -267 140 447 770 894 159 -743 535 743 733 245 1522 1273 420 344 968 221 -50
6802e0J729m19J385j988l82L83R65j301r23J005l92R74q06J692j065M52j539O91
$$ -50 1679 1260 2645 657 275 658 1623 322 -601 404 12 986 180 1872 807 1259 -280 411
6820D11p86Q46P48j290J007N33j363J157j010j77J182q17J40j079M97M08j303
$$ 411 -375 471 1219 -71 936 1469 106 1263 253 76 1258 441 581 -498 -1 407 -896
6837h96l4J20R83n98K75M07k12M01L83j304N20J24o82P71j541P57J033n22J97
$$ -896 -930 -810 173 -425 -150 257 45 446 829 -475 45 169 -513 258 -1283 -526 507 -15 182
6856A82j059J150j183J095j116K31J330n69l64J17n4p33O37j46l54k55M71P91
$$ 182 -877 273 -910 185 -931 -700 630 61 -303 -186 -240 -973 -336 -482 -836 -1091 -620 171
6874A71j98K96J49o83rj302O81M08O27l18j64p66Q58p90J628m67j379R91K01J05
$$ 171 -27 269 418 -265 -274 -1576 -895 -487 140 -178 -342 -1108 -250 -1040 588 121 -1258 -267 -66 39
6894C9q68O77o48Q06m90J010j65j453J261n6K35K5J11N4m53k93M87J04N6P95p20
$$ 39 -829 -152 -800 6 -484 526 361 -1092 169 113 348 373 484 538 85 -208 279 383 439 1234 514
6915E14k10k63P90j232m36P09J226n51N55j216P19O34K41o51N84q43L62n57l89
$$ 514 304 41 831 -401 -837 -128 1098 547 1102 -114 605 1239 1480 829 1413 570 932 375 -14
6934a4L57Q41o73j270K009Q6N01q59O79j913J196Q25l40L8j272J122r28J52K58
$$ -14 343 1184 511 -759 1250 1336 1837 978 1657 -256 940 1765 1425 1463 191 1313 385 537 795
6953G95Jl85K12o69P87r64L00O1m92J116p55J068j553J01K62r2k0j45K01J91m3
$$ 795 796 411 623 -46 741 -223 77 138 -354 762 7 1075 -478 -377 -115 -207 -227 -372 -171 20 -23
6974b3J17o35k42Q40N6n66J64q0o61O63N32r0p56o12J402p9r92m91Q70J302q25
$$ -23 94 -541 -783 57 113 -453 -289 -369 -1030 -367 165 75 -681 -1293 109 30 -962 -1453 -583 719 -106
6995a06l66L00r69R09k29n53L38q62R68n39Q51j041Q21q28J43Q90p11Q6K49K18
$$ -106 -472 -172 -1141 -232 -461 -1014 -676 -1538 -570 -1109 -258 -1299 -478 -1306 -1163 -273 -984 -898 -649 -431
7015d31r37K156j853R09j333L91R77J34n44j10J154O18k427L00J800j399N72M51
$$ -431 -1368 788 -1065 -156 -1489 -1098 -121 13 -531 -641 513 1131 -1296 -996 804 -595 -23 428
7033D28p14M94O0L64O30j166m8p76O58K65k30K75n30n82J185l88M47p78J561n40
$$ 428 -286 208 268 632 1262 96 48 -728 -70 195 -35 240 -290 -872 313 -75 372 -406 1155 615
7053F15N62p49O08j431Q50P90l33J83l49L96Q1j985J748k61R60j139O03n52N3
$$ 615 1177 428 1036 -395 455 1245 912 1095 746 1142 1223 -762 986 725 1685 546 1149 597 650
7072F50M87p53j05O26P74q94l93J245j233l01N29R9M84l76N84j377J693j116j642
$$ 650 1137 384 279 905 1679 785 392 1637 404 103 632 731 1215 839 1423 46 1739 623 -1019
7091a019J369j041J009r8J19j237O18O22o35l37P06n36O14r35n21J790r62J172
$$ -1019 350 -691 318 220 339 -898 -280 342 -293 -630 76 -460 154 -781 -1302 488 -474 698
7109F98j106K14q01M61Q66M82p59p05R92q35q05L70J053j065N16j267J781j062
$$ 698 -408 -194 -995 -534 332 814 55 -650 342 -493 -1298 -928 125 -940 -424 -1691 90 -972
7127i72r81Q46R81o20M87m53O41k450J183j50j31R0J463J293j418o66l16j12N21
$$ -972 -1953 -1107 -126 -746 -259 -712 -71 -2521 -1338 -1488 -1619 -1529 -66 1227 -191 -857 -1173 -1285 -764
7146g64j37M61j85R22m57j52O22j201k91J572q73P42p02L78k91L61N72K61j419
$$ -764 -901 -440 -625 297 -160 -312 310 -891 -1182 390 -483 259 -443 -65 -356 5 577 838 -581
7165e81P45k36j66J426r08j68K66l12k48K61J95m61L15N39j064O57J047j585Q93
$$ -581 164 -72 -238 1188 280 112 378 66 -182 79 274 -187 128 667 -397 260 1307 -278 615
7184F15j75o90O07o6M62J48N16q78K33p50R18N24r56K26q83J90J116J60j504J434
$$ 615 440 -250 357 291 753 901 1417 539 772 22 940 1464 508 734 -149 41 1157 1317 -187 1247
7204A247j368O19O89n10k93N01o27O94L16r04M32o48m63J170J09n60j26N06K47
$$ 1247 -121 498 1187 677 384 885 258 952 1268 364 796 148 -315 855 964 404 278 784 1031
7223A031j595Q25J75q2q70O61L93J0N1p60l0o97r5J463n10N42j688N49j34J56
$$ 1031 -564 261 436 354 -516 145 538 548 599 -161 -191 -888 -983 480 -30 512 -1176 -627 -761 -605
7243f05P67q70l11J349o42r30J281q55L93l58RR61j088L92k17N82J05k44j15k3
$$ -605 162 -708 -1019 330 -312 -1242 39 -816 -423 -781 -772 189 -899 -507 -724 -142 -37 -281 -396 -419
7263d19K64j127N18M01o4j168R43j67r3J71O24j427J508O69n29jJ1o70J70K96
$$ -419 -155 -1282 -764 -363 -427 -1595 -652 -819 -912 -741 -117 -1544 -36 633 104 103 114 -556 -386 -90
7283i0j85Q25p83K00q81J581j730R21j059J786p51j69N28L3j34j67J97l37N34
$$ -90 -275 550 -233 -33 -914 667 -1063 -142 -1201 585 -166 -335 193 226 92 -75 122 -215 319
7302C19j49m15j61K074qq00O98n84k3j69j097O43j61j74Q14N20l41n24kL29m24
$$ 319 170 -245 -406 1668 1660 860 1558 974 951 782 -315 328 167 -7 807 1327 986 462 460 789 365
7323C65o98N64Q25p21j59J329L13j117J124j851P34p95R60m53p67O61R35L25j857
$$ 365 -333 231 1056 335 176 1505 1818 701 1825 -26 708 -87 873 420 -347 314 1249 1574 -283
7342b83o0R73J055j580k02N71o89N35Q1j8l84l67R70j590J120j06M5l62J353j746
$$ -283 -343 630 1685 105 -97 474 -215 320 401 383 -1 -368 602 -988 132 26 71 -291 1062 -684
7362f84P72m95J35K13j78J076o0j421P99j039N38r65J536m99m33p16J083l51k15
$$ -684 88 -407 -272 -59 -237 839 779 -642 157 -882 -344 -1309 227 -272 -705 -1421 -338 -689 -904
7381i04M08K39J46j504O99J056r02m06J113n07J98m75j79q4O35r3k80m47M51R69
$$ -904 -496 -257 -111 -1615 -916 140 -762 -1168 -55 -562 -364 -839 -1018 -1102 -467 -560 -840 -1287 -836 133
7401A33j44m13q8M25k30l22J64M01N87q53Q01j214R65j5r32M28n55M09J128j101
$$ 133 -11 -424 -512 -87 -317 -639 -475 -74 513 -340 461 -753 212 197 -735 -307 -862 -453 675 -426
7421d26J291m3k94l96j6r52O93p04JN14J34k53J095N64j065J878k095l90K338
$$ -426 865 822 528 132 116 -836 -143 -847 -846 -332 -198 -451 644 1208 143 2021 -74 -464 1874
7440A874j313n60M15L77o59M72m31Q12m00M28J14p60j373J584k44k69j58J027
$$ 1874 561 1 416 793 134 606 175 987 587 1015 1129 369 -1004 580 336 67 -91 936
7458I36j198K78j69N30P15n40r76J480K36p63Q58k176J172m68L21m4J88L19n98
$$ 936 -262 16 -153 377 1092 552 -424 1056 1292 529 1387 -789 383 -85 236 192 380 699 101
7477A01K57o18P09J48p72K3Q89p44k88j91K39J47L2j15o25J86J74Q29K97j044
$$ 101 358 -260 449 597 -175 -152 737 -7 -295 -486 -247 -100 -68 -183 -808 -622 -448 381 678 -366
7497c66j11M74r23p6M79J574Q6j943J150n57j685K197q28N02n15j21j12K20j74
$$ -366 -477 -3 -926 -1002 -523 1051 1137 -806 344 -213 -1898 299 -529 -27 -542 -663 -775 -555 -729
7516g29J087r02l90P50J86K70j358J481j693O90j72l43K563k442J284o20m66J55
$$ -729 358 -544 -934 -184 2 272 -1086 395 -1298 -608 -780 -1123 1440 -1002 282 -338 -804 -649
7534f49M34Q14j96j179N37Q06j109N24r07R92q43l91J116L4k8Q93o7m29l7n01
$$ -649 -215 599 403 -776 -239 567 -542 -18 -925 67 -776 -1167 -51 -17 -45 848 781 352 315 -186
7554a86N63j42J6m99M03k51k25M86q16J336j17r96J047q5j072K94J352j005O11
$$ -186 377 235 251 -248 155 -96 -321 165 -651 685 568 -428 619 534 -538 -244 1108 103 714
7573G14o51L76n0K40M63Mo13r89N01L30j89O55k55j91j50J261n10J033j618K48
$$ 714 63 439 389 629 1092 1096 483 -506 -5 325 136 791 536 345 195 1456 946 1979 361 609
7593F09j690J905m32K37o85k50O72J09n95J035m80l96k27K61p96k03Q30M13j276
$$ 609 -1081 824 392 629 -56 -306 366 475 -120 915 435 39 -188 73 -723 -926 -96 317 -959
7612i59J394J70j260M40j49P01l72L81p83O52l04K32l78k74n20Q78m21n68K42
$$ -959 435 605 -655 -215 -364 337 -35 346 -437 215 -89 143 -235 -509 -1029 -151 -572 -1140 -898
7631h98K365j953L11j229R02o2J09o46q9m11J421q56K49O55m74K22Q1Q04j802
$$ -898 1467 -486 -175 -1404 -502 -564 -455 -1101 -1190 -1601 -180 -1036 -787 -132 -606 -384 -303 501 -1301
7650a301J142o71J437j262J3o50J134l53k91J033o59J02O50k05l00o65m50Q10
$$ -1301 -159 -830 607 -655 -642 -1292 -158 -511 -802 231 -428 -326 324 119 -181 -846 -1296 -486
7668d86n97M19J026j049K02r9R38k09k35Q34q39P93j425l54M53N19l06R28K71
$$ -486 -1083 -664 362 -687 -485 -584 354 145 -90 744 -95 698 -727 -1081 -628 -109 -415 513 784
7687G84k46o94P60k65M3j53N46k38L78k3p74J06P76k71j086J120m45l49l04J947
$$ 784 538 -156 604 339 382 229 775 537 915 892 118 224 1000 729 -357 763 318 -31 -335 1612
7707A612j286J092l94n21J63K0n6o14J023n13r13L85p0J678k637J052P6m81J85
$$ 1612 326 1418 1024 503 666 686 630 16 1039 526 -387 -2 -72 1606 -1031 21 97 -384 -199
7726a99MJ482r99N47k97J77k86J17L78j14p29m21m22m35J906l70m96Q72j303j115
$$ -199 -195 1287 288 835 538 715 429 546 924 810 81 -340 -762 -1197 709 339 -157 715 -588 -1703
7746a703J574o10R84N40j60q31P73j210N07K04r79O23p40N59P11j172Q83M60r56
$$ -1703 -129 -739 245 785 625 -206 567 -643 -136 68 -911 -288 -1028 -469 242 -930 -47 413 -543
7765e43k33M66l73L59k11p91P50J40j393J465o64Q62n77O96M92m33L4j326J134
$$ -543 -776 -310 -683 -324 -535 -1326 -576 -436 -1829 -364 -1028 -166 -743 -47 445 12 46 -1280 -146
7784a46J152j636k12k28N28P58n95Mk74J438q83L06j007J074M47m80J80j396M63
$$ -146 1006 -630 -842 -1070 -542 216 -379 -375 -649 789 -94 212 -795 279 726 246 426 -970 -507
7803e07m18P00K70L63p05o3K16R23j307N79m60M71K57j260J686l20o86l63NJ604
$$ -507 -925 -225 45 408 -297 -360 -144 779 -528 51 -409 62 319 -941 745 425 -261 -624 -619 985
7823I85j16o19K4P35q70L28j175J385p82R55o61q2J63o33J307L6p03P8n33K40
$$ 985 869 250 274 1009 139 467 -708 677 -105 850 189 107 270 -363 944 980 277 355 -178 62
7843F2M50j80L88k04J236j250j34R30j431M02J201l30j140J74k52P53k47m75P05
$$ 62 512 332 720 516 1752 502 368 1298 -133 269 1470 1140 0 174 -78 675 428 -47 658
7862F58J06k28j61n68j45m94J558q65o87J025j246J570l56n6k54k93j55J139j0
$$ 658 764 536 375 -193 -338 -832 726 -139 -826 199 -1047 523 167 111 -143 -436 -591 548 538
7881E38q95K05J93o5r5n28m94k32R8j37J103o90M03K22o27J243j266K63Q19j055
$$ 538 -357 -152 41 -24 -119 -647 -1141 -1373 -1275 -1412 -309 -999 -596 -374 -1001 242 -1024 -761 58 -997
7901i97J364q82L4o88J88L34k68M09k22l7J63J81l88K30J88j91K42m68K6J397
$$ -997 367 -515 -481 -1169 -981 -647 -915 -506 -728 -765 -602 -421 -809 -579 -391 -582 -340 -808 -782 615
7921F15j598J80J045l89J13J57n14l06L73J99o8m43N18r22J181K58m26K88M23
$$ 615 -983 -803 242 -147 -34 123 -391 -697 -324 -125 -193 -636 -118 -1040 141 399 -27 261 684
7940F84o16L85n45J0L64n26J044O31j456N43l15N98k7r4q81J085l49J269q48p15
$$ 684 68 453 -92 -82 282 -244 800 1431 -25 518 203 801 774 680 -201 884 535 1804 956 241
7960B41j13K68k93j88Q7N57M89j36l05n8Q5o14M9J216k49j312P69P06o33m42j222
$$ 241 128 396 103 -85 2 559 1048 912 607 549 634 20 69 1285 1036 -276 493 1199 566 124 -1098
7981a098J314K96j31Q43j505O76m39p2n08J588j518J300r71j39J078l40q15m47
$$ -1098 216 512 381 1224 -281 395 -44 -116 -624 964 -554 746 -225 -364 714 374 -441 -888
7999h88J221J25m25j58m38N26J48l21n00jM02J164j790k70Q55N64j112m57Q07
$$ -888 333 458 33 -125 -563 -37 111 -210 -710 -711 -309 855 -935 -1205 -350 214 -898 -1355 -548
8018e48l53KM26j19N44m47M22o05Q23j443N40J95P63M04j422L46j254J409r63
$$ -548 -901 -899 -473 -592 -48 -495 -73 -678 145 -1298 -758 -563 200 604 -818 -472 -1726 -317 -1280
8037a280O28J23K05O81j81k60j07L82k15p37q2K73N03Q2m1p67k6O51J37j423J272
$$ -1280 -652 -529 -324 357 176 -84 -191 191 -24 -761 -843 -570 -67 15 -26 -793 -819 -168 -31 -1454 -182
8058a82K24P37m74j05J74l74K21K09n44M30K49R53k144J042r6M19p75k32M9n3
$$ -182 42 779 305 200 374 0 221 430 -114 316 565 1518 -626 416 320 739 -36 -268 -219 -272
8078b72J049l2M5r61j70J027p05M23R27j282j221K159p37P91p95Q61j338Q80j631
$$ -272 777 745 790 -171 -341 686 -19 404 1331 49 -1172 987 250 1041 246 1107 -231 649 -982
8097i82J659m17k0n10K26J92m11J207n57j70K10M42n38N18j028J071q00l27J265
$$ -982 677 260 240 -270 -44 148 -263 944 387 217 427 869 331 849 -179 892 92 -235 1030
8116A030n5m84n31N46j98j313R70L41J32m81n25O02l73m41j96J206L56l71L71
$$ 1030 975 491 -40 506 308 -1005 -35 306 438 -43 -568 34 -339 -780 -976 230 586 215 586
8135E86R6j003K77m38N4l76P72M50j37o39l67Q04n40j65M64N59j95m11k15Q66
$$ 586 682 -321 -44 -482 -428 -804 -32 418 281 -358 -725 79 -461 -626 -162 397 202 -209 -424 442
8155D42p72n41M91n24J025r13O71j217J238q54R03O12j198M5L93j423J269o50
$$ 442 -330 -871 -380 -904 121 -792 -121 -1338 -100 -954 -51 561 -637 -592 -199 -1622 -353 -1003
8173a003J016L40p13k00K53N77p28l09P3K311j657O24N45q46M17q91p2Q20
$$ -1003 13 353 -360 -560 -307 270 -458 -767 -694 1617 -40 584 1129 283 700 -191 -263 557
8191E57
$$ Imaginary data points
##PAGE= N=2
##DATA TABLE= (X++(I..I)), XYDATA
0@%%%%%%%%%%%%%nJ00k03K16k16K16k21L01m03M31m71N69o48P36q43R54j085J211
$$ 0 0 0 0 0 0 0 0 0 0 0 0 0 0 -5 95 -108 108 -108 108 -113 188 -215 216 -255 314 -334 402 -441 513 -572 639
31F39j369J548j727J921k139K381k649K939l256L613m003M428m906N433o017O685
$$ 639 -730 818 -909 1012 -1127 1254 -1395 1544 -1712 1901 -2102 2326 -2580 2853 -3164 3521
47C521p441Q303r308J0478j1877J3579j5705J8449k2136K7417l5632N0309q4585
$$ 3521 -3920 4383 -4925 5553 -6324 7255 -8450 9999 -12137 15280 -20352 29957 -54628
60e4628L12695J28063n30253J4179L21342O3452l32944j4574K67286M3927k79976
$$ -54628 258067 386130 -144123 -129944 191398 254850 -78094 -92668 174618 218545 -61431
71f1431l6749K24748P1935k01907o1852J40216N7118j24734l2714R3735K6745
$$ -61431 -98180 126568 198503 -3404 -65256 74960 132078 7344 -25370 68365 95110
82I5110q3539j3509O0753J6911m6914j4350J8986Q515j1899L91L865q345j2002
$$ 95110 11571 -1938 58815 75726 28812 14462 33448 41963 30064 30455 34320 25975 13973
95A3973P996J4781j3477l5738N819M1233n920o3121o923O2491O817p6567j6053
$$ 13973 21969 36750 23273 -12465 -6646 34587 28667 -34454 -41377 21114 27931 -48636 -64689
108f4689Q8926J7834j14325l9794J18948O1000j28600p9097J25010P9239j28824
$$ -64689 24237 42071 -72254 -112048 6900 67900 -60700 -139797 -14787 64452 -64372
119f4372q3039J42201Q6091j53850j00056J52298J08781j41240j15212J26548
$$ -64372 -147411 -5210 80881 -72969 -173025 -20727 88054 -53186 -168398 -41850
129d1850J12390j15864j07690J09516J06637j01894j04820Q6632J01285p6199
$$ -41850 70540 -45324 -153014 -43498 63139 -38755 -143575 -56943 44342 -31857
139c1857q5792O3769P4608n5764n5487N2126M3601m7959l1768M9542K5982m5943
$$ -31857 -117649 -53880 20728 -35036 -90523 -38397 5204 -42755 -74523 -24981 1001 -44942
151d4942k4272M5309K6876l6546k1033L6336K3037l7072j5108M0656J8681m3706
$$ -44942 -69214 -23905 2971 -33575 -54608 -18272 4765 -32307 -47415 -6759 11922 -31784
163c1784j8326N0291K6372m7042k3776N1530K9336m9758l0369N8056M5402o0162
$$ -31784 -50110 181 26553 -20489 -44265 7265 36601 -13157 -43526 14530 59932 -230
175b30n5341O5774P3508n7710p7247N9617Q3449n3667q8109N3639R7480m7099
$$ -230 -55571 10203 83711 26001 -51246 8371 91820 38153 -49956 3683 101163 54064
187E4064r7994M3988J00515l5347j00836L1194J01524k1963j02603J6734R8453
$$ 54064 -43930 58 100573 65226 -35610 -4416 97108 75145 -27458 -10724 87729
198H7729j1820q9537R520Q3707o737p8643Q131P0394m640o2546J54N4661k731
$$ 87729 75909 -13628 -4108 79599 72862 -5781 2350 72744 68104 5558 5712 60373 57642
211E7642m5429N243M2358j3461m2822J5429M4633j9763m8064J7046M4076k2622
$$ 57642 12213 17456 59814 46353 3531 18960 63593 43830 -4234 12812 56888 34266
223C4266m8047K3737M7171l1293n4582K5803N7490k6444o5347J8331O1072j8906
$$ 34266 -13781 9956 57127 25834 -28748 -2945 54545 28101 -37246 -18915 42157 23251
235B3251o6411J8344O4700k0223p2617J6790P3379j5864p9509Q043P4569l343
$$ 23251 -43160 -24816 39884 19661 -52956 -36166 37213 21349 -58160 -50117 24452 21109
247B1109p4121l950O7985M173o9514p615O7058O368o9404j4745O4350J5027o0107
$$ 21109 -53012 -56962 11023 15196 -54318 -61933 5125 11493 -57911 -72656 -8306 6721 -53386
260e3386j7406N0861J3650m8330j2039M6903R941m7317j0936M4446J2992m0601
$$ -53386 -70792 -19931 -6281 -54611 -66650 -19747 -9806 -57123 -68059 -23613 -10621 -51222
272e1222j2192M2293Q869l9565k129M5104p89m4794o88N0099L132m4361r63M6810
$$ -51222 -63414 -21121 -12252 -51817 -53946 -8842 -9631 -54425 -55113 -5014 -1882 -46243 -47206 -396
286c96K654m4679j35N0434N105n3843m517N7009J1422n4225j2906N9703J5859
$$ -396 2258 -42421 -42556 7878 12983 -40860 -45377 11632 23054 -31171 -44077 15626 31485
299C1485n4848j4122N8241J8436n3681j9106N7663K6112n1163k5155N0534L2336
$$ 31485 -23363 -37485 20756 39192 -14489 -33595 24068 50180 -983 -26138 24396 56732
311E6732m6315k7422M7314L0710m5856k8670M9826L2161m4782k9389M2347K8770
$$ 56732 10417 -17005 30309 61019 15163 -13507 36319 68480 23698 -5691 36656 65426
323F5426l6413k4372L5792K0996l3249k1482L4127K2962l3046k2936L0154K2566
$$ 65426 29013 4641 40433 61429 28180 6698 40825 63787 30741 7805 37959 60525
335F0525l2432j9945L3897J6942l8861j7234L7901J6612l7635j9514L4918J7044
$$ 60525 28093 8148 42045 58987 20126 2892 40793 57405 19770 256 35174 52218
347E2218l7085j8032L5184J8477l9338k7627M0023K7244m1094l2564L6756L1454
$$ 52218 15133 -2899 32285 50762 11424 -16203 23820 51064 9970 -22594 14162 45616
359D5616m1283l3206L7636K9743m0959l2562L2487L3350l2178l8297K5304L4714
$$ 45616 4333 -28873 8763 38506 -2453 -35015 -2528 30822 -1356 -39653 -14349 20365
371B0365k5074l9896K3781L4789k5555m0852K3992L8548k4879l8699K1271L3925
$$ 20365 -4709 -44605 -20824 13965 -11590 -52442 -28450 10098 -14781 -53480 -32209 1716
383A716j9740l3103J4789K9990j8736k9746J9574L0194j8561l4028J5328L3258
$$ 1716 -18024 -51127 -36338 -6348 -25084 -54830 -35256 -5062 -23623 -57651 -42323 -9065
395i065j4223l1895J7572L1086k2788k9616K4950L3214k4282l1817K3014L1372
$$ -9065 -23288 -55183 -37611 -6525 -29313 -58929 -33979 -765 -25047 -56864 -33850 -2478
407b478j9676k6610K0376K8995j9426l1614K2598L9811k0682l8541J9712M1880
$$ -2478 -22154 -48764 -28388 607 -18819 -50433 -27835 11976 -8706 -47247 -27535 14345
419A4345j6175l8332K0423M1247j9355l6082J8935L9027j1083l7672J0284M0249
$$ 14345 -1830 -40162 -19739 21508 2153 -33929 -14994 24033 12950 -24722 -14438 25811
431B5811n958l5812O767L9205k579l7937M938M2290l820l7650M399L9237p01l4245
$$ 25811 19853 -15959 -9192 30013 27434 -10503 -5565 36725 32905 -4745 -346 38891 38190 3945
445C945L131L2888m03l1079K896L3885k87l4448M44L5641n15l3229J788L3962
$$ 3945 7076 39964 39561 8482 11378 45263 44976 10528 10972 46613 46098 12869 14657 48619
459D8619m892l2454N170L3877p331l4568N436L2317n916l0642J754L1775m383
$$ 48619 43727 11273 16443 50320 42989 8421 13857 46174 40258 9616 11370 43145 38762
472C8762l6188N034L4407k579l9628r3L7021j230l6937q0L5165n116l5722K12
$$ 38762 2574 7608 42015 39436 -192 -285 36736 35506 -1431 -1511 33654 28538 -7184 -6972
486f972L5561J65l9041n110L2541O813l4110j0827L0161O185l4009r118L3119
$$ -6972 28589 28754 -10287 -15397 17144 23957 -10153 -20980 9181 15366 -18643 -27761 5358
499E358P280l5566j2488L0222R653k8191j1888K4227R182k7245r860K6155J0528
$$ 5358 12638 -22928 -35416 -5194 4459 -23732 -35620 -11393 -2211 -29456 -39316 -13161 -2633
512b633k7724j5116K6048J8138k6827j7238K4363J3489k5142j0704K7431J0519
$$ -2633 -30357 -45473 -19425 -1287 -28114 -45352 -20989 -7500 -32642 -43346 -15915 -5396
524e396k9507j4092L1048J4646k5849j7933K7572J4457k7579j2665L0903J2983
$$ -5396 -34903 -48995 -17947 -3301 -29150 -47083 -19511 -5054 -32633 -45298 -14395 -1412
536a412l1358j6286L6195J7770l2132j5280L0608J6865k7770j0644L1068J4661
$$ -1412 -32770 -49056 -12861 4909 -27223 -42503 -11895 4970 -22800 -33444 -2376 12285
548A2285l0913j2230L0246K0375k6264j7161K6352J8705k3288j2934K5366J5767
$$ 12285 -18628 -30858 -612 19763 -6501 -23662 2690 21395 -1893 -14827 10539 26306
560B6306k4611j4069K3671J8260j9409j7125J7953J8622j5074j5011J5045J5613
$$ 26306 1695 -12374 11297 29557 10148 -6977 10976 29598 14524 -487 14558 30171
572C0171j3300j6995J5621K2302j5300k0410J4799K0799j1212j8434J2160J9559
$$ 30171 16871 -124 15497 37799 22499 2089 16888 37687 26475 8041 20201 39760
584C9760j3046k0074J5705K2608j3953k4898J4232K3698j1772k6058J3046K3859
$$ 39760 26714 6640 22345 44953 31000 6102 20334 44032 32260 6202 19248 43107
596D3107j5548k5612J6129K3275j6910k8098J5631K5948j6386k6948J3573K3461
$$ 43107 27559 1947 18076 41351 24441 -3657 11974 37922 21536 -5412 8161 31622
608C1622j5383k6021J5422K4018j8110k7476J7424K4047j8105k4655J5853K1883
$$ 31622 16239 -9782 5640 29658 11548 -15928 1496 25543 7438 -17217 -1364 20519
620B0519j9533k2651J8347J8635j9265k0851J6218K0723j8176k3147J4953K0516
$$ 20519 986 -21665 -3318 15317 -3948 -24799 -8581 12142 -6034 -29181 -14228 6288
632F288j3379k3775J2685K0753j2108k1829R258K2398j1091k2372P460K1152o173
$$ 6288 -7091 -30866 -18181 2572 -9536 -31365 -22107 291 -10800 -33172 -25712 -4560 -10733
645a0733j9546K433J8624k217k0535J080J9880j696k1280j423K4663K199k6666
$$ -10733 -30279 -27846 -9222 -11439 -31974 -30894 -11014 -12710 -33990 -35413 -10750 -8551 -35217
658c5217j887K2974K552k0377j715K1040J693k0947l49K4355J515k2908k113K7800
$$ -35217 -37104 -14130 -11578 -31955 -33670 -12630 -10937 -31884 -32233 -7878 -6363 -29271 -31384 -3584
672c584O099k5631j594K8117J904k6610J341L1128K000l0098j386K8380P055k5821
$$ -3584 2515 -23116 -24710 3407 5311 -21299 -19958 11170 13170 -16928 -18314 10066 17121 -8700
686h700l732K3818M264k0320m384K3980M210k5944k030K4933M440k3954j362K1319
$$ -8700 -12432 11386 15650 -4670 -9054 14926 19136 -6808 -8838 16095 20535 -3419 -4781 16538
700A6538K200j8010J388K1784k705j8765K587K1185M101j8529k627J7812M939
$$ 16538 18738 728 2116 23900 21195 2430 5017 26202 30303 11774 9147 26959 31898
713C1898j7100P71J9606j583k0949J442K2540O43k0085m803J6549K716j4239l474
$$ 31898 14798 15569 35175 33592 12643 14085 36625 37268 17183 12380 28929 31645 17406 13932
727A3932J2265L025j6615o848J6762P092j8308j0904J3635J0498j4837r137J2852
$$ 13932 26197 29222 12607 5759 22521 29613 11305 401 14036 24534 9697 560 13412
740A3412M017j3555o015J4987N997j7220j0944J5146J0817j3219j2185J1017R239
$$ 13412 17429 3874 -2141 12846 18843 1623 -9321 5825 16642 3423 -8762 2255 11494
753A1494j5094j1096J6507J0707k1312j5280K0452J1358k0172j3067J5813J0798
$$ 11494 -3600 -14696 1811 12518 -8794 -24074 -3622 7736 -12436 -25503 -9690 1108
765A108j9156j3461J9955J3138k2214j9932K0505K0056j8686k1130J6434J8169
$$ 1108 -18048 -31509 -11554 1584 -20630 -40562 -20057 -1 -18687 -39817 -23383 -5214
777e214j8389j5694J7846J6921k1182j6536J9402J6323j6991j4777J4707J4810
$$ -5214 -23603 -39297 -21451 -4530 -25712 -42248 -22846 -6523 -23514 -38291 -23584 -8774
789h774j3801j4247J7028J3478j5975j4588J7458J6227j5523j2774J5432J1938
$$ -8774 -22575 -36822 -19794 -6316 -22291 -36879 -19421 -3194 -18717 -31491 -16059 -4121
801d121j2316p933J3918Q245j1518p409J3355R784q098r214Q773J1137n253q141
$$ -4121 -16437 -24370 -10452 -2207 -13725 -21134 -7779 2005 -6093 -15307 -6534 4603 -650 -8791
815h791O855J2068n756j0726Q201J1331l047j0402L786J0241J524j0066J417J1901
$$ -8791 -1936 10132 4376 -6350 1851 13182 10135 -267 3519 13760 15284 5218 6635 18536
829A8536j40j1448J389J6006P77j6088O97J8456r80j7229K221K0023k180j8908
$$ 18536 18396 6948 8337 24343 25120 9032 9729 28185 27205 9976 12197 32220 30040 11132
843A1132K177J9901p82k0759J533K0162j944k0920L204K1749m573k3750N836K1326
$$ 11132 13309 33210 32428 11669 13202 33364 31420 10500 13704 35453 30880 7130 12966 34292
857C4292n535k4247P785K0521q487k0424P199J8701r243k0307P338J9073q912
$$ 34292 28757 4510 12295 32816 24329 3905 11104 29805 20562 255 7593 26666 17754
870A7754j8164O608J5657r540j5863O409J5142r664j5727O269J2137o587j4096
$$ 17754 -410 6198 21855 12315 -3548 2861 18003 8339 -7388 -1119 11018 4431 -9665
883i665L105J0274m364j0813J480R025m021r998r57J0212P55j2363l061J0141
$$ -9665 -6560 3714 -650 -11463 -9983 -958 -4979 -14977 -15934 -5722 -4967 -17330 -20391 -10250
897a0250J468j1158p59Q032K948j1674l484J1581M996j2408p185J1060Q069j3679
$$ -10250 -8782 -19940 -20699 -12667 -9719 -21393 -24877 -13296 -8300 -20708 -27893 -16833 -8764 -22443
911b2443o375J4629M543j4077p917J8294P100j7601p523J5875Q089j7579l072
$$ -22443 -28818 -14189 -9646 -23723 -31640 -13346 -6246 -23847 -31370 -15495 -7406 -24985 -28057
924b8057J7674L780j7773k965J9619M782j7701m738J9350O768j7692l087J9053
$$ -28057 -10383 -6603 -24376 -27341 -7722 -2940 -20641 -25379 -6029 739 -16953 -20040 -987
937i87K430j5120p87J6617M949j6613o16J5005L057j0534j530J0916M152j0714
$$ -987 1443 -13677 -14464 2153 7102 -9511 -10127 4878 7935 -2599 -4129 6787 10939 225
951B25j300J0883M508j0875l245J2595M059r335l660R256N325p739l746Q095O533
$$ 225 -1075 9808 14316 3441 196 12791 16850 7515 3855 13111 18436 10697 6951 15046 21579
966B1579q110n935Q654Q062p554q726Q790R852r548p973R238R518r764r458J0990
$$ 21579 13469 7534 16188 24250 16696 7970 16760 26612 17064 9091 18329 27847 18083 8625 19615
981A9615Q413r962r429R197R558j0895j0735J0347R578j0404j2568J0394Q542
$$ 19615 28028 18066 8637 17834 27392 16497 5762 16109 25687 15283 2715 13109 21651
994B1651r424j0392J0132Q490j2706q628Q608R214j0739j0159R420O695q785q667
$$ 21651 12227 1835 11967 20457 7751 -877 7731 16945 6206 -3953 5467 12162 3377 -5290
1008e290O007P985r235r621P700R027r744r169P463O319p162p166O763M351p930
$$ -5290 717 8702 -533 -10154 -2454 6573 -3171 -12340 -4877 1442 -5720 -12886 -6123 -1772 -9702
1023i702p735O734P081o636r333L995Q190n136q540L049J0683o794r619N143J1633
$$ -9702 -17437 -10703 -3622 -10258 -19591 -15596 -7406 -12542 -21082 -18033 -7350 -14144 -23763 -18620 -6987
1038f987o449j0916L861J1478m531j0435M655R308m242j0305M859J3097l844j3143
$$ -6987 -13436 -24352 -20491 -9013 -13544 -23979 -19324 -10016 -14258 -24563 -19704 -6607 -10451 -23594
1052b3594M049J2767l369j0553M757J1683m415j1016N927J1626m160j1798N873
$$ -23594 -19545 -6778 -10147 -20700 -15943 -4260 -8675 -19691 -13764 -2138 -6298 -18096 -12223
1065a2223J1591j638j0181K412J0846j943r482N423J1980k175j3592N385J2397
$$ -12223 -632 -2270 -12451 -10039 807 -1136 -10618 -5195 6785 4610 -8982 -3597 8800
1078H800n43j1187M572R618l573o782L286R248o89q617P2J2264J053j0159q00
$$ 8800 8257 -2930 1642 11260 7687 905 4191 13439 12750 4133 4205 16469 17522 7363 6563
1093F563R996O94r766K538J1934l765r394J059J1169p73q337j079R140k6q820
$$ 6563 16559 17253 7487 10025 21959 18194 8800 9859 21028 20255 11918 10839 19979 19953 11133
1108A1133M29J0179P3j1479o06J1059P88j1639J57R088k91j0048R49Q158j066
$$ 11133 11562 21741 21814 10335 9729 20788 21576 9937 10094 19182 18891 8843 9792 17950 16884
1123A6884j1418r65R790J667j1446k814R682O94j0255j874R239N40j2126r52R444
$$ 16884 5466 4501 14291 15958 4512 1698 11380 12074 1819 -55 9184 9724 -2402 -3354 6090
1138F090J744j0918k753R236j09j0101j903Q491J253r884k639Q229K860r502m334
$$ 6090 7834 -3084 -5837 3399 3290 -6811 -8714 -223 1030 -8854 -11493 -3264 -404 -9906 -14240
1153a4240O724K406q921k435Q380N63r513l608R419M185r242m699Q272K820p056
$$ -14240 -7516 -5110 -14031 -16466 -8086 -7523 -17036 -20644 -11225 -7040 -16282 -20981 -12709 -9889 -16945
1168a6945l775P592M321q928n638R284O628q605m084Q440K667q662p57J0043K298
$$ -16945 -20720 -13128 -8807 -17735 -23373 -14089 -7461 -16066 -20150 -11710 -9043 -17705 -18462 -8419 -6121
$$ [...]
8191F10
##END NTUPLES=NMR FID
##END=
