##TITLE=1H_SA_42.154.u
 CDCl3, 80 sc, 
 13.11.2019
##JCAMPDX= 6.0         $$ Bruker NMR JCAMP-DX V2.0
##DATA TYPE= NMR FID
##DATA CLASS= NTUPLES
##ORIGIN= UXNMR, Bruker Analytische Messtechnik GmbH
##OWNER= root
$$ XWIN-NMR		Version 3.5
$$ Wed Nov 13 14:33:46 2019 Russian Standard Time (UT+4h)  she@DPX200
##.OBSERVE FREQUENCY= 200.1315
##.OBSERVE NUCLEUS= ^1H
##.DELAY= (6, 6)
##.ACQUISITION MODE= SIMULTANEOUS
##.ACQUISITION SCHEME= undefined
##.AVERAGES= 80
##.DIGITISER RES= 18
##SPECTROMETER/DATA SYSTEM= spect
##.PULSE SEQUENCE= zg30
##.SOLVENT NAME= D2O
##.SHIFT REFERENCE= (INTERNAL, D2O, 0, 15.7039)
##AUDIT TRAIL= $$ (NUMBER, WHEN, WHO, WHERE, WHAT)
$$ ##TITLE= Audit trail, XWIN-NMR		Version 3.5
$$ ##JCAMPDX= 5.01
$$ ##ORIGIN= Bruker BioSpin GmbH
$$ ##OWNER= she
$$ F:/spectra/data/she/nmr/H-F/1/audita.txt
$$ ##AUDIT TRAIL=  $$ (NUMBER, WHEN, WHO, WHERE, WHAT)
(   1,<2019-11-13 14:32:31.23 +0400>,<she>,<DPX200>,
      <continue with go, POWCHK disabled, PULCHK disabled
       configuration hash MD5:
       00 E9 B6 7A A2 85 ED C7 34 08 36 98 17 FE 4E 26
       data hash MD5: 16K
       73 B0 1F 8D E4 EC 85 B3 DF 5C 9A 69 9C E9 AB 7F>)
$$ ##END=
$$ 
$$ hash MD5
$$ 0D C9 F7 4F CA F0 5C 98 24 51 30 9D 07 24 91 4D
##$RELAX= 
##$RELAX= 
##$RELAX= 
##$RELAX= 
##$RELAX= 
##$RELAX= 
$$ Bruker specific parameters
$$ --------------------------
##$DU= <F:/spectra>
##$EXPNO= 1
##$NAME= <H-F>
##$PROCNO= 1
##$TYPE= <nmr>
##$USER= <she>
##$AMP= (0..31)
100 100 100 100 100 100 100 100 100 100 100 100 100 100 100 100 100 100 
100 100 100 100 100 100 100 100 100 100 100 100 100 100 
##$AQSEQ= 0
##$AQ_mod= 1
##$AUNM= <au_zg>
##$AUTOPOS= <>
##$BF1= 200.13
##$BF2= 200.13
##$BF3= 200.13
##$BF4= 200.13
##$BF5= 200.13
##$BF6= 200.13
##$BF7= 200.13
##$BF8= 200.13
##$BYTORDA= 1
##$CFDGTYP= 0
##$CFRGTYP= 5
##$CHEMSTR= <none>
##$CNST= (0..31)
1 1 145 1 1 1 1 1 1 1 1 1 1 1 1 1 1 1 1 1 1 1 1 1 1 1 1 1 1 1 1 1 
##$CPDPRG= <>
##$CPDPRG1= <>
##$CPDPRG2= <>
##$CPDPRG3= <>
##$CPDPRG4= <mlev>
##$CPDPRG5= <mlev>
##$CPDPRG6= <mlev>
##$CPDPRG7= <mlev>
##$CPDPRG8= <mlev>
##$CPDPRGB= <>
##$CPDPRGT= <>
##$D= (0..31)
0 1.2 0 0 0 0 0 0 0 0.06 0 0.03 0 0 0 0 0.0002 0 0 0 0 0 0 0 0 0 0 0 0 
0 0 0 
##$DATE= 1573640907
##$DBL= (0..7)
120 120 120 120 120 120 120 120 
##$DBP= (0..7)
150 150 150 150 150 150 150 150 
##$DBP07= 0
##$DBPNAM0= <>
##$DBPNAM1= <>
##$DBPNAM2= <>
##$DBPNAM3= <>
##$DBPNAM4= <>
##$DBPNAM5= <>
##$DBPNAM6= <>
##$DBPNAM7= <>
##$DBPOAL= (0..7)
0.5 0.5 0.5 0.5 0.5 0.5 0.5 0.5 
##$DBPOFFS= (0..7)
0 0 0 0 0 0 0 0 
##$DE= 6
##$DECBNUC= <off>
##$DECIM= 24
##$DECNUC= <off>
##$DECSTAT= 4
##$DIGMOD= 1
##$DIGTYP= 9
##$DL= (0..7)
0 120 120 120 120 120 120 120 
##$DP= (0..7)
150 150 150 150 150 150 150 150 
##$DP07= 0
##$DPNAME0= <>
##$DPNAME1= <>
##$DPNAME2= <>
##$DPNAME3= <>
##$DPNAME4= <>
##$DPNAME5= <>
##$DPNAME6= <>
##$DPNAME7= <>
##$DPOAL= (0..7)
0.5 0.5 0.5 0.5 0.5 0.5 0.5 0.5 
##$DPOFFS= (0..7)
0 0 0 0 0 0 0 0 
##$DQDMODE= 0
##$DR= 18
##$DS= 0
##$DSLIST= <SSSSSSSSSSSSSSS>
$$ [...]
##$SUBNAM2= <"">
##$SUBNAM3= <"">
##$SUBNAM4= <"">
##$SUBNAM5= <"">
##$SUBNAM6= <"">
##$SUBNAM7= <"">
##$SUBNAM8= <"">
##$SUBNAM9= <"">
##$SW= 24.0689530833862
##$SWIBOX= (0..15)
0 0 2 0 0 0 0 0 0 0 0 0 0 0 0 0 
##$SW_h= 4816.95568400771
##$TD= 16384
##$TD0= 1
##$TE= 0
##$TE2= 300
##$TE3= 300
##$TEG= 300
##$TL= (0..7)
0 120 120 120 120 120 120 120 
##$TP= (0..7)
150 150 150 150 150 150 150 150 
##$TP07= 0
##$TPNAME0= <>
##$TPNAME1= <>
##$TPNAME2= <>
##$TPNAME3= <>
##$TPNAME4= <>
##$TPNAME5= <>
##$TPNAME6= <>
##$TPNAME7= <>
##$TPOAL= (0..7)
0.5 0.5 0.5 0.5 0.5 0.5 0.5 0.5 
##$TPOFFS= (0..7)
0 0 0 0 0 0 0 0 
##$TUNHIN= 0
##$TUNHOUT= 0
##$TUNXOUT= 0
##$USERA1= <user>
##$USERA2= <user>
##$USERA3= <user>
##$USERA4= <user>
##$USERA5= <user>
##$V9= 5
##$VALIST= <valist>
##$VCLIST= <CCCCCCCCCCCCCCC>
##$VD= 0
##$VDLIST= <DDDDDDDDDDDDDDD>
##$VPLIST= <PPPPPPPPPPPPPPP>
##$VTLIST= <TTTTTTTTTTTTTTT>
##$WBST= 1024
##$WBSW= 4
##$XGAIN= (0..3)
0 0 0 0 
##$XL= 0
##$YL= 0
##$YMAX_a= 345111
##$YMIN_a= -313885
##$ZGOPTNS= <>
##$ZL1= 120
##$ZL2= 120
##$ZL3= 120
##$ZL4= 120
##$ABSF1= 10
##$ABSF2= 0
##$ABSG= 5
##$ABSL= 3
##$ALPHA= 0
##$AQORDER= 0
##$ASSFAC= 0
##$ASSFACI= 0
##$ASSFACX= 0
##$ASSWID= 0
##$AUNMP= <proc_1d>
##$AZFE= 0.1
##$AZFW= 0.1
##$BCFW= 1
##$BC_mod= 2
##$BYTORDP= 1
##$COROFFS= 0
##$CY= 11.3945322036743
##$DATMOD= 1
##$DC= 2
##$DFILT= <>
##$DTYPP= 0
##$F1P= 16.9975609425685
##$F2P= -3.02152046262296
##$FCOR= 0.5
##$FTSIZE= 0
##$FT_mod= 4
##$GAMMA= 1
##$GB= 0.15
##$INTBC= 1
##$INTSCL= 1
##$ISEN= 128
##$LB= 0.24
##$LEV0= 0
##$LPBIN= 0
##$MAXI= 10000
##$MC2= 0
##$MEAN= 0
##$ME_mod= 0
##$MI= 1.114404
##$NCOEF= 0
##$NC_proc= 0
##$NLEV= 6
##$NOISF1= 3.799351
##$NOISF2= 2.8
##$NSP= 1
##$NTH_PI= 0
##$NZP= 0
##$OFFSET= 15.70392
##$PC= 1
##$PHC0= -9456.893
##$PHC1= 21.80088
##$PH_mod= 1
##$PKNL= yes
##$PPARMOD= 0
##$PSCAL= 0
##$PSIGN= 0
##$REVERSE= no
##$SF= 200.130013532006
##$SI= 16384
##$SIGF1= 3
##$SIGF2= 2
##$SINO= 400
##$SIOLD= 16384
##$SREGLST= <1H.CDCl3>
##$SSB= 0
##$STSI= 0
##$STSR= 0
##$SW_p= 3612.71676300578
##$SYMM= 0
##$S_DEV= 0
##$TDeff= 0
##$TDoff= 0
##$TI= <>
##$TILT= no
##$TM1= 0
##$TM2= 0
##$TOPLEV= 0
##$USERP1= <user>
##$USERP2= <user>
##$USERP3= <user>
##$USERP4= <user>
##$USERP5= <user>
##$WDW= 1
##$XDIM= 8192
##$YMAX_p= 0
##$YMIN_p= 0
$$ End of Bruker specific parameters
$$ ---------------------------------
##NTUPLES= NMR FID
##VAR_NAME=  TIME,          FID/REAL,        FID/IMAG
##SYMBOL=    X,             R,               I
##VAR_TYPE=  INDEPENDENT,   DEPENDENT,       DEPENDENT
##VAR_FORM=  AFFN,          ASDF,            ASDF
##VAR_DIM=   8192,          8192,            8192
##UNITS=     SECONDS,       ARBITRARY UNITS, ARBITRARY UNITS
##FACTOR=    0.0002076,     1,               1
##FIRST=     0,             0,               0
##LAST=      1.7004516,     0,               0
##MIN=       0,             -313885,         0
##MAX=       1.7004516,     345111,          0
$$ Real data points
##PAGE= N=1
##DATA TABLE= (X++(R..R)), XYDATA
$$ [...]
$$ plain form
2943 1270 1158 -1538 -2282 -265 3021 632 -1905 -430 3844 2575 182 -1644 2453 4567 1975
2958 1975 42 634 4305 3251 2196 679 2126 3974 4440 208 861 3586 5332 3756 789 2524
2974 2524 4799 4789 -149 319 4257 5802 2638 36 3127 4985 4778 1711 1208 3410 4945 3411
2990 3411 498 1194 3935 4168 1661 -346 2321 4298 3667 -342 -495 2134 3934 485 -1430 -594
3006 -594 3112 1294 -1814 -1546 767 2670 -175 -1820 -509 1799 952 -1321 -2330 -780 889 -1230
3022 -1230 -2640 -2368 94 1001 -2755 -4871 -1809 -663 -829 -3841 -2843 305 -400 -4439 -4956 -1953
3038 -1953 -47 -1949 -4344 -2905 -2024 -591 -2098 -5115 -2996 -646 -1581 -4111 -4730 -1587 152 -2299
3054 -2299 -4068 -2530 309 -882 -3277 -4173 -705 712 -1371 -1984 -1410 476 267 -2389 -2855 -269
$$ packed form
2943A270j12k696p44K017L286k389k537J475M274j269k393j826M097K114k592
2958A975j933N92L671j054j055j517J447J848M66m232O53K725J746j576k967J735
2974B524K275j0m938M68L938J545l164k602L091J858k07l067n03K202J535j534
2990C411k913O96K741K33k507k007K667J977o31m009j53K629J800l449j915Q36
3006e94L706j818l108K68K313J903k845j645J311K308q47k273j009J550J669k119
3022a230j410K72K462R07l756k116L062J146j66l012R98L148p05m039n17L003
3038a953J906j902k395J439Q81J433j507l017K119K350r35k530o19L143J739k451
3054b299j769J538K839j191k395q96L468J417k083o13N74J886k09k656m66K586
$$ plain form
3070 -269 1728 -202 -1634 -239 1210 3216 435 -2248 -236 3234 2878 -385 -996 2251 3755 633
3086 633 -388 1303 3567 2140 799 675 2726 2889 1887 -192 467 2793 3423 275 -324 2084
3102 2084 4210 2739 -899 1172 3715 3514 883 572 2082 4283 2148 -121 1422 3333 2967 929
3118 929 -807 1402 3415 2372 -92 -137 1883 3467 1169 -843 -345 1941 2463 -1867 -1920 316 2564
3135 2564 -839 -2902 -1825 1155 444 -3293 -2855 -655 655 -1083 -3159 -2655 -1194 -634 -2560 -3461
3151 -3461 -2087 -1540 -1713 -4628 -3585 -1010 10 -2710 -4669 -2353 -427 -1291 -3945 -3787 -1328 423
3167 423 -2887 -3417 -2750 -166 -1168 -3357 -3248 -1220 -250 -1982 -3652 -2541 1479 754 -2348 -3907
3183 -3907 -2175 275 -495 -3740 -2083 848 500 -2645 -2616 -241 2173 -559 -1306 -1509 1783 2315 -625
$$ packed form
3070b69J997j930j432J395J449K006k781k683K012L470l56l263o11L247J504l122
3086F33j021J691K264j427j341j24K051J63j002k079O59K326O30l148n99K408
3102B084K126j471l638K071K543k01k631l11J510K201k135k269J543J911l66k038
3118I29j736K209K013j043k464m5K020J584k298k012M98K286N22m330n3K236K248
3135B564l403k063J077K980p11l737M38K200J310j738k076N04J461N60j926r01
3151c461J374N47j73k915J043K575J020k720j959K316J926q64k654J58K459J751
3167D23l310n30O67K584j002k189J09K028R70j732j670J111M020p25l102j559
3183c907J732K450p70l245J657K931l48l145K9K375K414k732p47k03L292N32k940
$$ plain form
3200 -625 -1627 -803 1798 1513 -440 -1197 2274 3799 1237 -724 637 3076 4398 558 682 2873
3216 2873 4424 1197 772 1248 3922 3730 1473 1095 2556 3334 3524 780 1311 3642 4611 1080 -61
3233 -61 1288 5101 3161 172 1262 3292 3823 1946 942 1906 3409 1743 1456 616 1744 3182
3249 3182 1299 -740 291 2437 1881 827 -796 842 2302 -558 -1250 -1516 2093 1490 -458 -2173
3265 -2173 107 1752 -137 -2156 -2454 977 747 -2033 -3653 -1113 -134 -1024 -2313 -2202 -1896 119
3281 119 -1914 -3951 -2381 89 1 -3544 -3722 -1298 -317 -2401 -4875 -2378 -391 -325 -3935 -3176 -1552
3298 -1552 371 -1034 -3692 -2942 -778 352 -3201 -4123 -1437 513 -973 -2726 -2857 -745 338 -2010
3314 -2010 -2580 -844 1874 704 -1536 -1543 562 1450 -390 -2595 969 1766 1212 -1793 -1963 1791 1665
$$ packed form
3200f25j002Q24K601k85j953p57L471J525k562j961J361K439J322l840J24K191
3216B873J551l227m25M76K674j92k257l78J461P78J90k744N31K331R69l531j141
3233f1J349L813j940k989J090K030N31j877j004R64J503j666k87q40J128J438
3249C182j883k039J031K146n56j054j623J638J460k860o92k66L609o03j948j715
3265b173K280J645j889k019k98L431k30k780j620K540R79q90j289J11L06K015
3281A19k033k037J570K470q8l545j78K424R81k084k474K497J987O6l610P59J624
3298a552J923j405k658P50K164J130l553r22K686J950j486j753j31K112J083k348
3314b010n70J736K718j170k240pK105Q88j840k205L564P97n54l005j70L754j26
$$ plain form
3331 1665 618 -302 -19 1600 1987 206 -458 84 2966 883 -1043 1188 3318 2707 920 -363
3347 -363 2264 3046 1863 621 1614 3123 2081 1405 67 1510 4312 2069 484 365 1693 2855
3363 2855 1342 447 651 2271 2420 -333 -376 1325 2619 -19 -411 541 1736 2247 12 -1584 1751
3380 1751 1247 -168 -247 -1362 544 1437 -842 -1889 9 895 -104 -2525 -1386 420 290 -1380 -2998
3397 -2998 -1158 34 -641 -3136 -2873 -577 -245 -815 -2031 -3272 -587 -519 -2489 -3226 -1927 53 -615
3414 -615 -4143 -3437 270 -969 -1959 -3530 -1506 223 -1178 -3623 -1607 195 -160 -2857 -3511 -1816
3430 -1816 -172 -793 -2600 -2430 190 1062 -816 -2978 -1503 803 59 -2201 -1963 789 564 171 -1182
3447 -1182 -720 2127 1755 -1787 -1907 1801 1880 160 -1036 678 2557 1741 777 -253 649 2627 1980
$$ packed form
3331A665j047r20K83J619L87j781o64N42K882k083j926K231K130o11j787j283
3347c63K627P82j183j242R93J509j042o76j338J443K802k243j585j19J328J162
3363B855j513q95K04J620J49k753m3J701J294k638l92R52J195N11k235j596L335
3380A751n04j415p9j115J906Q93k279j047J898Q86r99k421J139J806j30j670j618
3397b998J840J192o75k495K63K296L32n70j216j241K685O8j970p37J299J980o68
3414f15l528P06L707j239r90j571K024J729j401k445K016J802l55k697o54J695
3430a816J644o21j807J70K620Q72j878k162J475K306p44k260K38K752k25l93j353
3447a182M62K847l72l542j20L708P9j720j196J714J879q16r64j030R02J978o47
$$ plain form
3464 1980 119 -231 3539 4754 992 222 1151 3806 2622 -591 782 2893 3073 1180 94 2203
3480 2203 3675 2730 1278 998 2383 3602 2518 290 745 3120 3938 833 -217 2220 3215 1910
3496 1910 -291 61 2070 1613 324 -421 1292 1913 472 195 -1311 1750 2136 -790 -1876 -371
3512 -371 793 233 -1212 -1153 222 296 -150 -1960 -2009 410 814 -2394 -2181 -398 990 -1243 -2791 -1477
3530 -1477 472 -1111 -3333 -3059 -404 60 -2417 -3539 -2423 -674 -134 -1961 -3440 -2970 -57 -1354
3546 -1354 -2798 -2733 -660 377 -2214 -3489 -848 269 -772 -2250 -2523 45 277 -1084 -2247 -2143
3562 -2143 252 117 -1867 -1447 -296 1288 -247 -2139 -494 1709 1102 -1896 -2321 566 2172 271
3578 271 -1049 -350 2106 1309 532 -991 920 2512 1219 -655 -166 2213 2549 1334 903 67 2911
$$ packed form
3464A980j861l50L770J215l762p70R29K655j184l213J373K111J80j893j086K109
3480B203J472r45j452k80J385J219j084k228M55K375Q18l105j050K437R95j305
3496A910k201L52K009m57j289p45J713O21j441k77j506L061L86k926j086J505
3512c71J164n60j445N9J375P4m46j810m9K419M04l208K13J783J388k233j548J314
3530a477J949j583k222K74K655M64k477j122J116J749N40j827j479M70K913j297
3546a354j444O5K073J037k591j275K641J117j041j478k73K568K32j361j163J04
3562b143K395j35j984M20J151J584j535j892J645K203o07k998m25K887J606j901
3578B71j320O99K456p97p77j523J911J592j293j874M89K379L36j215m31q36K844
$$ plain form
3595 2911 1538 754 361 830 2970 1167 -506 712 3257 2176 760 62 3018 2914 -26 -347
3611 -347 1225 2724 2736 410 -386 1380 2089 1058 -38 -496 1477 1301 233 -1245 -423 1894 895
3628 895 -1281 -594 626 1525 -1097 -2253 177 881 142 -1273 -631 -203 628 -629 -2001 -1335 452
3645 452 294 -1022 -1946 -218 -517 -492 -2929 -1693 568 -560 -2387 -2868 -533 167 -2077 -2603 -1927
3662 -1927 -1290 -1277 -2381 -2664 -1465 -975 -1504 -2743 -3127 -1350 -765 -2179 -3120 -2156 591 -861 -2562
3679 -2562 -3018 -858 -80 -356 -2937 -1797 846 623 -1430 -1638 489 1272 22 -1870 -1099 722 1210
3696 1210 -1038 -450 1459 1966 7 -1419 -190 1699 1152 -202 12 106 2315 2504 -623 -311 1653
3713 1653 3236 831 -71 1361 3334 1369 1142 689 2254 2961 1505 222 930 2837 2547 1131
$$ packed form
3595B911j373p84l93M69K140j803j673J218K545j081j416o98K956j04k940l21
3611c47J572J499J2k326p96J766P09j031j096m58J973j76j068j478Q22K317r99
3628H95k176O87J220Q99k622j156K430P04p39j415O42M28Q31j257j372O66J787
3645D52j58j316r24J728k99K5k437J236K261j128j827m81K335P00k244n26O76
3662a927O37J3j104k83J199M90n29j239l84J777N85j414r41R64K747j452j701
3679b562m56K160P78k76k581J140K643k23k053k08K127P83j250j892P71J821M88
3696A210k248N88J909N07j959j426J229J889n47j354K14R4K209J89l127L12J964
3713A653J583k405r02J432J973j965k27m53J565P07j456j283P08J907k90j416
$$ plain form
3729 1131 876 1489 3347 1304 384 1471 3162 2187 542 760 1952 3630 1189 577 644 2350 2199
3746 2199 588 849 360 2706 922 -1 -518 1381 2059 762 -1943 -1143 1458 991 -1174 -1244 308
3763 308 559 -820 -1091 -608 488 -37 -1857 -2575 -1032 124 -479 -1789 -2140 -661 -221 -1819 -2133
3780 -2133 -1408 598 -1199 -3352 -3315 -754 -228 -1821 -2426 -1803 -484 -1090 -1377 -1965 -1023 -656 -1755 -2940
3798 -2940 -2476 -787 -326 -1660 -2373 -1584 708 -1227 -3149 -1878 390 283 -1952 -1553 -430 -601 -1565
3815 -1565 -1944 -576 728 364 -764 -1695 310 811 53 -824 -488 -361 2196 1168 -121 662 2441
3832 2441 1434 471 335 1699 1810 1520 207 422 2629 1314 -190 -258 2476 1542 1436 470 1462 1823
3850 1823 1828 223 769 2261 2435 397 -393 546 2239 2609 415 -658 1144 2394 1321 563 841
$$ packed form
3729A131k55O13J858k043r20J087J691r75j645K18J192J678k441o12O7J706j51
3746B199j611K61m89K346j784r23n17J899O78j297k705Q00K601m67k165p0J552
3763C08K51j379k71M83J096n25j820p18J543J156o03j310l51J479M40j598l14
3780b133P25K006j797k153L7K561N26j593o05O23J319o06k87n88R42L67j099j185
3798b940M64J689M61j334p13P89K292j935j922J271K268j07k235L99J123j71r64
3815a565l79J368J304l64j128r31K005N01p58q77L36J27K557j028j289P83J779
3832B441j007r63j36J364J11k90j313K15K207j315j504o8K734r34j06r66R92L61
3850A823Nj605N46J492J74k038p90R39J693L70k194j073J802J250j073p58K78
$$ plain form
3867 841 1809 1956 478 239 1064 1137 567 -1671 -696 1704 1765 -296 -1193 -550 1009 326 -1035 -1297 -171
3886 -171 1263 -86 -1460 -933 728 143 -2057 -2769 236 709 -1562 -1657 -633 51 -22 -1574 -2930
3903 -2930 -1464 359 -731 -2430 -1314 -283 -425 -2473 -3226 -1159 24 -1002 -1798 -2955 -715 174
3919 174 -1661 -1532 -1609 -1030 -1311 -830 -1640 -1024 230 -152 -2021 -2119 260 488 -2023 -2638 -1519 636
3937 636 895 -1790 -734 889 301 -70 -1176 -1039 584 868 -1144 -375 1372 1197 497 -520 111
3954 111 1773 1906 421 -580 907 1318 1802 -151 635 1650 1537 325 -31 1607 2747 1090 890
3971 890 340 3008 1758 608 303 2796 1795 1594 1184 879 1038 2096 1057 -332 1373 1925 2525
3988 2525 118 475 2094 2047 1043 -4 836 1538 2290 62 379 748 715 110 -524 -466 728 1326 52
$$ packed form
3867H41R68J47j478k39Q25P3n70k238R75K400O1k061q97O43J559o83j361k62J126
3886a71J434j349j374N27J661n85k200p12L005M73k271r5J024O84p3j552j356
3903b930J466J823j090j699J116J031j42k048p53K067J183j026p96j157K240Q89
3919A74j835J29p7N79k81M81q10O16J254l82j869r8K379K28k511o15J119K155
3937F36K59k685J056J623n88l71j106J37J623K84k012P69J747j75p00j017O31
3954A11J662J33j485j001J487M11M84j953P86J015j13j212l56J638J140j657k00
3971H90n50K668j250j150l05K493j001k01m10l05J59J058j039j389J705N52O00
3988B525k407L57J619m7j004j047Q40P02P52k228L17L69l3o05o34N8J194N98j274
$$ plain form
4007 52 -874 441 849 183 -428 -1084 813 296 -1801 -2110 299 194 249 -1468 -1411 170 -266 -2408 -1202
4026 -1202 -1037 -24 -661 -1915 -2440 -1336 -164 -1273 -2156 -1726 -670 -167 -1615 -2086 -850 209 -1203
4043 -1203 -1902 -1965 -242 -443 -2258 -1844 -1094 188 -1426 -1871 -1521 -1293 422 -1457 -1446 -564 681 640
4061 640 -1425 -965 -80 1064 -1052 -1448 -117 2303 683 -159 -415 534 1602 -337 -375 13 1245
4078 1245 883 69 -720 1047 1918 1090 -1112 611 1774 1417 108 150 1705 2747 1417 135 610
4095 610 1028 2601 31 -769 1859 2033 1014 909 757 1573 1228 1313 -104 794 1804 1467 -240 559
4113 559 289 937 1379 37 396 1129 994 -99 -185 1250 1719 155 -312 173 1611 1081 -878 -562
4131 -562 -324 1117 965 -1817 -691 326 142 -946 -1295 -1778 773 17 -1161 -981 -237 761 -695
$$ packed form
4007E2r26J315M08o66o11o56J897n17k097l09K409j05N5j717N7J581m36k142J206
4026a202J65J013o37j254n25J104J172j109q83M30J056N03j448m71J236J059j412
4043a203o99o3J723k01j815M14P50J282j614m45L50K28J715j879J1Q82J245m1
4061F40k065M60Q85J144k116l96J331K420j620q42k56R49J068j939l8L88J232
4078A245l62q14p89J767Q71q28k202J723J163l57j309M2J555J042j330j282M75
4095F10M18J573k570q00K628J74j019j05j52Q16l45Q5j417Q98J010l37j707P99
4113E59k70O48M42j342L59P33j35j093q6J435M69j564m67M85J438n30j959L16
4131e62K38J441j52k782J126J017j84j088l49m83K551p56j178J80P44R98j456
$$ plain form
4148 -695 -1212 -847 28 -459 -1824 -2906 -1556 -1129 -1657 -1754 -1331 -488 75 -2344 -1998 -1923 367 -1608 -1370
4167 -1370 -779 -1236 468 -911 -1381 -1068 269 -1892 -1835 -2115 -241 -169 -742 -1905 -598 39 -672 -970
4185 -970 -1370 107 791 -548 -1776 -434 1483 -487 -920 -613 7 1672 397 -340 655 1889 466
4202 466 -649 280 776 1470 1426 121 1061 3084 1633 -60 -347 946 2065 915 383 -367 1477
4219 1477 1656 -107 -1 1697 1857 1714 61 336 1196 1530 1647 41 1015 1263 1982 119 1351 1571
4237 1571 1251 1032 -237 -513 1586 1856 -10 -558 861 859 176 -696 -307 2242 1427 -652 -383 285
4255 285 1634 490 -273 -636 1085 398 -973 -866 -118 974 -163 375 -414 -806 282 -995 -1940
4272 -1940 -1214 561 -912 -1453 -729 158 -29 -1234 -2058 -1710 -890 -631 -1941 -1934 -1406 523 -1899 -2510
$$ packed form
4148f95n17L65Q75m87j365j082J350M27n28r7M23Q43N63k419L46P5K290j975K38
4167a370N91m57J704j379m70L13J337k161N7k80J874P2n73j163J307O37p11k98
4185i70m00J477O84j339j228J342J917j970m33L07O20J665j275p37R95J234j423
4202D66j115R29M96O94m4j305R40K023j451j693k87J293J119j150n32p50J844
4219A477J79j763J06J698J60j43j653K75Q60L34J17j606R74K48P19j863J232K20
4237A571l20k19j269k76K099K70j866n48J419ko83q72L89K549q15k079K69O68
4255B85J349j144p63l63J721o87j371J07P48J092j137N38p89l92J088j277r45
4272a940P26J775j473n41P24Q87j87j205q24L48Q20K59j310PN28J929k422o11
$$ plain form
4290 -2510 -1993 -492 -766 -1687 -2239 -1190 -50 -325 -1985 -2026 131 360 -1160 -2254 -687 538 -334
4307 -334 -1208 -867 307 377 -362 -1287 -326 619 -797 -343 -2212 458 351 -136 -1071 858 1475 844 -1274
4326 -1274 -8 120 1937 237 -1065 -198 1263 647 470 -630 97 1772 1068 441 -581 1223 1004
4343 1004 21 -70 289 2190 886 -528 -42 1741 2135 3 207 768 1941 1871 265 -515 609 1574
4361 1574 1051 96 475 1268 679 200 -849 49 1187 620 -758 -48 26 644 -71 -385 41 217 -743
4380 -743 -1601 -685 695 1129 -829 -812 -49 1485 -90 -1831 -706 168 -189 -1009 -1069 -1211 530 -336
4398 -336 -736 -1314 -1041 -880 -336 -1273 -858 -1223 -214 -1414 -928 -963 -450 -1234 -2401 -1836 -62 340 -1189
4417 -1189 -860 -1046 -988 -931 -1970 -947 -11 184 243 -1800 -1186 371 352 -1039 -1189 569 -64 -704 -525
$$ packed form
4290b510N17J501k74r21n52J049J140k75j660m1K157K29j520j094J567J225q72
4307c34q74L41J174P0p39r25R61R45j416M54j869K670j07m87r35J929O17o31k118
4326a274J266J28J817j700j302Q67J461o16j77j100P27J675p04o27j022J804k19
4343A004r83r1L59J901j304j414M86J783L94k132K04N61J173p0j606p80J124R65
4361A574n23r55L79P93n89m79j049Q98J138n67j378P10P4O18p15l14M26J76r60
4380g43q58R16J380M34j958J7P63J534j575j741J125Q74l57q20o0j42J741q66
4398c36m00n78K73J61N44r37M15l65J009j200M86l5N13p84j167N65J774M02j529
4417a189L29j86N8N7j039J023R36J95N9k043O14J557j9j391j50J758o33o40J79
$$ plain form
4436 -525 -1100 597 464 -619 -190 656 1676 100 -4 268 1032 620 -208 -328 353 907 947 -500 -821
4455 -821 1362 723 511 -717 911 1921 1303 392 472 1078 1533 -73 370 350 848 462 625 -214 951
4474 951 2270 934 -400 1031 2193 1529 60 -78 1839 1259 956 -741 1156 1484 1298 -307 333
4491 333 1512 1265 850 -314 125 1398 1563 -522 -68 559 1952 1118 -937 -415 153 717 441 -800
4509 -800 592 572 -123 -1134 -488 -416 599 -1007 -1774 -828 421 411 -1232 -970 -1352 257 -631 -1812
4527 -1812 -1296 -564 166 -1155 -1230 -1260 -683 -662 -2066 -1669 234 -694 -1713 -2028 -237 497 -87 -1909 -1079
4546 -1079 -1066 -117 -496 -1404 -719 -666 -453 -641 -833 -375 275 -886 -1582 255 329 -896 -1593 -1407 -12
4565 -12 1344 562 -965 -481 99 1611 -727 -809 357 756 305 -418 204 690 154 328 159 960 1296
$$ packed form
4436e25n75J697j33j083M29Q46J020j576j04K72P64m12q28j20O81N54M0j447l21
4455h21K183o39k12j228J628J010o18r11Q0O06M55j606M43k0M98l86J63q39J165
4474I51J319j336j334J431J162o64j469j38J917n80l03j697J897L28j86j605O40
4491C33J179k47m15j164M39J273J65k085M54O27J393q34k055N22N68N64k76j241
4509h00J392k0o95j011O46P2J015j606p67R46J249j0j643K62l82J609q88j181
4527a812N16P32P30j321p5l0N77K1j404L97J903r28j019l15J791P34n84j822Q30
4546a079J3R49l79r08O85N3K13j88j92M58O50j161o96J837P4j225o97J86J395
4565a2J356p82j527M84N80J512k338q2J166L99m51p23O22M86n36J74j69Q01L36
$$ plain form
4584 1296 1445 -82 603 1825 1197 623 -7 1111 2778 656 340 168 1233 2213 45 -893 974
4601 974 772 778 162 33 922 1285 857 -818 -96 1369 874 230 -634 86 1374 240 -357 -276 1166
4620 1166 1846 -963 -238 749 523 -508 -802 -827 1164 168 411 -240 -1425 242 -100 -1072 -1134 -372 653
4639 653 -372 -1380 -271 -350 -302 -1222 -1605 -808 301 -1197 -2611 -979 -362 78 -1467 -1557 -1499 -370
4657 -370 -212 -1577 -885 -829 9 -992 -1907 -1891 547 -407 -1337 -1176 224 -149 -149 -2044 -1320 199 193 -596
4677 -596 -1142 -723 -54 -13 -1842 -1551 414 -251 -624 -736 609 1072 213 -787 -622 1269 1202 -719 -566
4696 -566 -816 1126 421 154 -571 1546 1384 386 -465 -318 511 1391 573 49 912 2139 1171 -521 838
4715 838 1993 1699 679 751 298 2390 960 277 1007 1835 1674 949 -150 258 2073 -205 -261 161
$$ packed form
4584A296J49j527O85J222o28n74o30J118J667k122l16j72J065R80k168r38J867
4601I74k02Oo16j29Q89L63m28j675P22J465m95o44q64P20J288j134n97Q1J442
4620A166O80k809P25R87k26j031k94k5J991r96K43o51j185J667l42r72o2P62J025
4639F53j025j008J109p9M8r20l83P97J109j498j414J632O17M40j545r0N8J129
4657c70J58j365O92N6Q38j001r15J6K438r54r30J61J400l73%j895P24J519op89
4677e96n46M19O69M1j829K91J965o65l73j12J345M63q59j000J65J891o7j921J53
4696e66k50J942p05k67p25K117j62r98q51J47Q29Q80q18n24Q63J227r68j692J359
4715H38J155k94j020P2m53K092j430o83P30Q28j61p25j099M08J815k278n6M22
$$ plain form
4733 161 1288 1173 329 -239 897 1324 939 -207 616 1169 1672 846 74 1117 1663 -91 652 10
4751 10 1242 910 -301 -737 -619 363 703 -466 -604 535 619 -481 -528 -1359 -155 688 -2312 -2698 243
4770 243 -25 -502 -2427 -2090 158 -599 -1093 -1652 -731 -710 -42 -2447 -1516 -875 -166 -1450 -1334 -941 -632
4789 -632 -692 -950 -996 114 708 -461 -1933 -621 842 -501 -1715 -792 -710 723 -178 -1466 192 103
4807 103 -332 -421 -1282 195 385 -604 -1531 30 583 991 754 -1014 -542 937 637 -927 -331 -293 832
4826 832 419 -1287 -483 1473 650 1148 205 690 1573 358 -711 1168 1456 1026 302 722 1105 1816
4844 1816 759 -107 246 1456 1336 -156 322 574 2099 1241 43 651 1176 1596 460 -395 888
4861 888 2551 -99 58 -22 1659 1675 40 -545 432 350 796 -1208 -558 -270 274 518 -874 -405 101
$$ packed form
4733A61J127j15q44n68J136M27l85j146Q23N53N03q26p72J043N46j754P43o42
4751A0J232l32j211m36J18R82L40j169j38J139Q4j100m7q31J204Q43l000l86K941
4770B43k68m77j925L37K248p57m94n59R21K1O68k405R31O41P09j284J16L93L09
4789f32o0k58m6J110N94j169j472J312J463j343j214R23Q2J433r01j288J658q9
4807A03m35q9q61J477J90r89r27J561N53M08k37j768M72J479l00j564N96L8J125
4826H32m13j706Q04J956q23M98r43M85Q83j215j069J879K88m30p24M20L83P11
4844A816j057q66L53J210j20j492M78K52J525q58j198O08N25M20j136q55J283
4861H88J663k650J57q0J681J6j635n85R77q2M46k004O50K88N44K44j392M69N06
$$ plain form
4880 101 1515 -726 47 -236 -271 -169 -117 -1199 52 197 -1112 -1994 -560 222 -729 -1207 -956 -735 353
4899 353 -2235 -1567 -653 316 -655 -506 -1530 -172 -110 -1271 -1315 -613 -1293 -161 -1715 -475 161 61
4917 61 -708 -1053 -710 -621 -387 -1294 -1350 -887 776 -852 -1227 -2004 -179 -113 -1577 -99 126 383 266 -797
4937 -797 -923 280 91 -941 -490 294 909 489 -297 668 782 517 305 -330 145 1262 1101 88 745
4956 745 100 1597 499 -274 556 848 1391 134 -516 924 1621 443 313 377 1008 916 1268 980 479
4975 479 1404 474 1045 667 781 1336 1330 327 417 1820 1008 1758 134 715 1081 350 -291 -278 2149 736
4995 736 -135 -83 33 890 155 -262 -758 360 303 927 -1123 -736 -229 218 -544 -397 397 -115 -1062 -841
5015 -841 -191 290 -672 -1998 -1266 -239 10 -419 -1102 -957 141 -586 -486 -1299 -610 161 -1028 -1150 -1222
$$ packed form
4880A01J414k241P73k83l5J02N2j082J251J45j309q82J434P82r51m78K51K21J088
4899C53k588O68R14R69r71J49j024J358O2j161m4P02o80J132j554J240O36j00
4917F1p69l45L43Q9K34r07n6M63J663j628l75p77J825O6j464J478K25K57j17j063
4937g97j26J203j89j032M51P84O15m20p86R65J14k65k12o35M75J117j61j013O57
4956G45o45J497j098p73Q30K92N43j257o50J440O97j178j30O4O31r2L52k88n01
4975D79R25r30N71l78J14N55oj003R0J403q12P50j624N81L66p31o41J3K427j413
4995G36q71N2J16Q57p35m17m96J118n7O24k050L87N07M47p62J47P94n12r47K21
5015h41O50M81r62j326P32J027K49m29o83J45J098p27J00q13O89P71j189j22p2
$$ plain form
5034 -1222 -329 -36 -707 -1241 -441 475 -1864 -1724 -1253 -240 77 -525 -1071 -788 -97 -358 -827 -1399 458
5053 458 -464 -332 -764 -790 608 -24 -1428 -636 -270 408 -237 -803 -471 2003 973 -221 -503 1152
5071 1152 1628 164 -259 596 759 399 -479 -303 1270 1071 251 36 -103 1193 1154 -305 -64 1144
5089 1144 1016 15 -205 -93 1514 1273 118 -56 683 1090 1229 195 359 1556 2078 442 -646
5106 -646 -137 1949 1322 810 700 70 1319 1198 -241 499 690 1341 -119 -38 1041 1026 745 -461 -934
5125 -934 815 427 -693 -271 -339 1116 76 -1177 -536 498 669 -1270 -1600 -1057 692 -125 -1119 -802
5143 -802 -77 817 -275 -1313 -1048 -49 -636 -1037 -1545 -1247 455 -1862 -687 -539 -651 25 -1291 -1854
5161 -1854 -734 -326 -385 -2164 -875 -462 66 -790 -1714 -284 -290 -504 -923 -1271 -1011 879 -1043 -1455 -316
$$ packed form
5034a222Q93K93o71n34Q00R16k339J40M71J013L17o02n46K83O91k61m69n72J857
5053D58r22J32m32k6J398o32j404P92L66O78o45n66L32K474j030j194k82J655
5071A152M76j464m23Q55J63l60q78J76J573j99q20k15j39J296l9j459K41J208
5089A144j28j001k20J12J607k41j155j74P39M07J39j034J64J197N22j636j088
5106f46N09K086o27n12j10o30J249j21j439P40J91O51j460Q1J079j5k81j206m73
5125i34J749l88j120M22o8J455j040j253O41J034J71j939l30N43J749q17r94L17
5143h02P25Q94j092j038K65R99n87m01n08K98J702k317J175J48j12O76j316n63
5161a854J120M08n9j779J289M13N28q56r24J430ok14m19l48K60J890j922m12J139
$$ plain form
5180 -316 162 757 -532 -552 -136 367 -546 -1301 -32 -34 740 -485 -519 364 638 -489 -287 381 1122 498
5200 498 -420 -99 1337 818 676 307 -87 1466 214 485 -438 576 653 1457 -340 -271 1697 855 795
5219 795 675 -318 566 827 -226 -148 1039 1834 945 -481 387 1414 1078 755 668 391 1355 415 -737
5238 -737 800 233 787 -549 -560 64 1245 573 554 -165 792 683 317 107 57 1112 957 -160 -817
5257 -817 -18 104 -387 -650 1121 208 38 -291 -1459 -200 305 -498 -1113 -1226 -850 -723 -1050 -1359 70
5276 70 243 -621 -1092 -678 -374 -473 -1872 -695 -884 -474 -430 -933 -1812 -307 668 -958 -1260 -53 -1293
5295 -1293 -496 -535 -1023 -13 532 -459 -752 -782 447 -160 -283 -262 -447 -25 427 -923 -281 160 1083 -491
5315 -491 -1032 357 881 740 -359 523 162 126 816 -122 814 1323 -256 -217 686 1251 1251 1272 -775 214
$$ packed form
5180c16M78N95j289k0M16N03r13p55J269kP74j225l4Q83K74j127K02O68P41o24
5200D98r18L21J436n19j42l69l94J553j252K71r23J014P7Q04j797O9J968q42o0
5219G95j20r93Q84K61j053P8J187P95q89j426Q68J027l36l23q7k77R64r40j152
5238g37J537n67N54j336j1O24J181o72j9p19R57j09l66k10n0J055j55j117o57
5257h17P99J22m91k63J771r13j70l29j168J259N05q03o15j13L76J27l27l09J429
5276G0J73q64m71M14L04r9j399J177j89M10M4n03q79J505R75j626l02J207j240
5295a293P97l9m88J010N45r91k93l0J229o07j23K1j85M22M52j350O42M41R23j574
5315d91n41J389N24j41j099Q82l61l6O90r38R36N09j579L9R03N65%K1k047R89
$$ plain form
5335 214 824 834 788 -423 1548 951 -168 1098 1221 1210 1348 523 57 728 889 779 -310 -313 334 1101
5355 1101 402 583 88 492 821 -199 198 995 366 209 -241 -94 922 465 -680 253 635 715 -417
5374 -417 -226 257 1122 -26 -997 -1131 4 -101 -783 -830 -828 1512 -467 -313 -638 -374 69 377 -952
5393 -952 -820 -74 -236 -897 -1083 -956 -95 -417 -1083 -864 -145 381 -927 -1420 -645 -424 -1672 -782 -85
5412 -85 73 990 -152 -1019 -669 -1017 769 -1254 -791 234 -993 -333 -944 -1168 -185 1221 -1309 -528
5430 -528 -151 1022 118 -524 -785 250 451 318 -633 -466 53 56 -1234 -653 617 945 -215 356 853
5449 853 1332 509 -611 472 1185 1523 393 -593 362 1003 597 -116 1105 818 303 994 -98 595
5467 595 1901 1088 261 -554 1018 1529 952 136 407 373 1381 -780 -374 196 1708 1224 -449 -109
$$ packed form
5335B14O10J0m6j211J971n97j119J266J23j1J38q25m66O71J61j10j089lO47P67
5355A101o99J81m95M04L29j020L97P97o29j57m50J47J016m57j145R33L82Q0j132
5374d17J91M83Q65j148r71j34J135j05o82m7KK340j979J54l25K64M43L08j329
5393i52J32P46j62o61j86J27Q61l22o66K19P19N26j308m93P75K21j248Q90O97
5412h5J58R17j142q67L50l48J786k023M63J025j227O60o11k24R83J406k530P81
5430e28L77J173r04o42k61J035K01j33r51J67N19Lj290N81J270L28j160N71M97
5449H53M79q23j120J083P13L38j130r86R55O41m06p13J221k87n15O91j092O93
5467E95J306q13q27q15J572N11n77q16K71l4J008k161M06N70J512m84j673L40
$$ plain form
5485 -109 1341 811 606 -765 -94 1109 744 435 -489 1093 -32 134 -355 -827 121 129 -631 -993 543
5504 543 384 168 -694 -186 -21 -753 -1039 -755 -441 467 -154 -1159 -1119 -491 274 -1150 -1281 -194 -1202
5523 -1202 -122 -1078 -621 -453 291 -1154 -2067 314 -333 112 -101 -1456 -157 -303 -711 -1553 -1210 206
5541 206 -590 -493 -2256 -335 110 -1007 -1045 -1206 176 563 -473 -1725 -679 698 561 -1751 -622
5558 -622 -396 83 -496 -844 253 446 -583 -207 -357 90 943 552 -368 457 833 845 298 -84 468 628
5578 628 642 -620 104 1244 807 392 -320 812 969 -795 1019 880 855 967 696 486 419 1204 391
5597 391 410 -5 886 1057 761 1262 692 1157 349 335 435 547 1190 704 -489 959 1145 786 -301 -385
5617 -385 -189 -30 270 31 38 330 -17 -148 -833 -663 942 454 181 -187 1048 900 -372 -1182 998
$$ packed form
5485a09J450n30k05j371O71J203l65l09r24J582j125J66m89m72R48Qp60l62J536
5504E43j59k16q62N08J65p32k86K84L14R08o21j005M0O28P65j424j31J087j008
5523a202J080r56M57J68P44j445r13K381o47M45k13j355J299j46m08q42L43J416
5541B06p96R7j763J921M45j117l8j61J382L87j036j252J046J377j37k312J129
5558f22K26M79n79l48J097J93j029L76j50M47Q53l91r20Q25L76J2n47l82N52J60
5578F28J4j262P24J140m37m15p12J132J57j764J814j39k5J12k71k10o7P85q13
5597C91J9m15Q91J71k96N01n70M65q08j4J00J12O43m86j193J448J86l59j087q4
5617c85J96J59L00k39PK92l47j31o85J70J605m88k73l68J235j48j272q10K180
$$ plain form
5636 998 679 -496 -251 -1196 -592 -406 -736 -962 130 256 -162 -1032 -549 1 689 -238 -1179 -1338 141
5655 141 -155 -1369 -797 -781 139 -602 -1070 -398 -343 -877 -1485 -369 -84 40 16 -737 -829 -155 306 -751
5675 -751 -1216 -153 504 -1444 -2048 -426 -302 678 -281 -1140 -968 73 -152 -442 -182 211 1273 80
5693 80 372 -714 454 1345 -146 211 1918 1674 61 389 429 1551 436 34 -275 1362 1064 786
5711 786 259 599 798 591 -286 713 1543 669 1035 142 1149 545 1280 -471 -290 437 873 1266 41
5730 41 -253 -223 754 731 -315 488 2041 421 -290 -36 1093 -725 301 -140 -91 1555 763 -271 -967
5749 -967 -74 734 843 -1188 319 486 171 -374 -805 -456 897 295 -964 -1008 293 456 -45 -1261
5767 -1261 -312 -279 -1063 -592 152 -721 290 -668 -1090 -267 333 -61 -1508 -962 360 -1116 -1387 -533 67
$$ packed form
5636I98l19j175K45r45O04J86l30k26J092J26m18q70M83N50O88r27r41j59J479
5655A41k96j214N72J6R20p41m68O72N5n34o08J116K85J24k4p53r2O74M61j057
5675g51m65J063O57j948o04J622J24R80r59q59J72J041k25k90K60L93J062j193
5693H0K92j086J168Q91j491L57J707k44j613L28M0J122j115m02l09J637k98k78
5711G86n27L40J99k07q77R99Q30q74L66q93J007o04P35j751J81P27M36L93j225
5730D1k94L0R77k3j046Q03J553j620p11K54J129j818J026m41M9J646p92j034o96
5749i67Q93Q08J09k031J507J67l15n45m31L49J353o02j259m4J301J63n01j216
5767a261R49L3p84M71P44q73J011r58m22Q23O00l94j447N46J322j476k71Q54O00
$$ plain form
5786 67 -53 -549 -519 -1505 -101 4 -1054 -393 -944 -115 -293 -1283 -596 262 546 -298 -199 -1290 -417 537
5806 537 -785 -457 135 -13 970 -22 419 -70 327 -464 -195 -741 1864 371 225 -1038 123 502
5824 502 78 -352 353 675 716 1121 683 505 1266 345 -187 -104 591 1205 927 133 758 1203 576 503 -1105
5845 -1105 816 1139 268 228 641 1071 742 -63 307 279 1553 317 353 205 482 962 540 -617 713
5864 713 109 -69 -329 533 2043 368 856 -755 -240 865 579 117 -577 695 -174 -66 142 -161
5882 -161 665 -491 -741 -642 586 292 -569 -1296 -1004 233 1015 -940 -466 -270 -519 -96 -883 -379 -600
5901 -600 -323 -988 -97 -501 623 -1460 -942 -1196 -160 -196 20 -660 -1150 736 -284 -79 -397 7 339
5920 339 -745 -1237 -1159 -231 -1412 -821 -578 363 744 -344 -264 -137 -123 140 -943 -253 919 1208 109
$$ packed form
5786F7j20m96L0r86J404J05j058O61n51Q29j78r90O87Q58K84q44R9j091Q73R54
5806E37j322L28N92j48R83r92M41m89L97p91K69n46K605j493j46j263J161L79
5824E02m24m30P05L22M1M05m38j78P61r21n32Q3O95O14k78p94O25M45o27p3j608
5845a105J921L23q71m0M13M30l29q05L70k8J274j236L6j48K77M80m22j157J330
5864G13o04j78k60Q62J510j675M88j611N15J105k86m62o94J272q69J08K08l03
5882a61Q26j156k50R9J228k94q61p27K92J237P82j955M74J96k49M23p87N04k21
5901f00K77o65Q91m04J124k083N18k54J036l6K16o80m90J886j020K05l18M04L32
5920C39j084m92P8R28j181N91K43R41L81j088Q0J27J4K63j083O90J172K89j099
$$ plain form
5939 109 -403 256 -472 -890 514 157 122 493 -896 -493 -723 1065 858 289 -463 640 376 123 157
5958 157 388 867 560 459 659 228 -737 196 456 -272 861 399 -866 229 212 1033 1084 -7 -563
5977 -563 257 823 1163 -90 783 -914 1124 505 178 372 1052 -53 -174 -211 803 1241 180 321
5995 321 154 -259 725 -112 -150 1029 -74 -334 -562 50 -15 187 -730 -618 -1329 -482 -669 -1185 -280 1256
6015 1256 -145 -1094 -1151 -210 296 -536 -1414 -212 700 625 -335 -1868 -379 -480 30 -1027 -857 -1179 -1018
6034 -1018 -570 -1142 -516 -390 -903 -1032 -132 -459 601 -841 -769 -20 -415 211 -1105 -837 289 -215 -530
6053 -530 -567 -911 -1290 497 -284 212 575 -207 -594 -413 -19 384 1408 455 -700 165 234 1132 -212
6072 -212 -940 974 685 -774 -457 1148 1514 768 480 -540 940 1194 417 -558 -50 286 759 128
$$ packed form
5939A09n12O59p28m18J404l57l5L71j389M03k30J788k07n69p52J103k64k53L4
5958A57K31M79l07j01K00m31r65R33K60p28J133m62j265J095j7Q21N1j091n56
5977e63Q20N66L40j253Q73j697K038o19l27J94O80j105j21l7J014M38j061J41
5995C21j67m13R84q37l8J179j103k60k28O12o5K02r17J12p11Q47j87n16R05J536
6015A256j401r49n7R41N06q32q78J202R12p5r60j533J489j01N10j057J70l22J61
6034a018M48n72O26J26n13j29R00l27J060j442P2P49l95O26j316K68J126n04l15
6053e30l7l44l79J787p81M96L63p82l87J81L94M03J024r53j155Q65O9Q98j344
6072b12p28J914k89j459L17J605L66p46k88j020J480K54p77r75N08L36M73o31
$$ plain form
6090 128 104 901 854 1095 348 348 1136 473 241 190 771 333 198 -532 315 743 813 -175 -364 64 854 1028
6112 1028 702 571 329 728 76 -376 1105 865 103 393 -785 392 -42 2 -1405 405 -165 462
6130 462 -810 -630 -562 -184 248 -1428 -373 -39 213 -792 -871 -267 607 -1170 -823 -848 714 -210 -865
6149 -865 -1766 -282 232 -554 -1165 -1052 -55 159 -307 -865 -241 -28 -49 -1287 -1445 -35 -1151 -612 -822
6168 -822 -1128 31 -206 -254 -941 -8 -365 -698 -1712 169 659 -686 -592 134 -507 477 582 188 212 524
6188 524 585 -205 -660 103 108 -288 440 -446 642 786 -1 -287 337 931 1306 260 -352 1133 1205 410
6208 410 384 890 1214 1278 515 1067 579 1565 1278 -171 772 1410 1349 695 485 146 700 1128 -38 363
6228 363 418 749 110 -237 612 1046 -312 -565 -37 113 791 467 221 838 997 392 792 14 -224 1075
$$ packed form
6090A28k4P97m7K41p47%P88o63k32n1N81m38j35p30Q47M28P0r88j89M28P90J74
6112A028l26j31k42L99o52m52J481k40p62K90j178J177m34M4j407J810n70O27
6130D62j272J80O8L78M32j676J055L34K52j005p9O04Q74j777L47k5J562r24o55
6149h65r01J484N14p86o11J13R97K14m66n58O24K13k1j238j58J410j116N39k10
6168h22l06J159k37m8o87R33l57l33j014J881M90j345R4P26o41R84J05l94K4L12
6188E24O1p90m55P63Nl96P28q86J088J44p87k86O24N94L75j046o12J485P2p95
6208D10k6N06L24O4p63N52m88R86k87j449R43O38o1o54k10l39N54M28j166M01
6228C63N5L31o39l47Q49M34j358k53N28J50O78l24k46O17J59o05M00p78k38J299
$$ plain form
6248 1075 196 -363 -367 800 158 -98 -721 -369 624 300 -579 -1500 -237 178 269 -1527 -305 -92 -607
6267 -607 -774 -1092 143 -757 -1040 -1439 -720 310 -271 -429 -671 412 -83 -243 -1332 -221 -219 -622 -485
6286 -485 63 -943 660 -1010 -924 -1082 137 -490 -332 310 -517 -476 145 -1131 -874 -333 233 -544 -1296
6305 -1296 259 1385 773 -313 62 -259 35 -401 -88 4 928 321 -135 -591 715 307 601 359 21
6324 21 1374 -540 -312 -498 1120 1187 -102 -223 222 692 1006 1231 -154 615 878 -203 -339 1032
6342 1032 480 860 -31 -166 -158 657 486 -253 282 775 1772 265 383 260 338 439 -36 690 675 980 -213
6363 -213 -77 119 1035 231 7 300 562 197 -437 -606 192 6 349 174 -553 -257 -123 -263 -324 -641
6383 -641 -55 238 445 -530 35 304 -899 -835 230 -491 -374 -798 -604 153 -409 -62 -707 -129 -240 62
$$ packed form
6248A075q79n59mJ167o42k56o23L52R93l24q79r21J263M15R1j796J222K13n15
6267f07j67l18J235r00k83l99P19J030n81j58k42J083m95j60j089J111Km03J37
6286d85N48j006J603j670Q6j58J219o27J58O42q27M1O21j276K57N41N66p77p52
6305a296J555J126o12j086L75l21K94m36L13R2R24o07m56m56J306m08K94k42l38
6324B1J353j914K28j86J618O7j289j21M45M70L14K25j385P69K63j081j36J371
6342A032n52L80q91j35QQ15j71p39N35M93R97j507J18j23P8J01m75P26j5L05j193
6363b13J36J96R16q04k24K93K62l65o34j69P98j86L43j75p27K96J34j40o1l17
6383f41N86K93K07r75N65K69j203O4J065p21J17m24J94P57n62L47o45N78j11L02
$$ plain form
6403 62 448 -1205 -489 -80 -748 -1101 -961 -879 -80 -531 29 -857 -436 132 -866 -529 189 447 -827 -475
6423 -475 -1064 10 645 309 -835 -369 442 -809 -1377 -591 71 -70 -834 -658 404 680 656 -565 432
6442 432 86 -46 4 -496 822 340 910 138 -1057 642 760 -17 139 183 528 693 634 428 747 743 507
6463 507 -572 436 -28 58 172 -41 1097 1363 253 317 363 -507 955 504 -669 531 895 600 54
6482 54 284 -265 251 1019 763 302 267 -103 294 -337 -208 879 439 -155 147 -92 -70 -391 -680 6 410
6503 410 -69 397 -1101 370 193 -183 -894 -389 443 219 -1213 -593 -59 295 291 -850 -202 -663 -314
6522 -314 -192 -25 -214 534 -764 -369 -428 -749 -818 -1001 -469 -1059 196 -81 -1650 -646 -19 -495 -1534
6541 -1534 -1370 356 -706 -49 -257 -1347 977 191 -53 -1750 -700 -518 296 -563 -774 114 184 445
$$ packed form
6403F2L86j653P16M09o68l53J40Q2P99m51N60q86M21N68r98L37P18K58j274L52
6423d75n89J074O35l36j144M66Q11j251n68P86O62j41p64J76J062K76k4j221R97
6442D32l46j32N0n00J318m82N70p72j195J699J18p77J56M4L45J65n9k06L19mk36
6463E07j079J008m64Q6J14k13J138K66j110O4M6q70J462m51j173J200L64k95n46
6482E4K30n49N16P68k56m61l5l70L97o31J29J087m40n94L02k39K2l21k89O86M04
6503D10m79M66j498J471j77l76p11N05Q32k24j432O20N34L54mj141O48m61L49
6522c14J22J67j89P48j298L95n9l21o9j83N32n90J255k77j569J004O27m76j039
6541a534J64J726j062O57k08j090K324p86k44j697J050J82Q14q59k11Q88P0K61
$$ plain form
6559 445 -749 -148 793 368 -964 135 228 648 1184 568 -352 843 18 -214 -1039 1038 823 3 -629
6578 -629 85 174 555 991 -34 -153 899 257 488 117 1120 739 457 614 234 744 487 223 683
6597 683 665 582 -131 498 403 345 1110 -247 -337 -134 751 -528 131 -1031 179 402 59 -310 -257 980
6617 980 174 91 -296 121 -82 280 -485 -363 1183 -70 -380 144 505 -229 -198 -1124 111 -37 1425
6636 1425 155 -568 146 151 -319 -375 -185 659 -23 -731 107 324 1254 -749 -1048 -23 -426 78 -942
6655 -942 -52 -162 -230 -381 -1378 136 -826 363 -186 -54 -784 406 -327 -1352 221 78 295 -305 -386
6674 -386 -1488 -868 -284 -651 65 659 -59 -640 -206 304 518 886 -39 -238 -552 191 253 104 -459 475
6694 475 146 -214 -893 177 498 -63 1224 -98 280 1465 531 -206 -468 1201 -112 295 813 599
$$ packed form
6559D45j194O01R41m25j332J099R3M20N36o16r20J195q25k32q25K077k15q20o32
6578f29P14Q9L81M36j025j19J052o42K31l71J003l81k82J57l80N10k57k64M60
6597F83j8q3p13O29r5n8P65j357r0K03Q85j279O59j162J210K23l43l69N3J237
6617I80q06q3l87M17k03L62p65J22J546j253l10N24L61p34L1r26J235j48J462
6636A425j270p23P14Nm70n6J90Q44o82p08Q38K17R30k003k99J025m03N04j020
6655i42Q90j10o8j51r97J514r62J189n49J32p30J190p33j025J573j43K17o00q1
6674c86j102O20N84l67P16N94p18n81M34N10K14L68r25j99l14P43O2j49n63R34
6694D75l29l60o79J070L21n61J287j322L78J185r34p37k62J669j313M07N18k14
$$ plain form
6712 599 375 -47 213 402 -136 -134 387 -52 842 543 1173 -773 466 547 215 -73 -479 651 454 655
6732 655 139 -1188 605 215 -75 149 102 746 -88 -347 610 127 -88 -12 599 -389 316 -1 -884 -239
6752 -239 482 222 -224 -320 -361 117 151 -601 -1444 -684 21 -501 -1275 93 142 893 -69 -804 -338 256 -275
6773 -275 -676 -419 -219 369 -378 -983 645 91 -178 -887 -842 -225 247 -508 -817 -878 -557 23 -1215 -636
6793 -636 -324 85 -1212 -573 -729 472 -56 -97 -635 531 -326 114 319 -356 995 171 111 -543 -40
6812 -40 1126 -603 -833 -524 245 -335 -420 -352 475 1043 617 88 -425 901 1183 145 -216 -89 906 519
6832 519 208 249 565 479 -44 687 299 322 458 269 -4 607 1027 445 -223 -783 747 1365 -15 227
6852 227 743 737 612 101 -796 -780 856 1165 -868 499 177 -320 531 480 290 27 1135 -926 -63 519
$$ packed form
6712E99k24m22K60J89n38KN21m39Q94k99O30j946J239Q1l32k88m06J130j97K01
6732F55n16j327J793l90k90K24m7O44q34k59R57m83k15P6O11r88P05l17q83O45
6752b39P21k60m46r6m1M78L4p52q43P60P05n22p74J368M9P51r62p35M66N94n31
6773b75m01K57K00N88p47o05J628n54k69p09M5O17M72p55l09o1L21N80j238N79
6793f36L12M09j297O39j56J201n28m1n38J166q57M40K05o75J351q24o0o54N03
6812d0J166j729k30L09P69n80q5O8Q27N68m26n29n13J326K82j038l61J27R95l87
6832E19l11M1L16q6n23P31l88K3J36j89k73O11M20n82o68n60J530O18j380K42
6852B27N16oj25n11q97J6J636L09k033J367l22m97Q51n1j90k63J108k061Q63N82
$$ plain form
6872 519 29 1128 -141 187 242 141 438 -490 72 582 -1095 -358 398 -107 -181 79 -423 -589 -289 -534
6892 -534 -229 -227 10 67 -805 439 -68 551 -953 -297 -112 535 -224 -898 -925 -797 -109 42 -701 -309 -261
6913 -261 -302 -434 -902 532 127 -1231 -101 172 -318 349 -950 -740 -493 620 476 2 76 -126 -142
6932 -142 -986 -1193 158 874 218 -342 -494 622 -695 -40 -623 -866 481 598 -153 811 -286 -611
6950 -611 -484 -1182 439 882 417 -148 525 24 404 911 -582 329 1421 548 775 -191 240 -136 981
6969 981 -110 -432 953 1608 542 683 322 129 147 -261 863 466 875 49 -461 222 339 804 -169
6988 -169 134 470 272 -278 -459 -63 31 -62 -121 -56 1225 1125 -156 -231 280 -42 617 -1214 252 -3
7008 -3 58 -5 -99 397 153 -537 -87 165 -782 -178 -738 -185 -476 -475 -613 -339 -986 -295 -499 -1169 -481 -651
$$ packed form
6872E19m90J099j269L28N5j01K97r28N62N10j677P37P56n05p4K60n02j66L00k45
6892e34L05KK37N7q72J244n07O19j504O56J85O47p59o74k7J28O88J51p43L92M8
6913b61m1j32m68J434m05j358J130K73m90O67j299K10K47J113j44m74P4k02j6
6932a42q44k07J351P16o56n60j52J116j317O55n83k43J347J17p51R64j097l25
6950f11J27o98J621M43m65n65O73n01L80N07j493R11J092q73K27r66M31l76J117
6969I81j091l22J385O55j066J41l61j93J8m08J124l97M09q26n10O83J17M65r73
6988a69L03L36j98n50j81L96R4r3n9O5J281j00j281p5N11l22O59j831J466k55
7008cO1o3r4M96k44o90M50K52r47O04n60N53k91Jj38K74o47O91k04o70O88j70
$$ plain form
7030 -651 -205 598 -359 -1923 -1229 -395 838 -267 -443 -434 -244 -779 -342 -35 -6 -188 56 -297 190 -885
7050 -885 -134 96 -697 33 418 1176 -1323 -399 -547 -227 -714 -313 354 604 442 -130 478 -335 -32 534
7070 534 -534 217 1172 -40 289 77 666 405 456 761 -336 1009 315 229 242 947 -166 -1045 -64
7089 -64 556 234 215 57 -2 185 1069 -91 249 -196 50 113 319 699 232 75 80 3 -447 298 -153 415
7111 415 373 526 -288 -82 -701 -668 -138 -35 143 -839 888 538 405 -448 482 -332 518 35 -322 -205
7131 -205 420 -39 -893 0 77 1323 448 -919 -324 -169 -438 -203 -433 631 -220 -585 -178 -233 395 26
7151 26 -504 -560 -473 -87 -114 -110 -93 178 -568 -314 -375 -143 -891 -8 167 -742 21 -338 205 -1169 10 107
7173 107 481 -416 -166 222 32 -757 538 423 -150 -61 -1153 188 -536 -242 -545 -344 -325 -1164 324
$$ packed form
7030f51M46Q03r57j564O94Q34J233j105j76RJ90n35M37L07K9j82K44l53M87j075
7050h85P51K30p93P30L85P58k499R24j48L20m87M01O67K50j62n72O08q13L03N66
7070E34j068P51R55j212L29k12N89k61N1L05j097J345o94q6J3P05j113q79R81
7089f4O20l22j9j58n9J87Q84j160L40m45K46O3K06L80m67j57Np7m50P45m51N68
7111D15m2J53q14K06o19L3N30J03J78r82J727l50j33q53R30q14Q50m83l57J17
7131b05O25m59q54Q93P7J246q75j367N95J55k69K35k30J064q51l65M07n5O28l69
7151B6n30n6Q7L86k7MJ7K71p46K54o1K32p48Q83J75r09P63l59N43j374J179R7
7173A07L74q97K50L88j90p89J295j15n73Q9j092J341p24K94l03K01J9q39J488
$$ plain form
7192 324 -109 -1344 1068 -318 -162 -412 580 -581 -465 -240 -1037 861 561 -579 346 213 1137 475
7210 475 370 -109 372 -344 -265 -675 -322 661 840 480 97 326 -194 145 531 16 219 272 -372 -396 427
7231 427 29 -469 -65 -747 658 -346 -98 -943 378 656 478 -104 -271 192 969 -13 -999 -705 60
7250 60 544 -716 -62 27 -358 506 -1188 -501 -96 168 -433 -332 -559 145 274 -541 -661 174 -33 -858
7270 -858 -699 -17 275 -98 -591 -526 -40 99 -705 -1299 -871 492 -201 -328 266 588 -138 -99 668 -43
7290 -43 602 292 -776 24 -257 -633 -484 -1123 -941 -525 -348 -110 -225 -1415 207 -181 -302 102 -155
7309 -155 468 48 -953 455 835 -150 104 -96 -313 -379 -772 -452 -632 1032 55 401 -304 5 574
7328 574 105 -341 -262 605 1031 -279 -105 -278 -91 538 -154 5 -299 -606 -751 -78 81 880 -538 227
$$ packed form
7192C24m33j235K412j386J56k50R92j161J16K25p97J898l00j140R25j33R24o62
7210D75j05m79M81p16P9m10L53R83J79l60l83K29n20L39L86n15K03N3o44k4Q23
7231D27l98m98M04o82J405j004K48q45J321K78j78n82j67M63P77r82r86K94P65
7250F0M84j260O54Q9l85Q64j694O87M05K64o01J01k27P04J29q15j20Q35k07q25
7270h58J59O82K92l73m93O5M86J39q04n94M28J363o93j27N94L22p26L9P67p11
7290d3O45l10j068Q00k81l76J49o39J82M16J77K38j15j190J622l88j21M04k57
7309a55O23m20j001J408L80r85K54k00k17o6l93L20j80J664r77L46p05L09N69
7328E74m69m46P9Q67M26j310J74j73J87O29o92J59l04l07j45O73J59P99j418P65
$$ plain form
7348 227 24 286 619 84 -407 -233 -312 800 391 -106 527 207 817 265 -74 -86 883 705 673 328 470
7369 470 -68 483 -654 337 297 539 576 228 1142 541 434 -466 -193 52 -214 -34 -244 54 -162 495
7389 495 -796 -309 -429 531 -291 794 -723 -317 876 -437 -628 111 88 -267 -17 -220 37 -677 -1284
7408 -1284 -110 545 444 -546 -705 -195 -309 -210 -295 -429 -232 -948 -277 25 -200 -123 -87 -637 -826 432
7428 432 -238 -812 -553 106 -180 83 -352 246 848 907 -280 -342 703 -238 185 196 554 888 -106 123
7448 123 -375 -362 408 429 -452 213 556 758 78 -13 -263 695 62 -492 714 -334 239 886 38 427
7468 427 195 587 -311 669 17 294 -198 649 -37 -10 648 -185 -383 -331 1228 -62 183 605 458 211
7488 211 401 -140 562 242 948 136 175 -165 267 284 515 -814 513 150 677 -555 -219 -206 380 -373
$$ packed form
7348B27k03K62L33n35m91J74p9J112m09m97O33l20O10n52l39j2R69j78l2l45J42
7369D70n38N51j137R91m0K42L7l48R14o01j07r00K73K45k66J80k10K98k16O57
7389D95j291M87j20R60q22J085j517M06J193j313j91P39k3l55K50k03K57p14o07
7408a284J174O55j01r90j59N10j14R9q5j34J97p16O71L02k25P7L6n50j89J258
7428D32o70n74K59O59k86K63m35N98O02N9j187o2J045r41M23J1L58L34r94K29
7448A23m98J3P70K1q81O65L43K02o80r1k50R58o33n54J206j048N73O47q48L89
7468D27k32L92q98R80o52K77m92Q47o86K7O58q33j98N2J559j290K45M22j47k47
7488B11J90n41P02l20P06q12L9l40M32J7K31j329J327l63N27j232L36J3N86p53
$$ plain form
7508 -373 -991 -187 364 -57 -738 -18 298 87 -347 -306 595 951 -1202 -511 -576 278 856 -570 -309 -856
7528 -856 333 -197 382 -824 -298 188 -460 -553 50 -317 1084 61 564 341 -593 -128 -58 328 131
7547 131 -1005 -227 -275 -182 -63 -102 -318 248 1104 -423 112 50 -122 490 -731 -621 -13 673 447 -369
7567 -369 552 -460 142 1098 546 -310 -151 -249 182 305 -245 307 506 283 511 540 904 1129 -69 409
7587 409 -561 699 -6 109 286 986 -578 69 748 -163 263 266 -38 757 -245 -137 680 468 -313 894
7607 894 -92 -155 1189 418 -284 -645 -574 -523 -168 -127 -14 -192 -454 -198 -679 39 -445 -158 -527 539 747
7628 747 -53 295 -286 -788 174 917 588 -641 -1518 -703 -436 -1474 -292 -242 576 -1323 232 -84 -20
7647 -20 26 -280 -348 -235 -588 -449 -879 -225 199 131 -329 -880 296 -263 272 -96 -503 -477 -199 -1098 -1058 -335
$$ packed form
7508c73o18Q04N51m21o81P20L16k11m34M1R01L56k153O91o5Q54N78j426K61n47
7528h56J189n30N79j206N26M86o48r3O03l67J401j023N03k23r34M65P0L86j97
7547A31j136P78m8R3J19l9k16N66Q56j527N35o2j72O12j221J10O08O86k26q16
7567c69R21j012O02R56n52q56J59r8M31J23n50N52J99k23K28K9L64K25j198M78
7587D09r70J260p05J15J77P00j564O47O79r11M26Ll04P95j002J08Q17k12p81J207
7607H94r86o3J344p71p02l61P1N1L55M1J13j78k62K56m81P18m84K87l69J066K08
7628G47q00L48n81n02R62P43l29j229q77Q15K67j038J182N0Q18j899J555l16O4
7647b0M6l06o8J13l53J39m30O54M24o8m60n51J176n59N35l68m07K6K78q99M0P23
$$ plain form
7669 -335 17 310 -243 261 1030 406 -620 -1200 181 946 433 -1041 178 275 547 570 -312 -487 -306
7688 -306 575 -664 -611 164 317 618 193 -654 -205 222 -119 -86 -108 377 477 -697 129 579 426 401 309
7709 309 153 258 810 623 77 552 1034 284 50 -495 17 -8 -393 659 209 -495 464 46 242 84
7729 84 249 -275 228 1008 515 511 -270 227 408 542 -472 -405 -1105 354 -485 -984 481 262 -476 168
7749 168 -340 -245 1335 615 -1007 -144 -469 -709 -442 -112 -236 94 4 -5 332 -481 -447 -931 -915 -544 27
7770 27 -473 -630 -633 41 121 -79 -212 -653 -1180 48 349 -225 758 -645 -218 -10 350 271 95 281 -1032
7791 -1032 -966 345 -116 -583 -334 -750 -155 78 -291 -95 -443 -510 -481 -366 -208 831 526 -561 -32 -124
7811 -124 -791 88 719 -314 -219 -187 613 -480 48 -107 602 -805 -405 281 51 -488 -73 920 369 -207
$$ packed form
7669c35L52K93n53N04P69o24j026n80J381P65n13j474J219R7K72K3q82j75J81
7688c06Q81j239N3P75J53L01m25q47M49M27l41L3k2M85J00j174Q26M50j53k5r2
7709C09j56J05N52j87n46M75M82p50k34n45N12k5l85J052m50p04R59m18J96j58
7729H4J65n24N03P80m93mp81M97J81J34j014O7p00J459q39m99J465k19p38O44
7749A68n08R5J580p20j622Q63l25k40K67L30j24L30r0rL37q13L4m84J6L71N71
7770B7n00j57lO74Q0k00j33m41n27J228L01n74R83j403M27K08L60p9j76J86j313
7791a032O6J311m61m67K49m16N95K33l69J96l48o7K9J15J58J039l05j087N29r2
7811a24o67Q79O31j033R5L2Q00j093N28j55P09j407M00O86k30n39M15R93n51n76
$$ plain form
7831 -207 1102 -408 752 442 -663 365 1228 1045 121 144 634 55 266 363 704 152 1030 511 361
7850 361 48 410 782 -381 236 -404 695 646 294 -145 426 698 116 -144 298 475 -1335 -267 -176
7869 -176 -64 560 -18 122 -514 -498 -399 416 854 100 522 131 -161 136 18 -1083 531 610 -248 -779
7889 -779 -428 -229 -348 -465 194 -714 -860 -502 -543 -919 525 -543 -87 482 -59 -663 257 463 37 -346
7909 -346 -1187 -1042 -72 260 -36 -1028 821 382 -829 45 -234 -241 4 173 -792 196 108 -1143 -570 946
7929 946 -299 3 -740 421 -468 -187 575 264 492 497 674 -172 407 -948 748 -498 -1025 762 449
7948 449 -61 63 839 172 1 310 -920 -580 270 496 276 344 696 -334 280 339 584 -264 -169 150
7968 150 224 567 -767 390 -84 596 1359 -115 -354 -330 1107 319 429 -98 118 -604 1100 877 -282
$$ packed form
7831b07J309j510J160l10j105J028Q63j83r24K3M90n79K11R7L41n52Q78n19j50
7850C61l13L62L72j163O17o40J099m9l52m39N71K72n82k60M42J77j810J068R1
7869a76J12O24n78J40o36J6R9Q15M38p54M22l91k92K97j18j101J614P9q58n31
7889g79L51J99j19j17O59r08j46L58m1l76J444j068M56N69n41o04R20K06m26l83
7909c46q41J45R70L32k96r92J849m39j211Q74k79pK45J69r65R88q8j251N73J516
7929I46j245L02p43J161q89K81P62l11K28NJ77q46N79j355J696j246n27J787l13
7948D49n10J24P76o67j71L09j230L40Q50K26k20O8L52j030O14N9K45q48R5L19
7968A50P4L43j334J157m74O80P63j474k39K4J437p88J10n27K16p22J704k23j159
$$ plain form
7987 -282 -31 413 476 -590 487 412 389 412 223 -124 -283 27 -1270 -523 -406 118 -782 -701 698 -553
8007 -553 -1144 -1007 134 161 -83 59 40 89 500 -637 -158 -333 -704 -261 -459 138 -187 14 -793 -508
8027 -508 -1320 617 339 176 59 -822 -245 -56 -768 -871 -97 -474 -844 -689 -352 53 -450 -548 -339 -946
8047 -946 287 -258 89 382 432 -44 333 218 -112 709 775 876 -387 533 347 554 -578 -424 -56 237
8067 237 -165 115 0 -45 -1145 -183 -282 -124 1213 2 87 -377 234 -350 -1243 1128 80 -131 219
8086 219 393 1006 1210 -174 540 630 -472 -297 58 -10 279 235 422 711 -215 181 45 45 -128 130 704
8107 704 227 0 267 1128 622 -915 -344 -510 521 519 -499 -376 -541 -696 199 -1146 -249 695 890
8126 890 -1234 215 -317 55 -47 -650 -210 128 -561 69 -611 -445 461 355 333 -481 427 115 -294 314
$$ packed form
7987b82K51M44O3j066J077p5k3K3j89l47j59L10j297P47J17N24r00Q1J399j251
8007e53n91J37J141K7k44J42j9M9M11j137M79j75l71M43j98N97l25K01q07K85
8027e08q12J937k78j63j17q81N77J89p12j03P74l77l70J55L37M05n03r8K09o07
8047i46J233n45L47K93N0m76L77j15l30Q21O6J01j263R20j86K07j132J54L68K93
8067B37m02K80j15m5j100R62r9J58J337j211Q5m64O11n84q93K371j048k11L50
8086B19J74O13K04j384P14R0j102J75L55o8K89m4J87K89r26L96j36%j73K58N74
8107G04m77k27K67Q61n06j537N71j66J031kj018J23j65j55Q95j345Q97R44J95
8126H90k124J449n32L72j02o03M40L38o89O30o80J66R06j06k2q14R08l12m09O08
$$ plain form
8146 314 -285 -194 219 158 -154 -210 43 523 454 -405 487 -95 -423 -818 -380 1197 -761 -285 -375 -787 243
8167 243 26 -710 166 -232 -422 -122 -589 -121 298 131 -677 485 454 -399 367 601 309 757 359 -188
8187 -188 393 569 337 93
$$ packed form
8146C14n99R1M13o1l12n6K53M80o9q59Q92n82l28l95M38J577j958M76r0m12J030
8167B43k17p36Q76l98j90L00m67M68M19j67q08J162l1q53P66K34k92M48l98n47
8187a88N81J76k32k44
8191I3
$$ Imaginary data points
##PAGE= N=2
##DATA TABLE= (X++(I..I)), XYDATA
$$ plain form
0 0 0 0 0 0 0 0 0 0 0 0 0 -74 80 -80 80 -80 89 -160 160 -162 240 -241 318 -330 400 -465 523 -584 666
29 666 -761 856 -957 1076 -1196 1342 -1499 1666 -1845 2048 -2267 2514 -2789 3084 -3411 3781
45 3781 -4199 4663 -5196 5803 -6516 7346 -8355 9579 -11139 13159 -15937 19980 -26462
58 -26462 38590 -69125 330460 334545 -252895 19531 345111 171948 -166256 53195 264680
69 264680 72588 -132065 83213 221266 58756 -56831 92245 129096 -3361 -30459
79 -30459 89831 69721 -32239 -9844 94670 70755 -6065 9175 88530 85845 10250 -28173
91 -28173 29377 84192 42270 -30418 -14384 46059 49576 25221 26615 8659 -15091 17020 48375
104 48375 -16040 -65962 6215 43723 -69513 -105039 50690 98087 -94472 -154440 56283
$$ packed form
0@%%%%%%%%%%%p4J54j60J60j60J69k49L20l22M02m81N59o48P30q65R88j107J250
29F66j427J617j813K033k272K538k841L165l511L893m315M781n303N873o495P192
45C781p980Q862r859J0999j2319J3862j5701J7934k0718K4298k9096L5917m6442
58b6462O5052j07715L99585M085n87440K72426L25580j73163l38204K19451K11485
69B64680j92092k04653K15278J38053j62510j15587J49076L6851j32457k7098
79c0459J20290k0110j01960K2395J04514k3915p6820J5240P9355k685p5595l8423
91b8173N7550N4815m1922p2688J6034O0443L517k4355J394j7956k3750L2111L1355
104D8375o4415m9922P2177L7508j13236l5526J55729M7397j92559n9968K10723
$$ plain form
115 56283 114645 -110168 -169522 46140 79589 -132379 -149163 43886 35508 -128689 -85135
126 -85135 56494 -24645 -156040 -49071 73802 -56605 -177609 -48877 58404 -62345
136 -62345 -138729 -10495 51452 -72109 -124962 -3758 50768 -49290 -108053 -38895 17268
147 17268 -17953 -59918 -42428 -5268 -4391 -23859 -29556 -25280 -25822 -17760 -7967 -28967 -55994 -29667
161 -29667 17926 -2981 -59171 -36035 30024 4663 -64482 -28487 51278 6105 -81768 -28761
173 -28761 66140 25107 -50751 -7702 41154 -3780 -15601 46776 28136 -58123 -18158 83467
185 83467 29322 -86602 -21747 101078 30072 -96519 -24697 101044 27031 -89794 -20746
196 -20746 80404 16087 -68512 -7304 59973 9970 -38069 2433 28357 -5129 -5496 31941
$$ packed form
115E6283N8362k24813n9354K15662L3449k11968j6784J93049q378j64197M3554
126h5135J41629q1139j31395J06969J22873j30407j21004J28732J07281j20749
136f2345p6384J28234O1947j23561n2853J21204N4526j00058n8763O9158N6163
147A7268l5221m1965J7490L7160Q77j9468n697M276n42Q062R793k1000k7027K6327
161b9667M7593k0907n6190K3136O6059k5361o9145L5995P9765m5173q7873N3007
173b8761R4901m1033p5858M3049M8856m4934j1821O2377j8640q6259L9965J01625
185H3467n4145j15924O4855J22825p1006j26591P1822J25741p4013j16825O9048
196b0746J01150o4317q4599O1208O7277n0003m8039M0502K5924l3486l67L7437
$$ plain form
208 31941 13671 -38401 -10568 57983 31375 -53108 -40276 46198 42076 -45947 -54534 22260
220 22260 34999 -41884 -63694 4715 25738 -38277 -60609 -11472 5013 -33960 -37526 -11801
232 -11801 -27044 -41062 -5520 688 -56554 -56003 21693 25414 -71174 -79825 25968 42660 -63051
245 -63051 -84517 16434 36362 -55951 -67125 14906 18423 -53781 -46004 12340 -8240 -52954
257 -52954 -18426 16995 -33155 -59353 6235 32509 -43040 -68268 19355 52719 -37528 -76485
269 -76485 15634 62399 -19867 -67087 7731 56715 1347 -38417 6412 39934 8923 -11944
281 -11944 14662 25166 6011 12133 35251 18718 -3580 32817 65452 20854 -16999 37359
293 37359 85395 31375 -21519 33778 91910 43620 -14126 29422 87417 53394 4823 34218
$$ packed form
208C1941j8270n2072K7833O8551k6608q4483J2832Q6474m122q8023q587P6794
220B2260J2739p6883k1810O8409K1023o4015k2332M9137J6485l8973l566K5725
232a1801j5243j4018L5542O208n7242N51P7696L721r6588q651J05793J6692j05711
245f3051k1466J00951J9928r2313j1174Q2031L517p2204P777N8344k0580m4714
257e2954L4528L5421n0150k6198O5588K6274p5549k5228Q7623L3364r0247l8957
269g6485R2119M6765q2266m7220P4818M8984n5368l9764M4829L3522l1011k0867
281a1944K6606J0504j9155O122K3118j6533k2298L6397L2635m4598l7853N4358
293C7359M8036n4020n2894N5297N8132m8290n7746M3548N7995l4023m8571K9395
$$ plain form
305 34218 68211 38923 23465 54519 50898 15059 33866 74927 43187 -4190 38293 92499
317 92499 43819 -19962 30674 101467 52342 -24529 17929 94093 57055 -12523 17853 77898
329 77898 49616 1918 23439 53715 30390 13644 34235 33913 2691 12074 49421 31766 -19988
342 -19988 -5181 53300 33965 -36020 -22547 48251 33335 -41817 -36232 31986 29888 -30790
354 -30790 -35467 8657 11819 -21447 -23712 -2989 -12122 -26460 -9467 -5856 -35740 -33099 9977
367 9977 2135 -57321 -49065 18048 12929 -60905 -64083 6552 13264 -53616 -65894 -5311 8178
380 8178 -46913 -58111 -14664 -8104 -42288 -40873 -17246 -31905 -47563 -17443 -6058 -46881 -57497
393 -57497 -4327 8803 -48610 -65064 -580 22909 -42879 -70761 -5588 31553 -25045 -59699
$$ packed form
305C4218L3993k9288j5458L1054l621l5839J8807M1061l1740m7377M2483N4206
317I2499m8680o3781N0636P0793m9125p6871M2458P6164l7038o9578L0376O0045
329G7898k8282m7698K1521L0276k3325j6746K0591l22l1222R383L7347j7655n1754
342a9988J4807N8481j9335o9985J3473P0798j4916p5152N585O8218k098o0678
354c0790m677M4124L162l3266k265K0723r133j4338J6993L611k9884K641M3076
367I977p842n9456Q256O7113n119p3834l178P0635O712o6880j2278O0583J3489
380H178n5091j1198M3447O560l4184J415K3627j4659j5658L0120J1385m0823j0616
393e7497N3170J3130n7413j6454O4484K3489o5788k7882O5173L7141n6598l4654
$$ plain form
405 -59699 -10099 22431 -16912 -37361 -5872 7526 -15441 -16524 1555 -7058 -19559 2920
417 2920 18342 -15285 -34236 9942 39123 -8693 -43598 5980 47765 -107 -40837 4024
429 4024 46934 8083 -30153 1027 36274 13782 -12172 6172 19953 3653 4342 23252 8481
442 8481 -15110 10334 39703 4523 -30254 9902 52548 9279 -40413 1138 52847 17395
454 17395 -33871 -7608 39471 19545 -22840 -6947 27746 11734 -14013 -1709 11608 -4737
466 -4737 -5314 12526 -657 -27644 -10412 23743 1116 -43357 -25680 24702 5954 -49554 -39021
479 -39021 19535 12368 -45177 -43180 8483 9682 -31878 -31766 -1760 -4765 -23180 -14149 -2803
492 -2803 -17883 -21734 -250 -2176 -33517 -27507 15680 6512 -47606 -42413 19181 16768 -46290
$$ packed form
405e9699M9600L2530l9343k0449L1489J3398k2967j083J8079q613j2501K2479
417B920J5422l3627j8951M4178K9181m7816l4905M9578M1785m7872m0730M4861
429D024M2910l8851l8236L1180L5247k2492k5954J8344J3781j6300O89J8910j4771
442H481k3591K5444K9369l5180l4777M0156M2646m3269m9692M1551N1709l5452
454A7395n1266K6263M7079j9926m2385J5893L4693j6012k5747J2304J3317j6345
466d737n77J7840j3183k6987J7232L4155k2627m4473J7677N0382j8748n5508J0533
479c9021N8556p167n7545J997N1663J199m1560J12L0006l005j8415R031J1346
492b803j5080l851K1484j926l1341O010M3187r168n4118N193O1594k413o3058
$$ plain form
505 -46290 -50794 8049 15510 -35581 -45419 -2550 4366 -25757 -28292 -5737 -7981 -19130 -6358
518 -6358 2038 -17655 -18073 14084 17035 -20529 -18964 28028 30430 -16786 -22745 30113 44986 -2742
532 -2742 -24491 19813 47092 14638 -13391 11092 34318 19541 4701 17388 22230 14033 19343
545 19343 29037 16106 5340 27434 42619 15929 -4383 29483 57349 19304 -11014 29089
557 29089 64493 25201 -11128 27380 61275 30545 475 24168 44966 27049 19461 32689
569 32689 27506 11346 29865 49756 21702 -4593 29749 58701 21949 -9824 27883 58574
581 58574 21237 -11471 23048 53657 23954 -11067 8341 36680 23996 -2994 -1758 13263
593 13263 14049 5953 1419 -4631 -9977 4701 14343 -6086 -26742 -9346 17020 846 -30459
$$ packed form
505d6290m504N8843P461n1091r838M2869O916l0123k535K2555k244j1149J2772
518f358Q396j9693m18L2157K951l7564J565M6992K402m7216n959N2858J4873m7728
532b742k1749M4304K7279l2454k8029K4483K3226j4777j4840J2687M842q197N310
545A9343R694j2931j0766K2094J5185k6690k0312L3866K7866l8045l0318M0103
557B9089L5404l9292l6329L8508L3895l0730l0070K3693K0798j7917p588J3228
569C2689n183j6160J8519J9891k8054k6295L4342K8952l6752l1773L7707L0691
581E8574l7337l2708L4519L0609k9703l5021J9408K8339j2684k6990J236J5021
593A3263P86q096m534o050n346J4678R642k0429k0656J7396K6366j6174l1305
$$ plain form
606 -30459 -19807 14794 5022 -33408 -24743 14683 6693 -34131 -28442 11209 5870 -27688 -24508
619 -24508 -1859 -10343 -21197 -8104 -10467 -36232 -28971 7789 -4778 -53930 -44102 11061 3818
632 3818 -55897 -49651 7616 3349 -48673 -43472 3692 -460 -38024 -33531 -2328 -4623 -24561
645 -24561 -22187 -12397 -15924 -13546 -4074 -12868 -32381 -18897 11435 -556 -36242 -32351 9145
658 9145 12829 -26219 -36662 -1111 16696 -10983 -31093 -5447 16469 -2983 -21902 -1428
670 -1428 15939 -520 -9666 9502 13405 -2036 5921 22069 5134 -12546 18228 42030 2224
683 2224 -29276 14321 53668 9870 -34491 4045 46474 12724 -25215 3119 30605 5143
695 5143 -10351 10465 16225 -1994 1450 15084 4747 -6075 11684 20027 -4238 -13157 14729
$$ packed form
606c0459J0652L4601r772l8430Q665L9426p990m0824N689L9651n339l3558L180
619b4508K2649q484j0854J3093k363k5765P261L6760j2567m9152R828N5163p243
632C818n9715O246N7267m267n2022N201M7164m152l7564M493L1203k295j9938
645b4561K374R790l527K378R472q794j9513J3484L0332j1991l5686L891M1496
658I145L684l9048j0443L5551J7807k7679k0110K5646K1916j9452j8919K0474
670a428J7367j6459r146J9168L903j5441P957J6148j6935j7680L0774K3802l9806
683B224l1500M3597L9347m3798m4361L8536M2429l3750l7939K8334K7486k5462
695E143j5494K0816N760j8219L444J3634j0337j0822J7759Q343k4265q919K7886
$$ plain form
708 14729 26746 -5599 -23521 8346 31460 5921 -20934 -6319 18848 12525 -8445 -9589
720 -9589 4291 7901 -1426 -6386 -1596 -90 -4385 -2263 -1793 -8959 -9109 3939 -126 -21578 -14901
735 -14901 12250 2666 -34913 -28769 13043 10008 -38858 -42207 2548 9119 -31314 -39058 -8794
748 -8794 -3613 -26011 -23099 -10394 -21451 -23517 -4665 -6950 -29120 -19987 7976 -2093 -31619
761 -31619 -14563 18712 4280 -30496 -15960 20037 12023 -21015 -15793 9640 10205 -5917 -6956
774 -6956 -2531 -1714 3104 6107 -5709 -13890 1238 13901 -69 -14189 -4045 15460 11435 -8775
788 -8775 -6939 18202 24965 1052 -8796 17016 36025 15127 -5779 12783 36000 25804 5493
801 5493 13380 27878 25568 19654 23588 17655 11644 27343 36963 13244 -1830 29536 46198 11307
$$ packed form
708A4729J2017l2345j7922L1867K3114k5539k6855J4615K5167o323k0970j144
720i589J3880L610r327m960M790J506m295K122M70p166j50J3048m065k1452O677
735a4901K7151r584l7579O144M1812l035m8866l349M4755O571m0433p744L0264
748h794N181k2398K912J2705j1057k066J8852k285k2170R133K7963j0069k9526
761c1619J7056L3275j4432l4776J4536L5997q014l3038N222K5433N65j6122j039
774f956M425Q17M818L003j1816q181J5128J2663j3970j4120J0144J9505m025k0210
788h775J836K5141O763k3913r848K5812J9009k0898k0906J8562K3217j0196k0311
801E493P887J4498k310n914L934n933o011J5699R620k3719j5074L1366J6662l4891
$$ plain form
815 11307 -9128 26738 47251 12529 -8966 21798 41269 15125 -1837 19682 30526 16190
827 16190 11017 19362 14541 8056 23102 26266 2091 -2066 25062 31269 -652 -10675 16520
840 16520 30547 3823 -14744 5610 24200 8253 -11243 -2887 13015 8569 -6471 -6695 3295
853 3295 5661 -2150 -7171 -6996 -4896 -1276 -257 -10213 -19797 -9168 6961 -6211 -30088 -19780
867 -19780 9582 -311 -32916 -28066 4402 329 -30698 -29775 -2852 -2055 -24167 -24229 -8944 -11421
881 -11421 -20409 -12627 -12448 -23999 -17719 411 -11222 -33384 -21039 7998 -4765 -36677 -25447
894 -25447 7464 -361 -31346 -27258 869 1208 -21951 -22276 -5801 -2095 -11232 -11347 -8546 -10515
908 -10515 -4681 734 -5970 -15909 -4765 10193 1972 -15642 -8761 13384 12574 -11288 -14615 11130
$$ packed form
815A1307k0435L5866K0513l4722k1495L0764J9471k6144j6962K1519J0844j4336
827A6190n173Q345m821o485J5046L164k4175m157K7128O207l1921j0023K7195
840A6520J4027k6724j8567K0354J8590j5947j9496Q356J5902m446j5040k24R990
853C295K366p811n021J75K100L620J019r956r584J0629J6129j3172k3877J0308
867a9780K9362r893l2605M850L2468m073l1027R23K6923P97k2112o2J5285k477
881a1421q988P782J79j1551O280J8130j1633k2162J2345K9037j2763l1912J1230
894b5447L2911p825l0985M088K8127L39k3159l25J6475L706r137j15K801j969
908a0515N834N415o704r939J1144J4958q221j7614O881K2145q10k3862l327K5745
$$ plain form
922 11130 20004 -3902 -15453 6400 20261 5951 -8441 2306 14552 9816 526 3410 5043
935 5043 5883 9638 10614 -158 -2631 17140 22180 -1752 -11713 15403 28180 1476 -13470 12468
949 12468 28800 6398 -10651 6439 21802 9181 -2734 4547 11042 6992 6948 7557 322 -1311
963 -1311 11440 12372 -6693 -11792 10558 17729 -6290 -19384 2736 19092 -1867 -21299 -7369
976 -7369 12343 2614 -16966 -12185 3602 -314 -11354 -10189 -5237 -5376 -5672 -5711 -12673 -14251 -3192
991 -3192 2717 -11167 -23565 -7874 8847 -5980 -28801 -17561 8370 565 -26310 -21550 2621
1004 2621 836 -17948 -19290 -3713 -2562 -11408 -13154 -8600 -7517 -7508 -2671 -7919 -16946 -6124 7529
1019 7529 -3471 -21752 -9507 14411 5211 -20844 -13257 13450 12194 -11781 -13488 6912 12260
$$ packed form
922A1130Q874k3906j1551K1853J3861j4310j4392J0747J2246m736r290K884J633
935E043Q40L755R76j0772k473J9771N040k3932r961K7116J2777k6704j4946K5938
949A2468J6332k2402j7049J7090J5363j2621j1915P281O495m050m4O09p235j633
963a311J2751R32j9065n099K2350P171k4019j3094K2120J6356k0959j9432J3930
976g369J9712r729j9580M781J5787l916j1040J165M952j39k96l9o962j578J1059
991c192N909j3884j2398J5691J6721j4827k2821J1240K5931p805k6875M760K4171
1004B621j785j8784j342J5577J151q846j746M554J083RM837n248r027J0822J3653
1019G529j1000j8281J2245K3918r200k6055P587K6707j256k3975j707K0400N348
$$ plain form
1032 12260 -2544 -6850 2974 8385 4208 3915 4036 770 6584 14809 9573 -4467 4746 22438
1046 22438 17826 -3992 775 24539 25681 2426 -3036 21179 29924 9393 -305 14135 25389
1059 25389 15481 7368 11211 16990 15901 16603 14194 8331 12085 22668 20750 5230 4095 23209
1073 23209 26993 4618 -2730 20003 30853 7969 -3132 15666 27620 13309 -269 8653
1085 8653 18214 14026 6375 5579 8107 8579 10644 8391 -968 -2875 10457 12671 -5496 -11595 6006
1100 6006 14811 -4683 -18391 -918 13259 -139 -17468 -8377 8164 1476 -14088 -11538 -1323
1113 -1323 -1284 -8494 -9747 -10421 -10146 -5645 -3520 -14874 -20562 -7624 1650 -14804 -28920 -13526 3232
1128 3232 -9901 -30030 -21009 763 -4969 -26230 -22531 -6042 -6125 -17915 -17398 -10870 -9890 -9494 -9735
$$ packed form
1032A2260j4804m306R824N411m177k93J21l266N814Q225n236j4040R213J7692
1046B2438m612k1818M767K3764J142k3255n462K4215Q745k0531r698J4440J1254
1059B5389r908q113L843N779j089P02k409n863L754J0583j918j5520j135J9114
1073B3209L784k2375p348K2733J0850k2884j1101J8798J1954j4311j3578Q922
1085H653R561m188p651p96K528M72K065k253r359j907J3332K214j8167o099J7601
1100F006Q805j9494j3708J7473J4177j3398j7329R091J6541o688j5564K550J0215
1113a323L9p210j253o74K75M501K125j1354n688J2938R274j6454j4116J5394J6758
1128C232j3133k0129R021K1772n732k1261L699J6489q3j1790N17O528R80L96k41
$$ plain form
1143 -9735 -12740 -14660 -6546 -2122 -11712 -19966 -9455 4849 -4834 -22549 -13401 6829 1612 -18394
1157 -18394 -16639 3092 5498 -8227 -13468 -1008 4660 -523 -6980 -3579 1120 1888 3115 -1333
1171 -1333 -5182 361 10073 4412 -8119 -3402 14876 11859 -9183 -7679 14326 17481 -3994 -10116
1185 -10116 8760 18706 3883 -5427 5588 14165 8573 3411 7477 7406 8602 14476 12405 1748
1199 1748 5558 20328 17490 315 945 20696 20982 -1010 -5423 12541 18976 924 -8465 3036
1213 3036 11984 2483 -6294 -4100 820 3634 1391 -5666 -8257 -2717 6201 49 -10090 -8539 4407
1228 4407 6978 -7914 -13526 1434 11082 -2749 -15189 -3324 11781 861 -14881 -9030 6216
1241 6216 3099 -10496 -12357 -3159 -732 -6282 -8171 -11236 -12878 -5049 742 -12631 -23547 -8950
$$ packed form
1143i735l005j920Q114M424r590q254J0511J4304r683j7715R148K0230n217k0006
1157a8394J755J9731K406j3725n241J2460N668n183o457L401M699P68J227m448
1171a333l849N543R712n661j2531M717J8278l017k1042J504K2005L155k1475o122
1185a0116J8876R946j4823r310J1015Q577n592n162M066p1J196N874k071j0657
1199A748L810J4770k838j7175O30J9751K86k1992m413J7964O435j8052r389J1501
1213C036Q948r501q777K194M920K814k243p057k591N540Q918o152j0139J551J2946
1228D407K571j4892n612J4960R648j3831j2440J1865J5105j0920j5742N851J5246
1241F216l117j3595j861R198K427n550j889l065j642P829N791j3373j0916J4597
$$ plain form
1255 -8950 5810 -7986 -24767 -10771 6478 -4874 -23155 -12883 4414 -2750 -16240 -12179
1267 -12179 -486 -2218 -7714 -7959 -6733 -6655 1808 1295 -9000 -11155 3913 11315 -3590 -13472 1456
1282 1456 15316 5855 -8746 -3828 12946 11704 -2172 -2494 10594 13520 5766 -520 6879 13661
1296 13661 10369 3875 5140 9369 11737 9803 7211 2083 5471 16437 14487 -1687 -645 18429
1310 18429 22217 1278 -4755 16038 24500 8153 80 14251 21403 10508 5589 13037 16991
1323 16991 12152 12662 14684 7883 10288 18894 14407 -199 4950 21817 15849 -3187 -2002 16985
1337 16985 17550 -740 -6135 7231 14106 4663 -3486 673 6968 6290 1442 -1125 1557 4200 4331
1352 4331 -1953 -4766 348 4313 -629 -7334 -8090 1365 3814 -7995 -16820 -6582 5813 -5207
$$ packed form
1255h950J4760j3796j6781J3996J7249j1352j8281J0272J7297p164j3490M061
1267a2179J1693j732n496k45J226P8Q463n13j0295k155J5068P402j4905r882J4928
1282A456J3860r461j4601M918J6774j242j3876l22J3088K926p754o286P399O782
1296A3661l292o494J265M229K368j934k592n128L388J0966j950j6174J042J9074
1310A8429L788k0939o033K0793Q462j6347q073J4171P152j0895m919P448L954
1323A6991m839N10K022o801K405Q606m487j4606N149J6867n968j9036J185J8987
1337A6985N65j8290n395J3366O875r443q149M159O295o78m848k567K682K643J31
1352D331o284k813N114L965m942o705p56R455K449j1809q825J0238J2395j1020
$$ plain form
1366 -5207 -20300 -13885 1855 -2767 -17303 -16931 -5678 -4607 -10870 -13866 -10266 -9707 -8180 -7126
1380 -7126 -13221 -15965 -6271 445 -12920 -21966 -6308 4998 -11104 -23716 -8769 5041 -5499
1393 -5499 -20332 -13602 -1678 -3395 -11761 -14145 -9273 -5363 -5695 -7996 -12799 -11911 -1694 -996 -11549
1408 -11549 -14650 -1432 3473 -6514 -13996 -4015 7538 1923 -10727 -7258 6221 8754 -4819
1421 -4819 -8260 2973 10682 4104 -3248 -92 6311 8530 5561 1421 1382 7964 11542 6673 -2115
1436 -2115 2612 15943 12048 -3146 -1982 16780 16127 -1671 -4997 11195 15593 2846 -2802 6747
1450 6747 10279 6467 3198 2237 2706 6280 10305 3483 -2979 2612 13048 7327 -6000 -1771 13909
1465 13909 10910 -3837 -4662 9464 10252 751 -4487 2650 8733 3498 -4223 -3190 3180 3839 -886
$$ packed form
1366e207j5093O415J5740m622j4536L72J1253J071o263k996L600N59J527J054
1380g126o095k744R694O716j3365r046J5658J1306j6102j2612J4947J3810j0540
1393e499j4833O730J1924j717q366k384M872L910l32k301m803Q88J0217O98j0553
1408a1549l101J3218M905r987p482R981J1553n615j2650L469J3479K533j3573
1421d819l441J1233P709o578p352L156O403K219k969m140l9O582L578m869q788
1436b115M727J3331l895j5194J164J8762o53j7798l326J6192M398j2747n648R549
1450F747L532l812l269r61M69L574M025o822o462N591J0436n721j3327M229J5680
1465A3909k999j4747q25J4126P88r501n238P137O083n235p721J033O370O59m725
$$ plain form
1480 -886 -4840 -4686 202 3086 -3346 -10338 -6831 1471 523 -10427 -14556 -3296 4093 -8733 -17836
1495 -17836 -8294 4465 -4640 -16857 -11198 722 -1265 -10747 -11073 -4457 -3657 -5137 -5998 -9333 -7159
1510 -7159 -550 145 -10227 -13543 194 4848 -7264 -16542 -3087 7106 -4966 -14798 -5757 4609
1524 4609 -304 -10125 -7197 -337 2713 -1695 -4749 -3323 193 3881 1356 -5305 -2742 6219 7328
1539 7328 -1822 -6109 4718 13079 4346 -4184 2314 14000 9210 -1700 256 12225 13508 4272
1553 4272 413 7611 13376 10123 4948 4984 7596 11334 12249 6187 3122 9573 17725 10466 -239
1568 -239 5523 18307 14525 -380 1139 16406 17337 3370 714 11568 15527 6600 2051 5574
1582 5574 10338 9970 6368 2646 2910 9283 11246 4120 -1719 2770 12885 7862 -5598 -3009 8738
$$ packed form
1480h86l954J54M888K884o432o992L507Q302r48j0950m129J1260P389j2826r103
1495a7836R542J2759r105j2217N659J1920j987r482l26O616Q00j480q61l335K174
1510g159O609O95j0372l316J3737M654j2112r278J3455J0193j2072r832R041J0366
1524D609m913r821K928O860L050m408l054J426L516L688k525o661K563Q961J109
1539G328r150m287J0827Q361q733q530O498J1686m790j0910J956J1969J283r236
1553D272l859P198N765l253n175L6K612L738R15o062l065O451Q152p259j0705
1568b39N762J2784l782j4905J519J5267R31j3967k656J0854L959q927m549L523
1582E574M764l68l602l722K64O373J963p126n839M489J0115n023j3460K589J1747
$$ plain form
1597 8738 10146 -2708 -6814 2924 7952 -1169 -7486 -1821 3661 842 -6021 -6517 -2803 -877 -2063
1612 -2063 -5718 -9207 -4604 185 -3961 -12705 -10969 627 884 -11802 -16345 -4315 2466 -8392
1626 -8392 -17598 -9815 745 -5566 -14423 -11995 -4988 -3727 -9758 -10906 -9428 -7005 -4206 -7730 -13282
1641 -13282 -10750 -1799 -2670 -13935 -15252 -2591 2119 -9858 -17415 -6998 2765 -3838 -14588 -9523
1655 -9523 495 -874 -7474 -8376 -2870 -466 -1468 -3628 -4332 -2394 3072 2311 -3738 -4186 3921 8615
1671 8615 -565 -7850 1366 11227 4366 -6425 -1570 9984 8669 -2157 -2561 6661 9754 4531
1685 4531 -1110 1818 7404 7566 3968 1080 2431 8018 10525 4123 -383 7059 12857 7271 -3463
1700 -3463 2654 12928 10563 -591 -1146 10544 12149 2693 -2084 5301 9383 5282 1118 2352
$$ packed form
1597H738J408j2854m106R738N028r121o317N665N482k819o863m96L714J926j186
1612b063l655l489M603M789m146q744J736J1596K57j2686m543J2030O781j0858
1626h392r206P783J0560o311q857K428P007J261o031j148J478K423K799l524n552
1641a3282K532Q951q71j1265j317J2661M710j1977p557J0417R763o603j0750N065
1655i523J0018j369o600r02N506K404j002k160p04J938N466p61o049m48Q107M694
1671H615r180p285R216R861o861j0791M855J1554j315j0826m04R222L093n223
1685D531n641K928N586J62l598k888J351N587K507o402m506P442N798n586j0734
1700c463O117J0274k365j1154n55J1690J605r456m777P385M082m101m164J234
$$ plain form
1714 2352 3081 5980 5447 118 -2637 3828 8136 3359 -6148 -1169 7528 6141 -5511 -6124 5760
1729 5760 6947 -4388 -9512 593 5560 -2597 -8050 -5212 -922 -565 -4243 -7819 -6480 -2754 -1449
1744 -1449 -6603 -10623 -7257 467 -2913 -12253 -11502 -106 2889 -9897 -13889 -2959 3251 -4898
1758 -4898 -11348 -7600 676 -1816 -7769 -8702 -3539 -343 -2899 -5718 -6460 -3501 319 -2863 -8314
1773 -8314 -8242 1384 2029 -7708 -10479 -432 5955 -1749 -9947 -2164 6564 3705 -5634 -4864 4165 5447
1789 5447 124 -1813 1598 4649 6102 2355 -237 2588 8472 8500 326 -171 7683 11752 4189 -2531
1805 -2531 4286 14488 9385 -1526 970 12816 12268 3880 2514 8391 13139 9418 5984 5830 9147
1820 9147 10863 10577 4789 3743 9313 14258 7373 239 6398 14190 8481 -1530 2457 11839 9869
$$ packed form
1714B352P29K899n33n329k755O465M308m777r507M979Q697j387j1652o13J1884
1729E760J187j1335n124J0105M967q157n453K838M290L57l678l576J339L726J305
1744a449n154m020L366P724l380r340P51J1396K995j2786l992J0930O210q149
1758d898o450L748Q276k492n953r33N163L196k556k819p42K959L820l182n451
1773h314P2R626O45r737k771J0047O387p704q198P783Q728k859r339P70R029J282
1789E447n323j937L411L051J453l747k592K825N884K8q174m97P854M069p563o720
1805b531O817J0202n103j0911K496J1846n48q388j366N877M748l721l434j54L317
1820I147J716k86n788j046N570M945o885p134O159P792n709j0011L987R382j970
$$ plain form
1835 9869 265 -1795 6282 10030 3653 -1258 731 6347 5487 1899 -2253 -215 4567 5739 -1262
1850 -1262 -4867 1478 7312 1214 -6992 -2528 5521 2497 -4717 -7852 802 4604 -3051 -10059 -4253
1865 -4253 1667 -1714 -8997 -8085 -3176 -1077 -5401 -8715 -9509 -5453 -1813 -5534 -11776 -11259 -1268 -1189
1881 -1189 -11286 -14933 -3788 -655 -10187 -15586 -6803 -671 -7791 -13753 -9124 -4084 -4788 -7626 -10696
1896 -10696 -8404 -3541 -1578 -6535 -10966 -5570 2428 312 -9995 -7334 1938 5330 -4245 -8365
1910 -8365 -515 4979 253 -5810 -2897 3516 3126 -3078 -4999 1311 3968 111 -4245 -2067 2335
1925 2335 3603 -235 -3210 -1672 3723 5880 -114 -3762 2083 11041 4677 -3528 1213 11568 8763
1940 8763 178 506 9144 10459 3499 3057 6549 8577 7038 6063 3784 4843 8563 8756 2068 -1298
$$ packed form
1835I869r604k060Q077L748o377m911J989N616q60l588m152K038M782J172p001
1850a262l605O345N834o098q206M464Q049l024p214l135Q654L802p655p008N806
1865d253N920l381p283R12M909K099m324l314p94M056L640l721o242N17R991P9
1881a189j0097l647J1145L133r532n399Q783O132p120n962M629N040p04k838l070
1896a0696K292M863J963m957m431N396P998k116j0307K661R272L392r575m120
1910h365P850N494m726o063K913O413l90o204j921O310K657l857m356K178M402
1925B335J268l838k975J538N395K157n994l648N845Q958o364q205M741J0355k805
1940H763q585L28Q638J315o960m42L492K028j539r75k279J059L720J93o688l366
$$ plain form
1956 -1298 7055 11875 3221 -5150 2873 11274 4758 -3685 -321 8000 6666 -197 -1929 2313 4813
1971 4813 2993 -1251 -2061 2005 4114 688 -3553 -2072 3741 2435 -3708 -5933 -1190 2677 661
1986 661 -6837 -5795 1318 3107 -5644 -9798 -3150 4129 -2633 -10140 -6372 81 426 -6773 -6838 -3800
2002 -3800 -1643 -2665 -5973 -8344 -3996 -46 -1778 -10269 -8256 941 429 -9498 -12419 112 3484
2017 3484 -6568 -10291 -3872 840 -3399 -7121 -4307 -2304 311 -413 -4563 -5725 -121 4707 -643
2032 -643 -5477 -2481 5212 2390 -4983 -3301 4903 6025 -1300 -3709 1777 6675 3796 -1392 -333
2047 -333 4970 7691 2674 -883 2956 8153 6842 2681 2030 5389 8714 8443 2798 2098 7883 11181
2063 11181 6114 -876 5698 12500 8009 -354 2518 11006 9837 1524 1634 8725 8869 5086 3026
$$ packed form
1956a298Q353M820q654q371Q023Q401o516q443L364Q321j334o863j732M242K500
1971D813j820m244q10M066K109l426m241J481N813j306o143k225M743L867k016
1986F61p498J042P113J789q751m154O648P279o762p507L768O453L45p199o5L038
2002c800K157j022l308k371M348L950j732q491K013R197n12r927k921J2531L372
2017C484j0052l723O419M712m239l722K814K003K615p24m150j162N604M828n350
2032f43m834K996P693k822p373J682Q204J122p325k409N486M898k879n188J059
2047c33N303K721n017l557L839N197j311m161o51L359L325k71n645p00N785L298
2063A1181n067o990O574O802m491q363K872Q488j169q313J10P091J44l783k060
$$ plain form
2078 3026 3297 5725 7297 6039 1856 1377 7080 9360 1544 -2447 5744 10940 4095 -3960 2192
2093 2192 9302 6262 -2146 -140 3958 5215 537 -1862 -576 2144 3198 -2474 -4980 -1555 3024
2108 3024 -148 -5032 -5815 -561 864 -4202 -7739 -5772 205 -1929 -9299 -8446 -1941 -147 -6152
2123 -6152 -10589 -5067 646 -3551 -9348 -7954 -3032 -3429 -6448 -7916 -7241 -4072 -1710 -5169 -10679
2138 -10679 -7316 -478 -3126 -10944 -10060 -1407 102 -8570 -11094 -2640 699 -5430 -9445 -4926 -432
2153 -432 -2028 -5506 -6591 -4869 -1544 -705 -4864 -6054 -2071 2601 -257 -6389 -2466 3479 2766 -3901
2169 -3901 -4822 1842 5665 -27 -4031 468 5750 3161 -863 -1638 3171 5908 1998 -294 1688
2184 1688 5784 6355 2118 -567 2482 7173 6997 1412 -650 5315 9509 3311 -1793 3102 10487
$$ packed form
2078C026K71K428J572j258m183m79N703K280p816l991Q191N196o845q055O152
2093B192P110l040q408K006M098J257m678k399J286K720J054n672k506L425M579
2108C024l172m884p83N254J425n066l537J967N977k134p370Q53O505J794o005
2123f152m437N522N713m197n797J394M922l97l019j468O75L169K362l459n510
2138a0679L363O838k648p818Q84Q653J509q672k524Q454L339o129m015M519M494
2153d32j596l478j085J722L325Q39m159j190L983M672k858o132L923N945p13o667
2169c901r21O664L823n692m004M499N282k589m024p75M809K737l910k292J982
2184A688M096N71m237k685L049M691j76n585k062N965M194o198n104M895P385
$$ plain form
2199 10487 6107 -913 1071 6749 7298 1617 -441 4477 6313 5086 2772 660 2505 6662 6133
2214 6133 -507 -1677 5343 7266 738 -4032 2512 7350 2256 -3153 -1779 5237 3518 -2330 -3661
2229 -3661 1364 3373 -766 -3852 -4161 551 852 -2579 -5121 -3102 1077 -512 -4168 -6687 -1249
2244 -1249 2125 -1660 -7933 -5672 789 480 -6302 -7794 -1424 812 -4239 -7895 -3392 -175 -2340
2259 -2340 -5874 -5417 -3290 -743 -1814 -4895 -7677 -2363 579 -3255 -8876 -4174 2202 301 -7706
2274 -7706 -6795 994 2529 -4194 -6856 -1383 1677 771 -3570 -2086 1349 2434 567 -1579 -689 2360
2290 2360 4655 340 -2647 1350 6009 3694 -1648 -636 5648 6692 1083 -1257 2992 7197 4987
2305 4987 -611 1414 6400 7370 2834 949 3950 7215 6071 3081 2027 5893 7891 6067 1851
$$ packed form
2199A0487m380p020J984N678N49n681k058M918J836j227k314k112J845M157n29
2214F133o640j170P020J923o528m770O544M838n094n409J374P016j719n848j331
2229c661N025K009m139l086l09M712L01l431k542K019M179j589l656k519N438
2244a249L374l785o273K261O461l09o782j492O370K236n051l656M503L217k165
2259b340l534M57K127K547j071l081k782N314K942l834n621M702O376j901q007
2274g706R11P789J535o723k662N473L060r06m341J484L435J085j867k146Q90L049
2290B360K295m315k987L997M659k315n342J012O284J044n609k340M249M205k210
2305D987n598K025M986R70m536j885L001L265j144k990j054L866J998j824m216
$$ plain form
2320 1851 2111 8632 9775 2411 212 6155 10180 4580 -1618 3151 8908 6667 925 2041 5271
2335 5271 6359 3189 1438 2944 4909 5260 2661 -1054 1137 5511 5372 -1135 -1932 3382 5026 85
2351 85 -4032 -360 4591 2119 -4704 -3357 1336 1573 -2535 -6134 -2891 690 -819 -4345 -4803 -2935
2367 -2935 -301 -1642 -6557 -6770 -1398 68 -5021 -7591 -4935 822 -2168 -7752 -7473 -367 -168 -7428
2383 -7428 -7499 -3614 -488 -4760 -8257 -5733 -3612 -2872 -5014 -7261 -5533 -2117 -1858 -6611 -8998 -3796
2399 -3796 -370 -3812 -8811 -6484 127 -841 -7105 -6570 -851 567 -3391 -4958 -2853 587 959 -3353
2415 -3353 -3718 99 2655 800 -3155 -2235 1023 4027 -261 -2544 160 5005 3196 -1109 -1323 4361
2431 4361 5803 969 -2051 1109 6120 3218 -429 -59 5693 5884 1819 -14 2453 4426 4538 2328
$$ packed form
2320A851K60O521J143p364k199N943M025n600o198M769N757k241n742J116L230
2335E271J088l170j751J506J965L51k599l715K191M374j39o507p97N314J644m941
2351H5m117L672M951k472o823J347M693K37m108l599L243L581j509l526m58J868
2367b935K634j341m915k13N372J466n089k570K656N757k990n584K79P106J99p260
2383g428p1L885L126m272l497K524K121P40k142k247J728L416K59m753k387N202
2399c796L426l442m999K327O611r68o264N35N719J418l958j567K105L440L72m312
2415c353l65L817K556j855l955R20L258L004m288k283K704M845j809m305k14N684
2431D361J442m834l020L160N011k902l647L70N752J91m065j833K467J973J12k210
$$ plain form
2447 2328 -97 1954 5520 5463 -699 -29 5619 5770 233 -2303 3551 7407 2652 -1439 1243 6522
2463 6522 5344 1337 403 2994 4184 4133 775 -647 2697 4764 2059 -2046 -1537 2868 2958 -2139
2479 -2139 -4333 578 2826 -1944 -4381 -2210 1540 -372 -3717 -4215 -1336 822 -2165 -5510 -2825
2494 -2825 -505 368 -2958 -5887 -3138 -1139 -1148 -4178 -5834 -1693 963 -3534 -7079 -4629 33 -1325
2510 -1325 -6285 -6382 -585 -456 -4690 -5888 -2856 1001 -2298 -4460 -4440 -2275 2 -378 -4626 -3895 675
2527 675 1952 -2490 -5222 -1185 3736 -239 -4181 -2978 2588 2592 -2554 -2754 1293 2272 -102 -2481
2543 -2481 145 2900 3083 1469 -1469 1001 4307 4662 834 122 3579 5064 4186 -435 1537 6826
2559 6826 7907 2409 234 5313 8186 5034 1347 2717 7656 7099 2157 2391 6986 6769 4088 3238
$$ packed form
2447B328k425K051L566n7o162O70N648J51n537k536N854L856m755m091K682N279
2463F522j178m007r34K591J190n1l358j422L344K067k705m105N09M405R0n097
2479b139k194M911K248m770k437K171L750j912l345m98K879K158k987l345K685
2494b825K320Q73l326k929K749J999rl030j656M141K656m497l545K450M662j358
2510a325m960r7N797J29m234j198L032L857l299k162K0K165K277l80m248P31M570
2527F75J277m442k732M037M921l975l942J203N566Mn146k00M047R79k374k379
2543b481K626K755J83j614k938K470L306L55l828p12L457J485q78m621J972N289
2559F826J081n498k175N079K873l152l687J370M939n57m942K34M595k17k681q50
$$ plain form
2575 3238 3060 5825 5943 3217 -272 2177 6640 5463 951 -436 4520 6822 1460 -1588 3478
2590 3478 5033 2707 -1249 -222 2841 3158 1228 161 140 2468 2654 76 -2643 271 3254 -116
2606 -116 -3796 -2568 2626 2337 -1666 -4867 -1584 2923 -601 -4132 -4103 -555 1141 -3557 -4527 -2553
2622 -2553 -402 -563 -4857 -5175 -3036 -1425 -4078 -5671 -5401 -1669 -2412 -5671 -8453 -3794 -639 -4045
2638 -4045 -9072 -5228 34 -2384 -7140 -5950 -3127 -508 -4466 -5978 -3634 -1677 -1918 -3605 -4640
2653 -4640 -2453 976 -318 -3665 -5058 -1230 2400 -1642 -4649 -1347 1952 258 -3756 -3483 1009
2668 1009 2238 -673 -3403 -1165 1957 1523 -744 -1832 1268 4301 1216 -1780 636 3484 3189
2683 3189 725 -277 1568 4277 3111 344 74 4896 5849 1494 -471 3525 5831 3731 534
$$ packed form
2575C238j78K765J18k726l489K449M463j177m512j387M956K302n362l048N066
2590C478J555k326l956J027L063L17j930j067k1K328J86k578k719K914K983l370
2606a16l680J228N194k89m003l201L283M507l524l531K9L548J696m698r70J974
2622b553K151j61m294l18K139J611k653j593K70L732p43l259k782M659L155l406
2638d045n027L844N262k418m756J190K823K619l958j512K344J957k41j687j035
2653d640K187L429j294l347j393L828L630m042l007L302L299j694m014K73M492
2668A009J229k911k730K238L122m34k267j088L100L033l085k996K416K848k95
2683C189k464j002J845K709j166k767k70M822R53m355j965L996K306k100l197
$$ plain form
2698 534 752 4731 4188 1485 1079 3982 5141 3422 1876 734 2839 4617 3843 -341 -714 5361
2714 5361 5256 -737 -2412 2767 4093 17 -2014 916 3030 2061 -1606 -581 1270 2682 860
2729 860 -1932 -1778 1491 3323 -1411 -4173 -1978 1956 -100 -3362 -3164 -638 1263 -2622 -4596 -3594
2745 -3594 424 -1113 -4758 -5545 -123 380 -2839 -5606 -2701 -583 -1949 -4485 -4459 -1996 -496 -1445
2761 -1445 -3801 -3867 -290 391 -4304 -6190 -2798 1065 -998 -5468 -2994 752 67 -3240 -3922 -586
2777 -586 627 -1096 -2385 -2669 620 1188 726 -1849 -1554 2315 2098 -1431 -3362 536 3715 -119
2793 -119 -1947 351 3936 2379 -248 -494 2934 4120 2545 -949 1210 3206 4544 2461 -64
2808 -64 2856 5375 4812 1188 1320 3704 5598 2812 1045 3842 5406 5119 1958 219 5584 6509
$$ packed form
2698E34K18L979n43k703m06K903J159j719j546j142K105J778p74m184l73O075
2714E361j05n993j675N179J326m076k031K930K114r69l667J025J851J412j822
2729H60k792J54L269J832m734k762K195L934k056l262J98K526J901l885j974J002
2745c594M018j537l645p87N422N03l219k767K905K118j366k536K6K463J500r49
2761a445k356o6L577O81m695j886L392L863k063m470K474L746o85l307o82L336
2777e86J213j723j289k84L289N68m62k575K95L869k17l529j931L898L179l834
2793a19j828K298L585j557k627k46L428J186j575l494K159J996J338k083k525
2808f4K920K519n63l624J32K384J894k786j767K797J564k87l161j739N365R25
$$ plain form
2824 6509 2829 15 2913 6498 3642 113 1621 4093 4193 1870 2101 874 3676 5065 1275
2839 1275 -299 2025 4822 3351 -757 -1027 3583 3648 -885 -1713 2066 3450 506 -2117 -729 737
2855 737 1167 -1215 -3090 -976 1606 258 -3246 -3097 -629 900 -576 -4056 -3122 611 -907 -3921
2871 -3921 -4585 -2482 4 -1998 -5223 -3864 -1190 -410 -5433 -4985 -1816 -327 -3110 -5236 -3491 -2360
2887 -2360 -2419 -4242 -4463 -2545 -85 -1800 -5422 -5786 -1914 -569 -2025 -4873 -3634 1217 -1012 -4207
2903 -4207 -3942 94 -19 -2323 -3585 -1205 -40 218 -2417 -3066 -488 1703 240 -2708 -1805 1717
2919 1717 1823 -1259 -1885 652 3311 696 -1662 -383 2299 2966 -136 -1313 1422 4311 2603 -26
2935 -26 -618 3188 3961 1538 -557 2086 3936 2817 1513 678 2694 4962 2771 -212 782 4718
$$ packed form
2824F509l680k814K898L585k856l529J508K472J00k323K31j227K802J389l790
2839A275j574K324K797j471m108k70M610O5m533q28L779J384k944k623J388J466
2855G37M30k382j875K114K582j348l504J49K468J529j476l480R34L733j518l014
2871c921o64K103K486k002l225J359K674P80n023M48L169J489k783k126J745J131
2887b360n9j823k21J918K460j715l622l64L872J345j456k848J239M851k229l195
2903d207K65M036j13k304j262K380J165K58k635o49K578K191j463k948R03L522
2919A717J06l082o26K537K659k615k358J279K682O67l102j177K735K889j708k629
2935b6n92L806P73k423k095K643J850j119j304q35K016K268k191k983R94L936
$$ plain form
2951 4718 4849 300 -661 3200 5733 1984 -395 1490 3875 3504 768 -346 2080 3464 2842 -451
2967 -451 -1216 2076 3108 285 -2556 1051 3925 1758 -2511 -2092 2081 2172 -1365 -3564 705 1767
2983 1767 282 -2690 -1867 -127 1456 -1178 -3347 -2263 393 357 -2431 -3316 -1202 480 -1636 -3936
2999 -3936 -3112 256 -171 -3586 -4437 -1428 395 -1344 -4241 -3744 -488 348 -3619 -4816 -2009 -1284
3015 -1284 -1629 -3192 -3961 -1265 -127 -1920 -4433 -3429 350 41 -3701 -4148 -753 1727 -1233 -3297
3031 -3297 -1821 1026 607 -2162 -1833 707 2283 319 -879 -934 1650 2480 649 -913 783 3869
3047 3869 2543 -236 -61 3418 3148 248 -362 1273 3842 2561 1221 -165 3183 4780 1356 43
3063 43 1921 3304 4777 914 146 3003 4481 2788 1445 1638 3827 4584 2408 458 2241 5575
$$ packed form
2951D718J31m549r61L861K533l749k379J885K385l71k736j114K426J384o22l293
2967d51p65L292J032k823k841L607K874k167m269M19M173R1l537k199M269J062
2983A767j485k972Q23J740J583k634k169J084K656l6k788q85K114J682k116k300
2999c936Q24L368m27l415q51L009J823j739k897M97L256Q36l967j197K807P25
3015a284l45j563p69K696J138j793k513J004L779l09l742m47L395K480k960k064
3031c297J476K847m19k769L29K540J576j964j198n5K584Q30j831j562J696L086
3047C869j326k779J75L479k70k900o10J635K569j281j340j386L348J597l424j313
3063D3J878J383J473l863p68K857J478j693j343J93K189P57k176j950J783L334
$$ plain form
3079 5575 4109 -511 616 4766 4015 405 572 3062 3887 2105 70 1269 3675 3760 953 -1230
3095 -1230 982 2988 3351 -324 -1812 965 2549 332 -1098 -847 2134 644 -2633 -2818 -214 1240
3111 1240 -765 -2888 -1739 64 -641 -2458 -3234 -2185 -37 -1003 -3271 -3378 -783 396 -3316 -4246
3127 -4246 -2985 -848 -1298 -3454 -4347 -932 735 -3061 -5091 -2329 -86 -1795 -3943 -4094 -1042 -979
3143 -979 -2890 -3997 -1923 -258 -673 -3218 -3076 -2989 -1928 -914 -3544 -3077 -249 137 -2627 -4843 -487
3160 -487 334 -1374 -2475 -1474 1165 574 -1806 -2490 -114 1184 825 -1404 -1120 1314 2388 838
3176 838 -1593 -50 3150 3572 -567 -128 2537 4214 1542 -490 1138 4013 2473 418 -63 3254
3192 3254 3456 2196 970 1278 3088 2770 894 113 2419 4354 2151 827 1121 2051 4328 1864
$$ packed form
3079E575j466m620J127M150p51l610J67K490Q25j782k035J199K406Q5k807k183
3095a230K212K006L63l675j488K777J584k217j430K51K981j490l277j85K604J454
3111A240k005k123J149J803p05j817p76J049K148r66k268j07K595J179l712r30
3127d246J261K137m50k156q93L415J667l796k030K762K243j709k148j51L052O3
3143i79j911j107K074J665m15k545J42Q7J061J014k630M67K828L86k764k216M356
3160d87Q21j708j101J001K639n91k380o84K376J298l59k229K84K434J074j550
3176H38k431J543L200M22m139M39K665J677k672k032J628K875j540k055m81L317
3192C254K02j260j226L08J810l18j876p81K306J935k203j324K94R30K277k464
$$ plain form
3208 1864 -791 1290 4164 2397 -795 470 2575 2880 82 -319 314 2836 1318 -1417 -124 1035
3224 1035 1630 526 -684 81 1232 2549 -2081 -2077 -770 1699 1184 -2707 -969 2032 499 -2728
3240 -2728 -2584 -1109 1612 -828 -2785 -1957 116 465 -2115 -3121 -2374 51 -1726 -3201 -3068 -1699
3256 -1699 -151 -2228 -3873 -2974 -879 -558 -3504 -4068 -1058 669 -1455 -3028 -2026 425 -1082 -2617
3272 -2617 -2905 -967 -96 -244 -3022 -2575 -656 1000 -1020 -2589 -1095 -327 654 -2028 -1486 1628 2053
3289 2053 -729 -2115 392 2146 1067 -128 -136 1484 2306 658 93 131 2461 2195 1131 -56 1179
3306 1179 2880 2389 1143 1604 3164 2658 1289 -529 3573 3724 1204 287 1069 4140 3215 1502 -162
3323 -162 2455 4230 2315 699 1608 3076 3040 1364 921 1360 3782 3278 1210 112 1456 4149 1667
$$ packed form
3208A864k655K081K874j767l192J265K105L05k798m01O33K522j518k735J293J159
3224A035N95j104j210P65J151J317m630MJ307K469n15l891J738L001j533l227
3240b728J44J475K721k440j957Q28K073L49k580j006P47K425j777j475J33J369
3256a699J548k077j645Q99K095L21k946n64L010J727k124j573J002K451j507j535
3272b617k88J938Q71j48k778M47J919J656k020j569J494P68R81k682N42L114M25
3289B053k782j386K507J754j079j195qJ620Q22j648n65L8K330k66j064j187J235
3306A179J701m91j246M61J560n06j369j818M102J51k520r17P82L071r25j713j664
3323a62K617J775j915j616R09J468l6j676m43M39K422n04k068j098J344K693k482
$$ plain form
3340 1667 -629 -916 3358 1785 -704 120 1352 1858 -302 -397 -563 1066 108 -353 -1383 -433 1120
3357 1120 402 -1975 -2576 473 1141 -1969 -2248 -1183 272 337 -1765 -2834 -1322 320 -2160 -3108 -1413
3374 -1413 22 -1426 -2542 -2928 -1040 -677 -1515 -3548 -2131 -1191 -613 -2296 -3472 -2029 -737 -2011
3390 -2011 -3100 -3097 -652 -133 -2280 -3869 -1668 533 -1174 -2819 -2710 404 -271 -2812 -2144 -296 1240
3407 1240 -331 -1265 -2147 221 1133 -311 -2523 -1210 2099 856 -1667 -1588 1148 2005 741 -1153
3423 -1153 197 1810 1385 -416 437 548 2627 2682 -282 69 2721 2816 1085 547 1637 3481 1393
3440 1393 278 239 2723 3282 2046 -854 1586 3772 2467 763 737 3238 3841 1078 -1065 1456
3456 1456 3402 1578 881 624 2187 2578 1597 339 151 1705 2554 227 -1426 720 2695 736
$$ packed form
3340A667k296k87M274j573k489Q24J232N06k160r5j66J629r58m61j030R50J553
3357A120p18k377o01L049O68l110k79J065J455O5k102j069J512J642k480r48J695
3374a413J435j448j116l86J888L63q38k033J417R40N78j683j176J443J292j274
3390b011j089LK445N19k147j589K201K201j707j645J09L114o75k541O68J848J536
3407A240j571r34q82K368R12j444k212J313L309j243k523P9K736Q57j264j894
3423a153J350J613m25j801Q53J11K079N5k964L51K652R5j731n38J090J844k088
3440A393j115l9K484N59j236k900K440K186j305j704k6K501O03k763k143K521
3456A456J946j824o97k57J563L91r81j258j88J554Q49k327j653K146J975j959
$$ plain form
3472 736 -939 -494 1905 2260 -1057 -549 874 1862 -363 -1012 -1188 -634 1421 -551 -2040 -432 1125
3489 1125 336 -2055 -2585 -837 1291 -1060 -2512 -1932 -530 -535 -2344 -2779 -720 -525 -2053 -3076 -3039
3506 -3039 416 -171 -2524 -2717 -1048 137 -907 -2743 -1660 -630 -171 -1904 -2517 -1350 419 -782
3522 -782 -3048 -2649 -371 874 -1053 -2869 -753 619 -432 -2566 -1086 1326 823 -363 -1179 -473
3538 -473 849 1674 -1053 -1524 267 2211 1038 -2317 -746 3192 2202 418 -615 1646 1546 909
3554 909 436 1129 2156 2150 1176 844 398 2641 2655 526 38 2114 3244 1805 1346 2537 3336 3440 1235
3573 1235 258 1541 3393 1820 687 469 3361 3510 1132 433 2566 2638 1952 157 625 3143 1708
3590 1708 828 -967 263 2525 1616 -672 -1166 1078 1296 -250 -1584 -202 1384 841 -1678 -1374
$$ packed form
3472G36j675M45K399L55l317N08J423R88k225o49j76N54K055j972j489J608J557
3489A125p89k391n30J748K128k351j452N80J402nj809m35K059J95j528j023L7
3506c039L455n87k353j93J669J185j044j836J083J030M59j733o13J167J769j201
3522g82k266L99K278J245j927j816K116J372j051k134J480K412n03j186q16P06
3538d73J322Q25k727m71J791J944j173l355J571L938r90j784j033K261j00o37
3554I09m73O93J027or74l32m46K243J4k129m88K076J130j439m59J191P99J04k205
3573A235r77J283J852j573j133k18K892J49k378o99K133P2o86j795M68K518j435
3590A708q80j795J230K262r09k288m94K244K18j546j334J382J586n43k519L04
$$ plain form
3606 -1374 1188 1207 -1079 -2693 -1392 -215 664 -1137 -2233 -183 725 -1401 -2929 -1513 -39 452
3622 452 -1969 -1955 -703 -8 -1295 -2896 -2652 -782 -470 -3139 -4038 -1681 -700 -1656 -3417 -3003 -1049
3639 -1049 -7 -1608 -4407 -1589 -772 -1644 -3696 -1960 -1207 -314 -691 -2313 -2003 -104 733 -2341 -3101
3656 -3101 -231 626 -1122 -1450 -650 1871 -245 -1431 -969 -62 526 459 -962 -1006 597 2359 -190
3673 -190 -1414 -10 2474 971 -252 484 2197 1405 196 -595 1304 1923 1883 199 884 2375 2531
3690 2531 1238 -560 1342 2747 2297 10 424 2856 2886 1676 70 763 2129 1804 995 955 1670
3707 1670 2625 842 -225 1315 3060 2309 -1322 -190 97 2005 1587 -1034 68 1026 1863 -42
3723 -42 -624 -617 799 504 -945 -1654 223 1494 -552 -2087 -920 1562 -130 -1492 -2685 -172 83
$$ packed form
3606a374K562J9k286j614J301J177Q79j801j096K050R08k126j528J416J474M91
3622D52k421J4J252O95j287j601K44J870L12k669q99K357R81r56j761M14J954
3639a049J042j601k799K818Q17q72k052J736P53Q93l77j622L10J899Q37l074p60
3656c101K870Q57j748l28Q00K521k116j186M62R07N88o7j421m4J603J762k549
3673a90j224J404K484j503j223P36J713p92j209p91J899O19m0j684O85J491J56
3690B531j293j798J902J405m50k287M14K432L0j210j606O93J366l25q09m0P15
3707A670R55j783j067J540J745p51l631J132K87J908m18k621J102R58Q37j905
3723d2n82PJ416k95j449p09J877J271k046j535J167K482j692j362j193K513K55
$$ plain form
3740 83 -1215 -2004 -1469 303 -563 -1402 -2465 -1289 29 -578 -2104 -2724 -305 -496 -1329 -3473 -2455
3757 -2455 25 -332 -2767 -2485 433 -336 -1702 -2521 -1680 100 -709 -2186 -2692 600 912 -1100 -2329
3774 -2329 -815 94 298 -1251 -1945 -1367 672 -606 -2327 -758 879 734 130 -724 1222 1619 1406
3791 1406 -1129 -581 1498 2072 1062 105 1455 2337 1868 19 -317 2147 2150 1211 -313 1373 2711
3808 2711 1917 441 104 2506 3059 490 573 1481 2462 2861 1188 556 675 3004 864 118 531 1858
3826 1858 1968 1139 -237 1266 2404 1349 -376 228 2209 2771 1007 -38 632 2772 1573 -223
3842 -223 -257 1390 1238 482 -109 41 1821 775 318 -164 554 1167 -842 -1813 -1384 484 193 -1036
3860 -1036 -1869 -573 132 -728 -1942 -1696 552 -380 -1174 -2816 -2030 591 -710 -2569 -2305 -826 603
$$ packed form
3740H3j298p89N35J772q66q39j063J176J318o07j526o20K419j91q33k144J018
3757b455K480l57k435K82K918p69j366q19Q41J780q09j477n06L292L12k012j229
3774b329J514R09K04j549o94N78K039j278j721J569J637j45o04q54J946L97k13
3791A406k535N48K079N74j010r57J350Q82m69j849l36K464Lr39j524J686J338
3808B711p94j476l37K402N53k569Q3R08R81L99j673o32J19K329k140p46M13J327
3826A858J10q29j376J503J138j055j725O04J981N62j764j045O70K140j199j796
3842b23l4J647j52p56n91J50J780j046m57m82P18O13k009r71M29J868k91j229
3860a036q33J296P05q60j214K46K248r32p94j642P86K621j301j859K64J479J429
$$ plain form
3877 603 -1464 -3537 -1545 220 -976 -2748 -2230 -644 -583 -2077 -2729 -1048 -247 -694 -1227 -2433 -407
3894 -407 1174 -1287 -2483 -2061 5 -530 -1469 -1573 -335 400 -5 -3071 -1537 -554 460 -1976 -1103
3911 -1103 -39 866 223 -1313 -1405 764 1476 -41 -414 -238 1021 1176 108 -725 687 1831 1229
3928 1229 156 541 1861 1463 1099 232 1602 1691 1397 -133 283 1945 1824 119 -85 2054 2328 1556
3946 1556 -712 697 2228 3097 1502 -78 1253 2322 1309 -483 319 2568 2409 1704 419 782
3962 782 1749 2395 -905 -371 1112 1906 -72 -1610 195 1501 1685 -162 -217 2297 1679 1 -479
3979 -479 -910 -157 274 -581 -2412 -808 959 5 -1478 -2092 190 938 -2488 -2127 -608 67 -1393
3996 -1393 -1236 -1995 269 -68 -894 -2389 -1034 -300 -20 -473 -2919 -132 69 -1571 -1560 -1389 -541 -948
$$ packed form
3877F03k067k073J992J765j196j772N18J586O1j494o52J681Q01m47n33j206K026
3894d07J581k461j196M22K066n35r39j04J238P35m05l066J534R83J014k436Q73
3911a103J064R05o43j536r2K169P12j517l73J76J259J55j068q33J412J144o02
3928A229j073L85J320l98l64q67J370Q9k94j530M16J662j21j705k04K139K74p72
3946A556k268J409J531Q69j595j580J331J069j013j792Q02K249j59p05j285L63
3962G82R67O46l300N34J483P94j978j538J805J306J84j847n5K514o18j678m80
3979d79m31P53M31q55j831J604J767r54j483o14K282P48l426L61J519O75j460
3996a393J57p59K264l37q26j495J355P34K80m53k446K787K01j640J1J71Q48m07
$$ plain form
4014 -948 -930 -1745 362 4 -863 -1640 -1530 -455 928 -2082 -1419 -194 805 -1112 -1362 -1188 376 157
4032 157 -930 413 -336 1706 -571 6 -476 459 774 500 115 675 1541 987 -600 -147 1327 1953
4050 1953 808 71 1284 1615 1471 539 389 1461 3214 1616 -57 41 1928 1777 755 169 1324
4067 1324 2763 321 398 932 1824 1466 803 648 939 2109 2192 254 28 1847 1063 760 -220 874
4085 874 2642 1352 545 18 312 1658 512 -636 -285 1370 1223 55 -1184 1211 738 355 -932
4102 -932 -1013 881 435 -589 -1606 -628 1069 -29 -1712 -1065 -119 1240 -380 -3300 -2100 -167 -195
4119 -195 -1989 -1983 -725 130 -932 -2247 -1149 -89 -362 -1979 -2514 -49 -571 -806 -2055 -1079 -319 -1311
4137 -1311 -1822 -2012 -1290 333 -1242 -2675 -1662 -570 313 -1996 -1821 -1945 428 -684 -1702 -1858 -322
$$ packed form
4014i48J8q15K107l58q67p77J10J075J383l010O63J225R99j917k50J74J564k19
4032A57j087J343p49K042k277N77m82R35L15k74l85N60Q66n54j587M53J474O26
4050A953j145p37J213L31j44r32j50J072J753j598j673R8J887j51j022n86J155
4067A324J439k442P7N34Q92l58o63j55K91J170Q3j938k26J819p84l03r80J094
4085H74J768j290q07n27K94J346j146j148L51J655j47j168j239K395m73l83j287
4102i32q1J894m46j024j017R78J697j098j683O47R46J359j620k920J200J933k8
4119a95j794OJ258Q55j062j315J098J060k73j617n35K465n22k35j249R76P60r92
4137a311n11j90P22J623j575j433J013J092Q83k309J75j24K373j112j018j56J536
$$ plain form
4154 -322 37 -797 -1805 -2034 647 367 -1443 -620 220 1099 791 -575 -351 131 1496 -905 -1299 857
4172 857 1578 634 -835 -125 872 493 -74 -1099 893 2165 567 -79 -107 2407 1897 324 755 1999
4190 1999 1746 1222 200 577 1263 2475 496 550 620 2280 1269 -86 181 1346 1607 782 -1017 1212
4208 1212 1284 1214 -360 228 783 980 1436 66 396 552 959 404 -97 -415 1109 193 -1974 -513 846
4227 846 764 -723 -1488 -567 1060 -250 -880 -1110 716 687 -1128 -2490 -1296 622 -1473 -1953 -1999 596
4245 596 -155 -1150 -1647 -1077 487 1216 -2433 -1957 -423 -138 -966 -1495 -1032 -80 -787 -1810 -1223 -1591 -245
4264 -245 -1289 -1694 -1491 -657 570 -673 -1866 -651 570 -496 -820 -944 525 64 -1403 -853 -143
4281 -143 610 -219 -609 -1243 1291 1011 -428 -1231 -440 619 551 -1256 -379 493 565 595 -454 1092 681
$$ packed form
4154c22L59q34j008k29K681k80j810Q23Q40Q79l08j366K24M82J365k401l94K156
4172H57P21r44j469P10R97l79n67j025J992J272j598o46k8K514n10j573M31J244
4190A999k53n24j022L77O86J212j979N4P0J660j011j355K67J165K61q25j799K229
4208A212P2p0j574N88N55J97M56j370L30J56M07n55n01l18J524r16k167J461J359
4227H46q2j487p65R21J627j310o30k30J826k9j815j362J194J918k095m80m6K595
4245E96p51r95m97N70J564P29l649M76J534K85q28n29M63R52p07j023N87l68J346
4264b45j044m05K03Q34J227j243j193J215J221j066l24j24J469m61j467N50P10
4281a43P53q29l90o34K534k80j439q03P91J059o8j807Q77Q72P2L0j049J546m11
$$ plain form
4300 681 1649 169 -162 748 1917 1013 290 257 1682 1541 313 666 698 1557 828 -1177 951 3003
4318 3003 1437 1178 135 1715 2240 1885 1190 566 1398 2516 1044 805 1236 2016 1340 -171 -13 2008
4336 2008 1036 827 -1066 -288 2406 1262 123 -397 -239 243 72 -1515 -1544 147 -88 -263 -902 -1250
4354 -1250 628 76 -1530 -1108 492 -460 -1535 -1743 -1106 -531 -1414 -1454 -559 -271 -121 -285 -1711 -1268
4372 -1268 -686 -538 -1736 -1579 -135 -133 -464 -1821 -1545 -808 -1298 -1923 -2584 -1325 62 -875 -1729 -1240 -243
4391 -243 407 -1379 -1857 -421 -341 -477 -1476 -754 -1031 209 -849 -1207 -1265 1215 30 -835 -733 -327 988
4410 988 170 -748 256 954 -749 -985 -111 -390 169 367 -653 637 662 1005 -657 -432 450 1126 866
4429 866 -433 605 1224 1400 693 -24 1358 1988 1175 -157 390 1823 2628 1142 173 1058 2377 1982
$$ packed form
4300F81R68j480l31R10J169r04p23l3J425j41j228L53L2Q59p29k005K128K052
4318C003j566k59j043J580N25l55o95o24Q32J118j472k39M31P80o76j511J58K021
4336B008r72k09j893P78K694j144j139n20J58M82j71j587k9J691k35j75o39l48
4354a250J878n52j606M22J600r52j075k08O37N75q83m0Q95K88J50j64j426M43
4372a268N82J48j198J57J444Kl31j357K76P37m90o25o61J259J387r37q54M89R97
4391b43O50j786m78J436Q0j36r99P22k77J240j058l58n8K480j185q65J02M06J315
4410I88q18r18J004O98j703k36Q74k79N59J98j020J290K5L43j662K25Q82O76k60
4429H66j299J038O19J76p07p17J382O30q13j332N47J433Q05j486r69Q85J319l95
$$ [...]
8191b65
##END NTUPLES=NMR FID
##END=
