##TITLE=1H_SA_42.154.d
 CDCl3, 72 sc, 
 13.11.2019
##JCAMPDX= 6.0         $$ Bruker NMR JCAMP-DX V2.0
##DATA TYPE= NMR FID
##DATA CLASS= NTUPLES
##ORIGIN= UXNMR, Bruker Analytische Messtechnik GmbH
##OWNER= root
$$ XWIN-NMR		Version 3.5
$$ Wed Nov 13 14:23:23 2019 Russian Standard Time (UT+4h)  she@DPX200
##.OBSERVE FREQUENCY= 200.1315
##.OBSERVE NUCLEUS= ^1H
##.DELAY= (6, 6)
##.ACQUISITION MODE= SIMULTANEOUS
##.ACQUISITION SCHEME= undefined
##.AVERAGES= 72
##.DIGITISER RES= 18
##SPECTROMETER/DATA SYSTEM= spect
##.PULSE SEQUENCE= zg30
##.SOLVENT NAME= D2O
##.SHIFT REFERENCE= (INTERNAL, D2O, 0, 15.7039)
##AUDIT TRAIL= $$ (NUMBER, WHEN, WHO, WHERE, WHAT)
$$ ##TITLE= Audit trail, XWIN-NMR		Version 3.5
$$ ##JCAMPDX= 5.01
$$ ##ORIGIN= Bruker BioSpin GmbH
$$ ##OWNER= she
$$ F:/spectra/data/she/nmr/H-F/1/audita.txt
$$ ##AUDIT TRAIL=  $$ (NUMBER, WHEN, WHO, WHERE, WHAT)
(   1,<2019-11-13 14:22:04.76 +0400>,<she>,<DPX200>,
      <continue with go, POWCHK disabled, PULCHK disabled
       configuration hash MD5:
       00 E9 B6 7A A2 85 ED C7 34 08 36 98 17 FE 4E 26
       data hash MD5: 16K
       D9 C3 7B D4 FD AB 72 41 3A E4 C6 3D CE ED 72 86>)
$$ ##END=
$$ 
$$ hash MD5
$$ 17 C9 94 18 3E 42 E1 11 6D 30 24 5F C5 58 C3 0D
##$RELAX= 
##$RELAX= 
##$RELAX= 
##$RELAX= 
##$RELAX= 
##$RELAX= 
$$ Bruker specific parameters
$$ --------------------------
##$DU= <F:/spectra>
##$EXPNO= 1
##$NAME= <H-F>
##$PROCNO= 1
##$TYPE= <nmr>
##$USER= <she>
##$AMP= (0..31)
100 100 100 100 100 100 100 100 100 100 100 100 100 100 100 100 100 100 
100 100 100 100 100 100 100 100 100 100 100 100 100 100 
##$AQSEQ= 0
##$AQ_mod= 1
##$AUNM= <au_zg>
##$AUTOPOS= <>
##$BF1= 200.13
##$BF2= 200.13
##$BF3= 200.13
##$BF4= 200.13
##$BF5= 200.13
##$BF6= 200.13
##$BF7= 200.13
##$BF8= 200.13
##$BYTORDA= 1
##$CFDGTYP= 0
##$CFRGTYP= 5
##$CHEMSTR= <none>
##$CNST= (0..31)
1 1 145 1 1 1 1 1 1 1 1 1 1 1 1 1 1 1 1 1 1 1 1 1 1 1 1 1 1 1 1 1 
##$CPDPRG= <>
##$CPDPRG1= <>
##$CPDPRG2= <>
##$CPDPRG3= <>
##$CPDPRG4= <mlev>
##$CPDPRG5= <mlev>
##$CPDPRG6= <mlev>
##$CPDPRG7= <mlev>
##$CPDPRG8= <mlev>
##$CPDPRGB= <>
##$CPDPRGT= <>
##$D= (0..31)
0 1.2 0 0 0 0 0 0 0 0.06 0 0.03 0 0 0 0 0.0002 0 0 0 0 0 0 0 0 0 0 0 0 
0 0 0 
##$DATE= 1573640276
##$DBL= (0..7)
120 120 120 120 120 120 120 120 
##$DBP= (0..7)
150 150 150 150 150 150 150 150 
##$DBP07= 0
##$DBPNAM0= <>
##$DBPNAM1= <>
##$DBPNAM2= <>
##$DBPNAM3= <>
##$DBPNAM4= <>
##$DBPNAM5= <>
##$DBPNAM6= <>
##$DBPNAM7= <>
##$DBPOAL= (0..7)
0.5 0.5 0.5 0.5 0.5 0.5 0.5 0.5 
##$DBPOFFS= (0..7)
0 0 0 0 0 0 0 0 
##$DE= 6
##$DECBNUC= <off>
##$DECIM= 24
##$DECNUC= <off>
##$DECSTAT= 4
##$DIGMOD= 1
##$DIGTYP= 9
##$DL= (0..7)
0 120 120 120 120 120 120 120 
##$DP= (0..7)
150 150 150 150 150 150 150 150 
##$DP07= 0
##$DPNAME0= <>
##$DPNAME1= <>
##$DPNAME2= <>
##$DPNAME3= <>
##$DPNAME4= <>
##$DPNAME5= <>
##$DPNAME6= <>
##$DPNAME7= <>
##$DPOAL= (0..7)
0.5 0.5 0.5 0.5 0.5 0.5 0.5 0.5 
##$DPOFFS= (0..7)
0 0 0 0 0 0 0 0 
##$DQDMODE= 0
##$DR= 18
##$DS= 0
##$DSLIST= <SSSSSSSSSSSSSSS>
$$ [...]
##$SUBNAM2= <"">
##$SUBNAM3= <"">
##$SUBNAM4= <"">
##$SUBNAM5= <"">
##$SUBNAM6= <"">
##$SUBNAM7= <"">
##$SUBNAM8= <"">
##$SUBNAM9= <"">
##$SW= 24.0689530833862
##$SWIBOX= (0..15)
0 0 2 0 0 0 0 0 0 0 0 0 0 0 0 0 
##$SW_h= 4816.95568400771
##$TD= 16384
##$TD0= 1
##$TE= 0
##$TE2= 300
##$TE3= 300
##$TEG= 300
##$TL= (0..7)
0 120 120 120 120 120 120 120 
##$TP= (0..7)
150 150 150 150 150 150 150 150 
##$TP07= 0
##$TPNAME0= <>
##$TPNAME1= <>
##$TPNAME2= <>
##$TPNAME3= <>
##$TPNAME4= <>
##$TPNAME5= <>
##$TPNAME6= <>
##$TPNAME7= <>
##$TPOAL= (0..7)
0.5 0.5 0.5 0.5 0.5 0.5 0.5 0.5 
##$TPOFFS= (0..7)
0 0 0 0 0 0 0 0 
##$TUNHIN= 0
##$TUNHOUT= 0
##$TUNXOUT= 0
##$USERA1= <user>
##$USERA2= <user>
##$USERA3= <user>
##$USERA4= <user>
##$USERA5= <user>
##$V9= 5
##$VALIST= <valist>
##$VCLIST= <CCCCCCCCCCCCCCC>
##$VD= 0
##$VDLIST= <DDDDDDDDDDDDDDD>
##$VPLIST= <PPPPPPPPPPPPPPP>
##$VTLIST= <TTTTTTTTTTTTTTT>
##$WBST= 1024
##$WBSW= 4
##$XGAIN= (0..3)
0 0 0 0 
##$XL= 0
##$YL= 0
##$YMAX_a= 350231
##$YMIN_a= -300091
##$ZGOPTNS= <>
##$ZL1= 120
##$ZL2= 120
##$ZL3= 120
##$ZL4= 120
##$ABSF1= 10
##$ABSF2= 0
##$ABSG= 5
##$ABSL= 3
##$ALPHA= 0
##$AQORDER= 0
##$ASSFAC= 0
##$ASSFACI= 0
##$ASSFACX= 0
##$ASSWID= 0
##$AUNMP= <proc_1d>
##$AZFE= 0.1
##$AZFW= 0.1
##$BCFW= 1
##$BC_mod= 2
##$BYTORDP= 1
##$COROFFS= 0
##$CY= 11.3945322036743
##$DATMOD= 1
##$DC= 2
##$DFILT= <>
##$DTYPP= 0
##$F1P= 16.9975609425685
##$F2P= -3.02152046262296
##$FCOR= 0.5
##$FTSIZE= 0
##$FT_mod= 4
##$GAMMA= 1
##$GB= 0.15
##$INTBC= 1
##$INTSCL= 1
##$ISEN= 128
##$LB= 0.24
##$LEV0= 0
##$LPBIN= 0
##$MAXI= 10000
##$MC2= 0
##$MEAN= 0
##$ME_mod= 0
##$MI= 1.114404
##$NCOEF= 0
##$NC_proc= 0
##$NLEV= 6
##$NOISF1= 3.799351
##$NOISF2= 2.8
##$NSP= 1
##$NTH_PI= 0
##$NZP= 0
##$OFFSET= 15.70392
##$PC= 1
##$PHC0= -9452.16
##$PHC1= 14.80088
##$PH_mod= 1
##$PKNL= yes
##$PPARMOD= 0
##$PSCAL= 0
##$PSIGN= 0
##$REVERSE= no
##$SF= 200.130013532006
##$SI= 16384
##$SIGF1= 3
##$SIGF2= 2
##$SINO= 400
##$SIOLD= 16384
##$SREGLST= <1H.CDCl3>
##$SSB= 0
##$STSI= 0
##$STSR= 0
##$SW_p= 3612.71676300578
##$SYMM= 0
##$S_DEV= 0
##$TDeff= 0
##$TDoff= 0
##$TI= <>
##$TILT= no
##$TM1= 0
##$TM2= 0
##$TOPLEV= 0
##$USERP1= <user>
##$USERP2= <user>
##$USERP3= <user>
##$USERP4= <user>
##$USERP5= <user>
##$WDW= 1
##$XDIM= 8192
##$YMAX_p= 0
##$YMIN_p= 0
$$ End of Bruker specific parameters
$$ ---------------------------------
##NTUPLES= NMR FID
##VAR_NAME=  TIME,          FID/REAL,        FID/IMAG
##SYMBOL=    X,             R,               I
##VAR_TYPE=  INDEPENDENT,   DEPENDENT,       DEPENDENT
##VAR_FORM=  AFFN,          ASDF,            ASDF
##VAR_DIM=   8192,          8192,            8192
##UNITS=     SECONDS,       ARBITRARY UNITS, ARBITRARY UNITS
##FACTOR=    0.0002076,     1,               1
##FIRST=     0,             0,               0
##LAST=      1.7004516,     0,               0
##MIN=       0,             -300091,         0
##MAX=       1.7004516,     350231,          0
$$ Real data points
##PAGE= N=1
##DATA TABLE= (X++(R..R)), XYDATA
0 0 0 0 0 0 0 0 0 0 0 0 0 0 0 0 0 0 0 0 0 0 0 1 -7 23 -33 46 -54 64 -67 69 -77 93 -102 116 -126 148 -158 176
38 176 -201 217 -243 274 -301 333 -366 409 -447 499 -548 608 -680 756 -839 944 -1061 1183
56 1183 -1308 1374 -1130 -889 40628 304660 90937 -300091 -92414 193776 -14921 -243777
68 -243777 -9297 167449 -74307 -237754 -9466 133956 -47708 -159654 -17061 55305
78 55305 -42363 -70809 4803 3700 -52791 -38510 6709 4595 -9693 -8501 -2759 21091 42275
91 42275 16197 -13123 15389 51473 33845 5521 3267 -2917 -3162 22533 22405 -26470 -34953 15004
105 15004 17630 -26906 -3847 39743 -18840 -75844 16200 95552 -8992 -100196 -1477 62353
117 62353 -42289 -72468 48726 42373 -103067 -77683 81756 48449 -102092 -54166 87205
128 87205 27675 -88035 -1379 100306 -13215 -105276 17742 93192 -39118 -108757 12491
139 12491 54331 -65960 -92555 11049 14339 -80141 -65430 24819 2298 -84847 -70621 2319
151 2319 -972 -54283 -59151 -36426 -44609 -55620 -41383 -40487 -62514 -70495 -49882 -36914 -37226 -40264
165 -40264 -47787 -50983 -40395 -17774 -7659 -25972 -55934 -49315 -7481 -570 -43766 -50930 -8908
178 -8908 -8918 -53747 -37974 22305 -1845 -73317 -35847 59458 31289 -68653 -33972 72960 42124
191 42124 -59581 -15921 82927 30387 -61478 7166 99275 23515 -64358 17160 112157 43762
203 43762 -33060 31796 96369 35599 -6515 64751 92878 13891 -13129 65908 87728 10108
215 10108 -12863 49135 56211 7714 13466 55501 36208 -7309 19505 62537 39053 802
227 802 21399 46105 20822 2424 30154 35761 -5427 -8226 35213 32751 -15147 -14202 29893
240 29893 27629 -12971 -6467 32325 20704 -20744 -4634 37775 14633 -37959 -19558 30742
252 30742 5516 -49185 -27751 16915 -14124 -58883 -26032 20458 -21080 -69356 -28109 22311
264 22311 -21741 -72849 -28624 15465 -34315 -75159 -23594 10891 -46448 -77138 -18297 8840
276 8840 -44918 -65496 -10166 6849 -40703 -49004 187 6492 -39050 -35503 9499 13 -40674
289 -40674 -25151 11714 -6803 -38482 -12697 12324 -14779 -32192 1007 15981 -17988 -27752
301 -27752 11527 19194 -18668 -19910 19043 14196 -26930 -15737 30096 12516 -32294 -9592 35235
314 35235 11753 -29251 2245 44709 13282 -25381 10586 51902 18025 -20229 16518 56126
326 56126 16661 -17506 24620 57136 13836 -14137 28850 53987 13786 -8356 32692 50372
338 50372 9792 -6610 35781 49334 5388 -6238 36351 43657 885 -2464 37762 34989 -3805
351 -3805 2014 36156 24976 -6259 6040 32517 16087 -8080 10052 31203 10401 -8892
363 -8892 13738 27638 -684 -9363 21457 24176 -12389 -11582 21882 18849 -17621 -12603 19734
376 19734 8303 -26288 -12385 22045 2495 -34934 -16002 19668 -2476 -38615 -12193 18877
388 18877 -13481 -44615 -10350 16852 -20833 -47936 -10728 11105 -26427 -47021 -8681 9611
400 9611 -29228 -46605 -5074 9925 -30919 -40435 -718 5239 -33309 -34243 3011 910 -33530
413 -33530 -31190 571 -5092 -32010 -23454 4655 -7424 -33075 -17256 9113 -7041 -28989 -9473
426 -9473 11309 -11527 -26271 -432 9875 -16499 -24979 2866 7503 -19136 -17903 11147 8994
439 8994 -19940 -11380 21518 12921 -16147 -1520 29132 10859 -17146 7811 34963 8976 -16397
452 -16397 10633 35343 8168 -11105 17002 36446 8973 -7608 26576 42483 10082 -3755
464 -3755 28145 38868 8917 -382 28907 32218 1164 -1504 27361 26875 -3019 -2990 28100 29109
478 29109 -900 1155 30287 28133 870 7546 33493 21818 -2383 11766 33683 16922 -5818
491 -5818 9853 29896 11700 -4412 16049 27416 4712 -3750 25351 32162 -1258 -6573 25648
504 25648 25059 -7900 -6017 19612 7337 -21956 -7080 19193 -2831 -34048 -12274 14635 -8833
517 -8833 -31787 -6617 11260 -19446 -32872 231 7999 -28669 -37336 -3103 2176 -31666 -35827
530 -35827 -7525 -5810 -29672 -26728 -3173 -4954 -27731 -22210 3043 1453 -21972 -19794 -1174
543 -1174 -681 -17945 -19591 -6898 -11251 -25787 -21561 -4535 -9675 -29270 -26227 -2994 -4911 -22324
557 -22324 -17580 277 -9919 -23001 -5450 7320 -16197 -31207 -5364 8633 -15157 -24797
569 -24797 1018 6272 -17951 -11243 23199 16787 -15671 -1225 39481 26311 -7867 11472 40661
582 40661 18816 -2529 24062 41639 7461 -7370 25448 41655 10909 -849 26595 32616
594 32616 10852 14543 35021 21880 -685 17627 37829 17573 -4226 8393 21349 4756
606 4756 -369 14793 16357 -2794 -2470 18031 23420 4041 -3496 12274 22936 11618 2448 9502
620 9502 9366 -707 -2498 9339 10143 -8338 -17016 -880 15166 -3101 -19348 -2461 12329
633 12329 -3946 -13583 6308 7172 -20268 -22198 7956 6588 -27817 -31111 -3905 -7814 -32847
646 -32847 -23517 -106 -20753 -41827 -9988 15481 -18884 -44852 -7914 18030 -17007 -35026
658 -35026 1297 9524 -31505 -34383 8905 8371 -34116 -33586 8381 10947 -23930 -21476 8339 4282
672 4282 -17895 -5166 16915 3490 -19705 -7405 11091 3434 -10131 -6969 -1028 45 -1602
685 -1602 303 1699 -1811 1757 8505 12403 10082 6308 7244 8189 11692 11605 9445 6466 4409 6143
701 6143 8977 10727 3335 -1090 7143 16155 9332 4081 10970 11559 1418 5908 19832 12963 -7762
716 -7762 -3841 15801 8065 -10498 -4873 8801 -158 -10672 5801 15106 -4518 -12877 13811
729 13811 22609 -2296 -2827 20075 13093 -10731 2906 24994 3067 -22476 632 24398 1324
742 1324 -21830 -73 15827 -5288 -14054 9752 14298 -14259 -18297 11075 8759 -19583 -19860
755 -19860 2283 -4687 -22630 -13685 -3042 -16847 -27082 -11849 1079 -11347 -20602 -12280 -3653
768 -3653 -8094 -12725 -5535 -5664 -12102 -11372 -3103 -4692 -13842 -16753 -8290 -1521 -6566 -12095 -8273 -772
784 -772 -5994 -12253 -4433 5392 -7411 -18940 -4928 6788 -12511 -27696 -10310 2283 -16448
797 -16448 -26880 -6582 7 -23907 -26225 2523 3219 -23434 -20354 9971 3424 -21588 -10889
810 -10889 12522 -2662 -21167 6 16189 -5552 -17474 6372 16623 -4128 -6965 16039
822 16039 18527 -1728 2976 23874 17509 -1578 8757 25514 13832 710 11521 20078 6460
835 6460 1771 14853 17234 5536 5339 15428 15185 7193 8281 15651 14985 10454 10699 14841 13808
850 13808 9490 8696 12586 15168 10993 8305 10736 15304 11575 7707 13968 19050 9469 5674 16082
865 16082 18152 3909 1364 14661 13651 -3195 -2329 13805 8619 -11316 -5725 11169 2887 -13285
879 -13285 -3816 10434 -5084 -17987 -1431 7881 -13142 -20777 781 2232 -20222 -18995 -303
892 -303 -5278 -24920 -17104 2043 -7479 -25024 -14317 2 -11396 -22639 -9373 -966 -15102
905 -15102 -21643 -7353 -4322 -19106 -20873 -6491 -6353 -17817 -17309 -8690 -9557 -17572 -15674 -7362 -9229
920 -9229 -16971 -14246 -6707 -5793 -13556 -13688 -6013 -5024 -9726 -9799 -3880 -3043 -10192 -7074 2217 2622 -7798
937 -7798 -4715 7367 5424 -5297 774 10600 4186 -3654 7350 16482 3547 -3564 10894 17405
951 17405 5787 1022 13819 15473 3989 3745 18427 15261 307 5083 21295 15338 1429
964 1429 8117 20833 11591 2060 13187 20678 8042 1430 14450 21587 10161 2611 13351 18342
978 18342 8303 5760 15380 15789 5388 6835 17313 15695 4592 5314 14547 11353 4076 5590
992 5590 11191 6688 -900 2633 10383 5088 -5417 -1123 8303 2927 -6171 -1237 5571 -2651 -8294
1007 -8294 -782 4819 -5679 -12173 -4385 2026 -7791 -15300 -5720 -1366 -12136 -13574 -3284 -3756
1021 -3756 -15823 -14511 -1408 -3277 -14569 -13501 -3240 -6704 -15322 -11410 -3631 -10462 -18430 -9488
1035 -9488 -1507 -10742 -18446 -8659 -2286 -10426 -13705 -3874 -1935 -12540 -12839 -1552 -1798 -12481 -13352
1050 -13352 -2305 -3182 -12773 -11185 -2077 -2003 -10561 -7849 2704 -112 -9007 -2710 7213 2833 -4849
1065 -4849 -85 6978 2654 -1872 3973 8605 2410 -2399 6563 11762 4257 -792 10074 13492 6643
1080 6643 3932 12667 13653 4992 5963 15346 13414 4271 4842 12802 11131 1477 4503 13059 9283 1158
1096 1158 6759 15009 9314 1723 9002 16417 8873 2215 10085 14214 6393 1598 8490 11554 2416
1111 2416 -298 9002 10371 1016 1274 11650 9695 496 3305 11923 7167 -2564 3420 10073 2355
1126 2355 -5932 -1093 5276 -1484 -8558 -3824 1611 -3812 -9803 -2812 2042 -4927 -8164 -1843 708
1141 708 -7168 -8829 -3771 -3059 -10286 -10819 -7073 -7461 -13718 -12803 -4233 -6108 -13559 -11311 -3118 -4089
1157 -4089 -11812 -10117 -2689 -4938 -12337 -9729 -2696 -8484 -15933 -10048 -3450 -8568 -15686 -9313 -1282
1172 -1282 -8054 -12850 -3799 530 -8468 -10035 109 2536 -8456 -9867 -49 1516 -8336 -7967 528
1187 528 -1631 -9044 -3488 6227 327 -7206 1649 9275 1704 -2742 5955 7764 -1144 -1727 8443
1202 8443 5878 -4083 -3773 6126 5907 -1380 -844 6565 4712 1350 5945 11416 7200 2824 7959 13705
1218 13705 9890 5703 8240 10004 9253 7162 8796 11043 9192 6405 9990 15463 13160 6431 8342
1233 8342 16337 14403 6687 9705 13257 8991 3259 6798 11043 1791 -5581 3196 9067 -1742 -7146
1248 -7146 2035 4982 -5782 -5624 6560 2807 -11183 -5264 7399 -154 -13819 -7260 3186 -5416
1262 -5416 -14029 -3970 2879 -8743 -13847 910 5546 -6719 -9033 2331 2250 -6521 -3376 3317
1276 3317 -3809 -10420 -3728 365 -8295 -13434 -7141 -5266 -10167 -10114 -6201 -8353 -13316 -10535 -5626
1291 -5626 -7226 -11248 -10140 -8324 -10138 -10212 -9826 -11426 -13092 -9496 -8336 -9305 -6777 -7491 -9387 -5678
1307 -5678 1528 -58 -5215 -1501 6209 2038 -3039 3642 8013 290 -2600 7811 10970 -740
1321 -740 -3151 8722 9425 575 4566 12725 6408 -1569 8252 15925 3749 -4084 8688 12166 374
1336 374 -1276 9582 7392 -4791 380 13248 7819 -4501 2472 14718 7326 -659 8735 15184
1350 15184 3254 725 12971 13779 1608 368 10284 9183 1967 3706 8687 4783 1882 5292
1364 5292 8796 4627 1985 4747 6304 3579 1735 1170 -538 54 -69 -897 -2558 -2646 -4149 -6713
1380 -6713 -2919 -640 -5800 -8173 -1593 421 -7582 -9705 -2474 -1820 -11610 -9776 295 -3211 -15225
1395 -15225 -12331 -275 -7042 -16397 -9977 405 -9035 -17259 -6187 -1050 -12341 -15053 -2284
1408 -2284 -2255 -14310 -12995 -2559 -5683 -15996 -10109 -1743 -8293 -15214 -6574 -89 -8681 -13121 -3587
1423 -3587 250 -6936 -7112 1674 -1399 -7576 -3261 2564 -1712 -5873 -38 2473 -1915 -4007 2714
1438 2714 3199 -982 1144 4662 4521 1662 2643 3333 3217 2859 4644 3980 2652 3470 3570 2999 4394
1455 4394 6678 4127 4885 8845 8765 4214 5956 10857 7879 4781 9736 13972 9067 5253 10200 13775
1471 13775 6645 4269 11559 13420 4380 3233 12176 12049 2519 4641 13936 9202 520 6122 12726
1486 12726 3688 -2422 6709 10727 351 -2647 4646 7220 -2213 -2774 5772 5122 -3200 -1478 5939
1501 5939 2398 -4304 -514 3887 -741 -3268 348 720 -3619 -5495 -205 165 -4453 -5031 -1880 -1744
1517 -1744 -4845 -4508 -3493 -4137 -6210 -5456 -3553 -5340 -7136 -8223 -6041 -5630 -7801 -9190 -7581 -5354
1533 -5354 -8441 -9587 -6957 -5678 -9243 -10642 -4462 -3934 -9547 -9372 -3242 -4850 -9339 -6893 -1066
1548 -1066 -3957 -9078 -5495 1236 -2721 -8749 -2720 2779 -2451 -5344 5 1202 -4119 -5042 3768
1563 3768 4372 -4286 -4451 4326 4131 -2888 -1364 4925 3975 -2640 730 8153 2750 -2351 2082 8318
1579 8318 5200 1747 4754 7953 4483 4439 8040 8577 5577 4811 8530 9008 6078 6231 8043 7958 5546
1596 5546 7075 9500 8153 5565 6209 9620 8677 5268 6522 8775 8046 5571 5321 6700 5482 2335
1612 2335 4499 7472 3720 616 2122 6311 3705 -47 2960 3979 1102 -773 2828 4081 -1238
1627 -1238 -2404 2115 3408 -707 -3301 94 -72 -3248 -2667 641 -1900 -6649 -3353 375 -2304
1642 -2304 -6302 -3744 -1458 -4366 -7389 -3405 -2668 -8456 -10507 -4867 -3298 -8739 -11306 -5715 -4187
1657 -4187 -8650 -9207 -5141 -6046 -9264 -8088 -3370 -4412 -9367 -8103 -4994 -4646 -7889 -7035 -3965 -5077
1673 -5077 -7088 -4232 -1558 -4452 -5962 -2441 -655 -2368 -3548 -1580 103 -826 -2160 707 925
1688 925 -1496 -2775 510 1565 -1853 -1436 2915 3055 -422 1734 4606 4204 214 2257 6786 5778
1704 5778 1346 2520 6939 5806 1956 3501 7660 5090 3198 6001 9345 6551 4593 8617 10527
1719 10527 6580 6703 8588 9981 6332 5593 10192 8670 5387 4333 9096 7222 3146 4760 8201
1734 8201 6000 3069 5562 6965 4810 3092 4917 5434 3069 483 2389 3123 516 -2125 615
1749 615 1899 -492 -2516 736 1579 -1486 -1940 1215 2094 -958 -1538 17 1188 -2881 -3226 -1369
1765 -1369 -1543 -4489 -4128 -1457 -3538 -5809 -4759 -1344 -4128 -6645 -4292 -1994 -4226 -6819 -4070
1780 -4070 -2757 -7498 -10429 -5640 -4769 -9076 -10773 -6643 -6603 -9134 -8814 -5511 -5283 -8025 -5699 -2584
1796 -2584 -4231 -6610 -4393 -2937 -5008 -5182 -4023 -2490 -5341 -5464 -1086 -536 -2944 -3671 -137 1664
1812 1664 250 608 2697 2060 754 1314 3120 1836 58 385 2674 2662 381 55 1183 2261 719
1829 719 1330 3695 3722 1534 2549 5435 5171 2160 2322 4702 5045 2369 2555 4565 3790 1299 4044
1846 4044 6926 5309 2479 6073 8810 4885 3683 8387 7435 3697 3449 7984 7288 553 1438 5977
1862 5977 4402 -609 1520 5982 1560 -564 2650 4547 301 -1733 2210 3443 -1095 -2366 568
1877 568 -479 -3438 -2851 -1022 -2322 -6014 -4391 -2187 -1989 -5276 -3766 -2968 -4340 -3797 -2202 -2862
1893 -2862 -5354 -5158 -3843 -4371 -5583 -5534 -5650 -5865 -5083 -3985 -4209 -4493 -4691 -5831 -4204 -2388 -4091
1910 -4091 -4857 -4841 -1562 -2380 -5192 -5033 -2611 -4593 -6689 -3852 -1595 -5310 -7013 -2353 53 -4024
1926 -4024 -4653 -453 -407 -3657 -2333 1384 -933 -4634 -1156 1371 -1487 -4491 -426 1338 -1313 -2881
1942 -2881 2823 1691 -2406 -342 5758 3664 -1099 1195 5601 3466 417 4591 7070 1896 1395
1957 1395 5013 7349 3167 1878 5540 6946 5303 4298 6393 6461 4827 6070 6455 5036 5139 4333
1973 4333 4246 4509 4118 3935 2785 3373 4383 2756 1668 3784 3698 1482 2887 5309 3267 450 1338
1990 1338 3739 864 -1124 752 3858 -833 -1621 2690 2291 -1485 -1572 3013 3068 -1918 523 3978
2006 3978 424 -2502 774 2407 -1961 -3767 86 457 -4434 -4793 -1147 -1881 -6136 -4282 -976 -4211
2022 -4211 -7291 -3925 -2769 -6550 -7650 -3234 -4004 -7703 -8002 -3747 -5972 -9068 -6545 -3212 -6316
2037 -6316 -8585 -5663 -3297 -5515 -7045 -3880 -3238 -4980 -5450 -2688 -3515 -4794 -4041 -2167 -3008 -2507
2053 -2507 -2094 -2942 -2208 -908 -2184 -1855 -555 972 -1217 -1462 -133 989 -1177 -1330 2669 2369 -905
2070 -905 -1079 3400 2150 -1427 1418 5203 1443 -161 4088 6512 1965 1502 5538 7337 3001 4962
2086 4962 8011 6624 1975 4020 9345 5779 3488 5502 8135 5498 3148 6854 6948 3645 3071 8649
2102 8649 6592 3234 3811 5806 5311 2416 4434 5260 3420 1944 4762 4704 1808 1766 2323 4039 1699
2119 1699 1746 2712 1692 -282 1711 2581 499 349 619 536 191 -800 -819 -1870 -732 -1234 -2178 -1917 -1572
2138 -1572 -2657 -4726 -2950 -1209 -2881 -5503 -3968 -826 -4399 -6644 -3346 -2567 -5150 -6431 -2773
2153 -2773 -2823 -6192 -7067 -2881 -2428 -6865 -4861 -2111 -3836 -6345 -3577 -2139 -5150 -5778 -2428 -1014
2169 -1014 -4278 -4777 -1354 -2112 -4650 -2968 -128 -2204 -4874 -2661 -711 -2653 -2317 -694 283 -2103
2185 -2103 -1840 633 -538 -1465 -1311 -90 708 -692 224 1140 308 -57 1052 1567 559 1428 2447
2202 2447 2417 3319 2461 3207 3017 3512 4058 2664 3034 3047 3173 3212 4982 4147 2727 3746 6105 5074 3815
2221 3815 3081 5586 5378 3508 3964 6058 3683 2856 4261 6518 4611 2431 3873 5743 2448 1918
2237 1918 4391 4373 1622 1843 4398 3481 884 560 3445 2830 478 858 3246 524 -1649 1467 2178
2254 2178 -249 -2001 696 787 -1509 -1511 -746 -442 -2100 -1093 -776 -1397 -4326 -2618 -2351 -3040 -4481 -3948
2272 -3948 -2440 -3941 -5222 -3925 -2971 -4434 -5161 -4429 -3464 -3093 -5164 -4610 -4590 -4783 -4949 -4221 -4406 -4674
2290 -4674 -5780 -4531 -4020 -4939 -6063 -3766 -3583 -3538 -5052 -2547 -1263 -3430 -3600 -2467 -680 -4076
2306 -4076 -4068 -1081 -749 -3190 -3214 -203 -354 -2364 -466 946 -18 -1937 1013 2608 833 -1061 1481
2323 1481 2463 649 -226 3082 3025 437 1170 3085 2733 1118 3010 3877 3635 2679 3179 4277 2443
2340 2443 3479 3079 4620 3628 3584 4268 3800 3340 2673 4433 3719 3166 4332 4017 3871 4976 3243 3075
2358 3075 3334 2948 2820 3622 2735 2053 1819 2668 2145 1833 438 2330 1971 -345 50 2459 1331 102
2376 102 -426 665 217 -1908 -1980 83 -710 -2426 -1866 -401 -2465 -3022 -2381 -1141 -2288 -3127 -923
2393 -923 -1074 -2419 -1767 -957 -576 -2981 -2308 -1266 -2048 -3470 -2956 -1425 -3121 -3957 -2483 -1608 -2380 -2318
2411 -2318 -2194 -1027 -2000 -2322 -1682 -2107 -1219 -2263 -1316 -1313 -4001 -3006 -887 -2202 -2973 -3485 -2539 -1099
2429 -1099 -2334 -2294 -1279 -753 -1891 -1411 -245 -510 -1630 -1569 103 819 -223 -1203 861 600 -408
2446 -408 134 2033 475 262 1773 3232 1875 1624 3034 4179 2412 1467 3503 3691 1480 1771 4061
2463 4061 3862 1127 2250 3989 2829 1931 3484 4515 3044 2658 2735 3382 3345 925 1869 3841 1725
2480 1725 1899 2360 2427 1470 1131 2634 2761 1501 1969 3543 2780 2087 2280 2487 2129 2109 2823 2101 1003
2499 1003 490 1177 844 1076 417 70 -25 -35 -382 123 242 -1442 -1076 -1731 -109 -1179 -2570 -2887 -1561
2518 -1561 -2547 -2969 -3978 -3397 -3943 -5028 -3148 -3108 -3910 -5366 -3019 -2985 -4266 -5281 -2894 -3501 -4141 -3919
2536 -3919 -3136 -2656 -5701 -3052 -1832 -3088 -4871 -1204 -1344 -3064 -2930 35 -681 -3423 -3057 -1429
2552 -1429 -232 -2494 -1627 -1477 -625 -2446 -930 -103 -1105 -668 -492 538 -16 -902 -193 250 702 682
2570 682 1254 648 1213 1070 1899 1627 1446 1365 1829 2036 2352 2959 2203 3671 2786 3455 3535 3851 3968 2897
2590 2897 3768 4828 4588 2558 4149 5084 3487 2471 3988 4050 1716 2360 5191 3925 2459 2116 4244
2607 4244 3950 3013 1842 3165 2523 787 1802 3495 1178 60 3109 2576 -252 -424 2922 1000
2623 1000 -535 -101 1488 -431 -1248 693 565 -936 -1851 -569 -7 -1758 -2502 -122 -633 -2395 -2285
2640 -2285 -518 -1257 -2268 -2095 -2216 -2394 -2302 -2484 -2253 -2903 -2129 -2806 -3124 -3133 -2610 -3278 -3637 -3503 -2896 -2611
2660 -2611 -3372 -1566 -2733 -3224 -2930 -1783 -2569 -3824 -2585 -1645 -3165 -3380 -1742 -2265 -3741 -3012 -2018
2677 -2018 -1514 -3900 -1245 -809 -1419 -2093 -702 -266 -1295 -1920 186 498 -770 -650 1404 434 -1870
2694 -1870 455 953 2817 1343 3169 2859 679 1273 3454 2756 1633 2126 3396 2468 882 2164
2710 2164 3838 2610 1789 2625 5028 3893 2522 2777 4305 2932 2804 3536 3816 3817 3106 2400 2580 3861
2728 3861 3063 2604 2612 3407 3143 2577 2891 2508 2456 2722 2318 2808 1026 1382 2841 2652 2376 183 2632
2747 2632 2248 281 660 1298 155 -200 376 455 -171 -1821 -279 31 -680 -1756 -777 -959 -2473 -892
2765 -892 -1172 -2206 -4290 -1998 -353 -2416 -2794 -2146 -939 -3093 -2850 -1929 -899 -4204 -2490 -865
2781 -865 -3328 -4551 -2899 -1139 -2359 -2825 -1870 -1303 -2920 -3567 -1191 -1107 -3881 -2526 -1153 -1195 -3031
2798 -3031 -2626 -1787 -1942 -2646 -1660 -1421 -1483 -1612 -1101 -658 -1565 -773 -922 210 -341 -303 174 -940 -109 955
2818 955 540 210 1205 196 -190 936 2206 768 297 1894 2032 281 22 1990 1850 409 1519
2835 1519 3071 1422 991 2289 2128 519 868 1938 2676 1660 1633 2174 1853 990 1138 2624 1638 969
2853 969 1521 2977 1859 1221 2069 2727 960 1043 1963 1347 1532 294 2384 2111 609 1321 1227 2224 201
2872 201 915 527 52 542 47 804 -1699 -465 -383 -396 -682 -549 -860 -867 -973 -892 -1708 -1173 -1349 -1916 -731
2893 -731 -799 -675 -2088 -2262 -1412 -1523 -1960 -1621 -574 -1548 -2805 -2303 -559 -2725 -3077 -1260 -2647 -2721
2911 -2721 -2530 -2388 -1962 -2943 -2864 -1929 -2504 -3231 -2074 -1052 -3007 -3463 -1959 -221 -1959 -3775 -2222
2928 -2222 -1771 -1415 -1727 -681 -1192 -2008 -473 -1340 -1354 -1548 -1432 309 10 -436 22 377 1321 -214 152
2947 152 539 220 785 922 1831 1626 1101 1373 1454 752 1493 1972 2550 1457 1779 1894 2821 2591 1837 1854
2967 1854 2426 2285 2011 2456 2328 2262 1981 3046 3427 1896 1432 2942 2935 2037 1639 2247 2942 1372 1735
2986 1735 2404 1586 1262 1520 2111 1987 1059 833 1442 1696 688 1535 1907 -306 -25 517 1471 -316 -1009
3005 -1009 274 382 -623 -503 -664 -840 -1233 -1178 -205 -1115 -1515 -2014 -1124 -2259 -2140 -1661 -1446 -2288 -4064
3024 -4064 -2237 -2372 -1401 -2525 -1512 -1853 -2955 -3055 -2928 -2135 -1636 -2022 -2560 -2068 -2096 -1248 -1923 -1792 -1849
3043 -1849 -1103 -1592 -1489 -1591 -1061 -218 -888 -1654 -1151 -193 -389 -1422 -157 903 -554 -986 -586 38
3061 38 -282 -807 468 -557 -506 515 1101 1307 565 776 1528 1020 504 1181 2888 1736 980 1067 2507
3080 2507 2506 1417 2909 2124 2349 2251 2265 2682 2308 2473 2988 2862 1756 2130 2731 2577 2445 2295 2689 1640
3100 1640 1441 2481 2357 3091 1676 2086 1530 1366 1014 1135 1008 1575 406 538 452 570 170 -346 198
3119 198 226 572 -108 170 -44 266 581 -491 -1019 -781 -950 842 -425 -1613 -869 -50 -961 -1609 -565
3138 -565 -803 -2241 -1169 -699 -861 -2042 -1854 -1023 -872 -2406 -2013 -279 -2425 -2673 -2297 -797 -2770
3155 -2770 -2120 -1890 -2240 -2048 -2387 -1912 -2212 -2505 -2993 -2183 -2577 -2004 -2618 -2747 -1705 -2187 -1451 -1982 -2335
3174 -2335 -1778 -1083 -776 -2080 -1568 -277 -1043 -656 -725 -795 -437 32 -438 -113 853 574 617 591 1125 1044 813
3195 813 757 -196 1038 731 2096 707 1364 99 1096 2235 831 882 1180 1776 421 91 1488 1165
3213 1165 1692 1675 2612 1202 1574 2068 1856 1800 1213 1936 1607 2075 1975 2719 2874 2232 2428 1959 1752 1910
3233 1910 2233 1294 2149 1324 1153 1778 1648 749 1511 1863 969 858 1789 119 171 926 409 638 697 786
3253 786 384 -413 -236 -237 -1201 -1311 -518 -1232 -1462 -1625 59 -946 -1475 -992 -656 -488 -1441 -2190 -713 -1118
3273 -1118 -1894 -1148 -2402 -1348 -1442 -1364 -1380 -1346 -1434 -1600 -1356 -1971 -1679 -2279 -2151 -2153 -2041 -2381 -874 -1365 -1348
3294 -1348 -1569 -2444 -1252 -1520 -1889 -1291 -1106 -982 -2356 -1195 -623 -570 -877 -102 218 -1474 -924 -541 21
3313 21 -805 87 590 502 68 351 873 302 -58 726 1224 684 234 1970 935 2047 1224 1591 696 368
3333 368 1213 1264 1311 1214 1982 2473 844 3029 2632 1171 1882 1352 1918 1232 2141 2292 2164 2242 1890 1705
3353 1705 2214 1903 1945 1887 1859 1962 2031 1136 1357 1911 1236 -11 951 1592 947 439 921 985 464 41 182
3374 182 63 -398 -53 -200 844 -43 105 -232 773 -801 -732 -186 -964 -795 -1476 -606 -1001 -1969 -1026
3393 -1026 -1089 -1253 -645 -1527 -2120 -837 -1224 -1097 -1190 -1660 -915 -1487 -2068 -1656 -595 -2461 -2354 -2169 -1772
3412 -1772 -1576 -1279 -1351 -1699 -2133 -203 -847 -1753 -1248 -976 -689 -1168 -1215 -446 -1116 -1239 -961 35 -882 -984
3432 -984 -694 -469 -449 -149 159 440 -507 195 769 -200 -657 891 1278 390 357 1707 1544 751 1330 1908
3452 1908 2003 1046 879 1479 1923 1018 1286 1670 1624 1216 1720 1942 623 1428 2142 1200 1239 1484 1920 1612
3472 1612 966 1151 270 1399 850 691 988 1295 1721 893 421 1002 139 257 1317 288 -27 517 119
3491 119 -204 655 559 -287 1208 403 -151 1017 589 223 -707 302 -906 -863 -545 -622 378 -1695 -897
3510 -897 -1078 -1261 -1197 -959 -517 -1480 -1693 -971 -928 -2117 -1285 -625 -1536 -1039 -1604 -1007 -1069 -1856 -2107 -852
3530 -852 -1893 -2254 -1638 -1565 -2175 -1165 -1317 -1235 -1236 -2041 -236 -555 -1848 -1716 -479 -1269 -1475 -1029 -350 -757
3550 -757 -1635 -1040 -750 -852 -322 -615 80 152 -760 230 667 -1036 -910 -231 615 -57 -55 754 59 -99 -182
3571 -182 216 709 668 937 1074 193 1820 894 562 1803 1378 818 335 1872 1240 1438 682 1169 1512
3590 1512 1435 1722 1525 652 1279 833 968 754 894 2010 2163 374 1753 1131 1900 784 797 1495 425
3609 425 702 2141 1263 620 641 677 810 424 904 1171 334 232 438 647 -43 381 923 -261 114 596
3629 596 -151 -86 -145 -103 -803 -797 92 195 -778 -290 -1161 -1670 -715 -1278 -1100 -1257 -1706 -1436 -1590 -1195 -1284 -597
3651 -597 -1228 -2624 -1619 -1952 -1612 -1936 -590 -1377 -1813 -2154 -1611 -1254 -1481 -668 -736 -1751 -1499 -574 -521
3670 -521 -1563 -1742 -1080 -1455 -652 -570 -86 -1307 -751 -349 39 360 -448 195 -490 -29 -424 853 -37
3689 -37 -223 231 1265 388 220 332 36 536 1302 992 616 430 710 437 834 949 1099 1108 1686 1417 2081
3710 2081 676 849 1607 753 1258 1781 940 1099 2005 1564 1606 1641 1572 1319 2089 1510 1675 1466 1442 695 965
3731 965 1387 454 527 1732 1139 1535 666 -274 325 1170 133 284 579 379 202 239 414 -226 -77 436
3751 436 -155 -529 -839 -350 -94 -458 -1381 -732 -910 -405 -413 -362 -794 -1585 -664 -257 -834 -2229 -1267 -1045 -1343
3772 -1343 -821 -633 -1962 -1166 -1146 -597 -1017 -1412 -1257 -2012 -1526 -825 -1536 -491 -1337 -1362 -1708 -1362 -2072 -1592
3792 -1592 -1220 -468 -843 -1234 -561 -301 -278 -1333 -833 -500 -1322 -1591 -285 -190 -1027 -407 -545 -361 187 -985
3812 -985 -257 -541 -86 -222 407 301 -518 -129 626 -77 735 899 139 632 1232 1044 942 1171 1515 1094
3832 1094 1496 1556 1123 2083 624 1170 874 635 1025 1125 995 1056 933 1155 182 723 -1 986 738 1445
3852 1445 1129 1269 902 1538 1057 958 262 857 373 1221 846 855 672 277 -3 188 112 912 651 355 -3
3873 -3 364 -120 188 -542 -1266 1010 -490 197 243 -212 -917 -707 -732 153 -869 -553 -1645 -1055 -754 -1284
3893 -1284 -1084 -1064 -852 -1337 -585 -1121 -1542 -1483 -1216 -1347 -1171 -1880 -1064 -466 -594 -1447 -391 -1673 -1606 -790
3913 -790 -1010 -765 -895 -799 -944 -766 -1824 -479 -747 -1175 -1047 -944 -1117 -1287 -360 400 59 -1235 -12
3932 -12 -818 -345 -220 349 -291 653 -423 410 303 971 169 -316 754 342 391 1127 508 -18 321 4
3952 4 870 1003 1244 115 999 791 268 67 1225 1122 931 914 488 625 -151 1404 780 473 333 1334
3972 1334 1291 536 1259 1022 491 1059 1768 1022 868 485 1366 1001 354 346 766 620 -11 1047 331 417 -213
3993 -213 -367 746 341 -630 -16 176 528 332 90 -891 -235 140 -1290 -44 118 -423 54 -826 -523
4012 -523 -1484 -1066 -827 -793 -722 -966 -1404 -1245 -1232 -566 -581 -964 -682 -1242 -1168 -876 354 -1814 -1049 -1010 -1471
4033 -1471 -34 -535 -1434 -1587 -639 -1204 -1623 -1196 -376 53 -1235 -731 377 84 -679 -1202 -1122 -669 -935
4052 -935 -128 -132 -1000 -1045 874 -70 -902 415 582 -1124 -845 -217 -471 464 -153 1159 1323 1212 199
4071 199 272 -151 -409 -208 884 -224 826 1384 417 666 1031 1169 10 997 816 822 1351 269 1012
4090 1012 832 1495 1644 1590 1725 661 1450 1093 583 976 510 559 647 343 911 1396 1123 643 926 312
4110 312 150 862 117 891 492 1015 567 58 367 257 -396 -227 61 -275 -827 -844 833 -517 -583 55
4130 55 296 -87 -587 -711 -157 -630 -725 -886 -703 -1400 -1232 -535 -1200 -792 -913 -995 -1831 -682 -1057 -772 -1326
4151 -1326 -1095 -426 -902 -181 -1499 -1370 -1928 -691 -1025 -502 -1457 -1025 -83 -561 -442 -793 -894 652 -63
4170 -63 -51 -605 -490 -562 22 -251 -911 -545 -505 -256 -107 -63 5 0 400 632 300 -36 66 -315 467 1141 1127
4193 1127 151 -397 497 635 1178 174 352 944 749 1225 402 518 811 390 877 1395 293 582 1019
4212 1019 847 734 889 574 585 673 778 1218 651 1285 1187 995 1422 1400 1150 1441 1146 222 1041 1316 393
4233 393 194 629 875 824 634 315 294 282 1173 88 1187 720 246 -518 -697 409 -448 71 942 445
4253 445 -917 -91 -541 -687 -772 -564 -494 -781 -54 -794 -896 160 -25 -579 -582 -1188 -420 -683 -1311 -358 38
4274 38 -697 -269 -1342 -433 -1062 -1735 -883 -694 240 -1370 -242 -218 -576 -1609 -884 -158 -929 -786 -219
4293 -219 -182 -1370 -1565 -790 -1391 -317 -864 -854 -442 -732 -185 -402 514 -742 831 118 -507 663 613
4312 613 55 2 409 -279 -415 671 456 -152 85 865 197 -151 940 257 282 1172 946 523 738 1681
4332 1681 1427 421 769 661 950 228 1001 1271 1101 734 497 652 -73 586 524 1081 666 1010 780 975
4352 975 190 165 538 2 345 504 342 365 885 -244 307 79 -732 324 1198 1300 432 10 -248 -113
4372 -113 201 779 55 1040 207 815 -494 415 -212 -1019 -896 -328 -580 -1007 -760 -802 240 -764 -1193
4391 -1193 -1327 -1473 -224 -1042 -301 -600 -789 -910 -367 -317 -660 -613 -296 -157 -1159 -71 -798 -143 -1197
4410 -1197 -517 -839 -176 -369 -625 -305 -854 -610 -970 211 -684 -754 -536 -1217 -1186 -439 -1001 -1115 -311 -1069
4430 -1069 -134 176 -249 -551 276 -322 -66 -474 -367 -319 433 26 310 758 489 690 257 440 237 1002
4450 1002 412 552 333 -176 235 514 1014 1250 -551 99 198 323 308 1095 1066 354 830 368 920 942 872
4471 872 1497 919 572 502 97 792 119 668 371 132 411 490 1323 203 14 -78 899 692 217 222 398
4492 398 1192 650 -546 -281 398 7 58 -202 -4 160 -182 -670 -196 -573 -112 627 -531 370 540 -189
4512 -189 -325 223 170 -325 -1115 -593 423 -245 -286 133 -1134 -975 -1536 -550 -621 -1488 -543 -743 -698 -523 -143
4533 -143 -988 -1118 -578 -216 -77 -405 -829 -643 -415 -554 -304 -718 -326 -1505 -638 -223 -204 -594 -673 -482
4553 -482 88 538 -382 -477 -266 -48 -1208 568 156 -101 177 72 763 1078 561 1112 639 377 -140 358
4573 358 -117 344 1424 816 353 766 1431 279 223 33 981 654 -544 -361 -368 367 -492 477 1158 797
4593 797 736 534 991 615 953 106 -215 -254 588 338 552 1465 -721 675 158 873 -424 595 921
4612 921 422 -24 -351 -15 685 810 721 -96 -443 47 -135 206 -67 81 -268 -456 -750 101 143 -37 153
4633 153 178 225 -1118 -891 -615 357 170 -678 -617 -733 -693 -558 -338 -383 -485 -489 -113 -426 -1399 -686 -906 -635
4655 -635 -472 -632 -354 -358 -290 -524 -1008 -523 -456 349 -375 -184 -746 -458 168 92 -786 -479 -231 -216 28 126
4677 126 -381 -826 -481 27 993 676 -553 -225 356 -228 205 52 -285 -12 -542 78 116 673 1132 336
4697 336 482 741 -202 225 99 969 -177 507 108 -3 509 -117 797 194 935 232 927 329 950 728
4717 728 847 -34 601 608 -81 390 -80 -38 597 -743 490 -483 642 1523 422 1007 -225 679 1040
4736 1040 259 1396 106 -345 294 -94 -434 -560 -522 -54 -390 87 -385 453 -203 -765 509 -124 -750
4755 -750 -301 393 -310 -11 -1068 -133 -82 -127 -1433 -665 -695 -1282 -1058 -1026 -128 -682 -872 239 -488 -613
4775 -613 -661 407 -397 -567 -1793 -479 -11 -931 -166 -613 -275 -313 -245 -2 127 391 175 -565 -903 -198
4795 -198 -1109 504 -633 1100 139 65 -107 113 -937 185 -729 -705 231 -326 -241 -122 540 142 414
4814 414 127 -157 -1 291 266 505 39 -335 381 1254 468 117 395 633 1020 913 641 396 78 686
4834 686 103 -188 -241 318 1099 -34 901 1895 -123 146 750 732 546 71 869 46 559 246 512 542
4854 542 415 449 999 278 217 -77 156 -368 155 462 -131 498 -517 185 -208 354 -181 471 323 -1021
4874 -1021 600 -23 808 92 -371 97 79 350 60 -1054 -148 -1031 -192 -166 -745 -471 -225 309 -656 -739
4894 -739 -1224 202 -220 -299 -533 152 -844 -361 -656 248 -546 -928 116 -128 -78 -197 340 -22 110 -809
4914 -809 -429 -5 -584 72 35 -569 -229 -263 -276 517 -75 -649 81 -727 -603 -522 -303 -844 1348 14 -614
4935 -614 -1 -685 -97 -288 219 -463 939 829 166 -431 -365 -248 436 1063 667 -404 697 116 203 278
4955 278 544 7 1137 478 -231 1050 763 545 669 215 415 246 346 587 407 808 433 291 625
4974 625 598 458 -408 216 1034 417 192 1278 211 -55 -660 -63 601 -610 91 265 348 -318 698
4993 698 1121 297 -318 197 139 73 -300 812 471 -917 -142 -99 -221 310 411 -684 -317 -96 -211 -422
5013 -422 204 -769 520 65 -713 -82 -66 -211 -484 -30 -836 -677 -233 -509 -360 -752 -1071 -269 -331 -384 116
5034 116 651 -1014 -339 163 -943 -624 -16 956 141 -833 -534 -271 -449 -70 159 327 -483 655 -122
5053 -122 -222 -279 754 67 608 -649 305 309 402 130 229 13 1373 1312 -88 511 171 1145 54 529
5073 529 475 -571 818 485 9 -182 539 -338 344 -45 75 1467 -306 653 408 46 625 407 0
5092 0 484 233 -1009 -97 244 406 -373 481 920 -43 538 -274 -421 393 102 67 330 82 757 221 583
5113 583 458 -349 361 -340 561 239 893 265 199 252 -72 303 43 -18 -737 -324 2 -847 -524 501 -132
5134 -132 -323 1085 -810 -791 -55 310 -609 -294 -671 -864 158 48 -89 -69 20 -500 63 -1004 14
5153 14 -932 -679 164 -221 -328 -238 401 -17 -251 57 172 -897 -490 -477 -389 -415 -375 -277 -283 -784 70 -399 862
5176 862 985 -300 -20 -241 665 -20 718 769 313 -21 145 -340 326 398 713 833 -486 449 -166 188
5196 188 281 492 795 406 225 685 392 441 1619 191 153 127 -352 937 620 797 259 89 -152 317
5216 317 -16 745 451 -1 -287 352 523 3 158 208 1063 963 265 89 509 -473 447 60 -360 931
5236 931 -493 309 437 -729 457 -795 581 23 377 228 -172 -345 -145 492 -75 -1037 -396 6
5254 6 -685 -600 -75 -363 -421 346 186 -135 252 -218 -276 -757 91 -1533 -153 -233 -72 -129 76 -48 100 -23
5276 -23 -858 114 267 -74 -357 512 360 -303 -248 -1577 -614 -56 -529 -164 -1263 -248 14 354 936 -321
5296 -321 -700 643 -584 -632 1074 -94 -129 604 351 -530 935 636 834 1171 483 189 860 777 -259
5315 -259 592 172 526 232 690 1068 -126 -21 674 476 53 213 168 441 -90 -56 -711 405 984 253
5335 253 464 276 64 377 72 -218 633 -648 -348 719 -453 -73 324 -181 359 439 666 -126 -333
5354 -333 808 -739 -9 -113 -755 763 184 307 1028 598 475 -563 945 506 -511 -200 -443 395
5372 395 593 -76 539 189 125 74 -233 338 320 183 -316 -268 -676 26 -397 -293 191 -692 -368 358 -698
5393 -698 -698 466 -144 471 -314 423 -427 -568 -183 -494 463 -603 -762 502 579 -365 299 -814 91 -695
5413 -695 630 -407 -90 -1120 173 256 -180 -258 -146 -191 -332 450 -545 114 406 1030 230 1193 -212
5432 -212 -647 -130 382 49 396 17 -78 -54 -185 -454 -639 48 41 734 567 -349 -384 550 491 -283 -33 1443
5454 1443 446 115 -1056 -85 85 786 -365 918 -181 155 104 73 496 178 421 202 679 1 488
5473 488 -93 8 -172 426 638 -196 541 -176 195 71 259 53 78 -716 157 -168 505 46 -280 -495
5493 -495 -886 -628 -219 -67 -109 56 -375 179 -292 -101 -607 -95 173 -142 -1099 209 -259 35 -17 -993
5513 -993 -659 -887 -308 -320 151 -1207 -406 -22 144 -2 -825 -590 1 -644 -404 556 -639 -518 42 -54
5533 -54 123 -361 -573 727 -156 -269 -86 672 -50 128 309 -540 105 310 234 -386 -44 -716 544 -285
5553 -285 145 463 396 621 877 817 -260 -80 308 522 -182 189 79 102 772 928 319 99 -12 8 586
5574 586 606 -533 -833 751 414 -65 -579 -591 -458 522 -82 -1064 0 -391 -270 -599 382 153 295 -248
5594 -248 87 877 -202 -198 99 1181 -63 583 14 709 304 486 244 26 384 47 -492 -273 -163 -893
5614 -893 205 186 -256 -466 -102 353 -404 319 -565 -32 -553 -105 -331 -161 213 -350 -629 253 -212 221
5634 221 -217 -99 377 7 1085 -250 722 88 71 -341 -602 -143 -410 743 -168 -642 246 -1132 -294
5653 -294 50 79 -113 83 -210 44 -674 1026 205 370 489 434 -75 225 -392 210 209 -49 -652 151 -628
5674 -628 -503 -55 -763 394 378 -63 -14 162 -644 -280 -249 655 310 -75 -150 -469 42 -290 28 -330 194
5695 194 577 -764 1099 -589 -609 -174 -81 383 645 928 -262 279 -296 901 176 -9 314 261 40
5714 40 -279 -581 -628 6 472 70 -175 -180 56 278 24 88 661 34 -227 -176 -758 -711 -105 694 349 -163
5736 -163 326 135 -310 -13 647 690 275 -312 179 -180 -16 223 181 288 165 827 519 -168 517 -91 366
5757 366 654 668 -549 -1121 353 -292 -62 29 49 340 -814 -479 -178 -728 -1085 140 -553 -97 -336 -777
5777 -777 220 -944 -651 -328 -754 -937 -992 619 427 63 -994 -322 -385 131 238 -247 -313 -259 830 -393
5797 -393 -711 -287 -71 325 -71 -380 -402 -89 -335 71 -73 545 833 281 351 -92 672 230 -302 1146
5817 1146 187 -158 830 269 -336 -128 417 -291 299 -222 -789 353 312 169 436 1056 -398 -26 828
5836 828 168 225 775 11 609 -166 522 -356 65 -596 -723 334 126 219 153 452 -139 246 169 -161 -234
5857 -234 -438 207 551 684 143 -453 -359 217 -108 179 506 -439 616 -251 -237 -413 -480 -290 -934 -306 -314
5878 -314 432 -240 -291 -885 -641 -256 -369 -120 -556 609 -132 -330 -95 -1234 497 -261 -431 -131 -284
5897 -284 938 505 -523 -222 354 -568 248 -2 -95 -216 474 -603 -55 -324 128 1029 -191 163 291
5916 291 58 -231 241 -27 -1291 325 114 -86 -89 828 -840 173 -48 -178 -351 568 188 -272 391
5935 391 668 174 59 355 -923 67 504 399 -47 108 21 429 912 -390 -527 93 -734 -186 496 -75
5955 -75 -135 -415 551 1000 -147 229 851 -205 229 -21 97 -326 -182 -717 -175 783 -167 -485 14 -167
5975 -167 -504 20 -123 -526 574 -17 287 542 249 -1182 -302 -263 552 857 1378 -597 -281 -409 -752
5994 -752 -241 142 -347 -139 260 -3 -410 -508 529 222 -718 -76 -451 210 -387 -574 516 529 -1038 631
6014 631 -617 51 325 -190 371 403 -523 -1150 -1053 970 -524 235 358 -20 -196 -495 -330 704 -1061
6033 -1061 194 103 -199 333 -252 -63 119 30 174 544 443 435 -801 -714 -250 -415 1039 458 743 155
6053 155 -82 -18 -543 -632 -309 400 434 -443 -459 733 115 930 270 104 -128 -213 89 -41 600 86 540
6074 540 -257 -296 -224 529 101 317 -557 1008 -11 -293 226 362 660 308 331 678 396 356 269 65 15
6095 15 611 352 446 502 -654 -227 293 28 13 866 -308 -97 5 620 -153 344 235 103 390 -155 -395
6116 -395 203 -542 -442 -175 79 516 597 -670 -683 -61 262 -49 -123 366 331 -331 -699 71 -3 -853 179
6137 179 10 -93 -689 -60 35 0 399 -713 -396 386 -188 -615 274 -666 -640 -501 -249 45 632 -16 -548
6158 -548 276 -244 -529 357 339 96 40 466 159 452 191 -168 574 -78 -624 576 -736 -591 -201 716
6178 716 252 -304 225 297 -49 4 745 -255 260 -84 -514 -293 33 -537 10 -104 -476 -164 430 442 -169
6199 -169 592 -48 -130 -621 -57 215 407 -275 158 60 231 151 42 -120 209 -126 -376 217 269 518 353
6220 353 -448 -318 -363 -323 -246 -352 114 -478 323 549 710 1061 1120 70 -460 -102 -507 353 -286 847 382
6241 382 -253 -324 -811 -422 -356 -184 157 812 -382 -109 -418 210 -515 -413 441 722 74 -673 60 -612
6261 -612 -192 -739 -265 -481 49 1056 286 -405 -502 -191 -415 -326 -207 -705 240 -661 42 -694 -474 -423 431
6282 431 301 -84 465 -375 -186 2 1093 -108 996 -255 -390 232 -1213 1031 -336 95 346 -741
6300 -741 -677 40 19 697 707 14 -894 -113 491 -524 -357 302 -16 -124 210 -10 1131 695 38 438
6320 438 -83 843 34 -209 -314 -466 -363 1034 132 392 473 394 1396 -577 485 408 85 -458 -110 -1019
6340 -1019 3 -605 428 54 -894 -99 359 -191 -320 -875 -129 846 -1228 -474 -289 111 -693 109 -5
6359 -5 77 -283 -455 -499 -214 809 -843 186 -39 -37 -366 -300 20 -997 -638 -472 -261 -578 112 -73 41
6380 41 -84 -116 -788 -207 -92 -470 110 -50 1119 -88 643 247 190 -194 450 270 -447 555 -14 -367
6400 -367 -648 399 54 534 461 339 206 -375 297 64 -256 112 259 610 398 -207 950 494 245 443
6420 443 443 779 22 258 405 613 -434 589 -117 891 -71 -88 145 230 -666 72 307 -924 250 21
6440 21 -308 1085 -443 212 629 667 600 239 728 448 368 201 535 -539 98 362 778 991 303 -44
6460 -44 -781 66 11 -21 -161 638 422 95 -363 190 8 -349 -732 716 -657 -507 -582 -618 -302 -4 -461
6481 -461 580 -42 -745 -523 249 44 -178 -366 -8 -339 610 -380 -585 489 478 192 -753 220 -556 -18
6501 -18 -674 -403 145 225 -295 -463 746 -949 -54 248 -371 91 -515 -899 551 5 190 -19 -481 315
6521 315 -436 -431 -575 -121 214 -623 341 -285 -201 8 -341 -103 -323 1100 173 48 167 -143 138 -189 478
6542 478 -626 -307 182 114 -180 644 319 -222 227 -233 304 -307 -339 -67 -1 -115 53 -526 310 862 310
6563 310 671 135 31 21 281 -442 493 -75 591 -67 83 199 165 -1 163 1 -128 397 -186 -481 109
6584 109 132 680 -200 -36 423 -787 785 -333 -428 1136 457 -1099 -101 -398 154 68 76 504 -252 -222
6604 -222 -103 -649 -27 -6 -293 -501 -806 -366 206 339 663 558 -613 -385 -340 -622 140 -846 -714 612
6624 612 -257 61 20 394 -347 9 -549 -555 -385 464 -528 10 488 -306 236 -692 49 -813 -773 -1109 -115
6645 -115 -320 -170 -222 -523 -17 -18 -313 -279 196 922 335 -181 303 303 291 628 -708 369 340 424 -581 297
6667 297 749 -484 1016 -286 -856 110 991 204 66 -124 672 504 -38 -9 379 -576 310 276 980 -61
6687 -61 -1081 51 -787 313 1004 436 222 -661 156 -24 791 -140 -154 -366 -42 -132 -556 865 -1072
6706 -1072 -375 752 -648 -324 -209 -420 687 -240 -113 -654 -35 -598 -447 -78 -248 -51 -433 562 53
6725 53 -818 -620 -402 -607 1042 -328 -488 202 -163 -440 -710 677 -530 987 108 -789 137 267 170
6744 170 -645 13 10 461 297 -228 305 -947 -644 -841 170 -355 24 592 200 108 -791 -446 1105 -235
6764 -235 1089 343 -423 -129 -830 -246 -863 -588 -300 223 -464 -4 84 260 90 681 87 -372 -733 210
6784 210 -127 144 1324 378 -284 -262 1354 256 499 369 -525 340 -6 114 26 636 455 -480 -470 444
6804 444 31 440 -114 309 354 -63 37 -50 647 251 312 302 -454 -269 -600 -296 -126 795 -104 117 -34
6825 -34 541 471 -265 147 370 -1256 -144 -270 -89 -382 -319 276 -605 171 27 832 223 -410 212 158 -415
6846 -415 305 -113 70 302 -187 1 -135 568 430 -1138 -559 344 -1220 -66 -1276 154 -359 671
6864 671 235 -222 592 -339 285 689 -211 -24 -503 -53 -154 166 -168 -989 -97 339 -52 251 -864 -893
6884 -893 193 -217 97 -677 -297 -100 -213 37 -707 -822 -19 454 -168 937 -101 -211 733 447 118
6903 118 -343 266 -381 447 285 -420 398 -451 881 576 1346 -438 206 191 -271 6 -539 439 -878
6922 -878 -195 1088 -381 -81 -100 -271 512 -100 343 656 194 383 390 536 34 -181 -302 587 -39 -261
6942 -261 -347 61 -195 -435 687 -148 15 296 -590 575 -244 491 1037 889 -241 -235 314 1065 -128 589
6962 589 -324 -21 -455 -151 -289 591 -82 -404 -336 -572 -403 -1440 517 -639 -652 -544 -88 414 -399 -437
6982 -437 -349 109 471 -211 -379 -228 -1173 -964 -359 -271 -371 -84 -154 -41 -127 -598 -258 -709 -744 -356 370 -806
7004 -806 -389 -850 255 45 -60 -499 17 -667 191 -82 -17 -885 408 660 -15 387 -75 -30 -64 271
7024 271 -144 -344 1024 51 -1286 371 -272 825 296 -15 199 465 -975 -72 -355 136 908 -159
7042 -159 -471 491 486 69 -291 320 -58 331 350 -304 -596 -119 -119 -419 -503 -53 -263 282 -300 -31 1032 400
7064 400 -438 -121 0 536 409 -6 -48 1300 4 -885 427 -230 -354 839 626 192 1179 275 -239
7083 -239 443 -271 154 -386 68 340 71 -247 -539 -115 119 201 -773 414 -310 -236 282 201 491 -224 -468
7104 -468 -361 -298 -348 -777 74 -192 -193 -221 -199 -951 125 -286 27 -413 323 429 -390 -194 -1047 57 -69
7125 -69 -224 -581 -529 -870 -298 356 -27 -516 185 -412 264 -309 -341 356 19 -448 -270 308 30 349 109
7146 109 779 289 -535 -257 -574 965 -295 -19 55 205 9 -287 304 578 105 63 -405 224 180 -422
7166 -422 283 -791 -183 67 271 191 -551 671 -681 -376 65 135 -13 443 28 297 828 103 23 -141
7186 -141 -181 -153 132 171 -140 -401 590 -141 931 27 277 -200 -375 -484 -25 -152 -685 -25 52 -308 123
7207 123 -838 -568 498 -318 -1133 455 132 19 -899 -525 -6 -3 -729 -749 132 -657 -199 -400 -492 -240 -348
7228 -348 433 -296 -619 -901 -224 -548 64 -516 60 -736 -34 -336 -146 -998 -672 -462 406 -1073 -343 -17
7248 -17 -217 -1165 -944 -149 152 353 228 134 383 -174 533 645 103 -169 131 -338 -396 644 530 723 -5
7269 -5 -392 -651 718 618 -339 -193 588 -436 -181 -484 -168 18 611 -196 330 510 230 -26 -300 -385
7289 -385 841 -255 -486 140 344 1366 999 -649 121 542 -63 108 -94 496 -298 47 -709 529
7307 529 1127 152 196 724 -415 -67 119 290 1294 530 562 546 174 -265 491 786 346 -175 272 -395
7327 -395 346 217 -834 166 -568 502 -885 -624 -271 -395 20 3 548 215 -48 192 -83 -1054 -428
7346 -428 -316 -302 35 215 294 251 -275 -489 -900 94 -159 -78 430 279 -554 -316 -1085 39 -526 -595 30
7367 30 -499 718 -139 4 -1360 55 215 415 -286 -473 369 -575 -59 7 -395 -1225 -241 334 -48 -914
7387 -914 593 -440 -220 -334 -435 50 371 -341 -138 259 -404 -240 -822 -128 464 21 617 -294 207
7406 207 500 -214 -50 -109 622 -479 380 368 150 702 488 1 416 -321 -221 291 -159 -11 88 150 75
7427 75 308 -204 1339 615 496 263 -447 666 529 -47 -451 -201 384 468 517 182 410 39 425 -136
7447 -136 141 -385 256 127 -705 1475 144 500 -436 344 552 -635 272 147 291 -884 512 712
7465 712 676 -202 -314 -192 282 254 31 -313 560 855 -613 -220 -637 -12 -469 -724 -185 -357 -36 -66 214
7486 214 -398 432 699 -556 294 -893 -666 -219 -1177 -263 0 -42 -265 -389 -387 23 -357 144 606 -376
7506 -376 -111 -24 -102 -467 673 -508 289 -434 -589 -113 -43 427 239 60 59 -473 567 567 65 -54 718
7527 718 316 -7 26 -550 154 489 -534 -562 -311 337 230 906 -249 164 696 228 -121 590 591 399 125
7548 125 -315 -134 762 175 6 528 94 -500 -760 557 852 -935 61 512 -497 1045 -111 -167 -918
7567 -918 320 531 -293 115 446 636 -274 -456 -362 -995 379 380 -373 422 479 40 -412 168 -1 -202 -636
7588 -636 -112 339 -610 -187 28 251 -97 -147 -411 400 -460 46 -461 -203 113 -3 -23 32 -649 -339 -230
7609 -230 29 -77 -377 43 -180 -375 -497 -695 -297 -831 -295 338 -852 -465 -265 -682 -75 -263 -883 62
7629 62 -44 207 -412 383 -661 20 165 345 -82 65 435 -775 -299 -71 -179 67 -26 -242 -589 -425
7649 -425 -519 -84 452 749 -351 407 785 -238 139 486 -294 -771 -650 69 -388 -305 -246 590 -581 110
7669 110 39 96 658 103 186 -174 -38 -301 -239 230 718 -598 -484 -168 271 361 -297 179 -449 -150 225
7690 225 337 -729 536 403 361 -28 400 659 149 -225 156 -37 -72 203 -997 -399 6 616 14 -635
7710 -635 0 54 186 671 576 -300 18 243 -693 -696 -408 267 495 -569 -216 -806 -377 664 -403 -759
7730 -759 -674 179 -449 367 -725 -298 489 -583 -77 -105 -68 -345 -423 -291 -329 -214 -582 -79 226 -341 -304
7751 -304 299 469 -149 80 197 -238 -198 -592 -770 -245 -65 -261 -14 -196 -99 735 161 -426 -798 -205 -67
7772 -67 28 -440 154 -204 284 175 -73 -989 -625 -143 115 -353 481 -713 262 911 422 133 600 391
7792 391 -876 1298 450 596 103 -84 10 -427 747 -184 35 59 -162 -684 -249 317 224 -26 505 984
7812 984 -610 330 -1328 -376 -732 721 -74 226 -130 -63 30 -57 483 -18 -457 273 -376 -320 -39 -351
7832 -351 -75 -197 -22 867 -134 -278 734 -799 366 -614 25 -841 -622 -727 720 247 457 -251
7850 -251 -290 100 -515 -179 -1068 -125 222 -238 153 -155 63 -207 -535 -201 -501 168 951 -582 -376 -638
7870 -638 -360 202 615 297 35 664 513 -369 -321 -209 -550 299 -12 -26 382 34 -241 259 -68 504 -337
7891 -337 80 -799 -355 -88 -496 -937 -393 -95 -747 547 -405 -28 226 -296 -581 356 -636 279 175 -524
7911 -524 97 360 671 -296 -15 161 -60 -322 248 878 -158 -5 -186 315 -831 -8 95 -157 26
7930 26 520 1286 183 -71 444 -422 288 1085 -31 54 1399 200 310 243 -603 -173 -461 505 -438 325
7950 325 543 -421 11 553 -48 44 -74 349 -488 -393 -56 248 -763 -348 -828 221 200 376 -857 -179
7970 -179 147 20 -728 -30 -295 270 -441 -30 374 -265 16 -84 -146 -532 -1457 106 -277 138 -653 -244
7990 -244 -354 -666 -113 46 -104 -230 309 568 -476 -24 710 174 475 -331 -5 415 -179 94 -185 -539
8010 -539 629 800 -140 -338 -330 282 53 -31 -47 -535 -242 63 71 569 30 -265 644 350 340 -191 -605 53
8032 53 -461 406 -560 -528 -409 -394 317 372 865 707 646 -293 118 -484 1096 100 47 -194 669 387 833 -349
8054 -349 -163 -426 -208 606 41 274 -287 689 523 98 573 102 -873 -187 -132 146 50 321 -48 -320 215
8075 215 -33 318 51 -829 110 -584 -602 196 168 169 -323 398 362 82 -301 -990 -14 -142 -169 -415 -16 -82
8097 -82 517 405 -52 343 -161 -574 -746 -197 -619 307 246 -611 145 -75 30 790 248 149 -357 -396 -147
8118 -147 -174 -1022 -195 -1239 -439 910 -351 -1389 -115 383 -57 206 -168 -579 -245 -549 -492 227 -197
8137 -197 33 -177 -861 -274 167 -292 96 -513 560 -610 72 -133 -287 71 39 269 298 713 147 711
8157 711 29 -412 528 756 387 1072 1411 111 723 -334 -575 379 -416 26 481 -449 236 491 671
8176 671 -446 -531 246 201 569 770 -609 -565 -558 -360 555 659 133 323 -413
8191d13
$$ Imaginary data points
##PAGE= N=2
##DATA TABLE= (X++(I..I)), XYDATA
0 0 0 0 0 0 0 0 0 0 0 0 0 -72 72 -72 72 -72 133 -144 144 -201 216 -244 288 -348 375 -434 506 -577 652
29 652 -733 826 -930 1042 -1164 1299 -1446 1615 -1794 1990 -2206 2447 -2707 2994 -3321 3679
45 3679 -4079 4532 -5049 5645 -6330 7141 -8117 9313 -10818 12791 -15482 19411 -25707
58 -25707 37478 -67161 319914 347167 -191853 71422 350231 168790 -129908 103363 271564
69 271564 37954 -152151 97151 238257 41682 -97753 72779 157553 44332 -14560
79 -14560 71910 74437 7126 5083 53350 34781 1854 -3953 4713 10720 20207 -6025 -29923
92 -29923 2687 41393 19296 -11508 -3750 9339 10408 26248 20883 -22134 -33535 11932 12875
105 12875 -39147 -36982 2293 -40767 -89943 -12223 57003 -45654 -132405 -30725 49630 -51348
117 -51348 -101074 6351 10964 -127051 -113676 37122 4073 -154548 -115182 33364 -16774
128 -16774 -142858 -63695 48434 -46273 -136495 -12139 77458 -46825 -118235 10745 67658
139 67658 -53540 -87724 24171 37064 -62122 -54629 36210 17925 -68318 -44921 40513 35279
151 35279 -25432 -24055 15892 16539 1195 12690 17546 -4509 -10377 10191 17734 4477 -6448
164 -6448 -10376 -10082 1828 19226 20752 995 -16220 124 40346 43365 2135 -5574 34570
177 34570 37931 -6714 -1456 47716 25075 -41468 -12330 73222 40208 -57955 -26280 80669
189 80669 49973 -54034 -15756 84668 37002 -57543 1176 92014 17305 -75421 3684 94153
201 94153 18508 -69056 -2180 70620 11418 -39353 27728 66443 -7036 -33313 49109 74121
213 74121 -6385 -30116 36744 51805 -6752 -10675 31175 14225 -30344 -8700 34105 7852
225 7852 -32924 -11266 21187 -1727 -23431 3293 13605 -23184 -28579 11454 7874 -41127 -42625
238 -42625 1973 -1835 -46521 -42538 -2100 -10743 -49255 -34307 9829 -9674 -55025 -32065 20205
251 20205 -1637 -55002 -32696 15176 -11463 -57396 -26169 17214 -21659 -68779 -28055 23023
263 23023 -18566 -69308 -24724 23551 -21702 -66081 -13301 22745 -32237 -65165 -7887 19872
275 19872 -37362 -61311 -7386 11756 -38300 -49126 1282 10356 -33367 -32519 16461 11977 -27640
288 -27640 -13164 28933 13158 -19874 2698 31483 7413 -13356 17629 34750 3528 -6434
300 -6434 30862 41899 5566 3028 41611 42206 2986 11348 54449 39246 -5826 13276 57191
313 57191 33617 -10041 16855 56380 25253 -13810 19175 58384 24914 -15399 20526 60113
325 60113 21619 -13953 25051 58433 14750 -17829 26300 51935 9926 -16189 24803 42858
337 42858 1776 -15430 24116 38494 -5611 -18967 22694 31344 -12448 -19847 19748 18343 -22271
350 -22271 -18909 16152 5778 -28081 -18364 8385 -6361 -32581 -17760 4487 -16865 -37704
362 -37704 -16040 -1092 -26543 -37958 -9724 -3768 -39493 -39403 -3279 -5566 -41796 -35995 -3189
375 -3189 -12183 -44433 -31333 2351 -13689 -50435 -31421 6737 -13507 -49308 -24144 10585
387 10585 -18570 -48574 -13995 15768 -20248 -45929 -7302 16676 -21018 -41348 -2859 16420
399 16420 -21529 -39062 2944 19099 -20948 -30281 10108 19741 -18769 -19860 19588 21245 -13213
412 -13213 -9250 23998 20710 -7060 642 28512 18252 -7785 7266 33577 19436 -4768 15013
425 15013 38171 17352 1749 28128 41124 15015 6095 32760 38223 11332 7209 34203 32291
438 32291 2368 7233 37350 27653 -3668 8912 39403 22962 -6163 15436 42639 16161
450 16161 -10495 16199 40095 11941 -11477 13831 31452 3151 -15930 14107 30492 -2933
462 -2933 -19108 13204 27540 -4030 -14736 15733 20605 -10392 -13879 13685 13169 -20786 -23405
475 -23405 4901 2923 -28640 -30755 -870 -5475 -34310 -28845 -2119 -11175 -37082 -23506 -698
488 -698 -16746 -40462 -23069 -2070 -20220 -39456 -21173 -8599 -30290 -39081 -11082 -3332 -33091
501 -33091 -36655 -1451 3950 -27330 -24600 6624 394 -26120 -12399 15104 -4481 -33381 -10511
514 -10511 17017 -5823 -30902 -5832 14002 -11264 -25817 8036 18772 -13455 -21370 14898
526 14898 22091 -11933 -16975 13425 16457 -10149 -9122 13801 11414 -10445 -4935 20375 18064
539 18064 -1784 1413 25872 27730 12820 13269 28495 27740 16449 19993 34010 28357 9421 12181
553 12181 32404 29474 9609 12962 30172 23294 8566 23254 36008 16297 1358 24461 38946
566 38946 12022 -3114 18396 23780 -4860 -6167 22020 13822 -21525 -9921 26953 13785 -21911
579 -21911 -5011 29369 10599 -14373 10746 29531 -1286 -18105 13677 29886 -3844 -19330
591 -19330 8057 16893 -7302 -7691 12526 4048 -15093 1576 22868 3900 -18228 -2905 13249
604 13249 -2887 -14355 -1495 -1262 -20662 -22839 -4087 -3085 -25182 -31147 -12586 -2151 -14656
617 -14656 -23609 -14560 -9339 -14921 -15155 -5360 -4737 -22020 -27850 -10440 721 -19331 -34850 -16683
631 -16683 281 -15677 -27976 -8091 -96 -21677 -22280 8918 9985 -22502 -23296 8449 5591
644 5591 -21699 -16023 6369 -9690 -32742 -7626 15852 -16354 -42191 -3410 24842 -9599
656 -9599 -29469 8275 21889 -14559 -19062 23700 23473 -19945 -19410 24391 24401 -14370 -15025 18347
670 18347 18037 -6994 3149 28165 16013 -4488 11111 32715 24818 7842 13273 23357 20147
683 20147 16276 16908 15855 13615 15151 20329 21297 18549 14859 16908 22725 25781 26596 24599 22301 23291
699 23291 25274 26841 24150 18566 14118 21311 26154 18288 9302 16572 19135 10636 13306 25961 21372
714 21372 1271 7496 26793 19176 -2296 1058 16263 5300 -10583 1487 7833 -13927 -23784
727 -23784 171 7063 -17906 -22213 -249 -1061 -22533 -12283 8292 -8531 -32252 -10913 13012
740 13012 -12526 -37429 -17148 2673 -18783 -31350 -9229 -2306 -28237 -30784 -1024 596 -28500
753 -28500 -26032 -886 -5430 -25490 -20004 -7143 -19008 -31380 -17235 -6239 -21181 -33242 -22484
766 -22484 -12418 -18230 -22891 -15954 -12788 -17298 -14313 -6994 -7546 -15724 -14691 -6194 -1088 -7022 -12380
781 -12380 -8667 -318 -946 -8146 974 12341 4260 -4914 10474 24723 8711 -4005 15029 29936
795 29936 10608 -893 17085 23697 1473 -2718 21636 23907 -4901 -2634 24733 20426 -6874
808 -6874 2244 28740 14781 -5533 11668 28770 6384 -9275 12793 23999 2331 -6636 15122
821 15122 17714 -3869 -1262 20025 15845 -3051 5636 24302 14919 -772 9745 20778 8297
834 8297 311 12366 15505 1074 -1396 8405 8694 -2483 -2254 5034 2615 -2620 -4011 812 -1964
849 -1964 -5572 -4646 -1912 -2693 -6555 -9935 -8499 -6168 -9382 -14096 -9573 -3892 -11628 -16870 -5901
864 -5901 -2023 -13415 -16165 -652 1078 -15525 -14739 1703 -1278 -20266 -15039 3342 -5020 -21932
878 -21932 -13136 2362 -10157 -23970 -7186 4940 -15276 -22066 -1146 2902 -17965 -18157 2352
891 2352 -1393 -21384 -14840 5208 -4211 -21700 -11536 6070 -5456 -17901 -5064 6429 -7062
904 -7062 -12275 2621 7949 -7120 -8203 6286 8088 -3773 -3489 6981 5680 -1788 572 8794
918 8794 7178 -737 1936 10913 9298 851 1218 9281 10680 5354 3352 8950 9242 2735 4818 13441
934 13441 11526 1350 2769 14595 12170 1280 4027 16709 10163 820 9807 18657 6747 -277
948 -277 11968 19230 6782 -20 12897 16114 3580 2014 15243 13210 -2241 1185 17205 10126
962 10126 -4154 1188 13294 5387 -5553 3264 10936 -1586 -8561 2877 9679 -3425 -11075
975 -11075 -649 5408 -5771 -10697 -1816 -942 -11498 -11582 -1477 -2086 -12858 -12483 -1971 -3175 -11878
990 -11878 -10047 -3085 -6628 -13870 -9183 -1596 -6419 -16803 -12797 -1894 -6636 -17683 -12506 -3533
1004 -3533 -8819 -16242 -9035 -2955 -10762 -15936 -6468 -1150 -10191 -16830 -7216 -1990 -11573 -15063 -3529
1019 -3529 -4087 -13598 -13054 196 -1206 -13186 -10358 1510 825 -8612 -3687 4618 -625 -7612 647
1034 647 7739 -758 -7056 1427 9361 1287 -3375 6459 9181 1112 210 12373 12928 1438 2639
1049 2639 13993 14604 5788 3777 13808 12705 4196 5179 14134 11390 1231 6334 15851 12215 1886
1064 1886 8016 15999 11347 5469 10888 15947 9988 4596 12037 16333 8196 1230 10353 15477 5723
1079 5723 1637 11864 13122 3852 4557 12899 12612 2904 3811 13118 10330 956 1834 8502 5620 -4994
1095 -4994 -675 7143 -1295 -9073 -1637 4891 -3143 -10301 -2185 3212 -5482 -9447 -2408 -254 -8923
1110 -8923 -12499 -3932 -4533 -14193 -15378 -5573 -5948 -16154 -14346 -4466 -8162 -16781 -9811 -2246 -7971
1125 -7971 -14805 -8362 -1641 -7927 -15295 -9742 -3104 -10088 -15975 -10419 -5375 -11474 -15275 -7107 -2902
1140 -2902 -10387 -11501 -3637 -2370 -6899 -7768 -2207 -1171 -7802 -6996 -1206 -1959 -9019 -7172 970 1188
1156 1188 -7959 -4513 4397 3258 -2704 2395 8662 5908 -226 5248 12479 6542 -620 4384 11431
1171 11431 5025 -712 7888 12372 3657 1212 13141 16318 4787 4765 15927 17626 7933 6600
1185 6600 15376 13447 5104 8315 16734 11114 1034 8822 16812 9132 3810 11776 15123 7831 7493
1200 7493 16401 15679 4559 5554 14437 11805 2572 2195 8009 5476 -1869 358 4837 -562 -6237
1215 -6237 -517 4309 210 -5192 -2246 1316 -580 -3410 -3063 -2378 -3985 -7567 -6041 -2177 -5971
1230 -5971 -12129 -9780 -1855 -2008 -8795 -7346 -481 -2335 -7667 -2761 1480 -5348 -11505 -3677 2196
1245 2196 -8397 -15438 -7246 -1870 -13850 -14193 -3559 -6629 -19200 -13759 -555 -6408 -17959 -12822
1259 -12822 -1905 -8870 -18880 -9470 -3494 -14686 -19822 -7910 -1141 -14980 -17872 -4610 -2285
1272 -2285 -10382 -7354 2405 -1673 -7482 1581 8431 1024 -3830 4016 8283 2554 682 5608 4287
1287 4287 -632 3276 9131 7857 3362 6117 8429 7284 8128 9328 7571 5503 7400 7234 5896
1302 5896 4716 3358 562 2026 8523 4652 -1395 3341 10664 6640 1883 7426 12711 6068 3901
1317 3901 13338 17361 5156 1665 13864 14436 4844 5331 15346 9980 1645 10692 19588 7726
1331 7726 269 13750 19376 5843 2373 13696 12061 -1144 591 13039 6037 -8037 -2858
1344 -2858 8724 -49 -9101 -2164 4398 -3995 -7935 2574 4274 -7643 -9125 1774 1551 -7063
1358 -7063 -7456 -3136 -4892 -9617 -6384 -3557 -6421 -9890 -6255 -4401 -6075 -7625 -6418 -6256 -5540 -5019
1374 -5019 -6625 -7259 -7622 -8525 -10950 -8214 -6186 -10912 -13906 -7961 -5347 -13011 -13928 -5612 -4057 -11336
1390 -11336 -9754 -277 -4036 -13768 -10736 1026 -2714 -13743 -8257 2135 -6830 -14442 -3843 3601
1404 3601 -7646 -12023 2295 4706 -7559 -7176 4304 3420 -6665 -1461 7854 1144 -6155 207
1418 207 7607 -758 -5009 2906 7620 145 -1382 6678 5022 -147 4669 10146 6297 1387 8101
1433 8101 10161 4188 3620 8628 9527 4159 5315 9855 9547 5003 6209 9676 7803 8084 8970 9390
1449 9390 7567 5907 6829 5394 6371 6444 4886 3172 4646 4509 742 650 5727 2156 -2219 1912 6012
1466 6012 1004 -3338 1430 5124 -907 -3812 2583 4529 -4183 -5794 3220 3526 -8020 -4940 4612
1481 4612 325 -9876 -4837 2665 -4866 -10156 -2135 2334 -6968 -13008 -2696 -838 -9749 -11654
1495 -11654 -4094 -3562 -12375 -10712 -3850 -6253 -14142 -9592 -4365 -7041 -11643 -7577 -6860 -10070 -10689
1510 -10689 -5140 -5014 -9228 -8341 -4448 -5519 -6934 -6943 -4310 -3525 -6159 -4475 -2676 -1872 -4178 -3547 -1017
1527 -1017 -476 -1254 -2912 -601 899 -305 -2395 990 3013 -1640 -1097 3238 4394 -2096 -1397 4603
1543 4603 5369 583 1409 7346 4560 -89 3366 8967 6447 -538 5449 11625 7071 2697 7078
1558 7078 9521 5662 4032 11173 11119 3505 3403 10930 10921 4071 5230 11893 8588 3760 5795 10972
1574 10972 7594 1010 4219 10108 5934 856 3528 6806 2074 1351 4505 4259 1905 -339 2834
1589 2834 3116 128 -928 1947 1280 -484 110 1402 -134 -3441 -1066 1216 -423 -4282 -3403 -315
1605 -315 -700 -3852 -3585 -2184 -3318 -5493 -4009 -1176 -4148 -8215 -6072 -1973 -4863 -9860 -6764 -4905
1621 -4905 -7891 -10087 -5763 -4620 -8741 -11070 -5500 -2998 -7033 -9792 -6061 -3893 -8098 -7194 -3883
1636 -3883 -4640 -9220 -5839 -1175 -4515 -8524 -4540 -965 -3154 -5281 -1920 800 -4068 -4927 450
1651 450 2943 -1846 -5513 -795 2554 -2694 -3099 1119 1327 -2554 -885 3559 2951 -1890 521 4910
1667 4910 4366 1825 1562 5444 4240 1658 3737 6536 2532 2295 4229 6445 4817 3454 6073 7476
1683 7476 5681 5909 7847 8283 6034 5691 8367 8435 4588 4189 7781 7824 3785 4144 7433 6320 2945
1700 2945 3833 7447 5929 2026 3601 7420 5416 1411 2331 5507 3035 -884 1879 3886 -158
1715 -158 -2727 650 2209 -1562 -2694 1167 1476 -2335 -1393 1235 1178 -2313 -2590 285 419 -4894 -4346
1732 -4346 -194 -3049 -6560 -3945 -762 -3050 -6380 -3106 -1251 -3060 -6350 -3458 -2209 -5492 -5978
1747 -5978 -4655 -3368 -6792 -8611 -5094 -5970 -8660 -8908 -5441 -5640 -7610 -6748 -4705 -3610 -5122 -6100
1763 -6100 -2694 -2456 -4032 -4558 -1462 -1781 -5763 -3638 -224 -1407 -3923 -2290 2051 -473 -1533 1362
1779 1362 3928 977 -311 3316 5704 1300 -287 3552 5179 1109 512 4536 2711 -474 1402
1794 1402 5940 2982 1144 3294 6224 4067 3074 4256 6421 3686 3511 5933 6834 4027 2370 6492
1810 6492 7724 5148 3981 7068 6595 5065 7585 8679 7644 6235 6419 8734 9200 6338 5315 6958
1826 6958 6792 4908 4291 5392 4305 1687 3451 5434 3816 2458 1600 2973 3726 2449 542 2124
1842 2124 813 -2224 363 1529 -1898 -5390 -2222 687 -4288 -4975 -1165 -444 -3789 -4157 346 -628
1858 -628 -5593 -3673 166 -1219 -6273 -5565 -1640 -4074 -7616 -4606 -1649 -6510 -8347 -3831 -1826
1873 -1826 -5832 -7502 -3782 -3302 -6555 -4860 -3941 -4701 -7520 -7468 -4628 -5104 -7812 -7276 -5707 -6832 -6893
1890 -6893 -4451 -5212 -7170 -5256 -3050 -3559 -4147 -4278 -3538 -3047 -3101 -3256 -3456 -3767 -3013 -3519 -1403 -1257
1908 -1257 -1256 -2639 -967 2409 2152 -599 -23 4286 3514 638 2480 5463 2701 248 4210 6976
1924 6976 2695 -377 4206 6354 2944 3270 7741 6383 2922 5837 9329 6106 2678 6075 8793
1939 8793 4799 2687 6558 7029 2203 2458 8021 5837 626 2868 7291 5219 1833 4618 7282
1954 7282 2598 1058 4306 5676 1539 -1049 3283 4421 1050 -454 2174 2837 727 518 2641
1969 2641 3014 1087 65 1495 1004 1820 105 -1482 40 220 -2173 -2417 -2422 -1634 -3943 -4237 -1767
1986 -1767 -3189 -5869 -4781 -2091 -4795 -6803 -5101 -2412 -6174 -9752 -4496 -4474 -8506 -10025 -3817
2001 -3817 -4183 -8797 -7483 -4198 -5341 -8189 -3947 -1518 -4789 -7194 -2214 -866 -4639 -5785 -518
2016 -518 -927 -4517 -3495 -329 -2093 -4401 -1437 1091 -2854 -3641 1750 489 -3741 -1209 1938 197
2032 197 -3268 -1636 1588 85 -3170 -562 1236 -159 -1555 917 2966 -304 -328 2295 2212 429
2048 429 3089 3568 2659 3137 3759 2568 3580 4418 3846 3705 4439 5107 4064 2426 4953 6006 2988
2065 2988 2694 6781 5865 2758 1795 7106 4514 739 2943 6118 2944 26 2771 5044 271 -1198
2081 -1198 3957 3985 391 1 3506 2664 -1918 -260 3569 1356 -2250 305 3944 18 -1848 587
2097 587 2174 -1024 -1670 1179 637 -2866 -2222 652 -1425 -4172 -270 -305 -2426 -3728 -1218 -1879 -4796
2114 -4796 -4803 -3349 -2910 -4501 -4515 -3823 -3838 -5054 -3226 -3523 -4966 -5258 -3779 -4016 -5097 -3317 -3652 -5227
2132 -5227 -3436 -2261 -3431 -3391 -2281 -2889 -4234 -2321 -2001 -3313 -4429 -1980 -78 -2767 -4919 -1646
2148 -1646 820 -1776 -3333 323 641 -3219 -4181 1121 1033 -2764 -1368 1796 866 -1360 1218 2174
2164 2174 263 -767 2609 3568 789 352 3829 4668 1893 1697 5336 3877 1651 3637 6065 3952
2180 3952 1800 4741 5032 4180 3441 5726 4653 3250 3582 5628 5270 3975 3530 4407 4422 3530 4068 3790
2198 3790 2445 3585 3451 3629 2154 2819 3077 2286 2693 2357 1012 1201 1647 1463 1191 1980 1633 450
2216 450 84 1416 178 -1284 -1377 964 353 -2516 -1450 -188 -1454 -2411 -1265 1641 -1947 -3777
2232 -3777 -2255 64 -2396 -4718 -2515 -3067 -3200 -4045 -1651 -2051 -5654 -4889 -1811 -2566 -4974 -4466 -2508
2249 -2508 -3748 -5630 -3838 -1515 -4116 -5880 -1564 -2024 -4006 -4258 -2600 -2052 -4122 -2341 -1508 -2494
2265 -2494 -3067 -2244 65 -1731 -2666 -1183 108 -1221 -1547 -1088 -741 -587 -1394 -468 -16 92 -62 -1262
2283 -1262 432 1289 973 1211 1199 1454 676 1542 2249 1648 1062 1571 3000 2393 1190 2070 3270 2497 1657
2302 1657 3819 4119 2241 2055 5170 4839 3213 2777 4349 3623 3142 2933 4441 3159 2218 3294 4508
2319 4508 2561 2010 3632 4068 3234 1769 4753 4386 2139 679 3978 3753 1195 1673 2981 1656
2335 1656 694 1167 1597 1072 -197 916 1893 594 147 97 -95 125 -1328 -269 850 -972 -2016
2352 -2016 -1109 -395 -2199 -1987 -1666 -701 -2228 -3119 -2120 -2636 -2426 -4047 -2798 -2597 -4484 -3766 -3745 -3372
2370 -3372 -4485 -5001 -4247 -3697 -5681 -5228 -3256 -3705 -4352 -4983 -3037 -3913 -5021 -3902 -2709 -3989 -5949
2387 -5949 -3878 -3065 -4728 -5371 -3820 -2927 -4831 -4506 -2000 -2720 -3083 -3389 -1607 -640 -3436 -1844 100
2404 100 -300 -1912 -619 249 -309 -353 -269 783 211 154 1755 1905 2065 2253 3299 3221 2975 3224 3600 4191
2424 4191 2367 3035 4122 4162 3534 2938 4338 3812 3174 4430 3949 4773 3451 4081 5005 5473 3942 3613
2442 3613 4358 4464 2275 3571 4196 2771 1940 3943 4165 2527 2052 2980 4179 2903 2316 3010 3530
2459 3530 1284 1129 3475 3747 567 54 3069 3014 50 1220 1304 -186 -656 -102 734 -654 -1247 -787
2477 -787 949 -527 -2861 -2241 -2412 -3912 -2916 -2481 -3394 -4169 -3458 -2992 -3724 -4253 -3948 -4689 -4790 -4185 -3947
2496 -3947 -3939 -4067 -4286 -3890 -3661 -3119 -4806 -3261 -2874 -2295 -2263 -3168 -2322 -3389 -3063 -2223 -708 -1563 -2098
2515 -2098 -2845 -989 -1059 -2304 -1770 87 -1109 -2250 -1388 -1375 -1306 -2504 -594 -665 -1962 -1686 178 -308
2533 -308 -1723 -1033 945 72 -1126 -463 2033 -355 -1088 -238 1280 697 514 1728 2676 1096 1206
2550 1206 4537 3299 1751 2396 4369 3426 2229 3293 4961 4010 1944 3183 4096 3387 2092 3402
2566 3402 3484 3481 2405 2890 3332 2634 3541 2803 2568 2831 2489 2551 1897 1383 1904 953 1433 2030 1461 1387 1464
2587 1464 1315 4 371 1318 1267 -36 618 2166 834 -287 337 349 -1635 -1308 -584 209 -1990 -1478
2605 -1478 -205 -598 -1731 -1966 -443 -1808 -2665 -2033 -718 -2612 -3779 -1427 -1599 -3651 -3385 -540
2621 -540 -2837 -4621 -4015 -1996 -3098 -4083 -2509 -1192 -2757 -3006 -3022 -2440 -3124 -4149 -2014 -2131 -4527
2638 -4527 -3699 -2516 -1353 -3587 -3087 -1911 -2030 -2210 -1618 -1147 -1739 -1272 -1640 -1809 -808 -403 -1051 -532
2656 -532 -294 272 -687 -188 554 821 138 1327 1620 616 1003 1624 2531 1848 617 2438 2328 1729 -353
2675 -353 2914 2122 1477 2618 3130 1925 1889 3479 3199 2375 2088 2659 3636 2486 2434 2689 3236 1683 2600
2694 2600 3471 2923 1816 1398 3721 1610 1186 3447 3355 1509 112 3411 2302 423 727 3251 2494
2711 2494 -63 1119 2505 724 -651 595 985 833 -35 1273 -282 -762 -1251 -336 -417 -49 -158
2728 -158 -1728 -1078 -1405 -1431 -2286 -1718 -1209 -1779 -1566 -1806 -2209 -2068 -3684 -2175 -1027 -2013 -3447 -1663
2746 -1663 -1758 -3427 -2374 -2140 -1453 -3620 -3053 -2415 -3388 -3702 -2243 -2098 -2132 -2391 -1251 -1283 -3155 -3092 -1078
2765 -1078 -1424 -2984 -1774 -149 -1507 -2259 -1504 440 -1274 -1436 -594 -678 -755 114 1110 -194 -1775 -117
2783 -117 1273 -135 -901 1420 1825 243 837 2548 2974 47 896 3211 2570 998 1755 3081 1846
2800 1846 1971 3709 2665 2729 3374 2869 3244 3550 2703 3015 3770 3583 3318 3896 3415 3082 3477 3523 3498 4071
2820 4071 2362 1975 3708 4216 3748 1810 2597 3951 2531 2611 2769 2677 1965 2239 3310 1574 964 1705
2838 1705 2927 1215 149 1178 1314 -535 -1159 664 611 -2790 -1930 883 39 -1963 -1559 -1166 -2341
2855 -2341 -2855 -1217 -1801 -3371 -2524 -2209 -2385 -3015 -3042 -2043 -3172 -3622 -3505 -2418 -2705 -4547 -3135 -2270
2873 -2270 -3114 -3624 -2708 -3489 -2378 -3983 -3537 -3431 -2918 -3049 -2903 -3074 -2188 -3480 -3057 -1941 -2448 -3264
2891 -3264 -2482 -2126 -1939 -2651 -1355 -1189 -1088 -2327 -1655 6 -611 -1698 -562 819 -359 -150 -400
2908 -400 370 892 221 1489 2252 1553 612 2474 1996 1628 1596 2943 2672 1844 2168 3108 2850 1419 2748
2927 2748 3597 2328 1778 2997 2957 2111 2520 3271 2026 2858 2543 2096 2353 2790 1792 1562 1953 1915 2599
2946 2599 2633 2580 1146 1775 2137 1805 1947 1578 1783 1528 993 1459 294 981 -150 304 495 -366 -352 -241
2966 -241 1003 -550 -287 -304 61 -523 -1469 -1459 -464 -1046 -2049 -506 -364 -2025 -1877 -1084 -865 -2688 -2638
2985 -2638 -1833 -2521 -3107 -1812 -1755 -1831 -2986 -2133 -2437 -2933 -3412 -2202 -2010 -2496 -2563 -1743 -1119 -2041 -2536 -1553
3005 -1553 -719 -2474 -2365 -1818 -1706 -1647 -2182 -978 -1134 -2353 -2067 -493 -1441 -2393 -1328 -824 -948 -650
3023 -650 -1302 -1324 -876 -1844 -1408 134 -179 -275 -273 -336 -122 -802 246 405 -385 -171 814 1148 19 991 967
3044 967 1055 1257 1017 1656 1930 374 1610 2025 2207 1573 2337 3371 2773 1923 2226 3843 2567 1749 2138
3063 2138 3123 2308 1653 2883 2718 2637 1786 1673 3096 2852 1458 3113 2497 946 1289 2411 1960 1740
3081 1740 2053 1791 1791 1710 1097 2012 1289 522 1399 1457 695 1212 698 120 992 -51 -256 290 46 335 745
3102 745 -46 -856 -839 -252 -378 -1165 -1325 -1165 -1412 -1218 -1252 -780 -1142 -2648 -2089 -2021 -1601 -2952 -1856 -2395
3122 -2395 -1782 -1906 -1839 -2734 -2474 -2638 -2461 -2253 -2482 -3142 -2892 -1776 -2171 -2960 -1720 -1388 -2664 -2772 -1169
3141 -1169 -1714 -2411 -1335 -223 -1906 -1068 -570 -623 -569 -1241 485 618 -575 -1171 928 1302 659 60
3159 60 876 406 -772 1060 162 481 272 -387 1031 1051 1489 572 912 132 1043 1678 1191 1031 804 1615
3179 1615 1306 1829 1778 1977 2355 1335 2132 2615 1633 2876 2458 1977 2971 2165 1916 2202 2004 2180 2663
3198 2663 1385 1858 1669 2580 1997 1788 1662 1306 2512 2176 1398 969 1172 1019 41 173 819 967 -447
3217 -447 94 -375 -69 -406 -361 -616 -639 -482 -692 -535 -1742 -2188 -374 -858 -1348 -1173 -1160 -1981 -1842 -1306
3237 -1306 -556 -1584 -2355 -1760 -1454 -1211 -2321 -1248 -2048 -2060 -2875 -2956 -1518 -1790 -2015 -1562 -1864 -2375 -2155
3256 -2155 -2063 -2315 -1722 -1310 -1591 -1652 -1114 -2115 -1421 -1598 -1226 -1463 -699 -384 -1281 -1757 -276 -209 -1005 -506
3276 -506 -214 -462 -561 -33 538 540 79 983 1054 114 -397 847 2032 1370 711 1698 2631 1044 -107 2273
3296 2273 2127 1630 1335 1964 2285 1282 2329 2626 1707 1929 2664 1955 1642 1868 2296 2635 1447 1692 2168
3315 2168 2280 2028 1996 1994 1309 1751 1312 2142 1930 1941 1981 2180 935 1085 1006 792 740 686 1059 599 405 -94
3337 -94 54 121 535 275 -160 -252 298 -197 177 670 294 -1225 241 -137 -654 -1154 -809 -411 -592 -977
3357 -977 -908 -2360 -1658 -1545 -32 -963 -1403 -1971 -1365 -1303 -2209 -884 -1296 -1538 -2350 -1126 -637 -1453 -1808
3376 -1808 -1226 -890 -1618 -1546 -871 -1203 -2251 -2073 -1222 -1376 -1649 -1730 -632 -1038 -1331 -1563 -1555 -1220 -1508 187
3396 187 -618 -435 -450 -867 -233 239 340 -389 -145 -225 160 -141 290 98 -79 1036 580 787 352 -806
3416 -806 1230 586 1937 773 691 1679 849 871 2058 1030 1232 1448 1699 1391 776 1507 2072 1698 1860
3435 1860 3114 2176 1169 1776 1901 1605 1082 1849 2359 1686 646 1912 1926 520 1173 1261 2053 1867 1722
3454 1722 673 1042 1037 1329 1361 957 387 1698 1444 1557 261 944 2141 -275 613 751 310 -53 235
3473 235 692 338 -539 -430 -193 -296 -105 -331 -1163 -1002 -805 -1991 -1401 -390 -668 -1613 -1601 -1712 -1949 -892
3493 -892 -1744 -983 -1116 -1494 -1865 -1767 -1959 -1649 -1911 -1439 -1658 -2150 -2005 -1893 -1624 -1866 -1157 -1935 -804 -1054
3513 -1054 -1438 -515 -2858 -508 -1125 -1627 -1073 -1032 -469 -2011 -1097 -1008 -656 -1042 -415 -805 -77 -2090 -446
3532 -446 265 -788 -38 -416 -24 -240 364 547 80 428 992 1148 1454 476 1190 2162 1125 1451 1124
3551 1124 1866 1322 2454 1384 2517 2359 1232 1521 1508 1868 1855 1895 1515 1507 970 1471 1559 2254 1524 1271
3571 1271 1797 2051 862 1729 1248 1211 234 371 318 861 318 465 782 -127 280 229 1260 1173 105 -135
3591 -135 518 677 -69 200 -177 -209 150 -608 -94 -520 -970 64 -960 -1873 -540 -419 -595 -1503 -1069
3610 -1069 -903 -1626 -1014 -1832 -1683 -2064 -752 -1234 -2001 -1403 -1763 -1193 -2082 -2426 -1236 -1765 -1978 -1499 -854
3629 -854 -1123 -2061 -1600 -1463 -325 -1476 -1462 -1701 -951 -525 -1572 -234 -674 -983 -692 -142 -589 -733 -688
3648 -688 -265 -904 -136 -628 -471 -362 -11 154 155 1390 68 207 652 992 347 468 395 166 -33 338
3668 338 1409 1641 995 639 199 372 268 1182 1293 652 259 1312 1802 1354 -178 2189 1829 651
3686 651 991 1487 1092 1730 1601 1256 1333 722 1869 1445 1427 1985 1470 754 780 650 450 1164 604 1194 -189
3707 -189 -162 610 640 409 153 -460 1302 119 -391 197 707 -39 -230 -572 -252 -65 -337 66 42 -832
3727 -832 -820 -351 -460 -646 -1296 92 -291 -35 -737 -1408 -1130 -453 -1126 -1075 -1310 -1356 -1214 -1299 -985 -90 -1181
3748 -1181 -779 -1521 -668 -1466 -749 -655 -1292 -1587 -1354 -543 -975 -1742 -951 -1352 -1374 -699 -614 -542 -995 -590 -858
3769 -858 -513 -362 -606 -659 -111 -93 -1069 -465 -1449 986 -52 -147 -315 -871 -231 327 309 188 -563 752
3789 752 618 770 876 1176 722 1116 944 1567 1175 375 1929 1360 1119 942 1072 1578 400 775 1277
3808 1277 1791 1405 1340 1483 1817 461 1384 2225 1635 2181 1720 1550 1308 1375 1267 1830 1137 923 616 1350
3828 1350 893 1035 1218 1230 155 88 472 40 312 164 789 180 143 -26 347 307 -350 260 176 -63 155
3849 155 -201 -774 -1257 -106 -452 -800 -1433 -797 59 -1491 -1413 -1267 -683 -738 -1409 -814 -1329 -1241 -1046 -1232
3869 -1232 -944 -1007 -1489 -2140 -1245 -539 -1186 -1211 -597 -1199 -1098 -547 -809 -1163 -1310 -1916 -833 -955 -2074 -1216
3889 -1216 -935 -1006 -967 -892 -820 -1287 -1362 -752 35 -276 -346 -252 -54 -1521 -177 -588 -544 -978 -518 323 -303 -152
3911 -152 570 -348 381 258 535 751 1163 1297 1092 892 793 989 1532 839 867 1499 1329 1266 1444 1527 1096
3932 1096 1488 1053 1314 2333 1879 1550 1067 1849 1390 1099 532 1231 1092 1709 1295 942 1621 404 574
3951 574 581 1394 211 225 777 198 961 1188 463 493 650 619 351 -360 685 922 984 65 -544 -352 -474
3972 -474 -173 373 -739 -513 -863 -251 -646 -744 206 -275 -410 -844 -936 -517 -261 -1457 -1183 -665 -891 -1375
3992 -1375 -1210 -856 -1221 -1318 -830 -1332 -1546 -1262 -1422 -1558 -1063 -1927 -759 -643 -1793 -1036 -182 -857 -2033
4011 -2033 -1549 -854 -731 -746 -1012 -547 -111 -1025 -740 -706 -380 -672 -1424 -787 -752 -385 -257 1134 154 135 -5
4032 -5 -600 110 -93 25 1482 1310 842 1208 523 1678 -17 573 1564 1323 374 291 981 1833 1943 1141
4052 1141 855 829 1182 786 957 1358 1526 733 2163 881 1712 1361 1286 1330 790 1755 1657 520 939 1228
4072 1228 914 1412 881 371 1136 648 496 750 230 429 1042 686 -13 670 382 435 144 617 -875 671
4092 671 1077 175 -506 202 56 257 -279 -99 -778 -573 191 -478 153 -1228 189 44 -759 -523 20
4111 20 -1160 -1217 -1000 -541 -345 -1688 -977 -598 -926 -1532 -179 -645 -1130 -909 -1069 -1322 -1606 -1850 -594
4130 -594 -870 -784 -1686 -850 -448 -432 1 -152 -843 -1207 -916 -619 -218 -1403 -737 -93 159 -763 -29 205
4150 205 -610 -790 619 2 262 -146 -289 -148 375 -482 -13 -487 -548 448 390 263 350 -446 1026 1251
4170 1251 324 1001 -286 919 1313 521 -88 621 759 1290 416 442 374 1148 352 1374 937 2173 1753
4189 1753 983 1214 1594 684 611 680 973 629 428 755 582 514 55 918 -541 606 68 353 569 994
4209 994 -670 205 312 111 1353 318 -124 354 -514 313 -313 -796 392 182 100 -1009 -408 -290 -908
4228 -908 389 121 -432 216 -186 -1026 35 -399 -371 -1201 -723 84 -823 -725 -1084 -1261 -622 -741 -1267 -749
4248 -749 -806 425 -1141 40 -1298 -1171 -743 -1343 -1135 -901 -220 -1057 -584 -969 59 -229 -1147 -505 -555
4267 -555 -751 -650 -268 -944 -822 -616 -864 -606 -515 -245 62 274 -470 143 -750 554 543 1090 406 -109
4287 -109 257 1107 10 973 349 1132 273 -14 -43 552 697 -358 693 1049 390 885 946 778 1063 1049
4307 1049 860 844 1818 663 477 257 1161 1482 1206 -37 1877 621 1544 588 419 95 -71 723 790
4326 790 1104 1009 659 1085 -368 1039 466 569 225 754 891 -473 -479 -196 348 287 515 241 -350 -540
4346 -540 797 122 -457 -547 -163 -817 -698 -1657 -1151 -1221 -962 -967 -872 -1525 -1086 -632 -693 107 -1235 -393 -661
4367 -661 -1180 -1181 -764 -927 -1130 -230 -41 -510 -368 -134 201 678 170 -1122 -833 -788 636 -563 -1014 353
4387 353 -1023 -172 -645 -51 -450 -928 -801 -811 -453 -631 -632 -19 10 -320 48 -314 -613 -129 69 702 42
4408 42 754 619 155 295 442 269 354 1260 -434 206 645 -316 969 1308 763 1138 1220 11 626 1083
4428 1083 706 483 468 614 927 403 544 1776 938 452 -152 1077 314 409 -87 572 1351 -125 1825
4447 1825 1391 733 678 1151 685 -369 -73 -376 373 -322 158 158 520 -317 779 -276 -102 1044 -197
4466 -197 35 295 -403 -1352 -217 -574 -934 -795 -432 -759 -689 -929 -412 189 100 -1008 -1046 -146 -950 -115
4486 -115 -1102 -986 -433 -1025 -653 1022 -1301 -314 -966 -909 -428 -486 -544 267 -857 -371 -572 55 -517 -152
4506 -152 187 -5 -69 -388 -1087 -1163 -318 -953 -448 -1387 -697 -35 443 -426 -1007 -629 -774 -810 -332 -690 289
4527 289 -99 -776 529 -311 515 -173 251 731 -1028 -440 408 406 113 726 7 1101 873 1032 62 1067
4547 1067 461 32 672 573 1123 332 1405 -8 403 136 1135 764 1432 1493 868 639 619 733 -66 656
4567 656 890 1612 213 593 -22 249 1166 937 1106 272 236 1062 -688 1228 -100 1186 912 -281
4585 -281 -230 -38 559 410 -343 -175 -124 142 -206 -167 320 -45 146 -534 65 -550 326 -352 -879 99 -656
4606 -656 392 -521 -723 -245 -1291 -871 -1072 52 -1227 -1338 300 -373 -294 -12 -685 -448 -259 -841 -1122
4625 -1122 -728 278 -1196 -762 -579 -314 -939 -506 -1013 -279 -253 -1841 -440 79 -1106 362 -749 -637
4643 -637 40 -224 521 -483 -1138 78 -91 -193 451 560 398 600 159 323 -122 627 297 346 -543 358
4663 358 -538 258 -241 342 344 -182 98 -31 859 607 916 109 -42 706 393 683 1049 -416 -233 490
4683 490 -69 434 229 656 556 602 878 -217 654 438 825 578 988 305 162 196 520 525 338 29 -37
4704 -37 -521 891 0 769 -32 557 1057 134 130 -134 369 422 848 -344 -527 53 478 -244 -241 1651 -860
4725 -860 136 -358 -597 -670 -274 85 99 -378 -151 655 -440 -303 -282 -299 -520 -452 36 -577 -1151 -1289 -928
4746 -928 -810 -342 -507 -628 -822 -303 -905 -508 -1110 -623 -639 120 -633 -310 -1090 -1028 -478 104 -38 -125 300
4767 300 28 -5 -476 4 424 -761 33 190 -345 23 -746 91 -94 -370 -245 150 277 319 -174 -266 709
4788 709 522 408 317 180 889 249 -151 -387 928 -107 282 727 424 277 574 872 -101 592 -232 344
4808 344 -201 -60 395 911 842 823 432 347 775 218 915 139 233 740 665 404 19 -150 -199 623 149 477
4830 477 617 520 668 -379 -280 99 836 459 -424 -388 -651 -70 -388 -110 28 233 129 -158 86 -272 455
4851 455 -240 250 463 -66 -872 -827 -1302 -368 -298 -1057 -27 -458 -343 -632 -326 -206 -838 -201 -261 -349 -427
4872 -427 -551 -887 -337 -286 -18 -514 -690 -322 16 117 239 522 -573 -313 179 -33 -243 210 -149 272
4892 272 418 -179 -493 -549 1030 547 -50 -585 353 -487 -296 -80 834 943 -481 0 335 337 -490 -93
4912 -93 699 176 862 124 701 746 -256 -113 577 486 -128 568 598 -123 433 857 283 1011 1272 -238 225
4933 225 1080 -433 822 147 123 10 564 210 210 91 -2 457 -516 732 -177 231 -14 -242 1102 146
4953 146 442 -56 895 -783 -1216 -48 82 -565 135 -124 -287 -436 -11 272 -696 369 -707 -651 856
4972 856 -268 135 129 -148 -195 309 -528 -562 221 -538 -588 71 -822 -347 -530 -624 -449 -701 -791 -454 -74 306
4994 306 227 -187 -553 -867 -1022 -1315 -893 -682 -578 -536 -378 -662 -557 -143 -168 -966 196 -407 -761 446
5014 446 -241 -489 -70 -123 -441 129 -30 271 45 495 590 438 -576 -249 -309 -784 134 589 -227 -384 -251
5035 -251 -388 441 630 1256 225 255 546 106 -315 -723 100 -39 -365 271 1119 1363 284 475 499 601
5055 601 -145 598 -29 755 10 873 -109 827 849 499 177 -70 44 385 1416 -94 530 742 -31 -57
5075 -57 505 244 -312 -384 334 237 375 444 -316 -184 -801 -404 480 -247 -212 -580 -966 182 176 -490 -847 -724
5097 -724 136 -101 -1068 -23 -699 -473 33 -872 334 -40 -234 297 -365 -172 211 -670 -195 -417 485
5116 485 -309 695 -102 44 -175 -467 -1092 -1048 -687 -253 -119 -912 -708 168 -710 -1509 -925 -16 -657 -467
5136 -467 -411 -373 -519 -248 -104 -350 310 -140 460 390 -166 86 -220 -134 -878 4 373 -345 337 88 85 1
5158 1 -10 -499 743 600 -164 -404 -225 904 -15 -607 180 -37 95 32 -114 1006 219 -519 -98 810
5178 810 365 1201 99 -285 929 1163 323 709 892 112 447 1438 513 169 -55 -297 451 459 341 461
5198 461 -279 -96 50 181 -354 457 233 407 -192 -295 372 671 325 570 -365 -364 -308 286 -155 -462 382
5219 382 -13 1174 406 -263 -290 -418 -1149 -212 -463 106 30 -652 91 183 -929 -496 252 -146 110 -401
5239 -401 -635 168 1037 -718 -361 213 -195 -811 -214 364 -667 317 224 -271 -545 -570 -478 -575 -915 -217 -180
5260 -180 -240 -230 -40 -287 730 61 444 -696 289 -183 55 -53 -252 305 -399 -322 -619 -171 -160 314 201
5281 201 -456 -1091 1328 205 682 -608 167 996 304 -269 276 630 265 1166 250 -18 -64 845 52
5300 52 290 1201 427 -72 623 985 611 680 1196 -653 597 690 271 800 802 606 -185 217 635 571 799
5321 799 602 -24 362 -649 -95 -200 -279 145 110 454 457 405 292 -521 -20 422 -51 259 -429 108 246
5342 246 25 704 -972 -445 -139 -610 -24 481 -1405 -488 195 -720 -698 -953 -38 144 123 -232 -77 -911
5362 -911 -57 -7 507 87 -487 -514 -101 -597 -101 -373 -1376 7 -443 1 -488 377 76 255 -245 238
5382 238 169 -138 47 305 367 -402 650 -285 638 -156 583 -671 135 555 307 -359 -639 -131 971 -696
5402 -696 192 -439 1212 497 332 354 90 208 201 756 -170 -68 -260 866 -437 -488 651 480 -157 584
5422 584 -281 -227 113 -524 208 394 101 353 214 371 446 40 -57 1386 1048 423 40 -101 -303 699
5442 699 1121 -37 -63 44 -414 30 -244 550 35 -82 -400 -171 198 -215 -545 -300 -85 553 -163 -649
5462 -649 -223 -610 -714 460 -213 -353 119 -253 -223 -653 -393 -262 -180 -90 -795 -326 -425 -282 437 -467 310
5483 310 439 -505 -769 -710 -242 -1164 -486 -135 -233 -734 -110 -74 168 -351 -134 270 345 108 -226 -471 -250
5504 -250 -771 -331 -112 295 595 -1039 -293 -120 -416 673 -637 52 1009 554 154 32 -16 -647 40
5523 40 651 207 609 587 67 754 384 383 -49 1146 48 -946 274 145 979 353 -61 661 499 -127
5543 -127 805 138 4 859 480 943 431 -3 248 397 208 251 -96 682 302 -287 107 415 740 -1130
5563 -1130 -166 -438 282 708 114 112 403 -240 936 1196 -82 576 969 329 208 434 87 772 -415
5582 -415 243 311 -143 1068 187 290 681 84 441 -572 -414 -308 -909 -57 675 -669 -796 -697 -395 -703
5602 -703 -464 1451 -54 -354 -49 -89 27 -270 -607 -228 -809 192 -1079 -155 -478 -1284 -61 431 -562
5621 -562 326 -971 -124 604 -1045 -216 -561 -154 -20 -20 -539 -664 -579 -349 -371 1053 -206 226 -361 138
5641 138 -13 145 69 655 289 -131 -269 357 -43 453 -490 444 364 -251 923 156 798 77 532 -171
5661 -171 -180 -936 412 -385 -266 382 -254 152 -394 -191 835 -64 169 -299 -86 -501 660 -793 320
5680 320 1198 137 246 261 -401 130 -141 -162 118 486 95 48 -62 347 468 -156 177 -139 96 -111 162
5701 162 129 408 -195 431 567 101 -81 -91 -674 987 571 -13 -239 -69 -603 -30 361 85 183 263 -179
5722 -179 254 205 101 -236 -439 -352 -834 -304 -584 -345 -296 -535 -1014 -791 -603 -1634 -235 -291 114 -620 -38
5743 -38 136 -70 -265 -277 -37 -851 -252 -327 -116 234 362 -26 -487 -62 262 -116 -131 -566 -95 -63 840 186
5765 186 -430 91 548 154 388 -249 245 191 348 -710 103 229 525 529 295 -565 -142 -160 -374 -70 -177
5786 -177 -522 -224 434 86 -110 158 389 -181 240 -546 640 264 -313 646 -583 495 575 517 197 -290
5806 -290 857 90 -490 330 220 -133 -594 772 -282 681 -228 706 277 -925 33 200 -1027 476
5824 476 171 -662 -156 -86 429 -242 -165 0 -139 -547 -69 413 293 -314 -698 -653 244 150 310 -272 98
5845 98 -586 24 -197 -933 243 208 -479 24 -818 -319 -681 -18 -625 -181 -346 -701 -177 -421 -58 -427
5865 -427 849 -119 -1057 518 174 -299 93 -494 -511 287 417 139 -582 -330 182 275 -39 -232 721 17
5885 17 -132 -433 -320 -9 -559 106 -812 115 370 -116 -2 627 -151 410 875 -779 -87 881 -193 -457
5905 -457 369 167 -441 520 41 -174 39 725 -338 536 788 -518 -591 54 745 -182 388 493 -293 1001
5925 1001 209 382 721 110 -117 30 391 -158 787 -679 437 343 409 369 442 413 -506 -253 -414 205 73
5946 73 -310 -805 -474 241 -653 -477 -644 -108 55 -814 -415 230 -623 -588 44 68 20 -377 -904 -685 208
5967 208 475 -425 -1425 -441 -100 795 399 290 -104 -377 235 150 623 -338 -473 -90 520 192 898 203
5987 203 -473 -36 158 772 830 -1124 210 -187 -192 201 900 232 -148 -222 226 119 239 -69 205 638 110
6008 110 -487 156 -956 525 599 -363 165 -197 -255 -352 -261 132 893 -576 -180 -91 -1094 -496 -767 567
6028 567 -374 195 -715 -8 360 561 -76 -615 4 645 97 -20 324 1007 100 233 391 -382 -216 -516
6048 -516 372 -150 340 383 625 -436 169 -795 -227 -315 634 33 -49 437 -127 529 1394 -244 305 -1260
6068 -1260 -100 -587 336 -285 311 -786 -834 -390 -371 583 143 -381 -735 186 49 -640 136 260 -347 -896
6088 -896 35 553 -209 232 -1104 304 -388 -254 331 -81 -357 -269 648 -1048 -351 -585 -510 -184 -589 -236
6108 -236 104 11 -543 -904 -226 -683 -313 230 133 301 605 19 -49 -1232 662 88 134 525 203 -188 413
6129 413 -852 159 394 -549 321 -521 -196 -115 -641 140 609 -783 -646 643 523 -57 50 1067 695
6148 695 9 347 215 878 273 461 270 -391 610 612 389 -50 183 16 629 -156 538 288 592 548 -405
6169 -405 966 216 -36 -61 482 603 545 837 351 419 -103 -377 -798 307 -207 -455 -212 -398 458 135
6189 135 348 -642 -600 -43 330 245 231 -1258 79 -157 40 -362 60 120 -222 -629 -677 207 -427 109 -174
6210 -174 -96 208 -601 -631 157 -353 -327 -345 -668 613 372 -647 -855 66 -766 -173 320 16 109 -412 559
6231 559 -572 -86 -518 -628 -31 -439 -76 -401 472 687 -431 -202 -149 -213 -1 -817 558 -487 551
6250 551 729 -354 -449 92 892 -342 701 -174 -380 -70 -101 268 -218 -14 -261 172 -517 158 52 -329
6270 -329 103 348 -22 -537 443 -188 254 -127 20 29 479 580 48 824 -292 -114 431 854 -418 -12
6290 -12 -561 -726 -883 200 79 -159 -701 171 869 -827 -47 1151 1011 56 205 93 -37 1011 70
6309 70 637 384 702 394 116 -311 282 -118 -952 121 390 -65 -347 120 -492 585 -789 -243 -358
6328 -358 133 239 -468 65 -757 280 428 -999 567 -384 54 -188 558 -176 -859 439 310 -685 351
6347 351 101 241 -844 -178 -35 -960 -359 -488 29 240 -299 -556 102 213 -92 66 -649 226 -278 15
6367 15 -363 -360 239 786 -240 -142 461 27 -788 455 82 -363 -849 133 -509 -1015 275 -139 -113 -282 364
6388 364 -539 413 172 529 198 457 -162 -347 631 504 -19 -173 794 438 425 -18 296 177 488 456 -59
6409 -59 -189 58 -421 693 12 -432 250 -402 232 5 -321 -791 142 297 206 205 -119 498 385 -109 -819
6430 -819 -682 343 93 348 145 259 97 -15 -187 614 220 -796 12 -343 -148 -389 109 -905 -11
6449 -11 -812 -73 -99 221 -289 -52 -299 -421 146 255 -345 -77 532 -1015 -330 -159 -671 -266 -360 -409 539
6470 539 -261 13 -523 983 -890 -606 205 320 -656 -81 -1361 -640 -597 772 428 -135 303 -195 -49
6489 -49 -524 192 202 358 734 -657 -102 427 148 513 -70 -988 563 604 -630 198 166 92 -152 301 666
6510 666 -1 -268 398 116 338 462 -576 -598 -245 494 516 -143 20 381 385 -297 -12 350 336 407 -34 -595
6532 -595 -236 767 -254 -501 246 -201 449 2 559 754 389 688 -385 -644 246 414 -851 -602 -357
6551 -357 -1043 -524 373 -447 -221 734 -783 -40 -190 -126 0 593 -216 -59 -690 -861 -588 294 44 334
6571 334 1103 -521 367 -289 501 270 -861 -957 390 313 295 -754 404 106 -84 -308 387 40 163
6590 163 107 -398 -405 -389 -1075 -283 -389 -565 838 -88 365 140 564 758 -383 204 28 274 716 329 -545
6611 -545 -383 532 -308 395 -539 331 -257 -301 -175 -379 202 292 -675 53 1077 -1005 642 -93 9 236
6631 236 669 422 -385 -226 -335 -491 43 -437 46 405 -493 660 -91 178 546 -8 55 -108 510 404
6651 404 590 237 108 -454 -515 161 -157 411 523 -413 9 169 442 161 708 1219 522 -62 264 -347
6671 -347 235 -287 218 142 -133 101 -419 -590 -1498 -69 -167 -610 -228 552 913 -415 110 -489 -380 471
6691 471 -6 369 -71 -359 -959 383 -264 -655 603 748 -733 484 -139 16 -344 129 170 -514 33
6710 33 -129 -73 180 -135 101 298 -398 105 -30 -746 -520 30 361 -578 158 -36 -521 -531 -6 -269 -82
6731 -82 -1039 -75 -398 -1169 -138 -912 101 -438 -212 408 359 232 619 119 -567 -182 -70 -137 359 -182
6751 -182 -24 147 -298 -312 49 -346 636 -538 -163 298 370 504 189 -459 38 -302 874 560 36 356
6771 356 828 77 -457 255 -122 83 238 553 192 584 655 160 816 -503 -574 169 637 60 -39 50 310
6792 310 -249 -250 -172 -180 611 787 65 -313 181 -335 -63 -463 416 -288 -236 -957 553 -834 -150 1023 -167
6813 -167 256 -41 -326 477 -260 -41 -300 -597 -156 114 -83 -190 296 -285 286 -723 -238 -406 711
6832 711 -294 92 637 193 -293 536 -126 391 125 -344 161 -130 508 -196 -123 -513 84 6 -367 -11
6852 -11 203 -818 -15 379 327 -780 -49 -427 -290 -491 -47 367 508 119 -555 -23 59 -760 706 169
6872 169 510 -431 302 -955 -171 -458 48 -105 300 34 -338 694 -40 -251 22 -6 -130 259 154 -1023
6892 -1023 119 511 477 -264 -268 626 -101 534 580 481 112 -273 178 622 324 431 -842 416 124 -8
6912 -8 137 -211 24 8 705 721 -191 -353 382 -461 574 62 -221 -9 -360 993 789 -393 564 256
6932 256 103 -129 -429 244 729 -191 -954 -298 54 299 -888 -98 -252 -605 -36 118 -446 507 -585
6951 -585 687 563 -548 -298 -20 -442 198 270 -13 -562 -714 266 -499 -347 -309 193 -292 142 -140 -246
6971 -246 45 -225 267 -146 -1366 -20 572 298 357 -270 -37 -136 132 336 -50 508 469 435 903 221 22
6992 22 503 893 300 825 -84 567 -50 -637 25 -192 516 237 1131 -217 -33 974 -266 -21 -547
7011 -547 780 -353 946 913 560 -162 844 82 -263 256 956 605 1129 394 144 1140 -213 -103 121
7030 121 1033 -217 704 -76 366 81 -192 532 724 159 45 -310 -439 59 189 660 -847 904 -150
7049 -150 735 -199 88 460 -73 -552 -163 -820 311 364 485 -2 250 430 -161 202 17 -147 7 199
7069 199 -403 -394 -422 -259 -409 -782 568 -814 135 363 -499 -213 -175 -1039 -392 -848 -860 395 169 -392 -304
7090 -304 -205 -646 -175 -401 404 -936 -420 240 -504 -427 270 -370 311 -66 403 -117 141 -408 271 -643
7110 -643 3 144 -414 -374 539 479 -207 301 -327 -312 708 -412 637 397 -272 362 -124 472 428 -291
7130 -291 361 199 -247 339 1285 1036 -109 626 913 818 -23 801 1245 283 354 -69 464 712 -170 -166 156
7151 156 845 -94 197 255 -699 504 103 -283 -98 -65 900 389 623 269 -226 993 189 -214 365 -9
7171 -9 630 189 198 152 -180 159 474 619 -206 146 -370 798 783 -505 -420 -234 -33 155 -217 232 74 -57
7193 -57 32 257 -790 -471 -485 -751 170 -462 -119 504 -592 -420 -167 -252 208 -278 -180 18 -1111 -638 -29
7214 -29 -532 -537 257 124 -672 -75 -130 -676 -130 -55 375 -520 500 -775 -593 -202 -77 548 -219 -502 291
7235 291 335 -79 -40 145 157 -770 739 -19 292 75 -361 -498 222 261 471 346 -244 -368 704 86 560
7256 560 -42 -735 116 -174 200 248 -257 -578 114 -11 337 689 343 216 -93 898 -48 277 -227 -539
7276 -539 287 67 138 -354 252 200 788 -163 412 318 -1153 1335 267 733 885 -399 26 -106 -6 227
7296 227 478 1076 32 -174 -551 108 -633 193 -183 -403 -479 -541 362 -483 -261 504 77 -355 166 -148
7316 -148 420 -244 -188 330 -330 -696 821 -702 -1571 -353 -514 -516 -764 -602 789 -469 359 -62 87
7335 87 -574 -185 -400 -576 -223 393 361 215 -103 -632 166 3 -723 -719 -199 -1093 210 -371 -191 -493 223
7356 223 -659 -549 822 -349 -137 660 -312 -41 402 -398 -698 -432 -95 -652 -484 964 51 -548 -134
7375 -134 -111 -164 440 -507 -39 1004 -308 169 272 -391 -542 450 398 347 189 1609 812 643 338 -181
7395 -181 -396 1103 72 163 648 -96 242 -40 -90 -480 851 246 619 -78 1230 207 -78 23 243
7414 243 -772 -226 467 269 -331 -1160 993 444 245 -378 -976 53 -212 576 -9 270 -59 -380 -616
7433 -616 4 261 -183 360 513 333 -454 -301 274 526 -950 -18 -622 -414 101 -136 -298 710 -206
7452 -206 -253 -104 -255 -121 -368 29 586 -175 344 -632 -550 -819 -125 -320 -220 -740 -212 -612 687 460
7472 460 -509 -406 -471 -731 -58 -17 -185 -114 295 -606 436 -354 199 -299 -277 -65 -437 -641 569 -44 -759
7493 -759 637 4 404 -287 199 -903 -21 -777 -306 -722 548 1123 55 482 725 365 207 476 578
7512 578 553 -232 84 613 818 667 121 618 -18 240 -6 905 621 -374 28 474 455 -241 210 55 181
7533 181 -248 -516 206 -250 6 207 445 61 -584 188 58 141 -156 -174 -418 103 410 -134 -700 154 90
7554 90 456 32 361 -477 151 -549 39 -33 295 -237 -328 -283 -323 334 -759 -465 57 -47 -136 -117 -539 328
7576 328 -85 513 319 -34 522 -316 -218 -282 -441 -439 552 301 -98 -405 -1358 283 -59 84 -675 -332 -178
7597 -178 811 18 -359 -98 216 408 -107 -233 -323 -405 -180 -268 353 -478 -313 -351 372 417 447 972 140 297
7619 297 53 217 -190 1042 107 10 686 133 489 118 -671 -395 19 -600 -478 860 706 -459 529
7638 529 1039 377 164 141 -617 809 -22 69 301 -34 221 488 -381 -406 968 778 222 240 13 453 114
7659 114 271 276 26 230 -360 -994 85 336 -552 -74 -107 175 -289 566 -358 1168 -388 216 429 340
7679 340 -60 -588 -111 56 14 -590 330 96 -523 -639 -32 -188 -300 145 24 -622 445 -486 456 372
7699 372 202 -83 -282 -268 142 353 -1139 129 -97 -286 -566 -108 329 -106 115 1 14 -74 30 -323
7719 -323 55 -735 19 -288 -110 -873 -403 189 -210 292 -256 -632 411 174 -378 431 -686 651 44
7738 44 313 880 -299 -760 -223 176 350 -72 -78 245 670 -751 76 -211 7 530 442 -741 -315 -463
7758 -463 203 592 1232 402 -681 111 396 594 855 330 571 -188 -398 186 1150 662 212 509 -46 -138
7778 -138 -614 -187 144 346 -90 191 -169 199 -138 433 -572 -469 -131 52 -70 -299 224 288 32 20
7798 20 -278 299 155 228 408 59 58 647 395 261 -4 -634 -356 1081 27 -667 -626 321 -302 -84 185
7819 185 -807 148 -761 -201 -36 291 -144 -953 339 -138 -992 -143 -399 -476 -131 -744 -983 395 507 -134
7839 -134 -373 -489 26 464 83 -538 -559 283 -833 71 75 -686 608 -39 778 126 97 426 -29 -140 760
7860 760 21 -113 174 -530 -441 104 444 186 1080 -330 -543 92 126 61 -120 870 -228 487 63 835
7880 835 423 -161 198 -132 58 542 627 -518 847 -201 711 506 223 135 -277 522 202 381 -447 536
7900 536 164 -576 1133 -109 28 625 593 -512 415 -228 -781 -485 -231 38 193 66 350 40 78 244
7920 244 -324 42 -474 -588 -132 12 -448 309 -1076 58 -401 256 499 -498 -96 101 663 -315 -426
7939 -426 782 -740 -578 -156 -727 166 394 -261 146 -369 -747 -223 147 329 411 -1054 150 965 72
7958 72 -501 -532 250 -695 175 735 -477 -1199 25 -795 -560 -375 166 306 319 347 -1039 -239 -391 317
7978 317 -406 -117 608 -241 237 78 -504 365 583 50 -400 -283 326 -271 892 501 -229 -496 165 527
7998 527 -488 -92 -296 -214 41 -793 -443 10 162 664 -420 38 -662 217 -49 124 -17 160 -362 485
8018 485 150 163 339 972 322 -215 133 -75 674 -543 55 214 532 -658 -55 -46 306 104 -1067 -275
8038 -275 -159 -208 -328 125 -58 38 -635 4 361 399 47 -41 767 65 16 -438 -1188 5 -605 449 -996
8059 -996 -205 -41 157 575 -320 131 199 -4 717 298 -527 -234 160 -283 -557 115 -1001 -542 -255 -417
8079 -417 -266 50 585 -293 -186 -130 19 324 814 -75 -243 -612 -104 -54 -517 448 -508 437 181 -435 181
8100 181 152 -606 72 572 103 -637 498 -20 -141 250 -589 -173 254 -68 -463 94 -80 -32 241 -245
8120 -245 -72 798 681 -234 516 786 1230 84 6 210 568 -45 663 -112 -337 -85 162 -230 117 -231
8140 -231 1059 -679 293 218 120 332 1252 818 -265 -463 310 -87 443 599 -345 500 -426 -662 -394 428
8160 428 106 707 263 130 683 168 582 693 255 55 -431 767 281 158 -180 -286 -218 -434 685 -116
8180 -116 368 -696 642 -348 -503 -378 -221 -368 -171 -1069 -396
8191c96
##END NTUPLES=NMR FID
##END=
