##TITLE=1H_SA_42.151
 CDCl3, 24 sc, 
 11.11.2019
##JCAMPDX= 6.0         $$ Bruker NMR JCAMP-DX V2.0
##DATA TYPE= NMR FID
##DATA CLASS= NTUPLES
##ORIGIN= UXNMR, Bruker Analytische Messtechnik GmbH
##OWNER= root
$$ XWIN-NMR		Version 3.5
$$ Mon Nov 11 14:29:27 2019 Russian Standard Time (UT+4h)  she@DPX200
##.OBSERVE FREQUENCY= 200.1315
##.OBSERVE NUCLEUS= ^1H
##.DELAY= (6, 6)
##.ACQUISITION MODE= SIMULTANEOUS
##.ACQUISITION SCHEME= undefined
##.AVERAGES= 24
##.DIGITISER RES= 18
##SPECTROMETER/DATA SYSTEM= spect
##.PULSE SEQUENCE= zg30
##.SOLVENT NAME= CDCl3
##.SHIFT REFERENCE= (INTERNAL, CDCl3, 0, 15.7039)
##AUDIT TRAIL= $$ (NUMBER, WHEN, WHO, WHERE, WHAT)
$$ ##TITLE= Audit trail, XWIN-NMR		Version 3.5
$$ ##JCAMPDX= 5.01
$$ ##ORIGIN= Bruker BioSpin GmbH
$$ ##OWNER= she
$$ F:/spectra/data/she/nmr/H-F/1/audita.txt
$$ ##AUDIT TRAIL=  $$ (NUMBER, WHEN, WHO, WHERE, WHAT)
(   1,<2019-11-11 14:28:33.20 +0400>,<she>,<DPX200>,
      <continue with go, POWCHK disabled, PULCHK disabled
       configuration hash MD5:
       00 E9 B6 7A A2 85 ED C7 34 08 36 98 17 FE 4E 26
       data hash MD5: 16K
       8C 07 E1 64 70 90 AB 23 A0 F2 66 BD 8C 90 B4 3E>)
$$ ##END=
$$ 
$$ hash MD5
$$ 11 55 D1 F9 29 95 76 A1 76 80 E1 2A E9 C7 1C 36
##$RELAX= 
##$RELAX= 
##$RELAX= 
##$RELAX= 
##$RELAX= 
##$RELAX= 
$$ Bruker specific parameters
$$ --------------------------
##$DU= <F:/spectra>
##$EXPNO= 1
##$NAME= <H-F>
##$PROCNO= 1
##$TYPE= <nmr>
##$USER= <she>
##$AMP= (0..31)
100 100 100 100 100 100 100 100 100 100 100 100 100 100 100 100 100 100 
100 100 100 100 100 100 100 100 100 100 100 100 100 100 
##$AQSEQ= 0
##$AQ_mod= 1
##$AUNM= <au_zg>
##$AUTOPOS= <>
##$BF1= 200.13
##$BF2= 200.13
##$BF3= 200.13
##$BF4= 200.13
##$BF5= 200.13
##$BF6= 200.13
##$BF7= 200.13
##$BF8= 200.13
##$BYTORDA= 1
##$CFDGTYP= 0
##$CFRGTYP= 5
##$CHEMSTR= <none>
##$CNST= (0..31)
1 1 145 1 1 1 1 1 1 1 1 1 1 1 1 1 1 1 1 1 1 1 1 1 1 1 1 1 1 1 1 1 
##$CPDPRG= <>
##$CPDPRG1= <>
##$CPDPRG2= <>
##$CPDPRG3= <>
##$CPDPRG4= <mlev>
##$CPDPRG5= <mlev>
##$CPDPRG6= <mlev>
##$CPDPRG7= <mlev>
##$CPDPRG8= <mlev>
##$CPDPRGB= <>
##$CPDPRGT= <>
##$D= (0..31)
0 1.2 0 0 0 0 0 0 0 0.06 0 0.03 0 0 0 0 0.0002 0 0 0 0 0 0 0 0 0 0 0 0 
0 0 0 
##$DATE= 1573468026
##$DBL= (0..7)
120 120 120 120 120 120 120 120 
##$DBP= (0..7)
150 150 150 150 150 150 150 150 
##$DBP07= 0
##$DBPNAM0= <>
##$DBPNAM1= <>
##$DBPNAM2= <>
##$DBPNAM3= <>
##$DBPNAM4= <>
##$DBPNAM5= <>
##$DBPNAM6= <>
##$DBPNAM7= <>
##$DBPOAL= (0..7)
0.5 0.5 0.5 0.5 0.5 0.5 0.5 0.5 
##$DBPOFFS= (0..7)
0 0 0 0 0 0 0 0 
##$DE= 6
##$DECBNUC= <off>
##$DECIM= 24
##$DECNUC= <off>
##$DECSTAT= 4
##$DIGMOD= 1
##$DIGTYP= 9
##$DL= (0..7)
0 120 120 120 120 120 120 120 
##$DP= (0..7)
150 150 150 150 150 150 150 150 
##$DP07= 0
##$DPNAME0= <>
##$DPNAME1= <>
##$DPNAME2= <>
##$DPNAME3= <>
##$DPNAME4= <>
##$DPNAME5= <>
##$DPNAME6= <>
##$DPNAME7= <>
##$DPOAL= (0..7)
0.5 0.5 0.5 0.5 0.5 0.5 0.5 0.5 
##$DPOFFS= (0..7)
0 0 0 0 0 0 0 0 
##$DQDMODE= 0
##$DR= 18
##$DS= 0
##$DSLIST= <SSSSSSSSSSSSSSS>
$$ [...]
##$SUBNAM2= <"">
##$SUBNAM3= <"">
##$SUBNAM4= <"">
##$SUBNAM5= <"">
##$SUBNAM6= <"">
##$SUBNAM7= <"">
##$SUBNAM8= <"">
##$SUBNAM9= <"">
##$SW= 24.0689530833862
##$SWIBOX= (0..15)
0 0 2 0 0 0 0 0 0 0 0 0 0 0 0 0 
##$SW_h= 4816.95568400771
##$TD= 16384
##$TD0= 1
##$TE= 0
##$TE2= 300
##$TE3= 300
##$TEG= 300
##$TL= (0..7)
0 120 120 120 120 120 120 120 
##$TP= (0..7)
150 150 150 150 150 150 150 150 
##$TP07= 0
##$TPNAME0= <>
##$TPNAME1= <>
##$TPNAME2= <>
##$TPNAME3= <>
##$TPNAME4= <>
##$TPNAME5= <>
##$TPNAME6= <>
##$TPNAME7= <>
##$TPOAL= (0..7)
0.5 0.5 0.5 0.5 0.5 0.5 0.5 0.5 
##$TPOFFS= (0..7)
0 0 0 0 0 0 0 0 
##$TUNHIN= 0
##$TUNHOUT= 0
##$TUNXOUT= 0
##$USERA1= <user>
##$USERA2= <user>
##$USERA3= <user>
##$USERA4= <user>
##$USERA5= <user>
##$V9= 5
##$VALIST= <valist>
##$VCLIST= <CCCCCCCCCCCCCCC>
##$VD= 0
##$VDLIST= <DDDDDDDDDDDDDDD>
##$VPLIST= <PPPPPPPPPPPPPPP>
##$VTLIST= <TTTTTTTTTTTTTTT>
##$WBST= 1024
##$WBSW= 4
##$XGAIN= (0..3)
0 0 0 0 
##$XL= 0
##$YL= 0
##$YMAX_a= 323890
##$YMIN_a= -291337
##$ZGOPTNS= <>
##$ZL1= 120
##$ZL2= 120
##$ZL3= 120
##$ZL4= 120
##$ABSF1= 10
##$ABSF2= 0
##$ABSG= 5
##$ABSL= 3
##$ALPHA= 0
##$AQORDER= 0
##$ASSFAC= 0
##$ASSFACI= 0
##$ASSFACX= 0
##$ASSWID= 0
##$AUNMP= <proc_1d>
##$AZFE= 0.1
##$AZFW= 0.1
##$BCFW= 1
##$BC_mod= 2
##$BYTORDP= 1
##$COROFFS= 0
##$CY= 11.3945322036743
##$DATMOD= 1
##$DC= 2
##$DFILT= <>
##$DTYPP= 0
##$F1P= 19.5091578491511
##$F2P= -0.509923556040331
##$FCOR= 0.5
##$FTSIZE= 0
##$FT_mod= 4
##$GAMMA= 1
##$GB= 0.15
##$INTBC= 1
##$INTSCL= 1
##$ISEN= 128
##$LB= 0.24
##$LEV0= 0
##$LPBIN= 0
##$MAXI= 10000
##$MC2= 0
##$MEAN= 0
##$ME_mod= 0
##$MI= 1.114404
##$NCOEF= 0
##$NC_proc= 0
##$NLEV= 6
##$NOISF1= 3.799351
##$NOISF2= 2.8
##$NSP= 1
##$NTH_PI= 0
##$NZP= 0
##$OFFSET= 15.70392
##$PC= 1
##$PHC0= -9461.152
##$PHC1= 25.80088
##$PH_mod= 1
##$PKNL= yes
##$PPARMOD= 0
##$PSCAL= 0
##$PSIGN= 0
##$REVERSE= no
##$SF= 200.130013532006
##$SI= 16384
##$SIGF1= 3
##$SIGF2= 2
##$SINO= 400
##$SIOLD= 16384
##$SREGLST= <1H.CDCl3>
##$SSB= 0
##$STSI= 0
##$STSR= 0
##$SW_p= 3612.71676300578
##$SYMM= 0
##$S_DEV= 0
##$TDeff= 0
##$TDoff= 0
##$TI= <>
##$TILT= no
##$TM1= 0
##$TM2= 0
##$TOPLEV= 0
##$USERP1= <user>
##$USERP2= <user>
##$USERP3= <user>
##$USERP4= <user>
##$USERP5= <user>
##$WDW= 1
##$XDIM= 8192
##$YMAX_p= 0
##$YMIN_p= 0
$$ End of Bruker specific parameters
$$ ---------------------------------
##NTUPLES= NMR FID
##VAR_NAME=  TIME,          FID/REAL,        FID/IMAG
##SYMBOL=    X,             R,               I
##VAR_TYPE=  INDEPENDENT,   DEPENDENT,       DEPENDENT
##VAR_FORM=  AFFN,          ASDF,            ASDF
##VAR_DIM=   8192,          8192,            8192
##UNITS=     SECONDS,       ARBITRARY UNITS, ARBITRARY UNITS
##FACTOR=    0.0002076,     1,               1
##FIRST=     0,             0,               0
##LAST=      1.7004516,     0,               0
##MIN=       0,             -291337,         0
##MAX=       1.7004516,     323890,          0
$$ Real data points
##PAGE= N=1
##DATA TABLE= (X++(R..R)), XYDATA
$$ [...]
$$ plain form
2275 -820 -703 -61 -289 -1233 -611 -88 -1350 -965 368 -527 -867 -1172 -369 307 -807 -702 269 -579 -1489
2294 -1489 -103 160 47 -871 -633 692 111 -1115 -629 657 348 -1139 -332 1207 -128 -584 603
2311 603 1216 -374 -206 422 1236 -35 -171 1253 954 -95 116 1316 1410 387 717 1952 484 -245
2329 -245 1006 1979 755 39 852 1142 402 20 1331 1638 235 43 1378 1304 1127 512 1994 1146
2347 1146 600 670 1333 1053 470 402 1262 727 290 418 1117 623 197 -234 1161 673 -373 -40 657 443
2367 443 -406 -152 424 -592 -1119 -369 -82 -650 -1024 -274 -389 -1014 -1432 225 421 -1348 -965 306 -434
2386 -434 -1316 -1384 158 -819 -2207 -1735 -462 -1258 -1998 -970 -840 -1554 -2096 -972 -740 -1558 -2238 -1049
2404 -1049 -468 -1785 -1875 -1070 -978 -1439 -1722 -422 -1174 -1877 -1467 -540 -976 -1118 -1421 -611 -268 -1170 -911 -62
$$ packed form
2275h20J17O42k28r44O22N23j262L85J333q95l40l05Q03O76j114J05R71q48r10
2294a489J386K63j13r18K38J325n81j226M86J286l09j487Q07J539j335m56J187
2311F03O13j590J68O28Q14j271j36J424k99j049K11J200R4j023L30J235j468p29
2329b45J251R73j224p16Q13K90p40l82J311L07j403j92J335p4j77o15J482q48
2347A146n46P0O63k80n83o8Q60n35m37J28O99m94m26m31J395m88j046L33O97k14
2367D43q49K54N76j016n27P50K87n68l74P50j15o25m18J657J96j769L83J271p40
2386d34q82o8J542r77j388M72J273p96p40J028J30p14n42J124K32q18o80J189
2404a049N81j317r0Q05R2m61k83J300p52p03M10R27m36j42l03Q10L43r02K59Q49
$$ plain form
2424 -62 -259 -1233 -736 -2 -655 -1222 -313 236 -145 -397 -163 883 -493 -478 395 1058 455 -176 1241 1411
2444 1411 201 195 1113 1119 221 -223 1300 777 -284 74 1442 678 136 89 1122 458 -180 1148 1410
2463 1410 568 -160 1136 1308 717 580 890 1662 325 559 1553 1344 575 440 1389 943 900 907 1030 974
2483 974 515 593 432 311 -414 300 885 461 -243 312 218 369 -252 -223 512 98 -192 557 211 -117 -629
2504 -629 -305 443 -785 -779 138 147 -515 -1023 240 126 -1233 -1285 -276 -95 -987 -703 -328 -34 -1235 -738
2524 -738 164 -1180 -1430 -838 -97 -822 -844 -263 -267 -671 -622 159 244 -1198 -783 88 -164 -1272 -561 -66 -220
2545 -220 -789 -1311 231 -155 -387 -106 486 52 -1116 737 301 -351 -770 86 -205 -272 -133 742 525
2564 525 -578 -240 168 378 386 -43 387 376 -9 514 1126 742 -36 89 559 950 427 -87 856 766 0
$$ packed form
2424f2j97r74M97P34o53n67R09N49l81k52K34J046j376J5Q73O63o03o31J417J70
2444A411j210oR18Oq98m44J523n23j061L58J368p64n42m7J033o64o38J328K62
2463A410q42p28J296J72n91j37L10P72j337K34R94k09p69j35R49m46m3PJ23n6
2483I74m59P8j61j21p25P14N85m24p04N55r4J51o21K9P35m14k90P49l46l28n12
2504f29L24P48j228OR17Ro62n08J263j14j359n2J009J81q92K84L75K94j201M97
2524g38R02j344k50N92P41p25k2N81mm04M9P81Q5j442M15Q71k52j108P11M95j54
2545b20n69n22J542l86k32K81N92m34j168J853m36o52m19Q56k91o7J39Q75k17
2564E25j103L38M08K10Qm29M30j1l85N23O12l84p78J25M70L91n23n14R43r0p66
$$ plain form
2585 0 915 1435 1232 201 419 1471 1063 12 754 1664 1234 725 1024 1498 584 604 1247 1160 491 581 1112
2606 1112 948 310 115 581 608 -202 -428 893 917 -611 -260 242 48 -487 -577 132 -243 -785 2 548
2626 548 -641 -650 56 -244 -831 -654 448 -36 -1034 -445 -30 -456 -1248 -1014 -95 -525 -1616 -819 -542 -641
2646 -641 -1031 -1029 -785 -979 -1115 -1059 -821 -648 -1438 -606 -974 -896 -1296 -740 -902 -1209 -1395 -861 -841 -1460 -831 -526
2668 -526 -273 -851 -1537 -655 -472 -771 -1254 -415 -437 -752 -577 206 -423 -621 -553 589 240 -407 122 566
2688 566 -47 -866 -65 1045 -126 -451 315 665 -223 -150 1139 359 -409 102 775 546 53 286 883
2707 883 545 463 531 1209 408 -13 774 1128 226 560 965 986 200 862 1628 958 327 627 959 401 346
2728 346 383 443 344 727 568 671 705 259 228 68 200 529 -103 833 330 -106 -13 162 326 -376 421 649
$$ packed form
2585@R15N20k03j031K18J052m08j051P42R10m30n09K99M74r14K0O43q7o69R0N31
2606A112j64o38j95M66K7q10k26J321K4j528L51N02j94n35r0P09l75n42P87N46
2626E48j189rP06l00n87J77J102m84r98N89M15m26p92K34R19m30j091P97K77r9
2646f41l90KK44j94j36N6K38J73p90Q32l68P8m00N56j62l07j86N34K0o19O29L05
2668e26K53n78o86Q82J83k99m83Q39k2l15J75P83o29j98O8J142l49o47N29M44
2688E66o13q19Q01J110j171l25P66L50q88P3J289p80p68N11O73k29m93K33N97
2707H83l38q2O8O78q01m21P87L54r02L34M05K1p86O62P66o70o31L00L32n58n5
2728C46L7O0r9L83j59J03L4m46l1j60J32L29o32R36n03m36R3J75J64p02P97K28
$$ plain form
2750 649 489 -597 -700 715 -17 -538 134 874 -492 -1058 104 506 -603 -972 140 -221 -751 -735
2768 -735 721 -87 -1178 -734 368 -328 -693 -455 -5 -593 -956 -311 148 -1294 -800 -147 -36 -483 -556
2787 -556 -158 100 -716 -430 -234 -728 -558 -326 -215 -224 -230 -561 356 21 29 -232 -352 -206 626 191 547 214
2809 214 100 379 608 5 35 -88 1338 870 199 479 1499 982 264 976 1427 233 64 1015 1508
2828 1508 602 441 1436 1552 496 174 1701 1057 114 940 1488 814 56 759 1348 990 150 629 1677
2847 1677 684 437 991 1139 112 297 1300 575 135 676 1040 33 117 225 574 300 -337 1 16
2866 16 -392 30 -512 -240 248 -114 -116 -442 20 -230 -604 131 -529 -650 -719 -309 -436 -1155 -630 -33 -418
2887 -418 -849 -990 -1100 -1243 -951 -210 -32 -1076 -1179 -460 -519 -1733 -914 -479 -778 -1476 -396 -272 -584
$$ packed form
2750F49j60j086j03J415p32n21O72P40j366n66J162M02j109l69J112l61n30J6
2768g35J456q08j091M44J102o96l65K38M50n88l63O45M59j442M94O53J11m47p3
2787e56L98K58q16K86J96m94J70K32J11rol31R17l35Qk61j20J46Q32m35L56l33
2809B14j14K79K29o03L0j23J426m68o71K80J020n17p18P12M51j194j69R51M93
2828A508r06j61R95J16j056l22J527o44r43Q26N48o74p58P03N89l58q40M79J048
2847A677r93k47N54J48j027J85J003p25m40N41L64j007Q4J08L49k74o37L38J5
2866A6m08M22n42K72M88l62kl26M62k50l74P35o60j21o9M10j27p19N25N97l85
2887d18m31j41j10j43K92P41J78j044j03P19n9j214Q19M35k99o98J080J24l12
$$ plain form
2906 -584 -1277 -1111 -709 -571 -1542 161 -164 -924 -1167 -362 -835 -1177 -688 162 -132 -799 -974 -191 -165 -931
2926 -931 -136 240 -202 -559 -298 -303 198 205 -88 102 76 -303 257 111 123 -78 -53 406 293 286 289 817 779 -436
2950 -436 820 819 670 323 1037 538 500 81 648 716 -24 -150 351 246 63 592 536 585 607 565 885 267
2972 267 -74 399 740 158 -21 818 840 -7 156 608 883 -114 -66 347 490 140 348 254 350 168 -352
2993 -352 704 241 -267 235 277 -428 -165 101 555 -241 -394 -59 189 -361 -887 -236 -149 -605 -703 -297 -225
3014 -225 -768 -497 -318 -388 -550 -742 -175 292 -1191 -626 -208 -356 -884 -190 -15 -464 -848 -589 -559 -304
3034 -304 -525 -791 160 -356 -708 29 124 -634 -756 -498 213 -812 -466 -424 -553 -620 -461 -73 -243 -542 -222
3055 -222 209 -174 -787 -488 361 267 -700 -341 -470 -738 128 -84 627 235 61 825 871 475 -303 685 1387
$$ packed form
2906e84o93J66M02J38r71J703l25p60k43Q05m73l42M89Q50k94o67j75P83K6p66
2926i31P95L76m42l57K61nN01Pk93J90k6l79N60j46J2k01K5M59j13pLN28l8j215
2950d36J256jj49l47P14m99l8m19N67O8p40j26N01j05j83N29n6M9K2m2L20o18
2972B67l41M73L41n82j79Q39K2q47J63M52K75r97M8M13J43l50K08r4R6j82n20
2993c52J056m63n08N02M2p05K63K66M54p96j53L35K48n50n26O51Q7m56r8M06P2
3014b25n43K71J79p0j62j92N67M67j483N65M18j48n28O94J75m49l84K59L0K55
3034c04k21k66R51n16l52P37R5p58j22K58P11j025L46M2j29o7J59L88j70k99L20
3055b22M31l83o13K99Q49r4r67L59j29k68Q66k12P11l92j74P64M6l96p78R88P02
$$ plain form
3076 1387 806 947 703 782 498 89 838 1000 638 730 802 1537 321 1072 1288 629 838 976 849 835 965
3097 965 1005 641 569 460 790 459 217 164 456 749 72 251 423 574 156 -163 -57 414 711 -95 500
3118 500 -114 -94 -230 681 295 -616 -247 511 -231 -308 -201 -204 42 -378 -20 -50 -359 -710 -283 -501 -400 -460
3140 -460 -541 -681 -764 -854 -222 -902 -877 -829 -696 -908 -886 -971 -880 -333 -1046 -1119 -396 -717 -1095 -740 -195 -567 -1139
3163 -1139 -635 -531 -631 -602 -297 -538 -168 -758 -713 99 -744 163 -67 118 -280 -505 212 311 -490 -266 527
3184 527 418 80 107 17 -43 -140 231 855 536 -282 -255 482 636 -347 240 716 536 -64 443 373 70 -56
3206 -56 495 561 305 28 462 179 403 405 1301 468 333 357 1146 296 248 554 179 60 -88 -54 389 575
3228 575 70 909 527 302 527 647 127 -244 424 34 76 36 -300 71 86 -121 -263 22 69 -399 77
$$ packed form
3076A387n81J41k44P9k84m09P49J62l62R2P2P35j216P51K16o59K09J38j27j4J30
3097I65M0l64p2j09L30l31k42n3K92K93o77J79J72J51m18l19J06M71K97q06N95
3118E00o14K0j36R11l86r11L69P58p42p7J07lK46m20L58l0l09l51M27k18J01o0
3140d60q1j40q3r0O32o80K5M8J33k12K2q5R1N47p13p3P23l21l78L55N45l72n72
3163a139N04J04j00K9L05k41L70n90M5Q12q43R07k30J85l98k25P17R9q01K24P93
3184E27j09l38K7r0o0r7L71O24l19q18K7P37J54r83N87M76j80o00N07p0l03j26
3206e6N51O6k56k77M34k83K24KQ96q33j35K4P89q50m8L06l75j19j48L4M43J86
3228E75n05Q39l82k25K25J20n20l71O68l90M2m0l36L71J5k07j42K85M7m68M76
$$ plain form
3249 77 -369 -256 60 -125 -57 -76 19 -234 -298 111 -220 -814 -538 -591 -569 -353 -212 -492 -475 -518 -176 -151 -382
3272 -382 -166 -125 -652 -374 -640 -35 -272 -511 -315 -371 -779 -290 199 -515 -338 -578 -2 -247 -419 -252 -261
3293 -261 -823 -461 288 -35 -409 244 176 56 -27 -419 227 -397 43 -164 -301 138 487 -72 415 119 249
3314 249 -84 92 -260 -23 -20 394 590 557 500 451 679 324 325 426 633 -139 286 695 534 387 316 1141 665
3337 665 249 927 921 577 93 1502 745 247 631 785 702 148 487 488 159 12 64 507 175 -82 742 648
3359 648 -34 -228 819 228 -483 -428 108 364 -52 83 312 186 -190 56 516 -72 -433 -130 -122 -518 -185
3380 -185 -404 -273 -62 -357 -200 -813 -509 -314 -373 -719 -781 -431 -671 -337 -31 -805 -64 -230 -820 -293 -747
3401 -747 149 -845 -831 -229 -171 -902 -195 -135 -195 -205 -649 -568 -631 -352 -202 -521 -208 -463 -424 -442 -324 -573 -656
$$ packed form
3249G7m46J13L16j85O8j9R5k53o4M09l31n94K76n3K2K16J41k80J7m3L42K5k31
3272c82K16M1n27K78k66O05k37k39J96n6m08M89M89p14J77k40N76k45j72J67r
3293b61n62L62P49l23l74O53o8j20q3l92O46o24M40k07j37M39L49n59M87k96J30
3314B49l33J76l52K37LM14J96l3n7m9K28l55JJ01K07p72M25M09j61j47p1Q25m76
3337F65m16O78ol44m84J409p57m98L84J54q3n54L39Jl29j47N2M43l32k57Q24r4
3359F48o82j94J047n91p11N5N36K56m16J35K29j26l76K46M60n88l61L03Ql96L33
3380a85k19J31K11k95J57o13L04J95n9l46o2L50k40L34L06p74P41j66n90N27m54
3401g47Q96r94J4O02N8p31P07O0o0j0m44Q1o3K79J50l19L13k55L9j8J18k49q3
$$ plain form
3424 -656 227 -582 -604 -454 -79 -262 52 294 -307 -312 -353 -97 203 132 -190 -109 360 26 617 318 115 154
3446 154 -373 551 470 54 515 612 214 169 723 654 508 416 562 841 600 507 914 796 289 -140 984 784
3468 784 409 281 417 341 732 -212 732 1110 342 810 648 491 22 179 669 611 242 497 419 287 470
3489 470 407 581 491 -63 195 234 -15 2 -144 555 -695 -188 216 278 -133 -256 -21 -162 -234 -784 -95 -303
3511 -303 -728 -472 -400 -289 -626 -201 -299 -500 -1353 -700 -76 -397 -127 -223 -351 -573 -829 -90 -307 -1104 -562
3532 -562 -210 -138 -686 -417 -305 -922 -351 -100 -213 -250 -439 -24 -437 -808 -520 -165 -171 -328 -843 -19 -81 -318
3554 -318 -662 45 -289 201 -47 -128 219 503 -56 15 119 208 477 92 -12 -420 107 764 -131 -229 554
3575 554 367 524 423 384 565 1067 331 442 564 716 89 236 288 901 178 869 665 138 457 636 994
$$ packed form
3424f56Q83q09k2J50L75j83L14K42o01nm1K56L00p1l22Q1M69l34N91k99k03L9
3446A54n27R24q1m16M61R7l98m5N54o9j46r2J46K79k41r3M07j18n07m29J124k00
3468G84l75j28J36p6L91r44R44L78p68M68j62j57m69J57M90n8l69K55p8j32J83
3489D70o3J74r0n54K58L9k49J7j46O99j250N07M04O2m11j23K35j41p2n50O89k08
3511c03m25K56P2J11l37M25r8k01q53O53O24l21K70r6j28k22k56P39k17p97N42
3532e62L52P2n48K69J12o17N71K51j13l7j89M15m13l71K88L55oj57n15Q24o2k37
3554c18l44P07l34M90k48q1L47K84n59P1J04Q9K69l85j04m08N27O57q95r8P83
3575E54j87J57j01l9J81N02p36J11J22J52o27J47N2O13p23O91k04n27L19J79L58
$$ plain form
3596 994 185 436 359 418 -185 490 242 354 126 578 310 216 151 -129 163 537 180 -151 433 240 -75
3617 -75 600 48 -60 -97 -432 -221 -6 84 -283 -104 -289 -168 -208 -530 -660 -494 -196 -178 -814 -604 -454 -477
3639 -477 -196 -703 -255 -115 -810 -611 35 -80 -210 -492 -152 -203 -717 -657 -408 -342 -321 -544 -442 -824 -530
3660 -530 -212 -487 -455 -269 -340 -361 -537 -157 -157 -374 -375 -773 70 -56 -576 -118 -445 -675 -518 -13 127 -171
3682 -171 -142 7 -172 -378 11 -174 -43 -7 -106 308 326 -351 615 431 60 160 79 349 417 165 512 459
3704 459 615 -160 448 109 321 363 239 217 562 -59 67 595 652 568 74 170 -131 519 728 618 257 218
3726 218 534 30 229 -14 396 442 -32 131 694 234 -90 657 402 264 143 -333 -65 66 -348 560
3746 560 -47 -28 9 -738 -140 302 111 -131 262 -75 76 -259 -409 148 -233 -22 -523 -601 -335 -240 -159 -306
$$ packed form
3596I94q09K51p7N9o03O75k48J12k28M52k68r4o5k80K92L74l57l31N84j93l15
3617g5O75n52j08l7l35K11K15R0l67J79j85J21m0l22j30J66K98J8o36K10J50k3
3639d77K81n07M48J40o95J99O46j15j30k82L40n1n14O0K49O6K1k23J02l82K94
3660e30L18k75L2J86p1k1j76L80%k17jl98Q43j26n20M58l27k30J57N05J40k98
3682a71K9J49j79k06L89j85J31L6r9M14J8o77R66j84l71J00q1K70O8k52L47n3
3704D59J56p75O08l39K12M2j24k2L45o21J26N28N7q4m94R6l01O50K09j10l61l9
3726B18L16n04J99k43M10M6m74J63N63m60l24P47k55j38j21m76K68J31m14R08
3746E60o07J9L7p47N98M42j91k42L93l37J51l35j50N57l81K11n01p8K66R5Q1j47
$$ plain form
3768 -306 -385 -472 54 -402 -263 -569 -322 -185 243 -585 -271 -428 -172 -191 -538 131 275 -588 -777 9 -131
3789 -131 -287 -19 -338 -208 -380 -688 -48 -113 95 -192 -860 379 -362 50 -324 -213 -187 -545 52 464
3809 464 -431 -199 206 752 -58 213 253 572 -126 84 344 303 -17 4 265 345 396 199 414 679 164 675
3831 675 564 86 465 292 131 516 519 195 480 416 118 284 468 313 674 700 292 70 680 62 558
3852 558 259 311 312 303 -12 805 490 -230 -153 -111 260 487 369 421 22 41 -196 137 716 -19 -618 -166 -220
3875 -220 149 -2 -291 -398 -202 -222 -308 -55 -476 -790 -213 -413 -310 -477 -284 147 -243 -562 -360 -560 -508
3896 -508 -165 -454 -210 -343 -479 164 -380 -344 -183 -273 -711 -72 193 -73 -864 -700 -509 -169 -497 -703 -69
3917 -69 -585 -521 -326 -201 -154 -335 247 -606 -419 -217 215 -60 -115 -462 -295 -327 42 -366 -79 63 123 410
$$ packed form
3768c06p9q7N26m56J39l06K47J37M28q28L14j57K56j9l47O69J44q63j89P86j40
3789a31j56K68l19J30j72l08O40o5K08k87o68J239p41M12l74J11K6l58N97M12
3809D64q95K32M05N46q10K71M0L19o98K10K60m1l20K1K61Q0N1j97K15K65n15N11
3831F75j11m78L79j73j61L85Ll24K85o4k98J66J84j55L61K6m08k22O10o18M96
3852E58k99N2Jrl15Q17l15p20P7M2L71K27j18N2l99J9k37L33N79p35n99M52n4
3875b20L69j51k89j07J96k0q6K53m21l14N77k00J03j67J93M31l90l19K02k00N2
3896e08L43k89K44j33j36O43n44L6J61r0m38O39K65k66p91J64J91L40l28k06O34
3917f9n16O4J95J25M7j81N82q53J87K02M32k75n5l47J67l2L69m08K87J42O0K87
$$ plain form
3939 410 300 -164 -252 419 68 406 137 116 79 572 117 -81 604 129 508 330 580 560 3 32 752 963
3961 963 42 803 209 493 408 893 449 -194 300 699 1196 437 123 651 649 203 455 159 -32 247 -264
3982 -264 721 -34 -383 -305 161 -56 237 -42 -84 -189 119 124 53 13 -428 305 67 -469 -386 -118 -192 -197 79
4005 79 169 -156 -366 -275 -78 -298 -254 -274 -49 -290 -350 -245 -1033 181 -481 -304 -654 -856 -860 -760 -137 -210 -521
4028 -521 -475 -235 -153 -854 -349 -234 -83 5 -164 -155 -421 -509 -314 -292 189 157 123 149 149 123 -289 -299 28 195 276
4053 276 -295 342 -337 -194 176 -127 488 185 6 78 265 -53 26 484 617 259 285 52 -133 92 -111
4074 -111 246 174 334 -307 173 229 799 -180 322 425 156 83 -339 166 165 -99 118 472 237 -43 5 326
4096 326 384 266 191 -212 232 441 356 557 207 -65 674 97 -251 272 -232 513 182 -75 477 318 -238
$$ packed form
3939D10j10m64q8O71l51L38k69k1l7M93m55j98O85m75L79j78K50k0n57K9P20K11
3961I63r21P61n94K84q5M85m44o43M94L99M97p59l14N28km46K52k96j91K79n11
3982b64R85p55l49P8M66k17K93k79m2j05L08Np1m0m41P33k38n36Q3K68p4nK76
4005G9R0l25k10R1J97k20M4k0K25k41o0J05p88J214o62J77l50k02mJ00O23p3l11
4028e21M6K40Q2p01N05J15J51Q8j69Rk66q8J95K2M81l2l4K6%k6m12j0L27J67Q1
4053B76n71O37o79J43L70l03O15l03j79P2J87l18P9M58J33l58K6k33j85K25k03
4074a11L57p2J60o41M80N6N70r79N02J03k69p3m22N05jk64K17L54k35k80M8L21
4096C26N8j18p5m03M44K09q5K01l50k72P39n77l48N23n04P45l31k57N52j59n56
$$ plain form
4117 -238 257 -191 -117 158 125 409 -188 -434 -19 -252 -296 -672 -4 -258 -561 -24 13 -191 90 29 -248 -71
4139 -71 -97 -99 -84 -553 -26 -26 -449 -223 -653 -512 -447 -788 -450 -382 -99 169 -34 -671 66 -176 -222 -394 -148
4162 -148 329 -575 -490 -327 -6 -603 -487 -958 -104 -253 -233 -268 3 1 -14 -80 -134 -394 -69 -320 -274 -125 125
4185 125 -667 -728 77 -385 -116 -561 -136 126 250 -240 153 194 -94 115 517 324 -204 298 598 -89 220
4206 220 691 4 -170 315 332 675 73 123 -132 67 234 485 466 -19 251 662 112 405 -259 328 -161
4227 -161 55 653 129 577 719 -109 775 323 -480 449 146 -151 -75 259 371 -23 -245 46 30 -193 -421
4248 -421 -131 -116 -71 295 -50 226 232 -517 -228 -58 12 95 -366 -646 -243 -203 -379 -316 -351 -355 -612 38 -591 -179
4272 -179 -95 185 -236 -621 -326 -437 130 -771 -391 -123 -168 409 -98 121 -491 -40 -163 -429 -240 233 -90
$$ packed form
4117b38M95m48P4K75l3K84n97k46M15k33m4l76O68k54l03N37L7k04K81o1k77J77
4139g1k6kJ5m69N27%m23K26m30J41O5l41L38O8K83K68k03o37P37k42m6j72K46
4162a48M77r04Q5J63L21n97J16m71Q54j49K0l5K71kj5o6n4k60L25k51M6J49K50
4185A25p92o1Q05m62K69m45M25K62J24m90L93M1k88K09M02j93n28N02L00o87L09
4206B20M71o87j74M85J7L43o02N0k55J99J67K51j9m85K70M11n50K93o64N87m89
4227a61K16N98n24M48J42q28Q84m52q03R29l03k97P6L34J12l94k22K91j6k23k28
4248d21K90J5M5L66l45K76Op49K89J70P0Q3m61k80M03M0j76O3l5mk57O50o29M12
4272a79Q4K80m21l85K95j11N67r01L80K68m5N77n07K19o12M51j23k66J89M73l23
$$ plain form
4293 -90 -111 -181 90 -663 -390 142 -481 128 -20 -106 147 -349 -481 109 275 709 267 418 395 286 -165 -576
4315 -576 383 64 -273 150 -99 319 480 342 331 259 333 287 -26 407 260 -295 275 -98 507 327 670
4336 670 462 -324 526 456 -206 526 165 -29 19 630 -141 242 21 211 586 75 125 24 55 59 108 28 169
4359 169 200 436 168 230 138 18 -339 417 147 -220 -291 118 310 172 -35 -418 268 560 -263 158 -446
4380 -446 -83 97 -94 -269 -64 120 -57 140 -526 -251 227 -200 -94 -119 -545 98 200 -543 -127 -226 -364
4401 -364 -259 -430 -427 -74 306 -149 214 -140 -22 -527 -687 -58 17 -380 -172 -381 -66 -181 41 566 99
4422 99 90 -633 -201 -196 -251 -239 -76 -35 -258 -445 39 -254 -4 82 237 79 500 -116 315 193 389 524 144
4445 144 318 334 149 531 290 153 354 123 502 521 500 -59 -250 -298 -66 -54 233 405 63 37 -46 176
$$ packed form
4293i0k1p0K71p53K73N32o23O09j48q6K53m96j32N90J66M34m42J51k3j09m51m11
4315e76R59l19l37M23k49M18J61j38j1p2P4m6l13M33j47n55N70l73O05j80L43
4336F70k08p86Q50p0o62P32l61j94M8O11p71L83k21J90L75n11N0j01L1MM9q0J41
4359A69L1K36k68O2r2j20l57P56k70l67p1M09J92j38k07l83O86K92q23M21o04
4380d46L63J80j91j75K05J84j77J97o66K75M78m27J06k5m26O43J02p43M16r9j38
4401c64J05j71LL53L80m55L63l54J18n05j60O29P5l97K08k09L15j15K22N25m67
4422I9rp23M32Nn5J2J63M1k23j87M84k93K50Q6J55j58M21o16M31j22J96J35l80
4445A44J74J6j85L82k41j37K01k31L79J9k1n59j91m8K32J2K87J72l42k6q3K22
$$ plain form
4467 176 511 426 431 154 539 295 546 125 -82 398 546 356 56 16 -219 -85 229 301 321 178 219 415
4489 415 125 425 116 -75 446 38 -108 128 309 -4 163 80 -87 -4 -162 -304 50 247 396 -373 -88
4510 -88 697 -197 -102 -444 -83 135 -148 -409 -170 -38 -15 -485 -352 -130 195 279 -396 -358 -564 271 -667 -540
4532 -540 -135 349 -402 -178 -204 -176 -295 102 134 -375 -285 -164 -529 -16 -514 171 186 44 115 -199 380 92
4554 92 -235 9 185 31 -121 -92 78 -530 279 256 587 634 -148 121 177 -392 -290 180 205 6 -48 42 242
4577 242 -333 418 297 179 -349 92 -118 28 422 620 -23 319 -115 -216 421 -97 -402 41 497 241
4597 241 534 751 402 253 454 121 332 72 273 618 621 -239 -370 443 -166 -238 -72 -14 20 -371 9 -206
4619 -206 -42 -37 -189 37 82 -83 -359 -234 -84 274 106 205 46 -146 -251 -272 -113 -501 31 -250 -147 -319
$$ packed form
4467A76L35q5Nk77L85k44K51m21k07M80J48j90l00m0k35J34L14P2K0j43M1J96
4489D15k90L00l09j91N21m08j46K36J81l13J67q3j67Q3j58j42L54J97J49p69K85
4510h8P85q94R5l42L61K18k83k61K39J32K3m70J33K22L25Q4o75L8k06Q35r38J27
4532e40M05M84p51K24k6K8j19L97L2n09R0J21l65N13m98O85J5j42P1l14N79k88
4554I2l27K44J76j54j52K9J70o08Q09k3L31M7p82K69N6n69J02M70K5j99n4R0K00
4577B42n75P51j21j18n28M41k10J46L94J98o43L42m34j01O37n18l05M43M56k56
4597B41K93K17l49j49K01l33K11k60K01L45Lq60j31Q13o09p2J66N8L4l91L80k15
4619b06J64Nj52K26M5j65k76J25J50L58j68R9j59j92j05k1J59l88N32k81J03j72
$$ plain form
4641 -319 175 482 -166 -479 -90 -7 8 -489 -564 -443 -249 -258 -170 -10 -383 -69 -359 -530 -509 -149 -95 -88 -107 -533
4665 -533 -381 174 -111 117 220 96 -340 137 -49 -82 -224 -183 -314 217 68 -206 71 -380 206 -483 -31
4686 -31 38 100 -80 27 524 394 67 85 -183 -190 -380 124 -432 -165 571 357 398 600 282 297 239 507 243
4709 243 83 -67 -493 180 217 693 -29 671 253 55 403 215 524 250 462 377 64 5 306 -222 -173
4730 -173 279 -287 20 295 552 -172 58 -134 464 19 -35 236 -113 406 148 304 -438 -134 29 -125
4750 -125 -389 -163 84 -31 438 -323 -181 -187 -243 236 -78 -222 -56 375 -246 -164 -206 -253 -603 215 139 -68
4772 -68 -444 -558 -135 1 -480 -220 104 -294 -337 -392 -327 -158 94 -130 -1 -133 -312 -377 219 164 -269 177
4794 177 -299 -345 -331 3 -386 101 463 -395 -376 284 -86 85 121 -194 -49 271 239 540 298 -2 -95 172
$$ packed form
4641c19M94L07o48l13L89Q3J5m97p5J21J94rQ8J60l73L14k90j71K1L60N4Pj9m26
4665e33J52N55k85K28J03j24m36M77j86l3j42M1j31N31j49k74K77m51N86o89M52
4686c1O9O2j80J07M97j30l27J8k68pj90N04n56K67P36k14M1K02l18J5n8K68k64
4709B43j60j50m26O73L7M76p22P00m18j98L48j88L09k74K12q5l13n9L01n28M9
4730a73M52n66L07K75K57p24K30j92N98m45n4K71l49N19k58J56p42L04J63j54
4750a25k64K26K47j15M69p61J42on6M79l14j44J66M31o21Q2m2m7l50Q18p6k07
4772f8l76j14M23J36m81K60L24l98m3n5O5J69K52k24J29j32j79o5N96n5m33M46
4794A77m76m6J4L34l89M87L62q58J9O60l70J71L6l15J45L20l2L01k42l00r3K67
$$ plain form
4816 172 272 -232 -184 126 172 -40 10 481 549 241 -35 -300 301 -145 41 -105 360 -81 367 35 -144
4837 -144 436 -144 242 155 487 208 713 282 -424 -96 546 83 -407 674 603 -160 243 -65 107 36 -449
4858 -449 132 -349 -228 655 -108 -231 -320 183 -296 27 14 232 87 -468 236 -260 864 141 -40 -216
4878 -216 -368 336 -329 -12 362 -100 -15 -59 -327 -212 -11 -80 -241 -50 385 -311 -156 -258 -479 -315 -380
4899 -380 -19 -509 -298 182 109 -422 -86 -265 -115 -33 -323 -334 -48 -445 -262 339 43 -94 -404 -250 -142
4920 -142 -210 -124 -8 -213 -302 233 -228 -251 -157 234 -235 145 -144 39 176 -367 -447 37 -50 -57 230 -114 -250
4943 -250 -111 -83 359 367 -482 187 186 -234 353 -11 352 456 286 33 227 553 -223 -157 169 512 -191 259
4965 259 479 193 -56 186 324 366 -1 382 2 -190 -376 67 403 201 459 -358 45 237 122 -200
$$ packed form
4816A72J00n04M8L10M6k12N0M71O8l08k76k65O01m46J86j46M65m41M48l32j79
4837a44N80n80L86q7L32k79N05m31p06L28O42m63m90J081p1p63M03l08J72p1m85
4858d49N81m81J21Q83p63j23q9N03m79L23j3K18j45n55P04m96J124p23j81j76
4878b16j52P04o65L17L74m62Q5m4k68J15K01o9j61J91M35o96J55j02k21J64o5
4899c80L61m90K11M80p3n31L36j79J50Q2k90j1K86l97J83O01k96j37l10J54J08
4920a42o8Q6J16k05q9N35m61k3R4L91m69L80k89J83J37n43q0M84q7pK87l44j36
4943b50J39K8M42Qq49O69jm20N87l64L63J04j70k53J94L26p76O6L26L43p03M50
4965B59K20k86k49K42J38M2l67L83l80j92j86M43L36k02K58q17M03J92j15l22
$$ plain form
4985 -200 538 -347 -314 284 197 304 -131 125 13 -90 -270 352 -287 39 222 103 404 -56 -227 15 -103
5006 -103 -86 -483 191 -361 -365 117 62 -549 -202 -63 111 104 -252 -256 -117 -520 206 -206 -315 -129 -286 176 -622
5029 -622 -367 -197 -176 86 69 -590 43 -544 38 -288 -210 6 -287 -270 -285 -420 -12 171 -138 -433 238 132
5051 132 -9 -112 -202 -170 -100 69 179 -129 187 50 593 283 70 252 314 -392 465 674 -81 199 -213
5072 -213 193 242 -130 159 -340 345 136 256 -143 255 31 643 384 -10 66 342 -37 262 519 -145 100
5093 100 11 350 200 352 148 -358 -357 470 -117 115 309 355 12 353 -88 670 219 232 283 -34 462 559
5115 559 62 -67 -42 11 178 200 -165 109 -25 -142 127 -238 -334 -180 116 197 -327 -286 -115 -269 -166 -306
5137 -306 -637 -270 -181 -326 -117 -317 -179 -322 -725 -175 72 -259 -496 57 -338 -686 -674 -132 -44 -153 -169
$$ packed form
4985b00P38q85L3N98q7J07m35K56j12j03j80O22o39L26J83j19L01m60j71K42j18
5006a03J7l97O74n52mM82n5o11L47J39J74pl56mJ39m03P26m12j09J86j57M62p98
5029f22K55J70K1K62j7o59O33n87N82l26P8K16k93J7j5j35M08J83l09k95O71j06
5051A32j41j03r0L2P0J69J10l08L16j37N43l10k13J82O2p06Q57K09p55K80m12
5072b13M06M9l72K89m99O85k09J20l99L98k24O12k59l94P6K76l79K99K57o64K45
5093A00q9L39j50J52k04n06JQ27n87K32J94M6l43L41m41P58m51J3N1l17M96R7
5115E59m97j29K5N3J67K2l65K74j34j17K69l65r6J54K96Q1n24M1J71j54J03j40
5137c06l31L67Q9j45K09k00J38j43m03N50K47l31k37N53l95l48J2N42Q8j09j6
$$ plain form
5158 -169 -489 319 -31 -423 -354 -250 -413 79 -569 -6 67 -228 -203 -385 84 -283 -22 196 -259 -233 217
5179 217 385 308 -295 -98 -61 -354 305 -41 -150 429 -89 -359 205 -8 327 148 263 -134 191 267 -246
5200 -246 626 138 -183 252 131 -163 544 -42 170 45 308 -374 340 -279 361 -106 24 249 24 306
5220 306 89 375 -61 113 81 49 -188 159 576 167 -648 -69 -205 343 246 162 -14 -122 -183 664 -11 102
5242 102 -207 -646 126 304 12 88 206 233 147 -76 90 -250 -342 -33 -331 121 429 -655 -53 -46 -67 -348
5264 -348 -47 311 -358 196 51 -31 -161 2 95 261 -531 -506 -181 -80 -371 -163 -485 3 -446 -420 -378 -498
5286 -498 -18 -265 -168 -473 -414 -38 -149 -166 -421 137 -176 -234 220 -323 -499 -239 40 113 -78 366 272 -154
5308 -154 -125 -65 -244 91 -256 343 -14 2 338 104 -78 -82 33 52 -94 237 216 -213 -7 162 397 -214
$$ packed form
5158a69l20Q08l50l92O9J04j63M92o48N63P3k95K5j82M69l67K61K18m55K6M50
5179B17J68p7o03J97L7k93O59l46j09N79n18k70N64k13L35j79J15l97L25P6n13
5200b46Q72m88l21M35j21k94P07n86K12j25K63o82P14o19O40m67J30K25k25K82
5220C06k17K86m36J74l2l2k37L47M17m09q15N79j36N48r7q4j76j08o1Q47o75J13
5242A02l09m39P72J78k92P6J18K7q6k23J66l40r2L09k98M52L08j084O02Pk1k81
5264c48L01L58o69N54j45q2j30J63R3J66p92K5L25J01k91K08l22M88m49K6M2j20
5286d98M80k47R7l05N9L76j11j7k55N58l13n8M54n43j76K60K79P3j91M44r4m26
5308a54K9O0j79L35l47N99l57J6L36k34j82mJ15J9j46L31k1m29K06J69K35o11
$$ plain form
5330 -214 -138 360 536 248 601 19 559 44 -136 -50 296 476 -21 9 36 26 -254 40 406 8 -192 519
5352 519 -370 213 78 -276 -89 122 334 -92 328 289 485 165 -97 194 48 260 -552 362 356 -298 37
5373 37 -162 -335 -571 -3 -151 -247 -12 164 -28 -108 -376 238 21 154 78 -22 -212 -185 -285 -323 -331 -391 -190
5396 -190 -379 -188 -193 17 81 -343 -401 -121 -231 -367 -829 -391 -170 -229 202 399 -439 -440 220 -225 133 -178
5418 -178 -172 -536 -365 121 326 394 59 -383 -369 329 -94 -116 -167 55 275 -51 -67 162 -24 439 -165 88
5440 88 258 -167 -178 11 112 243 -102 245 444 167 626 -432 -379 -28 126 -115 -274 414 418 151 321
5461 321 289 195 -52 -51 582 144 354 64 655 287 -375 -112 -153 -121 254 -224 406 -112 3 227 629 213
5483 213 222 -186 84 83 78 49 391 -86 28 -41 -136 -340 -180 134 199 159 20 72 34 -207 -320 -200 -300 -201 -347
$$ packed form
5330b14P6M98J76k88L53n82N40n15j80Q6L46J80m97L0K7j0k80K94L66l98k00P11
5352E19q89N83j35l54J87K11K12m26M20l9J96l20k62K91j46K12q12R14oo54L35
5373C7j99j73k36N68j48r6K35J76j92q0k68O14k17J33p6j00j90K7j00l8qo0K01
5396a90j89J91nK10O4m24n8K80j10j36m62M38K21n9M31J97q38jO60m45L58l11
5418a78Ol64J71M86K05O8l35m42J4O98m23k2n1K22K20l26j6K29j86M63o04K53
5440H8J70m25j1J89J01J31l45L47J99k77M59j058N3L51J54k41j59O88Mk67J70
5461C21l2r4k47JO33m38K10k90N91l68o62K63m1L2L75m78O30n18J15K24M02m16
5483B13Rm08K70jnk9L42m77J14o9r5k04J60L14O5m0j39N2l8k41j13J20j00R9j46
$$ plain form
5508 -347 34 298 134 82 -687 -748 154 -549 -8 -452 -321 52 -74 -67 157 123 -127 -404 -69 -292 -126 -421
5530 -421 -126 -9 -84 -189 149 -153 99 -74 -24 32 -350 -239 -374 65 -426 15 -5 -356 69 -100 -308
5551 -308 77 560 -198 101 -16 -349 355 161 -493 -80 117 -485 38 -253 156 260 -26 -346 19 -60
5571 -60 76 208 -45 131 69 490 -64 564 -111 331 353 326 -200 468 245 321 -90 368 118 113 245 587
5593 587 -321 241 -220 91 373 -201 0 -242 627 135 -46 -319 -2 250 10 77 -243 223 137 -187 102
5614 102 -135 218 -20 51 -172 -287 -482 211 228 374 35 212 234 -160 331 -178 -280 -13 367 -33 263
5635 263 -134 -38 -201 -201 297 160 334 -169 49 -215 -124 -240 -296 -24 212 -184 -149 -172 218 333 49 -142
5657 -142 -114 2 57 -268 -144 190 -62 239 -137 -502 -469 -410 73 -341 219 129 -346 -204 236 -396 -188 -301
$$ packed form
5508c47L81K64j64n2p69o1R02p03N41m44J31L73j26PK24l4k50k77L35k23J66k95
5530d21K95J17p5j05L38l02K52j73N0N6l82J11j35M39m91M41k0l51M25j69k08
5551c08L85M83p58K99j17l33P04j94o54M13J97o02N23k91M09J04k86l20L65p9
5571f0J36J32k53J76o2M21n54O28o75M42K2k7n26O68k23P6m11M58k50nJ32L42
5593E87r08N62m61L11K82n74K01k42Q69m92j81k73L17K52k40O7l20M66q6l24K89
5614A02k37L53k38P1k23j15j95O93J7J46l39J77K2l94M91n09j02K67L80m00K96
5635B63l97R6j63%M98j37J74n03K18k64R1j16n6K72K36l96L5k3L90J15k84j91
5657a42K8J16N5l25J24L34k52L01l76l65L3N9M83m14N60r0m75J42M40o32K08j13
$$ plain form
5679 -301 -155 -69 17 -768 -55 40 78 -179 167 335 -532 27 130 -73 157 -273 -286 230 178 290 214 371
5701 371 -224 593 266 66 -123 113 487 82 381 233 30 -239 139 474 397 152 77 -6 -3 -339 657 -227
5723 -227 351 495 57 53 95 593 -54 840 -199 16 1 -354 139 11 377 -105 -164 296 -223 -24 -339
5744 -339 -122 93 100 18 -271 -299 237 -276 236 237 137 581 13 -5 90 314 59 -252 67 309 30 -444 -567
5767 -567 -104 -236 -190 -411 -383 -288 -89 -29 16 -429 -572 25 -173 -400 -12 -42 -277 46 25 53 -34 -140 48
5790 48 -84 -315 -148 81 -213 -319 -42 -45 -201 -253 -69 -590 -679 -258 72 218 364 -125 -280 450 -253 -214
5812 -214 200 -41 156 28 161 -44 6 -184 538 -158 92 -309 -185 -4 206 410 428 -219 149 -99 148
5833 148 -143 -46 28 17 27 -236 -357 323 -304 -93 67 -454 53 -145 598 217 292 -77 80 376 80 70
$$ packed form
5679c01J46Q6Q6p85P13R5L8k57L46J68q67N59J03k03K30m30j3N16n2J12p6J57
5701C71n95Q17l27k00j89K36L74m05K99j48k03k69L78L35p7k45p5q3Ll36R96q84
5723b27N78J44m38mM2M98o47Q94j039K15j5l55M93j28L66m82n9M60n19J99l15
5744c39K17K15Pq2k89k8N36n13N12Jj00M44n68j8R5K24k55l11L19K42k79m74j23
5767e67M63j32M6k21K8R5J99O0M5m45j43N97j98k27L88l0k35L23k1K8q7j06J88
5790D8j32k31J67K29k94j06K77lj56n2J84n21q9M21L30J46J46m89j55P30p03L9
5812b14M14k41J97j28J33k05N0j90P22o96K50m01J24J81K10K04J8o47L68k48K47
5833A48k91R7P4j1J0k63j21O80o27K11J60n21N07j98P43l81P5l69J57K96k96j0
$$ plain form
5855 70 -124 151 85 -308 365 72 184 23 280 233 113 18 316 -85 278 -124 253 -122 -140 -395 -324 163
5877 163 -142 43 -3 -83 119 24 208 -234 -124 113 43 397 -590 -106 -120 -363 -300 -112 194 1 179 75
5899 75 -268 3 -375 -105 -325 -38 -183 169 -175 -122 78 -283 306 -408 -21 -514 -253 -492 157 -279 -353
5920 -353 -449 266 -287 -48 -181 -44 -330 -105 206 -457 323 37 100 -424 181 -248 168 -50 13 -328 -310
5941 -310 -169 60 114 267 325 195 -327 374 403 325 180 246 -395 153 304 -239 456 -173 34 -143 471 258
5963 258 154 -20 -47 366 -60 379 348 98 253 202 0 405 354 21 179 -286 -73 -158 -50 -80 252 -65
5985 -65 -172 229 272 19 362 -116 665 531 -212 521 -87 -183 -179 347 388 -137 304 52 -97 -218 276 152
6007 152 42 -279 -275 90 -40 -247 -357 -116 -86 187 9 -99 87 166 -134 325 54 -140 162 141 -17 -227
$$ packed form
5855G0j94K75o6l93O73k93J12j61K57m7j20r5K98m01L63m02L77l75j8k55P1M87
5877A63l05J85m6q0K02r5J84m42J10K37p0L54r87M84j4k43O3J88L06j93J78j04
5899G5l43K71l78K70k20K87j45L52l44N3K00l61N89p14L87m93K61k39O49m36p4
5920c53r6P15n53K39j33J37k86K25L11o63P80k86O3n24O05m29M16k18O3l41J8
5941c10J41K29N4J53N8j30n22P01K9p8j45O6o41N48J51n43O95o29K07j77O14k13
5963B58j04j74k7M13m26M39l1k50J55n1k02M05n1l33J58m65K13q5J08l0L32l17
5985f5j07M01M3k53L43m78P81j34p43P33o08r6MN26M1n25M41k52j49j21M94j24
6007A52j10l21ML65j30k07j10K41L0K73j78j08J86P9l00M59k71j94L02k1j58k10
$$ plain form
6029 -227 19 -435 -70 -238 -175 187 94 -286 -173 124 -337 -41 -148 5 -114 423 260 -128 113 -74 -194
6050 -194 517 -33 163 98 260 109 -178 -350 -560 -310 250 178 -186 -105 140 162 493 11 285 52 -287
6071 -287 139 28 326 -442 710 590 193 44 -277 -217 58 4 689 -346 -249 -193 -80 -182 459 267 -110
6092 -110 147 86 -34 174 356 264 -35 191 -19 206 -40 158 -86 -52 113 75 -321 164 -145 65 23 62
6114 62 -159 -422 53 157 347 -352 -140 -62 -356 -262 -256 161 175 -207 -388 201 281 256 -350 -436 -487 -20 -85 157
6138 157 -22 -42 -50 -116 -157 -288 298 76 98 131 -203 12 125 68 -383 -183 -409 -269 -581 -57 278 -180 -245
6161 -245 -106 -54 -411 -554 398 32 -30 -420 -175 -111 48 -249 192 110 139 -32 323 -346 -133 364 -24 444
6183 444 -210 199 49 187 -53 -267 -17 -207 -184 -26 222 -148 124 -245 176 20 -176 163 -534 -175
$$ packed form
6029b27K46m54L65j68O3L62r3l80J13K97m61K96j07J53j19N37j63l88K41j87j20
6050a94P11n50J96o5J62j51k87j72k10K50N60p2l64Q1K45K2L31m82K74k33l39
6071b87M26j11K98p68J152j20l97j49l21O0K75n4O85j035R7N6J13j02O41j92l77
6092a10K57o1j20K08J82r2k99K26k10K25k46J98k44L4J65l8l96M85l09K10m2L9
6114F2k21k63M75J04J90o99K12P8k94R4OM17J4l82j81N89Q0k5o06q6n1M67o5K42
6138A57j79k0qo6m1j31N86k22K2L3l34K15J13n7m51K00k26J40l12N24L35m58o5
6161b45J39N2l57j43R52l66o2l90K45O4J59k97M41q2K9j71L55o69K13M97l88M68
6183D44o54M09j50J38k40k14K50j90K3J58K48l70K72l69M21j56j96L39o97L59
$$ plain form
6203 -175 -427 246 305 44 -41 -519 -44 -34 161 405 194 415 400 44 617 -152 -99 230 191 -65 -30 340
6225 340 -338 -382 189 432 346 150 -249 608 266 306 -67 -84 -217 258 -656 -132 193 -69 -35 -173 205 215
6247 215 110 289 -63 339 -42 50 -232 -196 22 30 211 -131 -174 126 -196 -72 180 71 119 351 -17 -220
6269 -220 266 200 -322 -479 -37 -234 -190 -136 512 -74 -210 26 -293 -507 -152 -522 -260 266 141 -76 -671
6290 -671 78 465 -74 -569 -81 -245 -150 113 155 523 23 -449 -12 -106 -202 -230 -62 15 76 -209 -182 -167 -121
6313 -121 -823 -309 28 581 -51 294 -44 31 116 465 -122 -38 265 -337 432 318 -481 188 -82 89 -4
6334 -4 19 393 -375 257 100 -273 371 250 -467 419 372 -15 63 18 147 -194 -282 179 -53 -404 65 165
6356 165 186 306 68 67 136 351 293 -409 -195 69 243 77 519 469 303 264 221 182 -475 -200 244 71 90
$$ packed form
6203a75k52O73N9k61q5m78M75J0J95K44k11K21j5l56N73p69N3L29l9k56L5L70
6225C40o78m4N71K43q6j96l99Q57l42M0l73j7j33M75r14N24L25k62L4j38L78J0
6247B15j05J79l52M02l81R2k82L6K18QJ81l42m3L00l22J24K52j09M8K32l68k03
6269b20M86o6n22j57M42j97M4N4O48n86j36K36l19k14L55l70K62N26j25k17n95
6290f71P49L87n39m95M88j64R5K63M2L68n00m72M37r4r6k8J68P7O1k85K7J5M6
6313a21p02N14L37N53o32L45l38P5Q5L49n87Q4L03o02P69j14p99O69k70J71r3
6334dK3L74p68O32j57l73O44j21p17Q86m7l87P8m5J29l41q8M61k32l51M69J00
6356A65K1J20k38jO9K15n8p02K14K64J74j66M42n0j66l9m3l9o57K75M44j73J9
$$ plain form
6379 90 167 -363 -247 -463 -77 -119 65 475 -73 -17 -109 -115 -55 -174 -434 392 -151 128 -252 -425 -301 -135 -333
6402 -333 123 -418 -128 -198 -94 -96 -465 -421 -355 -76 -29 270 -138 -219 126 -31 34 226 -280 75 298 -96 -61
6425 -61 -347 -296 12 -54 -221 -224 112 -384 -97 -321 -447 304 38 372 -102 -354 105 108 -301 -11 -23 153 -52
6448 -52 58 -247 48 -173 224 248 -112 -464 131 18 -121 76 -340 85 -87 156 133 161 73 242 -230 58
6470 58 225 246 165 -137 -47 -211 -134 -55 -106 398 465 275 229 540 42 -306 483 -359 19 133 99 334 -277
6493 -277 -122 43 -167 -67 -71 -7 11 -275 -563 97 449 93 -559 -209 230 115 -425 -129 30 -43 321 -2
6515 -2 -136 -605 -221 -455 197 124 183 -534 89 -227 -138 -462 91 -188 -420 -154 86 27 67 87 -875 372
6537 372 -290 238 -388 -152 -100 5 290 307 -620 -312 130 -318 -411 -221 84 -144 -80 -132 6 10 -84 258 54
$$ packed form
6379I0P7n30J16k16L86m2J84M10n48N6r2oO0j19k60Q26n43K79l80j73J24J66j98
6402c33M56n41K90p0J04kl69M4O6K79M7K99m08q1L45j57O5J92n06L55K23l94L5
6425f1k86N1L08o6j67lL36m96K87k24j26P51k66L34m74k52M59Lm09K90j2J76k05
6448e2J10l05K95k21L97K4l60l52N95j13j39J97m16M25j72K43k3K8q8J69m72K88
6470E8J67K1q1l02R0j64P7P9n1N04O7j90m6L11m98l48P89q42L78J14l4K35o11
6493b77J55J65k10J00mO4J8k86k88O60L52l56o52L50M39j15n40K96J59p3L64l23
6515bj34m69L84k34O52p3N9p17O23l16Q9l24N53k79k32K66K40n9M0K0r62J247
6537C72o62N28o26K36N2J05K85J7r27L08M42m48r3J90L05k28O4n2J38Mr4L42k04
$$ plain form
6560 54 75 195 -381 404 214 -394 461 255 -268 -164 -197 -550 120 81 23 310 91 -91 257 32 -314 567
6582 567 -488 -172 200 -47 166 -246 -335 556 -430 -322 190 0 7 59 145 290 451 -49 -98 104 96 126 -414
6605 -414 228 -234 73 -74 39 -220 63 340 -323 189 -116 156 -30 -68 307 -90 -478 295 304 382 3
6626 3 -52 -440 298 129 -660 -518 178 33 -145 219 380 -45 111 -319 179 -59 455 43 216 231 -87
6647 -87 -110 -294 181 -98 -66 -30 -45 -182 375 -81 166 259 14 -22 -46 99 -175 -372 -466 130 -323 -122 220
6670 220 -498 -41 178 -321 -102 -93 438 215 173 132 8 -184 214 93 -43 15 99 -216 281 -89 548 222
6692 222 151 404 35 141 95 -223 -273 134 -32 198 137 -455 100 391 298 -72 167 -3 -205 161 59 153
6714 153 -69 -205 18 71 -302 371 -166 79 240 462 141 234 261 -657 -106 -585 -46 104 161 288 99
$$ packed form
6560E4K1J20n76P85j90o08Q55k06n23J04l3l53O70l9n8K87k19j82L48k25l46Q81
6582E67j055L16L72k47K13m12q9Q91r86J08N12j90PN2Q6J45J61n00m9K02qL0n40
6605d14O42m62L07j47J13k59K83K77o63N12l05K72j86l8L75l97l88P73RP8l79
6626Cn5l88P38j69p89J42O96j45j78L64J61m25J56m30M98k38N14m12J73J5l18
6647h7k3j84M75k79L2L6j5j37N57m56K47R3k45l6k4J45k74j97r4N96m53K01L42
6670B20p18M57K19m99K19RN31k23m2m1j24j92L98j21j36N8Q4l15M97l70O37l26
6692B22p1K53l69J06m6l18n0M07j66K30o1n92N55K91r3l70K39j70k02L66j02R4
6714A53k22j36K23N3l73O73n37K45J61K22l21R3K7r18N51m79N39J50N7J27j89
$$ plain form
6735 99 404 229 129 16 68 -94 335 -214 -26 61 -142 157 -109 388 -292 143 308 -136 -214 -339 446
6756 446 116 12 -139 -185 250 72 -186 -198 342 133 244 301 241 12 159 59 -346 -7 333 408 -375 -568
6778 -568 -320 350 -161 -552 -57 -98 265 -384 62 -826 -351 -47 -528 25 -219 -17 262 180 -79 229 -257
6799 -257 116 -347 103 187 167 -272 -117 -215 -418 258 -130 147 171 -139 188 -306 -143 -221 394 -385 -121 -106
6821 -106 -39 -206 -174 426 403 85 320 185 430 215 352 -73 561 72 9 152 -7 -721 260 7 218
6842 218 -291 247 220 -159 -287 -139 -175 -459 -44 170 255 28 -125 -23 54 159 -64 -159 254 389 223 163
6864 163 -188 3 -193 107 214 -184 -129 288 173 183 -415 -386 -7 -339 105 -187 -257 -104 29 9 -86 -470
6886 -470 -210 333 -198 124 139 -225 -56 -103 -52 -482 171 243 -521 -76 55 -250 194 -89 165 -37 -547
$$ packed form
6735I9L05j75j00j13N2j62M29n49J88Q7k03K99k66M97o80M35J65m44p8j25P85
6756D46l30j04j51m6M35j78k58j2N40k09J11N7o0k29J47j00m05L39L40P5p83j93
6778e68K48O70n11l91M95m1L63o49M46q88M75L04m81N53k44K02K79q2k59L08m86
6799b57L73m63M50Q4k0m39J55r8k03O76l88K77K4l10L27m94J63p8O15p79K64J5
6821a06O7j67L2O00k3l18K35j35K45k15J37m25O34m89o3J43j59p14R81k53K11
6842B18n09N38k7l79j28J48l6k84M15K14Q5k27j53J02P7J05k23r5M13J35j66o0
6864A63l51J91j96L00J07l98N5M17j15J0n98K9L79l32M44k92p0J53J33k0r5l84
6886d70K60N43n31L22J5l64J69m7N1m30O53P2p64M45J31l05M44k83K54k02n10
$$ plain form
6907 -547 400 -316 -319 -145 204 -614 97 -101 201 297 227 -526 -235 -15 -726 281 308 -570 15 175 222 -50
6929 -50 -123 -260 -335 52 128 -185 431 46 -545 -106 -582 -355 -68 339 -628 -672 -225 246 315 -295 2 -55
6951 -55 -352 -308 -141 33 -457 413 199 88 255 178 -168 738 -168 201 -114 24 -131 387 127 33 -362
6972 -362 148 -251 -193 12 -349 505 -164 -327 230 -263 -87 142 201 -309 -409 129 65 160 74 23 -85 -237
6994 -237 274 -137 255 -161 -474 427 -181 -439 269 -109 -148 -258 -322 -417 98 -742 -33 209 160 201 -680 -306
7016 -306 -273 118 -175 -54 93 -521 395 45 -88 -193 -298 318 -396 -128 36 -191 -539 -124 265 -123
7036 -123 -366 -163 159 -360 -375 -362 71 -235 40 -24 -324 -156 -120 -202 -137 78 148 -52 355 123 301 20
7058 20 -466 303 519 368 180 101 -125 211 -49 99 -421 492 -103 134 -352 18 9 329 -569 -77 -57 -221
$$ packed form
6907e47R47p16lJ74L49q18P11j98L02R6p0p53K91K20p11J007K7q78N85J60M7k72
6929e0p3j37p5L87P6l13O16l85n91M39m76K27K87M07r67m4M47M71O9o10K97n7
6951e5k97M4J67J74m90Q70k14j11J67p7l46R06r06L69l15J38j55N18k60r4l95
6972c62N10l99N8K05l61Q54o69j63N57m93J76K29N9n10j00N38o4R5q6n1j08j52
6994b37N11m11L92m16l13R01o08k58P08l78l9j10o4r5N15q40P09K42m9M1q81L74
7016c06L3L91k93J21J47o14R16l50j33j05j05O16p14K68J64k27l48M15L89l88
7036a23k43K03L22n19j5J3M33l06K75o4l00J68L6q2O5K15P0k00M07k32J78k81
7058B0m86P69K16j51j88p9k26L36k60J48n20R13n95K37m86L70rL20q98M92K0j64
$$ plain form
7080 -221 -116 -71 -36 -414 430 109 58 -496 66 139 23 36 225 253 356 156 197 366 110 -23 254 175 506
7103 506 -62 293 144 -156 100 509 359 -229 265 -90 -22 165 271 -75 -25 341 228 -92 180 50 -230
7124 -230 -83 2 -267 -67 -19 18 -29 -182 -127 -184 -358 -25 72 19 -110 -108 -290 32 -143 -167 79 9 60 -196
7148 -196 130 -17 21 62 -134 204 237 74 95 156 -338 -52 -575 219 861 -63 -77 -485 -19 -100 -125 -380 139
7171 139 21 -228 -624 -252 -115 -377 155 -323 -54 281 183 -57 -85 -37 -44 31 26 -252 -299 -82 -126 274 -61
7194 -61 429 -51 -460 468 159 -23 93 -80 -390 144 -320 371 304 -170 -482 346 -248 -214 245 333 47
7215 47 -181 435 388 211 -93 -206 119 165 594 2 120 -108 -105 -215 -294 -260 -222 212 186 -102 109 -377 247
7238 247 130 290 -43 -22 -274 -118 302 -76 341 -15 170 32 -265 -114 -225 121 -105 -56 -125 73 -210
$$ packed form
7080b21J05M5L5l78Q44l21n1n54N62P3j16J3J89K8J03k00M1J69k56j33K77p9L31
7103E06n68L55j49l00K56M09j50n88M94l55O8J87J06l46N0L66j13l20K72j30k80
7124b30J47Q5k69K00M8L7m7j53N5n7j74L33R7n3j29Kj82L22j75k4K46p0N1k56
7148a96L26j47L8M1j96L38L3j63K1O1m94K86n23P94O42r24j4m08M66q1k5k55N19
7171A39j18k49l96L72J37k62N32m78K69L35r8k40k8M8pP5nk78m7K17m4M00l35
7194f1M90m80m09R28l09j82J16j73l10N34m64O91o7m74l12Q28n94L4M59Q8k86
7215D7k28O16m7j77l04j13L25M6M29n92J18k28Lj10p9L4L8M34k6k88K11m86O24
7238B47j17J60l33K1k52J56M20l78M17l56J85j38k97J51j11L46k26M9o9J98k83
$$ plain form
7259 -210 -11 238 -100 102 176 9 -482 10 -204 240 -263 -251 -29 135 -262 -250 -153 21 -12 186 545 -290
7281 -290 -104 -257 -139 -4 -247 226 -207 -154 91 -233 -187 -156 -198 -38 13 -164 140 181 -185 -259 207 -74
7303 -74 -401 -19 -72 -285 113 -490 -248 92 -550 236 243 126 -124 245 93 332 320 92 15 40 -96 285
7325 285 102 -184 -482 -222 157 -251 319 385 -898 -288 -140 -93 -83 643 299 804 -121 122 174 -71 153
7346 153 425 -103 457 341 68 -180 407 -69 202 133 71 532 -187 -63 202 94 176 -97 76 412 -86
7367 -86 304 49 409 -344 -487 272 -284 31 184 -149 78 -204 -285 596 -367 98 -268 -264 -623 -102 114
7388 114 -419 315 -79 321 65 98 -80 -266 -254 -406 -19 116 166 319 -446 -25 -184 15 145 116 122 187
7410 187 -239 21 -7 -151 -137 -358 208 466 39 -221 13 -219 308 -34 265 -14 -4 71 167 -117 -76 -57
$$ packed form
7259b10J99K49l38K02P4j67m91M92k14M44n03J2K22J64l97J2R7J74l3J98L59q35
7281b90J86j53J18J35k43M73m33N3K45l24M6L1m2J60N1j77L04M1l66p4M66k81
7303g4l27L82n3k13L98o03K42L40o42P86Pj17k50L69j52K39j2k28p7K5j36L81
7325B85j83k86k98K60L79m08N70O6j283O10J48M7J0P26l44N05r25K43N2k45K24
7346A53K72n28N60j16k73k48N87m76K71o9o2M61p19J24K65j08Q2k73J73L36m98
7367h6L90k55L60p53j43P59n56L15J53l33K27k82q1Q81r63M65l66Ml59N21K16
7388A14n33P34l94M00k56L3j78j86J2j52L87J35N0J53p65M21j59J99J30k9OO5
7410A87m26K60k8j44J4k21N66K58m27k60K34k32N27l42K99k79J0P5R6k84M1J9
$$ plain form
7432 -57 -158 -152 17 14 -407 32 214 233 76 177 -279 -159 206 -42 -118 -200 40 -228 -105 131 6 165 229
7455 229 46 -42 -161 356 239 125 329 244 -207 283 296 23 171 289 428 229 -55 429 120 302 299 290
7477 290 197 620 186 -306 55 -315 -36 43 136 5 42 180 372 -27 -177 524 176 96 -298 303 364 201
7499 201 -35 -259 206 205 103 -38 64 308 111 -651 227 -14 -312 -83 -312 -79 -119 23 -93 -144 -318
7520 -318 -405 -418 -392 -371 -382 78 -287 -320 42 -223 283 -405 -132 -392 -279 -174 321 -504 -435 162 -7 226
7542 226 52 99 807 262 -115 -317 -274 -173 -41 195 81 -337 -30 -606 257 -20 11 -660 574 188 -328
7563 -328 131 257 239 -111 -52 326 -9 -95 -200 -71 492 -481 311 337 132 204 101 -75 570 36 33 284
7585 284 -63 31 308 31 -188 264 21 292 -184 419 -92 315 246 -78 23 383 -110 108 -239 568 426
$$ packed form
7432e7j01OJ69lm21M39J82J9j57J01m56J20L65k48p6q2K40k68J23K36j25J59O4
7455B29j83q8j19N17j17j14K04q5m51M90J3k73J48J18J39j99k84M84l09J82lr
7477B90r3M23m34m92L61l70K79P9R3j31L7J38J92l99j50P01l48q0l94O01O1j63
7499B01k36k24M65jj02j41J02K44j97p62Q78k41k98K29k29K33m0J42j16n1j74
7520c18q7j3K6K1j1M60l65l3L62k65N06o88K73k60J13J05M95q25O9N97j69K33
7542B26j74M7P08n45l77k02M3J01J32K36j14m18L07n76Q63k77L1o71J234l86n16
7563c28M59J26j8l50N9L78l35q6j05J29N63r73P92K6k05P2j03j76O45n34lK51
7585B84l47R4K77k77k19M52k43K71m76O03n11M07o9l24J01L60m93K18l47Q07j42
$$ plain form
7606 426 -308 -351 -138 8 468 57 -99 -72 -258 -196 -403 281 -299 -291 -434 -207 486 -60 113 629 -191 26
7628 26 -5 -8 -115 -168 -79 -131 -187 174 -28 -33 -548 28 135 -40 -157 212 73 -30 -355 -190 -157 -158 -541 258
7652 258 33 -83 234 -29 -276 -543 323 251 87 98 158 433 -212 -121 118 350 7 -230 -258 169 -512 -95
7674 -95 -466 -277 -309 149 169 379 362 -151 331 -305 139 -117 -295 -253 -74 69 65 288 -790 -9 -2 -305 327
7697 327 201 -28 88 -46 125 -124 -60 -352 -312 -331 -149 220 55 336 -141 -213 144 -115 -407 -234 132
7718 132 144 152 196 -211 -116 -139 577 -141 -33 197 -89 -297 -101 30 267 20 -289 -103 203 -53 -192 -148
7740 -148 133 311 -106 174 -54 227 -84 101 231 -364 -350 207 446 -451 -634 12 -52 49 72 346 254
7761 254 -412 -39 49 -5 -38 382 106 8 -118 212 -76 -69 -350 309 -237 429 -241 127 206 -658 -40 -88 584
$$ packed form
7606D26p34m3K13J46M60m11j56K7j86O2k07O84n80Qj43K27O93n46J73N16q20K17
7628B6l1lj07n3Q9n2n6L61k02nn15N76J07j75j17L69j39j03l25J65L3jl83P99
7652B58k25j16L17k63k47k67Q66p2j64J1O0K75o45R1K39K32l43k37k8M27o81M17
7674i5l71J89l2M58K0K10j7n13M82o36M44k56j78M2J79J43mK23j078P81Pl03O32
7697C27j26k29J16j34J71k49O4k92M0j9J82L69j65K81m77p2L57k59k92J73L66
7718A32J2QM4m07R5k3P16p18J08K30k86k08J96J31K37k47l09J86L06k56j39M4
7740a48K81J78m17K80k28K81l11J85J30n95J4N57K39q97j83O46o4J01K3K74r2
7761B54o66L73Q8n4l3M20k76r8j26L30k88Pk81O59n46O66o70L68P9q64O18m8O72
$$ plain form
7784 584 174 -282 -197 54 -499 -302 331 204 -552 90 794 -69 226 -58 -42 136 -65 -163 314 -153 195
7805 195 -74 -244 224 -90 312 72 81 -509 353 -128 -169 -147 -378 -165 -617 276 244 -35 -47 -185 1 313
7827 313 2 -541 122 300 -183 395 132 -88 233 526 56 464 262 -147 -281 167 250 -367 -255 -282 363
7848 363 501 -388 237 148 -43 47 548 73 156 -49 -355 822 -113 239 93 69 19 -78 -64 361 461 334
7870 334 -158 237 30 146 -228 -259 11 -374 39 117 23 246 -342 -72 -194 -218 198 -355 -335 138 -50 115
7892 115 -137 -262 -246 -74 74 -380 965 -103 -116 -166 -347 188 342 -27 405 35 -183 250 167 49 165
7913 165 150 -232 351 -261 -284 338 -432 -170 -125 164 -390 132 23 16 -27 203 -241 40 5 -303 152 -14
7935 -14 104 -333 -230 640 -540 -413 308 766 76 366 -61 574 373 -129 -141 24 -283 119 -336 -129
$$ packed form
7784E84m10m56Q5K51n53J97O33j27p56O42P04q63K95k84J6J78k01r8M77m67L48
7805A95k69j70M68l14M02k40Rn90Q62m81m1K2k31K13m52Q93l2k79j2j38J86L12
7827C13l11n43O63J78m83N78k63k20L21K93m70M08k02m09j34M48Q3o17J12k7O45
7848C63J38q89O25q9j91R0N01m75Q3k05l06J177r35L52j46k4n0r7J4M25J00j27
7870C34m92L95k07J16l74l1K70l85M13P8r4K23n88K70j22k4M16n53K0M73j88J65
7892A15k52j25J6J72J48m54J345j068j3n0j81N35J54l69M32l70k18M33q3j18J16
7913A65j5l82N83o12k3O22p70K62M5K89n54N22j09pm3K30m44K81l5l08M55j66
7935a4J18m37J03Q70j180J27P21M58o90K90m27O35k01n02j2J65l07M02m55K07
$$ plain form
7955 -129 -276 33 -52 -100 105 180 267 185 348 -106 164 373 -98 11 128 40 -27 1 407 120 58 239 13
7978 13 89 501 529 -99 297 -86 -84 40 501 365 17 237 -231 -27 -39 150 359 -336 -445 357 93 11
8000 11 -203 125 503 -310 190 57 -101 -319 -294 143 -212 -332 -214 153 -11 281 213 -331 -249 -49 -121 -189
8022 -189 165 329 345 267 283 -176 161 -223 85 -186 -141 -28 439 164 -252 -537 -217 89 165 -175 -222 40
8044 40 149 -247 94 98 -538 -133 -167 99 -194 -5 -274 211 261 87 53 -234 -535 -317 124 -372 271 -198
8066 -198 -259 162 -310 -247 18 280 25 -82 -378 300 -331 -199 -238 -328 217 327 133 -59 179 132 114 297
8088 297 -19 71 18 -50 142 -329 300 176 -13 60 -369 -49 164 -6 395 -345 229 -46 34 -285 -266 49
8110 49 399 27 -422 495 -111 271 43 151 -352 5 -155 -178 158 -9 87 13 -194 -220 100 -660 -42 205
$$ packed form
7955a29j47L09q5m8K05P5Q7q2J63m54K70K09m71J09J17q8o7K8M06k87o2J81k26
7978A3P6M12K8o28L96l83KJ24M61j36l48K20m68K04j2J89K09o95j09Q02k64q2
8000A1k14L28L78q13N00j33j58k18K5M37l55j20J18L67j64K92o8n44Q2K00p2o8
8022a89L54J64J6p8J6m59L37l84L08k71M5J13M67k75m16k85L20L06P6l40m7K62
8044D0J09l96L41Mo36M05l4K66k93J89k69M85N0j74l4k87l01K18M41m96O43m69
8066a98o1M21m72O3K65K62k55j07k96O78o31J32l9r0N45J10j94j92K38m7j8J83
8088B97l16R0n3o8J92m71O29j24j89P3m29L20K13j70M01p40N74k75Q0l19J9L15
8110D9L50l72m49R17o06L82k28J08n03L57j60k3L36j67R6p4k07k6L20p60O18K47
$$ plain form
8132 205 26 -291 35 197 406 -28 -118 -412 -280 -166 -208 60 -205 8 -188 -137 -261 -16 64 -429 205
8153 205 358 -11 -411 246 51 272 102 172 200 262 734 -72 -64 328 -339 128 -75 291 592 -425 -328 136
8175 136 -409 -308 146 194 464 149 -179 -176 -496 272 -78 -72 5 137 -311 399
$$ packed form
8132B05j79l17L26J62K09m34r0k94J32J14m2K68k65K13j96N1j24K45Q0m93O34
8153B05J53l69m00O57j95K21j70P0K8O2M72q06QL92o67M67k03L66L01j017R7M64
8175A36n45J01M54M8K70l15l28Ll20P68l50OP7J32m48P10
8191C99
$$ Imaginary data points
##PAGE= N=2
##DATA TABLE= (X++(I..I)), XYDATA
$$ plain form
0 0 0 0 0 0 0 0 0 -1 24 -24 24 -24 48 -48 71 -72 96 -98 120 -144 168 -195 240 -265 312 -360 408 -458 525
29 525 -589 666 -746 837 -936 1045 -1163 1294 -1438 1593 -1769 1959 -2167 2398 -2655 2942
45 2942 -3264 3627 -4042 4515 -5069 5723 -6505 7463 -8674 10261 -12430 15598 -20679
58 -20679 30153 -53910 240288 278745 -208655 52921 323890 122834 -148125 95656 243758
69 243758 -4191 -154817 106366 206532 -6785 -92270 95804 125509 -18272 -28191 85652
80 85652 50889 -36903 3296 75434 22949 -27334 17500 62137 24407 -10638 3125 29504
92 29504 25248 10027 9752 24807 12711 -9912 20642 73162 33487 -47568 -9185 88695 45939
105 45939 -64464 -27506 64725 -5592 -97291 3876 101716 -25195 -128889 8455 106553
$$ packed form
0@%%%%%%%jK5m8M8m8P2r6J19j43J68j94K18k64L12l63M35n05N77o72P68q66R83
29E25j114J255j412J583j773J981k208K457k732L031l362L728m126M565n053N597
45B942o206O891p669Q557r584J0792j2228J3968j6137J8935k2691K8028l6277
58b0679N0832q4063K94198L8457m87400K61576K70969k01056k70959K43781J48102
69B43758k47949j50626K61183J00166k13317q5485J88074K9705j43781r919J13843
80H5652l4763q7792M0199P2138n2485n0283M4834M4637l7730l5045J3763K6379
92B9504m256j5221k75J5055j2096k2623L0554N2520l9675q1055L8383R7880m2756
105D5939j10403L6958R2231p0317r1699J01167R7840j26911j03694J37344R8098
$$ plain form
116 106553 -31054 -100995 39456 68074 -93483 -103524 58111 42829 -113844 -79000 59749
127 59749 3825 -113200 -30473 72597 -23432 -111660 -9193 58204 -40874 -78397 24322
138 24322 39346 -62029 -52118 50372 31433 -62783 -33524 47562 8187 -68006 -28097 40911
150 40911 7728 -48497 -18000 30605 6240 -30941 -3640 31564 -933 -44533 -17424 27997
162 27997 2634 -51273 -37829 7000 -5988 -38290 -11270 20416 -23120 -59367 1781 52290
174 52290 -9546 -64116 -5691 37626 -22631 -47804 20867 29073 -51867 -47467 42486 28339
186 28339 -66313 -46896 42593 12617 -72558 -33860 41930 -5254 -69602 -9849 47149 -21972
198 -21972 -71501 4442 49591 -26532 -68628 -412 28735 -30961 -41106 22112 21487 -41099
$$ packed form
116A06553j37607o9941J40451K8618j61557j0041J61635j5282j56673L4844J38749
127E9749n5924j17025Q2727J03070r6029q8228J02467O7397r9078l7523J02719
138B4322J5024j01375R911J02490j8939r4216K9259Q1086l9375p6193L9909O9008
150D0911l3183n6225L0497M8605k4365l7181K7301L5204l2497m3600K7109M5421
162B7997k5363n3907J3444M4829j2988l2302K7020L1686m3536l6247O1148N0509
174E2290o1836n4570N8425M3317o0257k5173O8671Q206q0940M400Q9953j4147
186B8339r4652J9417Q9489k9976q5175L8698P5790m7184o4348N9753N6998o9121
198b1972m9529P5943M5149p6123m2096O8216K9147n9696j0145O3218o25o2586
$$ plain form
210 -41099 -26806 46439 34956 -37611 -27983 38622 29258 -31147 -17609 32577 5928 -46292
222 -46292 -12761 40664 2758 -52274 -15997 34765 -2962 -47364 -6192 31361 -14885 -46204
234 -46204 4015 31559 -23572 -45983 12856 31884 -30208 -45658 15980 26574 -33018 -36219
246 -36219 22704 17929 -37446 -22101 34958 16216 -37929 -14049 37487 9759 -37424 -5864
258 -5864 34390 -4888 -43873 -1812 33328 -12067 -41418 6981 32881 -17067 -36444 15115
270 15115 29416 -23853 -33484 20177 25305 -27732 -28236 23551 19807 -31578 -21450 29911 15853
283 15853 -33992 -15042 35299 12707 -32201 -2202 42606 11303 -27962 8718 45690 7788
295 7788 -23415 20125 46348 -160 -22607 27622 48317 -2643 -16997 34817 43685 -7142
$$ packed form
210d1099J4293P3245j1483p2567R628O6605r364o0405J3538N0186k6649n2220
222d6292L3531N3425l7906n5032L6277N0762l7727m4402M1172L7553m6246l1319
234d6204N0219K7544n5131k2411N8839J9028o2092j5450O1638J0594n9592l201
246c6219N8923m775n5375J5345N7059j8742n4145K3880N1536k7728m7183L1560
258e864M0254l9278l8985M2061L5140m5395k9351M8399K5900m9948j9377N1559
270A5115J4301n3269r631N3661N128n3037n04N1787l744n1385J0128N1361j4058
283A5853m9845J8950N0341k2592m4908K9999M4808l1303l9265L6680L6972l7902
295G788l1203M3540K6223m6508k2447N0229K0695n0960j4354N1814Q868n0827
$$ plain form
307 -7142 -6617 46093 39901 -13241 -2957 47465 32484 -16131 3146 45896 21006 -19607 9127
320 9127 48382 15968 -19964 14160 47027 9641 -18179 22233 44546 2758 -15561 27135
332 27135 41496 -513 -11219 30047 35515 -6738 -8838 33236 30473 -14762 -10168 33321 24599
345 24599 -18377 -6229 34311 14419 -25285 -4045 32769 7447 -28422 -2720 27486 -2655
357 -2655 -30011 2313 26709 -9966 -33673 2825 22614 -15856 -30437 9156 17104 -25623
369 -25623 -29444 14939 15566 -28549 -26543 14474 8466 -30120 -19463 19306 3435 -35243 -17675
382 -17675 20057 -1342 -35989 -12064 19027 -9907 -37689 -4411 20076 -15439 -36420 -652
394 -652 16920 -19646 -32480 6056 14732 -24373 -30225 10387 13612 -26391 -26699 13291 8665 -29330
$$ packed form
307g142N25N2710o192n3142J0284N0422j4981m8615J9277M2750k4890m0613K8734
320I127L9255l2414l5932L4124L2867l7386k7820M0412K2313m1788j8319M2696
332B7135J4361m2009j0706M1266N468m2253k100M2074k763m5235M594M3489q722
345B4599m2976J2148M0540j9892l9704K1240L6814k5322l5869K5702L0206l0141
357b655k7356L2324K4396l6675k3707L6498J9789l8470j4581L9593P948m2727
369b5623l821M4383O27m4115K006M1017o008l8586J0657L8769j5871l8678J7568
382a7675L7732k1399l4647K3925L1091k8934k7782L3278K4487l5515k0981L5768
394f52J7572l6566j2834L8536Q676l9105n852M0612L225m0003l08L9990m626l7995
$$ plain form
408 -29330 -18307 19461 6012 -29792 -12584 21929 4935 -25751 -4022 23015 -969 -27609
420 -27609 616 26591 -3976 -27766 3166 24101 -9630 -23514 11375 24110 -13635 -21569
432 -21569 17241 22663 -14739 -16035 20284 16688 -19202 -12233 23303 12284 -24219 -10742 22261
445 22261 4810 -25862 -3619 24579 -1398 -26595 1085 24055 -4303 -24029 4294 19189
457 19189 -10240 -22787 8088 17252 -16258 -24641 8994 14826 -17610 -19241 11134 9355 -21450
470 -21450 -14510 16179 7282 -23700 -14001 15765 2660 -27626 -14279 12525 -4688 -33172 -15164
483 -15164 9725 -11104 -34472 -10759 10038 -17050 -34801 -3560 14146 -16616 -31200 218
495 218 10548 -19872 -25111 8127 9142 -26728 -24127 14569 10746 -25395 -18029 16983 6837
$$ packed form
408b9330J1023L7768j3449l5804J7208L4513j6994l0686K1729K7037k3984k6640
420b7609K8225K5975l0567k3790L0932K0935l3731j3884L4889J2735l7745p934
432b1569L8810N422l7402j296L6319l596l5890O969L5536j1019l6503J3477L3003
445B2261j7451l0672K2243K8198k5977k5197K7680K2970k8358j9726K8323J4895
457A9189k9429j2547L0875R164l3510q383L3635N832l2436j631L0375j779l0805
470b1450O940L0689q897l0982R699K9766j3105l0286J3347K6804j7213k8484J8008
483a5164K4889k0829k3368K3713K0797k7088j7751L1241J7706l0762j4584L1418
495B18J0330l0420n239L3238J015l5870K601L8696l823l6141P366L5012j0146
$$ plain form
508 6837 -23288 -6284 22242 1291 -24544 648 23798 -2345 -22739 4573 19420 -7887
520 -7887 -19676 8975 18176 -11324 -15440 15055 18511 -10227 -8315 21290 19699 -6969 -1851
533 -1851 23474 18173 -5052 1292 23412 15026 -6478 3059 24281 14893 -5749 5184 25889
546 25889 15671 -2621 12022 31444 15297 -4046 14223 32319 13450 -3318 16582 28163
558 28163 4568 -4766 21890 28550 -1954 -6588 25896 29716 -2009 -2079 27691 21608 -7606 3907
572 3907 32648 13490 -18037 1700 29568 6937 -19270 1557 21899 -1082 -16693 9908
584 9908 20725 -6538 -14134 16219 24139 -4604 -11103 15055 17495 -4325 -4639 12829 6159 -9594
598 -9594 557 16537 2879 -15591 -3391 13874 4217 -9531 244 9384 -3139 -11282 5330
$$ packed form
508F837l0125J7004K8526k0951k5835K5192K3150k6143k0394K7312J4847k7307
520g887j1789K8651R201k9500m116L0495L456k8738J912K9605j591k6668N118
533a851K5325n301k3225O344K2120q386k1504R537K1222r388k0642J0933K0705
546B5889j0218j8292J4643J9422j6147j9343J8269J8096j8869j6768J9900J1581
558B8163k3595r334K6656O660l0504m634L2484L820l1725p0K9770o083k9214J1513
572C907K8741j9158l1527J9737K7868k2631k6207K0827K0342k2981j5611K6601
584I908J0817k7263p596L0353P920k8743o499K6158K440k1820l14J7468o670j5753
598i594J0151J5980j3658j8470J2200J7265r657j3748R775R140j2523q143J6612
$$ plain form
611 5330 11395 -10737 -20404 1896 12465 -10515 -22324 -2007 7700 -11720 -15752 6078 7546
624 7546 -16681 -15826 13726 12907 -18417 -17660 13613 11007 -19216 -15581 10401 1756 -24232 -11382
638 -11382 13801 -2347 -26165 -8348 15101 -1311 -21183 -3114 14005 -4797 -16950 5374
650 5374 13299 -13745 -20292 8239 13685 -15730 -20490 7024 9391 -17436 -15235 11863 7954 -18477
664 -18477 -12324 15417 7760 -19198 -11139 15056 4504 -20686 -7614 15920 -1022 -23274 -4601
677 -4601 17562 -89 -18339 1382 18600 -23 -12014 8762 19452 -949 -8945 12374
689 12374 18570 -3188 -7494 11076 11428 -5350 -2376 13206 6675 -8416 -543 14907 7636 -5909
703 -5909 358 13800 8170 -2883 1388 8919 1668 -5035 5219 12660 -333 -9718 2191 13344
$$ packed form
611E330O065k2132r667K2300J0569k2980j1809K0317R707j9420m032K1830J468
624G546k4227Q55K9552q19l1324P57L1273k606l0223L635K5982q645k5988J2850
638a1382K5183j6148k3818J7817K3449j6412j9872J8069J7119j8802j2153K2324
650E374P925k7044o547K8531N446k9415m760K7514K367k6827K201K7098l909k6431
664a8477O153K7741p657k6958Q059K6195j0552k5190J3072K3534j6942k2252J8673
677d601K2163j7651j8250J9721J7218j8623j1991K0776J0690k0401p996K1319
689A2374O196k1758m306J8570L52j6778K974J5582o531j5091P873J5450p271j3545
703e909O267J3442n630j1053M271P531p251o703J0254P441j2993r385J1909J1153
$$ plain form
717 13344 2924 -6829 3977 11661 602 -4433 8114 10667 -5999 -8760 10100 11116 -10813
730 -10813 -13921 5792 3847 -15516 -9532 8110 -4080 -22015 -4323 14167 -5508 -24359 -3084
743 -3084 15243 -5215 -19584 672 9963 -13534 -18489 6075 6978 -19351 -17413 7944 4439
756 4439 -18390 -12193 6147 -1978 -14866 -2648 9874 -5868 -16944 -2117 7805 -5794 -13463
769 -13463 -2322 3283 -6849 -10014 377 1101 -6710 -5721 4301 3996 -4265 -4997 4233 7419 -1732
784 -1732 -4704 4384 8230 -1560 -6286 5156 9661 -4042 -7357 9982 13349 -3268 -4712 14354
798 14354 14191 -3685 443 20120 13478 -5158 4448 22712 9416 -8419 8237 23399 4645
811 4645 -8880 12526 22176 -1528 -7112 17048 18581 -4275 -2832 18753 13117 -9024 -771
$$ packed form
717A3344j0420r753J0806P684j1059n035J2547K553j6666k761J8860J016k1929
730a0813l108J9713j945j9363N984J7642j2190j7935J7692J8490j9675j8851K1275
743c084J8327k0458j4369K0256R291k3497m955K4564R03k6329J938K5357l505
756D439k2829O197J8340q125j2888J2218J2522j5742j1076J4827R922j3599p669
769a3463J1141N605j0132l165J0391P24p811R89J0022l05q261p32R230L186r151
784a732k972R088L846r790m726J1442M505j3703l315J7339L367j6617j444J9066
798A4354j63j7876M128J9677o642j8636R606J8264j3296j7835J6656J5162j8754
811D645j3525K1406R650k3704n584K4160J533k2856J443K1585n636k2141Q253
$$ plain form
824 -771 18893 7541 -10139 2114 16070 2055 -10036 4986 14324 -1084 -6135 8913 12617
837 12617 -1354 -3682 9272 10377 -675 -1119 7569 6688 -1463 -1445 4783 3763 -3099 -3330 2912
852 2912 4409 -4151 -6479 2274 3681 -4980 -6757 2905 2737 -8102 -7556 3556 1330 -12094 -7596
867 -7596 6381 246 -13765 -5299 8372 -1802 -14534 -1135 10484 -4408 -13736 2887 9869
880 9869 -8040 -12284 6448 7735 -11892 -10211 8174 4342 -13615 -6680 9858 749 -14690
893 -14690 -2569 10753 -2760 -14106 215 10169 -4479 -11936 2741 7788 -6312 -9338 3957
906 3957 4425 -7551 -6908 4942 3855 -6938 -6016 5248 4014 -5314 -2665 5506 3777 -4675 -2069
921 -2069 7136 3260 -5143 -2419 7086 4261 -4373 -1842 6744 3320 -5970 -210 8172 1291 -7903
$$ packed form
824g71J9664j1352j7680J2253J3956j4015j2091J5022R338j5408n051J5048L704
837A2617j3971k328J2954J105j1052m44Q688q81q151J8O228j020o862k31O242
852B912J497q560k328Q753J407q661j777R662j68j0839N46J1112k226j3424M498
867g596J3977o135j4011Q466J3671j0174j2732J3399J1619j4892r328J6623O982
880I869j7909m244J8732J287j9627J681J8385l832j7957O935J6538r109j5439
893a4690J2121J3322j3513j1346J4321R954j4648p457J4677N047j4100l026J3295
906C957M68j1976O43J1850j087j0793R22J1264j234r328K649Q171j729q452K606
921b069R205l876q403K724R505k825q634K531Q586l424r290N760Q382o881r194
$$ plain form
936 -7903 346 9325 -390 -8804 2262 8604 -3395 -7718 4670 7172 -6738 -7965 6225 5874
950 5874 -7783 -6856 7080 3630 -9306 -3796 8290 1458 -10133 -1354 9193 -1366 -10321 346
964 346 8399 -3367 -8818 2246 5822 -5968 -8630 2986 5404 -7170 -9005 1979 2540 -7430
978 -7430 -7400 2800 360 -9802 -6456 2844 -638 -10215 -6721 1892 -1982 -10115 -6364 1030 -3659
993 -3659 -10404 -4666 2881 -4558 -11579 -3258 4385 -3590 -10718 -1340 3987 -5170 -8645 716 3430
1008 3430 -6642 -8465 2937 3780 -7697 -8018 3744 2878 -7569 -5432 5512 1392 -8766 -2427
1022 -2427 7219 608 -9116 -1669 6754 -354 -7083 483 5650 -1601 -5450 3332 7224 -2243 -4979
1037 -4979 6093 8217 -1493 -1756 7813 7639 -1970 -599 9155 6172 -2613 392 9660 6206 -2418
$$ packed form
936g903Q249Q979r715q414J1066O342j1999m323J2388K502j3910j227J4190l51
950E874j3657R27J3936l450j2936N510J2086o832j1591Q779J0547j0559q955J0667
964C46Q053j1766n451J1064L576j1790k662J1616K418j2574j835J0984N61r970
978g430L0J0200k440j0162L346R300l482r577L494Q613l874q133L751P394m689
993c659o745N738P547p439p021Q321P643p975p128R378N327r157l475R361K714
1008C430j0072j823J1402Q43j1477l21J1762q66j0447K137J0944m120j0158O339
1022b427R646o611r724P447Q423p108o729P566N167p251l849Q782L892r467k736
1037d979J1072K124r710k63R569j74r609J371R754k983q785L005R268l454q624
$$ plain form
1052 -2418 432 10288 5873 -1773 3437 11309 5363 -1741 5608 11542 3934 -1747 6637 10979 2658
1067 2658 -1454 6287 9059 574 -983 7428 8808 -543 -1160 9116 8229 -1176 330 9308 5875
1082 5875 -2972 1387 9216 3744 -3385 938 7898 2315 -4299 1851 8415 1060 -3963 3584 7720
1097 7720 301 -4133 4888 8075 -1962 -4771 4463 5065 -4628 -5239 2712 2371 -6291 -5095 2815
1112 2815 788 -7076 -4453 3407 -484 -8083 -3314 2992 -1864 -8395 -2562 3452 -4105 -8627 -1806
1127 -1806 3011 -4881 -8471 -359 2774 -4102 -7001 370 2810 -4928 -5148 2592 1695 -6829 -5990 1741
1143 1741 296 -7617 -6182 591 -2319 -7708 -4277 1952 -2074 -8146 -2315 4330 -208 -5410 146
1158 146 5824 -144 -4545 1496 5218 -1289 -4122 3308 5502 -1406 -3883 4186 6456 -1102 -2266
$$ packed form
1052b418K850R856m415p646N210P872n946p104P349N934p608n681Q384M342q321
1067B658m112P741K772q485j557Q411J380r351o17J0276q87r405J506Q978l433
1082E875q847M359P829n472p129M323O960n583o614O150O564p355n023P547M136
1097G720p419m434R021L187j0037k809R234O02r693o11P951l41q662J196P910
1112B815k027p864K623P860l891p599M769O306m856o531N833O014p557m522O821
1127a806M817p892l590Q112L133o876k899P371K440p738k20P740q97q524Q39P731
1143A741j445p913J435O773k910n389L431O229m026o072N831O645m538n202N556
1158A46N678n968m401O041L722o507k833P430K194o908k477Q069K270p558j164
$$ plain form
1173 -2266 5720 6139 -1868 -910 7867 5147 -3992 -387 7568 3186 -5508 -720 6674 1408 -5635
1188 -5635 960 6714 94 -4015 3814 7170 -1112 -3337 5200 5994 -1851 -2334 5827 3583 -4721
1203 -4721 -1419 5308 2315 -4177 -53 5236 1730 -2850 1440 5758 1370 -1704 2498 4759 577
1218 577 -2313 631 2459 -1505 -4329 -1195 891 -4077 -6089 -2059 649 -5091 -7851 -2589 -105
1233 -105 -5293 -8426 -2954 -786 -7336 -8738 -2089 -1665 -9644 -9330 -172 -794 -9437 -6984 2589 -211
1249 -211 -7345 -1936 5399 -1053 -7497 1002 7748 -1260 -6982 1759 5852 -3684 -6255 2461 1949
1264 1949 -6814 -5816 3873 1467 -8530 -5018 3722 -42 -6708 -2298 2001 -3047 -5836 -183 1746
1279 1746 -3888 -5340 467 2605 -1640 -2173 1210 2469 507 1863 4118 3684 1279 1672 5603 6589
$$ packed form
1173b266P986M19q007R58Q777k720r139L605P955m382q694M788P394n266p043
1188e635O595N754o620m109P829L356q282k225Q537P94p845m83Q161k244q304
1203d721L302O727k993o492M124N289l506m580M290M318m388l074M202K261m182
1218E77k890K944J828l964k824L134K086m968k012M030K708n740k760N262K484
1233a05n188l133N472K168o550j402O649M24p979L14R158o22q643K453R573k800
1249b11p134N409P335o452o444Q499O746r008n722Q741M093r536k571Q716n12
1264A949q763R98R689k406r997L512Q740l764o666M410M299n048k789N653J929
1279A746n634j452N807K138m245n33L383J259j962J356K255m34k405L93L931R86
$$ plain form
1295 6589 3183 1042 3848 6410 3515 939 4244 6340 1538 1217 6936 7443 696 934 8725 7712
1311 7712 169 1491 9159 6465 -1637 2244 8578 3243 -3382 2869 8767 1862 -3591 3932 7964
1326 7964 -131 -844 6789 6390 -2135 358 8093 4672 -3609 483 7662 2557 -3487 2036 6357
1341 6357 617 -3640 3003 5962 -1 -1951 3880 5062 -874 -1430 3252 2984 -1896 -1498 2279 1388
1357 1388 -2209 -2587 445 439 -2436 -2587 604 1053 -2491 -3407 1527 1638 -2142 -2845 886 1352 -2403
1374 -2403 -2544 1051 -431 -4493 -2053 1617 -1248 -6159 -2354 2388 -1967 -6176 -567 2304 -3056
1389 -3056 -5402 217 2174 -5015 -6230 1485 1972 -4804 -4769 2037 1192 -5082 -2619 3883 1692 -4227
1405 -4227 342 5968 830 -3524 965 4920 1031 -2843 2092 4073 -1112 -2983 2110 3025 -2149
$$ packed form
1295F589l406k141K806K562k895k576L305K096m802l21N719N07o747K38P791j013
1311G712p543J322P668k694q102L881O334n335o625O251N898o905n453P523M032
1326G964q095p13P633l99q525K493P735l421q281M092P179n105o044N523M321
1341F357n740m257O643K959n963j950N831J182n936n56M682k68m880L98L777q91
1357A388l597l78L032ok875j51L191M49l544r16M934J11l780p03L731M66l755
1374b403j41L595j482m062K440L670k865m911L805M742m355m209N609K871n360
1389c056k346N619J957p189j215P715M87o776L5O806q45o274K463O502k191n919
1405d227M569N626n138m354M489L955l889l874M935J981n185j871N093R15n174
$$ plain form
1420 -2149 -2680 2380 2752 -2919 -2243 2069 1370 -2754 -497 2922 501 -2817 -1037 2304 293 -1915
1436 -1915 -14 2512 553 -1550 1196 3306 826 -1234 1885 4040 723 -1009 1930 3060 229
1451 229 -1047 2303 2827 -608 -1139 1928 1910 -1553 -871 2617 1759 -2370 -1903 2378 748 -3622 -2178
1468 -2178 1305 -120 -4172 -2066 897 -1840 -6103 -2390 820 -2292 -5429 -2052 1110 -3291 -5279
1483 -5279 -545 1250 -3907 -4830 848 1034 -5193 -4576 1057 675 -5171 -3738 1492 -788 -5493 -3127
1499 -3127 1659 -1836 -5451 -1586 1575 -1748 -5358 -1043 -163 -3493 -4413 -418 158 -4532 -4514 -232
1515 -232 -681 -3235 -3136 78 -432 -2728 -1868 294 -129 -2299 -1257 1925 981 -1680 -355 2288 1134
1532 1134 -1179 701 2793 1507 -371 1363 3942 1496 -549 1449 4222 1783 -998 2011 4061
$$ packed form
1420b149n31N060L72n671O76M312o99m124K257L419k421l318J780L341k011k208
1436a915J901K526j959k103K746K110k480k060L119K155l317j732K939J130k831
1451B29j276L350N24l435n31L067j8l463O82L488q58m129M67M281j630m370J444
1468b178L483j425m052K106K963k737m263L713L210l112l137L377L162m401j988
1483e279M734J795n157r23N678J86o227O17N633l82n846J433N230k280m705K366
1499c127M786l495l615L865L161l323l610M315Q80l330r20L995N76m690J8M282
1515b32m49k554R9L214n10k296Q60K162m23k170J042L182r44k661J325K643j154
1532A134k313J880K092j286j878J734K579k446k045J998K773k439k781L009K050
$$ plain form
1547 4061 903 -877 3370 4842 298 -850 3745 4768 84 61 4353 3602 -433 1668 5758 3327
1563 3327 -1080 1903 6505 3361 -1582 2572 5678 1986 -1126 3693 6065 1542 -688 3809 5017
1578 5017 274 49 3471 4287 -61 -483 3164 2877 -294 -195 3298 1993 -1295 -461 2558 1103 -2136
1595 -2136 -167 1348 14 -2254 -495 1205 -656 -2441 -695 486 -900 -2710 -424 1113 -1512
1610 -1512 -2979 -287 1109 -2370 -3146 -93 457 -2918 -2781 -173 197 -4282 -3318 755 -559 -3634
1626 -3634 -3154 750 -185 -3558 -2687 798 -1095 -3850 -1491 807 -2160 -4431 -561 663 -2511 -3329
1642 -3329 -446 811 -2395 -1970 339 450 -3100 -2142 1886 983 -3033 -1992 1924 489 -2584 -851
1658 -851 2110 248 -1576 692 2444 948 -1331 994 4146 1130 -1248 1559 3087 339 -599
$$ packed form
1547D061l158j780M247J472m544j148M595J023m684k3M292p51m035K101M090k431
1563C327m407K983M602l144m943M154L106l692l112M819K372m523k230M497J208
1578E017m743k25L422Q16m348m22L647k87l171R9L493j305l288Q34L019j455l239
1595b136J969J515j334k268J759J700j861j785J746J181j386j810K286J537k625
1610a512j467K692J396l479p76L053N50l375J37K608L70m479R64M073j314l075
1626c634M80L904r35l373Q71L485j893k755K359K298k967k271L870J224l174q18
1642c329K883J257l206M25K309J11l550R58M028r03m016J041L916j435l073J733
1658h51K961j862j824K268J752j496k279K325L152l016k378K807J528k748r38
$$ plain form
1673 -599 1838 2428 -192 -1060 2166 3029 -594 -831 1347 2024 -530 -394 2325 1968 -113 586 2553
1690 2553 1626 -1073 495 3311 1369 -976 952 2844 1028 -606 1277 3054 541 -970 1434
1705 1434 2941 -561 -1761 1120 2344 -944 -1929 1119 962 -2307 -1966 1258 312 -3200 -2198 674
1721 674 -748 -2501 -1788 338 -789 -3174 -1871 461 -2197 -3850 -1710 -289 -2610 -4233 -1287
1736 -1287 -357 -2757 -3756 -1151 -881 -3510 -3349 -745 -185 -3775 -3042 -96 -776 -3085 -2672 -312 -1415
1753 -1415 -3771 -2048 -220 -954 -3040 -1295 889 -515 -2711 -818 1560 -1406 -2379 -889 603
1768 603 -1682 -2349 -1008 809 -1593 -3022 360 189 -1967 -1871 1322 844 -1770 -861 1994 1190 -375
1785 -375 -479 2400 1946 -722 711 3205 1054 174 2069 3548 1738 -148 2625 4754 2276 1020
$$ packed form
1673e99K437N90k620q68L226Q63l623k37K178O77k554J36K719l57k081O99J967
1690B553r27k699J568K816j942k345J928J892j816j634J883J777k513j511K404
1705A434J507l502j200K881J224l288r85L048j57l269L41L224r46l512J002K872
1721F74j422j753P13K126j127k385J303K332k658j653K140J421k321j623K946
1736a287R30k400r99K605K70k629J61K604N60l590P33K946o80k309M13K360j103
1753a415k356J723J828p34k086J745K184j404k196J893K378k966r73J490J492
1768F03k285o67J341J817k402j429L382j71k156R6L193m78k614R09K855q04j565
1785c75j04K879m54k668J433K494k151q80J895J479j810j886K773K129k478j256
$$ plain form
1801 1020 3238 3939 2039 1156 3950 3760 588 748 3572 3669 457 435 3235 2501 185 2066 3556
1818 3556 1988 26 2070 3449 2028 -481 1516 3681 1140 -341 1429 2195 974 25 1940
1833 1940 2728 106 20 2120 2772 830 259 2116 2824 398 476 2024 1236 -544 392 2482 857
1850 857 -1013 -262 1988 727 -1563 178 1192 -419 -1737 -2 1421 -1204 -3292 -454 553
1865 553 -2631 -3392 -686 -452 -2790 -3418 29 -581 -2863 -2438 874 -59 -2654 -1718 951 -312 -2073
1882 -2073 -842 877 -947 -2346 -484 156 -1030 -1977 -6 1086 -895 -1692 476 582 -871 -766
1898 -766 394 -126 -1094 -785 659 11 -1217 -608 407 262 -1655 -1324 364 856 -969 -361 1219
1915 1219 1076 -1292 -34 2364 618 -1394 -487 2506 690 -2059 -276 1952 60 -1611 683
$$ packed form
1801A020K218P01j900q83K794j90l172J60K824R7l212k2K800p34k316J881J490
1818C556j568j962K044J379j421k509J997K165k541j481J770P66j221r49J915
1833A940P88k622q6K100O52j942n71J857P08k426P8J548p88j780R36K090j625
1850H57j870P51K250j261k290J741J014j611j318J735J423k625k088K838J007
1865E53l184p61K706K34k338o28L447o10k282M25L312r33k595R36K669j263j761
1882b073J231J719j824j399J862O40j186r47J971J092j981p97K168J06j453J05
1898g66J160n20r68L09J444o48j228O09J015j45j917L31J688M92j825O08J580
1915A219j43k368J258K398j746k012R07K993j816k749J783K228j892j671K294
$$ plain form
1930 683 2162 -148 -1015 1651 3385 -434 -1121 2627 3138 -210 127 2566 1874 -871 1266 2667
1946 2667 1194 -807 1072 3173 551 -604 1473 2020 -472 -374 1958 1441 -1089 -836 1339 898
1962 898 -1688 -606 355 -444 -1007 -188 -134 -1183 -565 -762 -66 -921 -896 -1006 -677 -421 -1086 -2035 -487
1981 -487 -680 -1537 -1803 -486 -661 -2523 -1924 -76 44 -2502 -2175 794 -613 -3153 -1154 668 -1675
1998 -1675 -2972 -117 596 -2938 -2939 29 887 -3204 -2635 469 -3 -3209 -1300 643 -1160 -2689 -896
2015 -896 1368 -1188 -3254 -622 373 -2508 -2552 180 366 -1863 -1484 967 -119 -1302 358 1341 261
2032 261 83 1575 2229 283 269 1641 1884 1071 449 1928 1903 672 1293 1446 1531 1556 1790 675 1539
2051 1539 1692 1156 1597 1432 1907 313 1646 2042 1766 168 1393 2007 615 -52 2067 2644 483
$$ packed form
1930F83J479k310q67K666J734l819o87L748N11l348L37K439o92k745K137J401
1946B667j473k001J879K101k622j155K077N47k492R8K332n17k530K53K175m41
1962H98k586J082R61p99n63Q19N4j049O18j97O96q55K5j10L29K56o65r49J548
1981d87j93q57k66J317j75j862N99J848J20k546L27K969j407k540J999J822k343
1998a675j297K855P13l534jK968Q58m091N69L104m72l206J909J943j803j529J793
2015h96K264k556k066K632R95k881m4K732J86k229L79K451j086j183J660R83j080
2032B61j78J492O54j946j4J372K43q13o22J479k5j231O21J53Q5K5K34j115Q64
2051A539J53n36M41j65M75j594J333L96k76j598J225O14j392o67K119N77k161
$$ plain form
2068 483 4 2607 2536 685 418 2869 2138 -725 550 3046 1822 -899 1533 2689 286 -1016
2084 -1016 1425 2256 -271 -941 2336 1805 -1451 -1083 1139 980 -1081 -493 956 262 -2152 -692 772
2101 772 -1040 -2330 -700 309 -908 -938 -1017 -583 -927 -1406 -686 -568 -875 -1204 -1368 -470 -1043 -1462 -725
2120 -725 -309 -746 -1304 -1080 -935 -1283 -1140 -895 -132 -1235 -989 -583 -440 -1632 -1768 -86 -369 -1747 -1472
2139 -1472 -125 -540 -1943 -1253 377 -605 -1790 -672 1203 -703 -1588 53 825 -696 -1468 831
2155 831 837 -802 -611 1709 938 -1003 -352 1288 953 -770 242 1543 1071 -860 520 1385 694 -658
2173 -658 858 1865 707 -106 792 2245 789 -87 1058 1543 216 -278 1050 1430 82 380 1394
2190 1394 1485 -122 335 1307 1341 108 479 1181 1218 442 540 1245 1131 -385 475 1060 457 -63 335 924
$$ packed form
2068D83m79K603p1j851k67K451p31k863J275K496j224k721K432J156k403j302
2084a016K441Q31k527o70L277n31l256L68K222j59k061N88J449o94k414J460J464
2101G72j812j290J630J009j217l0p9M34l44m79P20J18l07l29j64Q98n73m19P37
2120g25M16m37n58K24J45l48J43K45P63j103K46M06J43j192j36J682k83j378K75
2139a472J347m15j403O90J630r82j185J118J875j906q85J641P72j521p72K299
2155H31Oj639J91K320p71j941O51J640l35j723J012J301m72j931J380Q65o91j352
2173f58J516J007j158q13Q98J453j456q76J145M85j327m94J328L80j348K98J014
2190A394R1j607M57R72L4j233L71P02L7p76R8P05j14j516Q60N85o03n20L98N89
$$ plain form
2210 924 417 -284 350 557 -867 -821 390 347 -459 -1472 -157 113 -1829 -1607 -800 -43 -2127 -1057
2228 -1057 177 -865 -2150 -1155 -204 -503 -2292 -1299 -430 -890 -2262 -1458 -435 -1548 -2497 -1458 -277
2245 -277 -2102 -2612 -1434 -423 -2302 -1912 -592 -865 -2125 -1927 -397 -608 -2472 -1416 271 -523 -2078
2262 -2078 -1515 -129 -915 -1862 -1034 -55 -412 -1025 -52 123 -198 -1120 -60 120 6 -614 225 751 68
2281 68 -602 532 537 105 257 896 946 532 858 1327 1672 405 758 1826 1652 830 628 2241 1707 403
2301 403 1164 2372 1064 342 1255 2235 998 621 1321 2573 1215 327 1921 1757 1065 710 1892 1646
2319 1646 838 751 2020 1555 299 798 2315 1276 -193 496 2299 1214 -461 682 1592 589 -328
2336 -328 842 1485 152 -79 1156 824 -89 -367 686 579 -372 130 823 -118 -245 17 352 450 -735
$$ packed form
2210I24n07p01O34K07j424M6J211m3q06j013J315K70j942K22Q07P57k084J070
2228a057J234j042j285R95R51k99j789R93Q69m60j372Q04J023j113r49J039J181
2245b77j825n10J178J011j879L90J320k73j260J98J530k11j864J056J687p94j555
2262b078N63J386p86r47Q28R79l57o13R73J75l21r22J060J80j14o20Q39N26o83
2281F8o70J134Nm32J52O39N0m14L26M69L45j267L53J068j74q22k02J613n34j304
2301D03P61J208j308p22R13R80j237l77P00J252j358q88J594j64o92l55J182k46
2319A646q08q7J269m65j256M99J517j039j469O89J803j085j675J143R10j003r17
2336c28J170O43j333k31J235l32r13k78J053j07r51N02O93r41j27K62L35R8j185
$$ plain form
2355 -735 -318 478 107 -813 -782 -691 -549 -848 -930 -20 -673 -910 -385 70 -480 -1343 -466 -172 -785 -1588 -550
2376 -550 -215 -534 -1811 -482 -357 -1099 -2230 -792 -246 -1591 -806 -181 -45 -849 -1572 286 -175 -1466
2394 -1466 -595 -94 -676 -995 -21 112 -545 -855 124 588 -580 -1052 323 664 212 -397 654 628 -353
2413 -353 591 613 754 259 -39 660 -231 -59 49 740 697 196 15 1072 533 21 541 1294 551 94
2433 94 393 877 84 -142 643 856 814 116 1066 1726 541 274 1311 1385 327 715 1506 1180 -416 475
2453 475 1699 1142 64 1128 1170 800 -356 -14 932 305 -637 99 293 -381 -441 453 232 -1047 -490
2472 -490 -96 28 -1342 -430 -245 -1 -1276 -947 24 -837 -1071 -997 -612 -932 -1553 -539 -213 -1065 -1525
2491 -1525 -837 -554 -884 -1380 -1168 -1008 -1483 -1708 -943 -708 -1517 -1938 -926 -585 -1516 -1468 -660 -853 -962 -1557
$$ packed form
2355g35M17P96l71r20L1R1J42k99q2R10o53k37N25M55n50q63Q77K94o13q03J038
2376e50L35l19j277J329J25p42j131J438N46j345P85O25J36q04p23J858m61j291
2394a466Q71N01n82l19R74J33o57l10R79M64j168m72J375L41m52o09J051k6r81
2413c53R44K2J41m95k98O99q91J72J08O91m3n01j81J057n39n12N20P53p43m57
2433I4K99M84p93k26P85K13m2o98R50O60j185k67J037P4j058L88P91l26j596Q91
2453D75J224n57j078J064M2l70j156L42R46o27r42P36J94o74o0Q94k21j279N57
2472d90L94J24j370R12J85K44j275L29R71q61k34P4L85l20o21J014L26q52m60
2491a525O88K83l30m96K12J60m75k25P65K35q09m21J012L41r31M8Q08j93j09n95
$$ plain form
2511 -1557 -404 -193 -1313 -1131 -596 -185 -945 -965 -43 -374 -1247 -912 586 45 -1202 248 372 -880
2529 -880 -962 -126 569 -282 -429 701 459 -93 233 999 598 27 560 1104 1204 292 522 915 1014 401
2549 401 835 1498 710 502 1228 1828 940 270 1621 1105 829 1068 1296 1440 1541 1447 1539 1375 909 461
2569 461 1407 1317 521 250 1340 1182 366 423 965 583 464 51 1070 870 42 62 544 284 -317 288
2589 288 172 291 -274 -194 927 -164 -850 -196 543 -819 -825 718 333 -679 -387 -199 232 -539 -683
2608 -683 642 161 -42 -644 176 23 -1311 -842 -25 -662 -917 -672 -341 -937 -1459 -619 -360 -1022 -1571
2627 -1571 -596 -745 -1492 -1485 -510 -507 -637 -615 -712 -554 -763 -525 -168 -347 -537 -752 -85 -134 -716 -574 153 157 -583
2650 -583 -258 228 -666 -554 -119 583 -118 -118 -28 648 837 47 -107 899 459 -36 970 1174 -55 93
$$ packed form
2511a557J153K11j120J82N35M11p60k0R22l31q73L35J498n41j247J450J24j252
2529h80q2Q36O95q51j47J130k42n52L26P66m01n71N33N44J00r12K30L93R9o13
2549D01M34O63p88k08P26O00q88o70J351n16k76K39K28J44J01r4R2j64m66m48
2569D61R46r0p96k71J090j58q16N7N42l82j19m13J019k00q28K0M82k60o01O05
2589B88j16J19n65Q0J121j091o86O54P39j362oJ543l85j012K92J88M31p71j44
2608f83J325m81k03o02Q20j53j334M69Q17o37k55K45L31n96n22Q40K59o62n49
2627a571R75j49p47PR75Lj30K2r7J58k09K38L57j79j90k15O67m9n82J42P27Mp40
2650e83L25M86q94J12M35P02p01%R0O76J89p90j54J006m40m95J006K04j229J48
$$ plain form
2670 93 650 765 435 337 1165 1350 -79 16 1179 819 24 736 1319 975 -220 813 1359 540 -290 856
2690 856 1380 1031 62 747 1069 153 293 1056 1183 371 214 1393 840 -350 366 667 493 -227 214
2709 214 762 -448 -474 82 146 -579 -1085 -112 -434 -901 -600 -103 -639 -793 -388 -899 -31 -1029 -577 -814
2729 -814 -510 -550 -753 -994 -1033 -1078 -1218 -840 -761 -877 -1066 -306 -991 -1896 -1321 -924 -477 -1206 -1889 -831 -1165
2750 -1165 -1538 -906 -435 -707 -1408 -662 -440 -725 -1794 -374 -431 -1093 -1396 -304 -249 -1111 -1401 -509 -403
2769 -403 -1256 -1219 -103 -209 -985 -111 496 -7 -595 518 332 -352 -459 298 302 -676 -9 532 6 -317
2789 -317 407 439 -214 119 958 428 344 -118 1085 732 819 593 19 764 662 910 1065 195 660 1076 925
2810 925 1009 692 484 408 1327 898 0 1229 1292 109 695 789 1498 786 6 967 585 691 474 1138 1564
$$ packed form
2670I3N57J15l30r8Q28J85j429R5J163l60p95P12N83l44j195J033N46q19q30J146
2690H56N24l49r69O85L22r16J40P63J27q12j57J179n53j190P16L01j74p20M41
2709B14N48j210k6N56O4p25n06R73l22m67L01M97n36j54M05n11Q68r98M52k37
2729h14L04m0k03k41l9m5j40L78P9j16j89P60o85r05N75L97M47p29o83J058l34
2750a165l73O32M71k72p01P46K22k85j069J420n7o62l03J092N5q62k90Q92J06
2769d03q53L7J116j06p76Q74O07n03n88J113j86o84j07P57Mr78O67N41n26l23
2789c17P24L2o53L33Q39n30q4m62J203l53Q7k26n74P45j02K48J55q70M65M16j51
2810I25Q4l17k08p6R19m29q98J229O3j183N86R4P09p12p80R61l82J06k17O64M26
$$ plain form
2831 1564 277 53 1117 541 122 629 1269 436 -302 415 1003 -127 -877 -75 639 -158 285 955 336
2850 336 -258 -111 333 -51 -253 -186 -302 -507 -132 -87 -115 -275 -42 -392 -475 -258 -412 18 -749 -309 -148
2871 -148 -674 -412 -767 -576 -1043 -544 -89 -253 -564 -501 -302 -647 -94 -168 -750 -1021 -89 15 -184 -1034 -513
2892 -513 222 -618 -289 438 133 -654 -766 79 143 -474 -52 413 115 -269 -218 455 248 -516 -67 777 107
2913 107 -489 558 655 -355 675 669 1025 815 72 344 908 549 367 663 775 559 363 572 896 553
2933 553 826 805 449 573 630 668 402 535 373 777 380 916 729 851 461 99 1020 1165 505 533 450 1035
2955 1035 389 111 662 736 127 102 643 550 -161 -322 259 145 -507 -592 -56 -903 -669 -506 -431 -693 -502
2976 -502 -203 -510 -924 -1119 -152 -545 -455 -719 -541 -534 -1227 -523 -337 -813 -981 -1059 -568 -724 -1079 -550 -344
$$ packed form
2831A564j287k24J064n76m19N07O40q33p38P17N88j130p50Q02P14p97M43O70o19
2850C36n94J47M44l84k02O7j16k05L75M5k8j60K33l50q3K17j54M30p67M40J61
2871a48n26K62l55J91m67M99M55j64l11O3J99l45N53p4n82k71R32J04j99q50N21
2892e13P35q40L29P27l05p87j12Q45O4o17M22M65k98l84N1O73k07p64M49Q44o70
2913A07n96J047R7j010J030oL56k10p43K72N64l59j82K96J12k16j96K09L24l43
2933E53K73k1l56J24N7L8k66J33j62M04l97N36j87J22l90l62R21J45o60K8q3N85
2955A035o46k78N51P4o09k5N41r3p11j61N81j14o52q5N36q47K34J63P5k62J91
2976e02K99l07m14j95R67l93R0k64J78Po93P04J86m76j68p8M91j56l55N29K06
$$ plain form
2997 -344 -785 -1146 -650 -158 -724 -1507 -406 -179 -762 -945 -510 -484 -711 -632 -202 -524 -552 -1102 -615 -635 -724
3018 -724 -1017 -181 -400 -918 -578 -341 -142 -570 -280 266 -232 -414 94 148 -152 -136 389 144 398 363 470
3039 470 950 -21 512 382 626 600 -64 756 894 424 477 1265 387 195 761 939 953 478 808 1235 1159
3060 1159 -34 518 798 237 -99 541 470 4 811 -132 334 159 -2 -24 452 -280 -337 446 261 -182
3080 -182 -63 -6 171 160 -167 791 256 -687 725 357 -77 93 162 590 263 -452 -150 -28 -762 -104 -170
3101 -170 283 -217 -568 -43 -55 -331 -799 -264 -457 -230 -802 -841 -280 -143 -241 -608 -380 -624 -872 -489 -463
3122 -463 -587 -1044 -409 -889 -906 -719 -428 -292 -21 -531 290 -404 -759 -593 436 -853 -539 181 99 -59
3142 -59 -654 522 529 19 -562 712 770 -509 45 602 125 -225 278 -51 192 -212 625 733 323 -367
$$ packed form
2997c44m41l61M96M92n66p83J101K27n83j83M35K6k27P9M30l22k8n50M87k0q9
3018g24k93Q36k19n18L40K37J99m28K90N46m98j82N08N4l00J6N25k45K54l5J07
3039D70M80r71N33j30K44k6o64Q20J38m70N3P88q78j92N66J78J4m75L30M27p6
3060A159j193N52K80n61l36O40p1m66Q07r43M66j75j61k2M76p32n7P83j85m43
3080a82J19N7J77j1l27R58n35r43J412l68m34J70O9M28l27p15L02J22p34O58o6
3101a70M53n00l51N25j2k76m68N35j93K27n72l9N61J37r8l67K28k44k48L83K6
3122d63j24m57O35m80j7J87K91J36K71n10Q21o94l55J66J029j289L14P20q2j58
3142e9n95J176Pn10n81J274N8j279N54N57m77l50N03l29K43m04Q37J08m10o90
$$ plain form
3162 -367 466 887 -75 -453 631 315 -213 156 251 801 911 109 245 288 245 439 529 551 -22 321 844
3183 844 1368 334 552 591 515 435 769 690 710 255 611 573 428 238 425 460 262 395 188 525 106 62
3205 62 475 934 384 -295 446 238 -363 -268 499 250 -831 -40 533 -593 -27 -27 -23 -639 -950 15 -29 -568
3227 -568 -557 -54 -769 -888 -662 -305 74 -570 -1024 -25 -449 -442 -335 -983 -705 -768 -748 43 -708 -776 -577 -356
3249 -356 -629 -542 -838 -724 -757 -520 -463 -133 -500 -759 -553 -584 -72 -855 -575 -99 -727 -1011 -477 -11 -395
3270 -395 -792 -727 182 -522 -1185 64 -44 -75 -724 -19 240 -466 -216 438 275 -311 67 854 358 178
3290 178 308 900 95 -391 782 88 200 809 398 -119 313 59 78 520 397 1294 1083 569 256 996
3310 996 964 284 368 707 508 319 676 727 632 1118 166 87 889 177 -165 587 -216 111 142 310 300 612
$$ packed form
3162c67Q33M21r62l78J084l16n28L69R5N50J10q02J36M3m3J94R0K2n73L43N23
3183H44N24j034K18L9p6q0L34p9K0m55L56l8j45j90J87L5j98J33k07L37m19m4
3205F2M13M59n50o79P41k08o01R5P67k49j081P91N73j126N66%Mo16l11R65m4n39
3227e68J1N03p15j19K26L57L79o44m54R99m24PJ07o48K78o3K0P91p51o8J99K21
3249c56k73Q7k96J14l3K37N7L30l67k59K06l1N12p83K80M76o28k84N34M66l84
3270c95l97O5R09p04o63J249j08l1o49P05K59p06K50O54j63n86L78P87m96j80
3290A78J30N92q05m86J173o94J12O09m11n17M32k54J9M42j23Q97k11n14l13P40
3310I96l2o80Q4L39j99j89L57N1r5M86r52p9Q02p12l42P52q03L27L1J68j0L12
$$ plain form
3332 612 -35 603 509 281 -45 304 -21 -306 -232 93 266 -562 -207 262 253 -275 26 193 -422 -383 -621 -288
3354 -288 -412 -647 -501 -372 -123 -1219 -121 -446 -325 -305 -932 -153 -780 -89 -333 -554 -943 -220 -595 -830
3374 -830 -822 166 -206 -695 -796 -559 -817 -454 -48 90 -13 -181 -155 -520 -103 -592 -309 -327 -459 -532 -265 -333
3396 -333 -256 -317 -238 1 -224 -187 514 -118 214 -7 64 111 42 222 487 332 136 123 530 143 74 626 416
3419 416 958 396 -288 219 1024 401 223 130 469 -215 83 500 357 234 624 214 180 663 214 411 249
3440 249 -244 191 735 -345 346 426 378 357 474 445 287 417 -81 525 279 376 139 310 207 51 183
3461 183 -173 -93 -174 19 363 247 -631 -326 18 -64 -133 -268 -82 103 -352 -544 -355 -410 -385 -1066 -822 -395
3483 -395 -711 -348 -305 -579 -665 -66 -85 -210 -503 -388 -389 -916 -642 -642 -289 -600 -430 -550 -668 -323 -521 -3
$$ packed form
3332F12o47O38r4k28l26L49l25k85P4L25J73q28L55M69rn28L01J67o15L9k38L33
3354b88j24k35J46J29K49j096J098l25J21K0o27P79o27O91k44k21l89P23l75k35
3374h30QR88l72m89j01K37k58L63M06J38j03j68K6l65M17m89K83j8j32p3K67o8
3396c33P7o1P9K39k25L7P01o32L32k21P1M7o9J80K65j55j96j3M07l87o9N52k10
3419D16N42n62o84N07Q05o23j78r3L39o84K98M17j43j23L90m10l4M83m49J97j62
3440B49m93M35N44j080O91Q0m8k1J17k9j58J30m98O06k46R7k37J71j03j56J32
3461A83l56Q0q1J93L44j16q78L05L44q2o9j35J86J85m55j92J89n5K5o81K44M27
3483c95l16L63M3k74q6N99j9j25k93J15jn27K74%L53l11J70j20j18L45j98N18
$$ plain form
3505 -3 -311 -505 -17 -432 -106 -333 -846 -437 -139 -491 -19 146 -637 -188 121 -138 -463 -228 86 -107 -910
3526 -910 -528 -160 -53 -224 -138 725 201 225 262 87 112 67 754 24 -27 -226 538 4 115 761 380 349
3548 349 168 -153 -107 607 111 203 321 257 696 658 326 474 235 646 675 205 341 720 412 113 303 535
3570 535 -13 579 344 97 577 596 33 625 179 435 539 145 661 -90 370 385 386 195 641 504 578 -1
3592 -1 212 5 117 -147 -55 262 18 -472 267 322 -301 -262 -410 -433 -749 -661 -319 -194 -308 -186 -244 -808 -861
3615 -861 192 -508 -145 -544 -513 -298 -695 -915 -470 -329 -175 -550 -268 -568 -306 -135 -212 -23 -299 127
3635 127 95 -573 -272 -231 -220 -20 -102 -634 72 -488 371 -36 202 172 125 -512 -164 661 193 28 167 266
3657 266 -78 148 388 218 -88 128 -45 168 -10 265 566 653 151 990 669 237 556 389 825 396
$$ packed form
3505cl08j94M88m15L26k27n13M09K98l52M72J65p83M49L09k59l25K35L14j93q03
3526i10L82L68J07j71Q6Q63n24K4L7j75K5m5O87p30n1j99P64n34J11O46l81l1
3548C49j81l21M6P14m96R2J18o4M39l8l32J48k39M11K9m70J36L79l08k99J90K32
3570E35n48N92k35k47M80J9n63N92m46K56J04l94N16p51M60J5Jj91M46j37P4n79
3592aK13k07J12k64R2L17k44m90P39N5o23L9j48k3l16Q8L42J25j14J22n8n64n3
3615h61J053p00L63l99L1K15l97k20M45J41J54l75K82l00K62J71p7J89k76M26
3635A27l2o68L01M1J1K00q2n32P06n60Q59m07K38l0m7o37L48Q25m68j65J39R9
3657B66l44K26K40j70l06K16j73K13j78K75L01Q7n02Q39l21m32L19j67M36m29
$$ plain form
3677 396 255 479 360 -381 373 196 742 350 556 477 307 584 244 80 -104 148 89 64 407 324 506
3698 506 980 428 160 423 119 610 -125 632 770 95 -433 231 110 38 399 -276 329 147 63 -166 84
3719 84 -401 -172 -67 37 -20 -290 -76 15 -540 -686 -279 -656 -736 -524 170 -734 -1187 -602 -365 -257 -631
3740 -631 -414 -393 -272 -378 -376 -282 -581 -826 -345 -122 -208 -527 -765 -688 -211 -499 -398 74 -1050 -334 262 -637
3762 -637 -353 -504 -431 150 -409 -316 -18 136 -39 -502 -18 -121 -360 -174 238 113 -200 32 492 -10 43
3783 43 -105 159 -532 -458 312 -35 27 251 420 -147 127 263 725 21 671 -219 390 192 33 737 40
3804 40 435 247 362 307 98 309 641 682 161 203 909 -123 337 481 631 -26 452 234 650 521 559
3825 559 88 475 514 292 353 -22 484 149 388 945 22 -31 -97 -23 -260 51 64 5 644 14 241 -355
$$ packed form
3677C96j41K24j19p41P54j77N46l92K06p9j70K77l40j64j84K52n9k5L43q3J82
3698E06M74n52k68K63l04M91p35P57J38o75n28O64j21p2L61o75O05j82q4k29K50
3719H4m85K29J05J04n7k70K14R1n55j46M07l77q0K12O94r04m53N85K37J08l74
3740f31K17K1J21j06KR4k99k45M81K23q6l19k38P7M77k88J01M72j124P16N96q99
3762f37K84j51P3N81n59R3K98J54j75m63M84j03k39J86M12j25l13K32M60n02N3
3783D3j48K64o91P4P70l47O2K24J69n67K74J36M62p04O50q90O09j98j59P04o97
3804D0L95j88J15n5k09K11L32M1n21M2P06j032M60J44J50o57M78k18M16j29L8
3825E59m71L87L9k22O1l75N06l35K39N57r23n3o6P4k37L11J3n9O39o30K27n96
$$ plain form
3847 -355 13 -579 195 -70 -96 -575 71 45 -214 -301 -285 -197 -79 -311 -105 -31 -181 -567 -268 -319 -323 -278 -118
3870 -118 179 -347 -248 -47 -128 -309 -312 242 245 -339 -240 -137 69 -188 168 -147 -392 -285 -310 -45 -107 -344 47
3893 47 -231 -74 154 -24 -67 -36 -38 -43 184 15 64 603 153 -28 467 -239 -209 -8 641 215 160 160 116 32 65
3918 65 471 808 165 486 304 528 55 340 195 921 627 -8 252 29 -80 427 251 524 676 70
3938 70 650 295 196 400 56 635 420 486 131 496 198 536 543 483 203 115 -245 318 -53 206 170 337 97
3961 97 -312 201 -167 5 322 -96 15 -160 -517 551 -101 -574 -309 131 -461 -270 -439 -336 97 -160
3981 -160 -98 -695 -344 -143 -18 52 -299 -621 -357 -671 -826 -102 -384 -922 -327 -393 -531 -443 -314 -446 -700
4002 -700 -614 31 -193 -20 -801 -550 -462 -245 -253 131 -491 -132 -369 -23 -148 -487 20 -49 -151 -70 -348 199
$$ packed form
3847c55L68n92P74k65k6m79O46k6k59q7J6Q8J18k32K06P4j50l86K99n1mM5J60
3870a18K97n26R9K01q1j81lN54Ln84R9J03K06k57L56l15k45J07k5K65o2k37L91
3893D7k78J57K28j78m3L1knK27j69M9N39m50j81M95p06L0K01O49m26n5%m4q4L3
3918F5M06L37o43L21j82K24m73K85j45P26k94o35K60k23j09N07j76K73J52o06
3938G0N80l55r9K04l44N79k15O6l55L65k98L38Po0k80q8l60N63l71K59l6J67k40
3961I7m09N13l68J72L17m18J11j75l57J068o52m73K65M40n92J91j69J03M33k57
3981a60O2n97L51K01J25P0l51l22K64l14j55P24k82n38N95o6j38Q8J29j32k54
4002g00Q6O45k24J73p81K51Q8K17qL84o22L59k37L46j25l39N07o9j02Q1k78N47
$$ plain form
4024 199 -239 361 -592 -129 51 391 -134 -165 99 -345 242 431 -9 323 -209 518 233 -63 78 385
4044 385 682 -285 193 300 217 238 284 239 252 318 -181 791 67 261 430 -46 98 363 531 265 619 14
4066 14 499 766 344 536 612 57 291 544 156 298 272 627 359 312 463 4 485 172 37 -1 -38 69
4088 69 178 129 -139 81 -395 -184 227 221 -7 338 198 -175 -244 -441 111 -232 -664 332 116 -24 -60 -665
4110 -665 -380 184 -219 -621 382 -124 -592 -16 128 -37 -45 206 -409 -424 351 108 -114 -106 -442 -333 -257 -171
4132 -171 -180 -254 -320 -395 -129 -426 -473 203 4 -111 -341 -30 207 -210 -238 -97 65 172 84 -101 433 194 396
4155 396 266 725 -207 176 189 28 -458 643 591 -268 302 303 83 238 -17 358 370 332 435 -167 -276 628
4177 628 84 89 162 249 129 509 315 408 858 139 250 612 -167 416 90 511 240 197 -52 -31 239 644
$$ packed form
4024A99m38O00r53M63J80L40n25l1K64m44N87J89m40L32n32P27k85k96J41L07
4044C85K97r67M78J07q3K1M6m5J3O6m99R72p24J94J69m76J44K65J68k66L54o05
4066A4M85K67m22J92P6n55K34K53l88J42k6L55k68m7J51m59M81l13j35l8l7J07
4088F9J09m9k68K20m76K11M11ok28L45j40l73o9j97N52l43m32R96k16j40l6o05
4110f65K85N64m03m02J003n06m68N76J44j65qK51o15j5P75k43k22Ql36J09P6Q6
4132a71rp4o6p5K66k97m7O76j99j15k30L11K37m17k8J41J62J07q8j85N34k39K02
4155C96j30M59r32L83J3j61m86J101n2q59N70Jk20J55k55L75J2l8J03o02j09R04
4177F28n44NP3Q7j20L80j94R3M50p19J11L62p79N83l26M21k71m3k49K1K70M05
$$ plain form
4199 644 879 136 -108 -148 78 -96 -465 217 80 -199 -561 -369 31 249 -143 -180 145 137 -360 -300 173 -193
4221 -193 -289 -324 -448 -222 -143 -674 -480 117 -152 -459 -574 -961 216 -61 -359 209 109 -637 -440 -773 -289
4242 -289 -646 -292 -239 -310 -241 -280 -90 -608 -318 -469 -96 -195 -563 115 -255 2 -544 -356 -144 -446 260 -359
4264 -359 113 -258 53 -201 -250 -466 -430 -231 145 143 -303 252 -92 -234 131 161 674 141 533 46 20 443
4286 443 248 -49 407 398 -454 412 150 6 381 283 183 541 631 325 -30 6 276 86 659 -100 280 481
4308 481 130 56 104 710 317 641 522 -433 117 526 375 213 104 405 504 126 978 161 329 323 316 -17
4330 -17 -17 238 208 55 -35 624 -240 139 246 51 -73 -101 32 45 -316 -84 312 -530 -50 184 -57 -451
4352 -451 -328 331 62 -551 -426 -479 342 124 -354 -307 -216 99 1 110 -359 -391 -305 -17 -633 -282 -378 -395 290
$$ packed form
4199F44K35p43k44m0K26j74l69O82j37k79l62J92M00K18l92l7L25qm97O0M73l66
4221a93r6l5j24K26P9n31J94N97k69l07j15l87J177k77k98N68j00p46J97l33M84
4242b89l57L54N3p1O9l9J90n18K90j51L73r9l68O78l70K57n46J88K12l02P06o19
4264c59M72l71L11k54m9k16L6J99L76km46N55l44j42L65L0N13n33L92m87k6M23
4286D43j95k97M56rq52Q66k62j44L75r8j00L58R0l06l55L6K70j90N73p59L80K01
4308D81l51p4M8O06l93L24j19r55N50M09j51j62j09L01R9l78Q52q17J68opl33
4330a7%K55l0j53r0O59q64L79J07j95j24k8J33J3l61K32L96q42M80K34k41l94
4352d51J23O59k69o13J25n3Q21k18m78M7R1L15r8J09m69l2Q6K88o16L51r6j7O85
$$ plain form
4375 290 -584 -536 -329 -72 -69 -33 193 -618 -26 -207 -559 -350 42 -638 -138 -128 -281 100 266 422 69 -81
4397 -81 -85 644 264 499 -2 -109 -273 313 232 -19 461 -112 389 17 476 334 622 -185 -150 -155 275 136
4419 136 91 154 121 246 -235 167 308 -58 762 310 294 548 260 -235 265 -84 116 -339 67 505 378
4440 378 277 -113 479 154 93 -31 -81 76 533 -128 -126 141 253 -74 201 68 515 117 -174 169 380
4461 380 52 -190 328 -106 275 -56 386 -187 1 -268 301 -88 -72 -403 -445 -268 2 -233 -224 -316 -561 -536
4483 -536 -207 -629 -144 -340 -511 -388 334 2 -414 -344 -234 -515 -78 -514 -718 -176 -228 -25 134 -153 -696
4504 -696 -286 -276 375 -194 -170 -456 -526 25 -352 -87 -333 15 48 -512 -333 -165 -175 387 -131 139 14 117
4526 117 -33 65 -523 626 -499 37 166 687 365 42 -25 -79 -237 99 79 21 333 8 329 18 295
$$ packed form
4375B90q74M8K07K57LL6K26q11N92j81l52K09L92o80N00J0j53L81J66J56l53j50
4397h1mP29l80K35n01j07j64N86q1k51M80n73N01l72M59j42K88q07L5nM30j39
4419A36m5O3l3J25m81M02J41l66Q20m52j6K54k88m95N00l49K00m55M06M38j27
4440C78j01l90N92l25o1j24n0J57M57o61KK67J12l27K75j33M47l98k91L43K11
4461C80l28k42N18m34L81l31M42n73J88k69N69l89J6l31m2J77K70k35Rr2k45K5
4483e36L29m22M85j96j71J23P22l32m16P0J10k81M37m36k04N42n2K03J59k87n43
4504f96M10J0O51n69K4k86p0N51l77K65k46L48L3n60J79J68j0N62n18K70j25J03
4526A17j50R8n88J149j125N36J29N21l22l23o7n4j58L36k0n8L12l25L21l11K77
$$ plain form
4547 295 202 271 240 642 -25 -253 -66 83 402 489 519 -9 6 523 163 554 499 466 271 212 161 -331 990
4570 990 126 444 321 168 1016 -78 70 316 307 -38 225 97 268 -304 -121 262 -17 456 -78 -56 -189
4591 -189 -7 -515 397 146 303 49 -328 451 -310 -285 -304 -333 -21 -414 139 -326 -56 64 -218 -94 89
4612 89 -126 -235 566 -112 -52 -384 196 -324 200 -437 35 132 -339 -13 -336 -373 -492 40 -617 220 -284
4633 -284 -228 369 160 20 -151 -130 -380 -147 -333 424 -331 35 297 -396 -236 -172 -8 63 92 -81 -157 31
4655 31 263 772 235 -28 7 -106 -160 -9 -9 -143 -152 230 -202 404 201 614 367 263 -133 547 232 -101
4677 -101 297 188 20 259 281 346 96 221 385 461 736 415 151 17 686 150 -388 294 -389 636 286
4698 286 89 386 473 254 107 -367 463 -130 -240 559 -122 -62 234 448 234 38 464 -249 -456 -2 1
$$ packed form
4547B95r3O9l1M02o67k28J87J49L19Q7L0n28J5N17l60L91n5l3j95n9n1m92J321
4570I90q64L18j23j53Q48j094J48K46rl45K63j28J71n72J83L83k79M73n34K2j33
4591a89J82n08R12k51J57k54l77P79p61K5j9k9L12l93N53m65K70J20k82J24J83
4612H9k15j09Q01o78O0l32N80n20N24o37M72R7m71L26l23l7j19N32o57Q37n04
4633b84N6N97k09j40j71K1k50K33j86P57p55L66K62o93J60O4J64P1K9j73p6J88
4655C1K32N09n37k63L5j13n4J51%j34rL82m32O06k03M13k47j04l96O80l15l33
4677a01L98j09j68K39K2O5k50J25J64P6K75l21k64j34O69n36n38O82o83J025l50
4698B86j97K97Q7k19j47m74Q30n93j10P99o81O0K96K14k14j96M26p13k07M54L
$$ plain form
4719 1 -214 109 156 -315 184 -359 469 -27 -442 58 -199 -223 -103 -555 -188 -134 -403 424 -721 -219 -97
4740 -97 -327 -136 -337 -825 -500 -901 -277 -166 -139 -1 -69 -364 -824 -440 307 -416 -67 -301 -618 -107 82
4761 82 -190 -308 124 -114 -496 41 70 -149 -761 281 -767 -357 234 -203 -226 296 -185 182 -171 126
4781 126 59 109 -48 86 295 56 26 83 310 326 266 169 8 -14 134 -50 530 -159 -358 485 66 16 311
4804 311 223 -89 426 127 313 30 117 159 411 -30 36 260 556 45 356 -194 148 298 594 595 257 6
4826 6 -171 628 314 420 129 228 -138 167 136 61 48 -311 163 265 623 220 43 -436 36 -36 264 222 188
4849 188 517 506 1 261 -369 157 -228 -365 -103 -383 -360 318 -190 -151 -57 -11 -189 -92 -266 -338 -335 -481 -216
4872 -216 -488 -370 -556 -181 -425 171 -863 -300 -103 464 -45 -358 -433 -509 -22 458 -370 295 -250 262
$$ packed form
4719Ak15L23M7m71M99n43Q28m96m15N00k57k4J20m52L67N4k69Q27j145N02J22
4740i7k30J91k01m88L25m01O24J11K7J38o8k95m60L84P47p23L49k34l17N11J89
4761H2k72j18M32k38l82N37K9k19o12J042j048M10N91m37k3N22m81L67l53K97
4781A26o7N0j57J34K09k39l0N7K27J6o0r7j61k2J48j84N80o89j99Q43m19n0K95
4804C11q8l12N15k99J86k83Q7M2K52m41O6K24K96n11L11n50L42J50K96Jl38k51
4826Fj77P99l14J06k91R9l66L05l1p5j3l59M74J02L58m03j77m79M72p2L00m2l4
4849A88L29j1n05K60o30N26l85j37K62k80K3O78n08L9R4M6j78R7j74p2Lj46K65
4872b16k72J18j86L75k44N96j034N63J97N67n09l13p5p6M87M80q28O65n45N12
$$ plain form
4892 262 233 37 -89 -202 -35 -286 32 1 -7 -456 387 -72 -494 -249 -137 -147 143 -185 -28 468 -231 135
4914 135 -190 -433 28 445 -246 65 168 5 367 363 -136 512 151 179 371 135 152 -458 132 564 371
4935 371 410 301 439 -60 306 211 517 529 -156 172 297 -136 135 -220 459 486 199 -136 218 -370 -153
4956 -153 -28 105 -65 378 -155 242 692 229 43 -63 294 453 9 -254 57 -160 -94 -184 329 -336 -253
4977 -253 -214 -15 -37 -91 6 -340 187 -155 41 328 4 -15 -295 426 -26 -249 32 -87 -124 -587 -279 475
4999 475 -205 200 -132 -464 -324 -302 221 -135 -96 54 168 -159 -529 -215 -3 -59 -438 481 -465 266 -13
5020 -13 17 497 -102 107 -18 -138 -106 -218 -177 27 346 -109 -25 61 20 389 71 655 328 -65 -101 -233 416
5043 416 4 -130 14 -17 382 197 -110 495 119 143 428 -116 -444 80 47 -223 -244 467 584 478 -69
$$ packed form
4892B62k9j96j26j13J67k51L18l1qm49Q43m59m22K45J12j0K90l28J57M96o99L66
4914A35l25k43M61M17o91L11J03j63L62mm99O48l61K8J92k36J7o10N90M32j93
4935C71L9j09J38m99L66r5L06J2o85L28J25m33K71l55O79K7k87l35L54n88K17
4956a53J25J33j70M43n33L97M50m63j86j06L57J59m44k63L11k17O6r0N13o65Q3
4977b53L9J99k2n4R7l46N27l42J96K87l24j9k80P21m52k23K81j19l7m63L08P54
4999D75o80M05l32l32J40K2N23l56L9J50J14l27l70L14K12n6l79R19r46P31k79
5020a3L0M80n99K09j25j20L2j12M1K04L19m55Q4Q6m1L69l18N84l27l93l6j32O49
5043D16m12j34J44l1L99j85l07O05l76K4K85n44l28N24l3k70k1P11J17j06n47
$$ plain form
5064 -69 598 -192 148 -278 26 423 -320 93 425 -107 -38 17 31 663 -215 -97 114 -123 516 -138 252
$$ packed form
5064f9O67p90L40m26L04L97p43M13L32n32O9N5J4O32q78J18K11k37O39o54L90
$$ [...]
8191G35
##END NTUPLES=NMR FID
##END=
