##TITLE=1H_SA_40.145
 DMSO-d6, 8 sc, 
 25.10.2019
##JCAMPDX= 6.0         $$ Bruker NMR JCAMP-DX V2.0
##DATA TYPE= NMR FID
##DATA CLASS= NTUPLES
##ORIGIN= UXNMR, Bruker Analytische Messtechnik GmbH
##OWNER= root
$$ XWIN-NMR		Version 3.5
$$ Fri Oct 25 14:51:20 2019 Russian Standard Time (UT+4h)  she@DPX200
##.OBSERVE FREQUENCY= 200.1315
##.OBSERVE NUCLEUS= ^1H
##.DELAY= (6, 6)
##.ACQUISITION MODE= SIMULTANEOUS
##.ACQUISITION SCHEME= undefined
##.AVERAGES= 8
##.DIGITISER RES= 18
##SPECTROMETER/DATA SYSTEM= spect
##.PULSE SEQUENCE= zg30
##.SOLVENT NAME= DMSO
##.SHIFT REFERENCE= (INTERNAL, DMSO, 0, 15.7039)
##AUDIT TRAIL= $$ (NUMBER, WHEN, WHO, WHERE, WHAT)
$$ ##TITLE= Audit trail, XWIN-NMR		Version 3.5
$$ ##JCAMPDX= 5.01
$$ ##ORIGIN= Bruker BioSpin GmbH
$$ ##OWNER= she
$$ F:/spectra/data/she/nmr/H-F/1/audita.txt
$$ ##AUDIT TRAIL=  $$ (NUMBER, WHEN, WHO, WHERE, WHAT)
(   1,<2019-10-25 14:50:01.35 +0400>,<she>,<DPX200>,
      <created by zg, POWCHK disabled, PULCHK disabled
       configuration hash MD5:
       00 E9 B6 7A A2 85 ED C7 34 08 36 98 17 FE 4E 26
       data hash MD5: 16K
       1B ED 61 37 CA 9A D5 DE 37 96 A2 AD D5 9E 75 F9>)
$$ ##END=
$$ 
$$ hash MD5
$$ 94 E6 DD F7 F5 91 ED A9 19 38 28 7B 5E 7E 9C 0B
##$RELAX= 
##$RELAX= 
##$RELAX= 
##$RELAX= 
##$RELAX= 
##$RELAX= 
$$ Bruker specific parameters
$$ --------------------------
##$DU= <F:/spectra>
##$EXPNO= 1
##$NAME= <H-F>
##$PROCNO= 1
##$TYPE= <nmr>
##$USER= <she>
##$AMP= (0..31)
100 100 100 100 100 100 100 100 100 100 100 100 100 100 100 100 100 100 
100 100 100 100 100 100 100 100 100 100 100 100 100 100 
##$AQSEQ= 0
##$AQ_mod= 1
##$AUNM= <au_zg>
##$AUTOPOS= <>
##$BF1= 200.13
##$BF2= 200.13
##$BF3= 200.13
##$BF4= 200.13
##$BF5= 200.13
##$BF6= 200.13
##$BF7= 200.13
##$BF8= 200.13
##$BYTORDA= 1
##$CFDGTYP= 0
##$CFRGTYP= 5
##$CHEMSTR= <none>
##$CNST= (0..31)
1 1 145 1 1 1 1 1 1 1 1 1 1 1 1 1 1 1 1 1 1 1 1 1 1 1 1 1 1 1 1 1 
##$CPDPRG= <>
##$CPDPRG1= <>
##$CPDPRG2= <>
##$CPDPRG3= <>
##$CPDPRG4= <mlev>
##$CPDPRG5= <mlev>
##$CPDPRG6= <mlev>
##$CPDPRG7= <mlev>
##$CPDPRG8= <mlev>
##$CPDPRGB= <>
##$CPDPRGT= <>
##$D= (0..31)
0 1.2 0 0 0 0 0 0 0 0.06 0 0.03 0 0 0 0 0.0002 0 0 0 0 0 0 0 0 0 0 0 0 
0 0 0 
##$DATE= 1572000600
##$DBL= (0..7)
120 120 120 120 120 120 120 120 
##$DBP= (0..7)
150 150 150 150 150 150 150 150 
##$DBP07= 0
##$DBPNAM0= <>
##$DBPNAM1= <>
##$DBPNAM2= <>
##$DBPNAM3= <>
##$DBPNAM4= <>
##$DBPNAM5= <>
##$DBPNAM6= <>
##$DBPNAM7= <>
##$DBPOAL= (0..7)
0.5 0.5 0.5 0.5 0.5 0.5 0.5 0.5 
##$DBPOFFS= (0..7)
0 0 0 0 0 0 0 0 
##$DE= 6
##$DECBNUC= <off>
##$DECIM= 24
##$DECNUC= <off>
##$DECSTAT= 4
##$DIGMOD= 1
##$DIGTYP= 9
##$DL= (0..7)
0 120 120 120 120 120 120 120 
##$DP= (0..7)
150 150 150 150 150 150 150 150 
##$DP07= 0
##$DPNAME0= <>
##$DPNAME1= <>
##$DPNAME2= <>
##$DPNAME3= <>
##$DPNAME4= <>
##$DPNAME5= <>
##$DPNAME6= <>
##$DPNAME7= <>
##$DPOAL= (0..7)
0.5 0.5 0.5 0.5 0.5 0.5 0.5 0.5 
##$DPOFFS= (0..7)
0 0 0 0 0 0 0 0 
##$DQDMODE= 0
##$DR= 18
##$DS= 0
##$DSLIST= <SSSSSSSSSSSSSSS>
$$ [...]
##$SUBNAM2= <"">
##$SUBNAM3= <"">
##$SUBNAM4= <"">
##$SUBNAM5= <"">
##$SUBNAM6= <"">
##$SUBNAM7= <"">
##$SUBNAM8= <"">
##$SUBNAM9= <"">
##$SW= 24.0689530833862
##$SWIBOX= (0..15)
0 0 2 0 0 0 0 0 0 0 0 0 0 0 0 0 
##$SW_h= 4816.95568400771
##$TD= 16384
##$TD0= 1
##$TE= 0
##$TE2= 300
##$TE3= 300
##$TEG= 300
##$TL= (0..7)
0 120 120 120 120 120 120 120 
##$TP= (0..7)
150 150 150 150 150 150 150 150 
##$TP07= 0
##$TPNAME0= <>
##$TPNAME1= <>
##$TPNAME2= <>
##$TPNAME3= <>
##$TPNAME4= <>
##$TPNAME5= <>
##$TPNAME6= <>
##$TPNAME7= <>
##$TPOAL= (0..7)
0.5 0.5 0.5 0.5 0.5 0.5 0.5 0.5 
##$TPOFFS= (0..7)
0 0 0 0 0 0 0 0 
##$TUNHIN= 0
##$TUNHOUT= 0
##$TUNXOUT= 0
##$USERA1= <user>
##$USERA2= <user>
##$USERA3= <user>
##$USERA4= <user>
##$USERA5= <user>
##$V9= 5
##$VALIST= <valist>
##$VCLIST= <CCCCCCCCCCCCCCC>
##$VD= 0
##$VDLIST= <DDDDDDDDDDDDDDD>
##$VPLIST= <PPPPPPPPPPPPPPP>
##$VTLIST= <TTTTTTTTTTTTTTT>
##$WBST= 1024
##$WBSW= 4
##$XGAIN= (0..3)
0 0 0 0 
##$XL= 0
##$YL= 0
##$YMAX_a= 192177
##$YMIN_a= -264416
##$ZGOPTNS= <>
##$ZL1= 120
##$ZL2= 120
##$ZL3= 120
##$ZL4= 120
##$ABSF1= 10
##$ABSF2= 0
##$ABSG= 5
##$ABSL= 3
##$ALPHA= 0
##$AQORDER= 0
##$ASSFAC= 0
##$ASSFACI= 0
##$ASSFACX= 0
##$ASSWID= 0
##$AUNMP= <proc_1d>
##$AZFE= 0.1
##$AZFW= 0.1
##$BCFW= 1
##$BC_mod= 2
##$BYTORDP= 1
##$COROFFS= 0
##$CY= 11.3945322036743
##$DATMOD= 1
##$DC= 2
##$DFILT= <>
##$DTYPP= 0
##$F1P= 19.5091578491511
##$F2P= -0.509923556040331
##$FCOR= 0.5
##$FTSIZE= 0
##$FT_mod= 4
##$GAMMA= 1
##$GB= 0.15
##$INTBC= 1
##$INTSCL= 1
##$ISEN= 128
##$LB= 0.24
##$LEV0= 0
##$LPBIN= 0
##$MAXI= 10000
##$MC2= 0
##$MEAN= 0
##$ME_mod= 0
##$MI= 1.114404
##$NCOEF= 0
##$NC_proc= 0
##$NLEV= 6
##$NOISF1= 3.799351
##$NOISF2= 2.8
##$NSP= 1
##$NTH_PI= 0
##$NZP= 0
##$OFFSET= 15.70392
##$PC= 1
##$PHC0= -9594.699
##$PHC1= 44.20083
##$PH_mod= 1
##$PKNL= yes
##$PPARMOD= 0
##$PSCAL= 0
##$PSIGN= 0
##$REVERSE= no
##$SF= 200.130013532006
##$SI= 16384
##$SIGF1= 3
##$SIGF2= 2
##$SINO= 400
##$SIOLD= 16384
##$SREGLST= <1H.CDCl3>
##$SSB= 0
##$STSI= 0
##$STSR= 0
##$SW_p= 3612.71676300578
##$SYMM= 0
##$S_DEV= 0
##$TDeff= 0
##$TDoff= 0
##$TI= <>
##$TILT= no
##$TM1= 0
##$TM2= 0
##$TOPLEV= 0
##$USERP1= <user>
##$USERP2= <user>
##$USERP3= <user>
##$USERP4= <user>
##$USERP5= <user>
##$WDW= 1
##$XDIM= 8192
##$YMAX_p= 0
##$YMIN_p= 0
$$ End of Bruker specific parameters
$$ ---------------------------------
##NTUPLES= NMR FID
##VAR_NAME=  TIME,          FID/REAL,        FID/IMAG
##SYMBOL=    X,             R,               I
##VAR_TYPE=  INDEPENDENT,   DEPENDENT,       DEPENDENT
##VAR_FORM=  AFFN,          ASDF,            ASDF
##VAR_DIM=   8192,          8192,            8192
##UNITS=     SECONDS,       ARBITRARY UNITS, ARBITRARY UNITS
##FACTOR=    0.0002076,     1,               1
##FIRST=     0,             0,               0
##LAST=      1.7004516,     0,               0
##MIN=       0,             -264416,         0
##MAX=       1.7004516,     192177,          0
$$ Real data points
##PAGE= N=1
##DATA TABLE= (X++(R..R)), XYDATA
0 0 0 0 0 0 8 -8 8 -8 8 -16 16 -24 30 -32 40 -49 63 -72 88 -103 120 -140 161 -188 215 -247 279 -319 363
29 363 -410 461 -519 581 -651 726 -809 901 -1000 1110 -1229 1362 -1509 1671 -1849 2047
45 2047 -2273 2525 -2810 3140 -3522 3973 -4511 5174 -6003 7086 -8563 10703 -14109 20397
59 20397 -35935 157190 149568 -109811 84033 192177 120415 50534 123854 82312 16317 58487
71 58487 128193 48426 -10200 39888 82401 33104 19684 40864 39820 31383 56085 47177 28199
84 28199 52942 75376 35802 33182 89903 84765 9824 16886 89310 87313 29149 22058 34312
97 34312 28715 54324 78819 16197 -36562 35390 103937 38550 -20505 31728 62514 20472
109 20472 35641 83926 29617 -31788 48233 122042 31946 -48920 29846 95098 22910 -26010
121 -26010 31472 51276 -4132 -11366 30326 24432 -7023 682 11854 1797 9801 21860 -1689
134 -1689 -18579 5805 20783 6272 5142 5085 -21554 -13796 41557 35412 -42381 -47076 37989 56595
148 56595 -12370 -32694 11522 24371 11762 22507 16360 -15268 3674 52090 31430 -23516
160 -23516 -8093 33826 13738 -15740 3017 7243 -26238 -22469 8811 -10667 -45810 -19866
172 -19866 7793 -28672 -50022 -2534 19670 -25525 -45322 -1815 24902 4858 -12101 -10206
184 -10206 -1214 17023 26063 -2314 -26182 -1076 26729 7676 -17987 -14735 -10022 -10087 5885
197 5885 5615 -31941 -39058 10878 28759 -18076 -36721 5620 25721 -1150 -7621 13112 12967
210 12967 3319 13879 15587 -1986 3157 23082 7988 -17482 -877 21779 1117 -23935 -10718
223 -10718 4914 -1622 -4724 -3326 -14401 -12930 16002 22478 -10957 -21100 15051 35156 13465
236 13465 -4527 3995 16564 23238 23114 7186 -5618 11684 32770 16782 -8919 14 19302
249 19302 14389 2450 4560 5598 3607 11600 13424 -2331 -4864 17025 21779 -2834 -9441 14060
263 14060 22649 4326 -5765 3380 10751 12140 10246 -658 -6958 9058 24291 8855 -11803
276 -11803 -1760 20174 19016 3111 -1865 3138 10438 16560 9864 -6340 -5726 14018 17574 -3514
290 -3514 -13213 1222 11444 3443 -6037 -6526 -991 6099 6799 -3871 -10700 1689 14577 5691
304 5691 -8734 -3875 10623 10703 141 -5683 -2238 5276 9147 1027 -11259 -8869 5822 7391
318 7391 -8671 -16311 -4512 6010 914 -9777 -11858 -4390 4709 3727 -7593 -12321 -434 11129
332 11129 4125 -9548 -8410 4233 8846 66 -8317 -6489 2852 6734 -1617 -12543 -9768 2906
346 2906 5661 -6693 -15026 -7116 3204 1437 -8489 -12065 -5590 3243 2063 -7511 -11234 -2091 6405
361 6405 1362 -9274 -9126 1266 7083 669 -7832 -6805 1654 5846 -914 -9358 -6270 3596 5297
376 5297 -4208 -11423 -5804 3976 3035 -5962 -11003 -4836 4655 3303 -6010 -10186 -2451 5595 2671
391 2671 -6154 -7702 682 6597 1818 -6308 -6535 1896 6885 1133 -6829 -5646 3301 5799 -1760
406 -1760 -7429 -3717 4413 5530 -2292 -7524 -2307 6431 6003 -2535 -6687 305 7594 5029 -3080
421 -3080 -4993 1459 6952 4042 -3481 -5313 2743 8086 2634 -5078 -3205 5437 8017 2724 -1754
436 -1754 1293 7697 9753 5084 25 3307 11201 11303 2290 -1971 4584 10570 6376 -1432 -3618
451 -3618 837 5812 4437 -2895 -6757 107 7480 3316 -4019 -1372 7255 10415 6296 3454 5311
466 5311 10394 14578 12387 6127 6200 13862 15142 6595 2441 7871 10425 5867 1147 844 2367 4549
482 4549 4649 -857 -4392 3058 11059 5597 -2508 2131 11774 11628 7127 5361 6248 9720 14495 12327
498 12327 2681 925 11055 14101 3147 -2928 2853 6119 2956 1854 957 -1162 1239 7222 4531
513 4531 -1617 3469 11844 8357 2334 7519 12915 9057 6802 9536 8768 6781 10435 10036 141 -680
529 -680 10350 10520 -3457 -6601 3724 6486 -420 -2028 -1263 -3151 188 6920 1414 -8536 -2801
544 -2801 8321 3755 -5482 -3295 1816 211 150 2093 -3402 -6410 2324 6472 -2911 -5233 5539
559 5539 6974 -2256 -188 9141 6590 163 3872 6791 1794 2808 7600 173 -8289 93 6250
574 6250 -5035 -13822 -5625 -1873 -9440 -9518 -5568 -12265 -14705 -532 3647 -12482 -15531 3453 9148
589 9148 -4582 -6440 4726 3945 -2223 3220 5776 -3330 -5272 3372 1818 -8076 -6362 -779 -6201
604 -6201 -8644 -2597 -2647 -9071 -4631 2011 -2717 -3869 6803 7171 -4674 353 16402 12264 -2846
619 -2846 1475 12467 6311 -665 4435 1256 -9516 -4012 6221 -5806 -19285 -8917 1055 -9498
633 -9498 -14494 -4041 -4731 -13352 -3188 9501 -2349 -11437 5004 16050 2742 -2498 12206
646 12206 14310 1563 3392 14597 9709 -233 4034 8769 3648 2283 4930 -478 -2800 5269
660 5269 6437 -3396 -2946 5152 1540 -3223 6796 7786 -8059 -6969 12709 10517 -11296 -8547 9707
675 9707 3978 -9959 -1606 5253 -7058 -9200 6820 5179 -11558 -5544 9767 2545 -7695 3547
689 3547 9669 -3422 -4190 11165 8167 -7190 -1886 9889 1511 -6936 3625 6404 -7238 -7394
703 -7394 6482 4866 -7019 -4841 3094 831 -301 3551 -1666 -5545 3810 8025 -3894 -7087
717 -7087 3173 832 -10291 -3863 2906 -11845 -19685 -3022 1983 -17926 -21415 -2052 -2247 -19249
731 -19249 -12689 3800 -5231 -15333 -663 9954 -3461 -7036 7510 8098 -2725 2213 10678
744 10678 586 -6924 4592 6933 -7082 -9257 -465 -5274 -12862 -6476 -3421 -14865 -15727 -3864
758 -3864 -4089 -14557 -11206 -2240 -6122 -8276 -343 -1337 -9257 -2897 5995 -2979 -9942 267 3423
773 3423 -8776 -8554 3487 -2495 -16336 -7628 4141 -7493 -16225 -2729 2171 -10765 -10614 4591
787 4591 1866 -11375 -3735 8787 1186 -6686 2347 6427 -2237 -1949 6020 1144 -6592 379 5108
802 5108 -3828 -7321 521 -266 -7349 -2740 2198 -5191 -8430 1186 2680 -6478 -4861 3773 -451
817 -451 -5941 1046 4741 -4121 -4153 5853 3534 -5192 202 7490 310 -3675 5957 8291 -2176
832 -2176 -1307 9869 6895 -2157 3442 10176 2925 -757 7633 7860 -1943 -312 7894 3257 -3953
847 -3953 801 5015 -1891 -3075 3963 2392 -4250 61 6315 1202 -2206 4406 6529 753 2531
862 2531 8777 5724 956 5912 9073 2963 1590 7492 5993 -524 2054 6263 1282 -2764 2931
877 2931 4347 -2049 -1695 4635 2471 -2312 2400 6653 1835 -459 5369 6923 1361 2681 7338
892 7338 4522 332 4381 6348 1070 144 4275 2651 -2134 276 3749 -561 -3114 1529 2525 -2267
908 -2267 -1178 3110 1671 -1844 1687 4752 1168 -376 3933 4732 480 1695 4651 2415 80
923 80 2931 4049 -348 -689 2602 1746 -1498 94 2174 -957 -2266 1216 1398 -1702 -1805 1475 477
940 477 -1606 517 1963 -315 -1008 2219 1774 -1178 20 2674 1219 -480 1344 1801 -775 -224
956 -224 2436 1463 -1408 -323 1242 60 -928 430 614 -2069 -1107 1162 186 -1802 -549 1018 -408
973 -408 -678 925 350 -1363 28 1802 364 -1639 29 957 80 -197 631 -65 -1167 161 1040
990 1040 -19 -981 -174 696 -197 231 1090 46 -665 1000 1225 61 -506 520 421 -430 -114 161 -1244
1009 -1244 -1822 -293 146 -1297 -2426 -738 -474 -629 -108 133 -651 -299 912 1573 549 655 1300 832
1027 832 827 1655 834 -630 -434 694 370 -1465 -1552 -1172 -1597 -1480 -704 -1414 -1995 -1467 41 -262 -828 52
1047 52 534 1160 1687 1853 1067 517 1513 2178 1314 336 493 444 -123 164 83 -825 -1723 -420 95 -382 -617
1068 -617 -306 -166 -43 989 1197 558 436 1508 1765 1219 998 1167 543 335 940 344 -586 -944 4
1087 4 -548 -1376 -1116 -915 -1164 -790 -296 -225 -1140 -322 826 317 274 747 1148 400 382 1217 537 -665 425
1108 425 604 -562 -808 363 416 -666 92 931 215 -401 1058 1682 715 748 1818 1070 -534 465 1182
1127 1182 -723 -1894 -809 -896 -3151 -3591 -2133 -3040 -4286 -3041 -2233 -3361 -3588 -1099 -611 -1986 -771
1144 -771 1544 1097 418 2386 3018 1629 1989 3226 2034 -39 1224 2060 -1081 -2122 -590 -1133 -3550
1161 -3550 -3300 -1352 -3264 -4733 -2295 -1487 -3353 -2860 -146 -544 -2285 -166 1995 145 -802 1045
1177 1045 989 -1629 -1400 290 -1657 -4011 -2265 -1315 -4799 -5403 -2565 -2311 -5097 -3756 -1750 -2539 -3459
1194 -3459 154 1129 -1130 -293 3422 2778 15 2301 3776 1355 573 3324 1844 -1626 -445 1769
1210 1769 -1686 -3861 -949 -223 -4484 -4408 -549 -1994 -5741 -3275 50 -2893 -4404 -575 -125 -4007
1226 -4007 -2504 1558 -721 -3752 -654 1546 -1480 -2686 876 333 -2478 204 3092 -496 -1845
1241 -1845 2641 3921 278 637 4653 2342 -142 2848 4737 141 -1791 2574 1888 -2951 -1650
1256 -1650 1398 -2010 -4665 -855 435 -4239 -4328 440 -267 -3864 -936 2228 -1335 -2128 3433 3789
1272 3789 -1647 -695 4125 2231 -1491 737 2481 -1867 -2463 1861 533 -4036 -2513 1725 -981
1287 -981 -3085 1004 2197 -1153 1107 5490 2887 -2 4727 7017 2453 1429 6663 4887 -432
1302 -432 1677 5763 540 -3818 301 1638 -4292 -4874 187 -2240 -7089 -3674 1160 -2912 -5698
1317 -5698 -303 2098 -1756 -861 4300 2278 -438 3720 6637 2291 708 5193 5022 521 2028
1332 2028 4695 950 -1302 2909 2860 -2140 -1471 3008 545 -2668 1243 3356 -1281 -1645 3718 2516
1348 2516 -2354 345 4360 297 -2580 2714 3689 -2825 -2430 3634 1670 -4279 -1348 2617 -1277
1363 -1277 -3738 1574 2729 -2822 -1857 3865 1874 -3033 857 4075 370 -1189 3321 2426 -1122
1378 -1122 825 4132 709 -1727 2289 3200 -1078 -401 3794 1664 -1908 1631 4136 -181 -793 3468
1394 3468 2594 -1982 443 4104 -472 -3279 1451 2527 -2933 -3097 1429 -482 -5052 -1285 1825
1409 1825 -2661 -4879 1493 2721 -2836 -1859 3691 2110 -1450 2101 5346 1295 220 4508 4273
1424 4273 -297 1158 4880 1189 -1784 1434 2271 -2236 -2263 1008 -546 -3644 -775 1521 -2223 -3301
1440 -3301 1668 1799 -2485 -683 3412 1079 -1294 2349 3567 -732 -313 3727 1853 -2235 411
1455 411 3373 -915 -2928 1247 1600 -3299 -1838 2133 -396 -3481 309 2632 -1173 -1533 2738 2453
1471 2453 -1570 231 4166 1461 -750 2180 2993 -277 -205 3704 1249 -1774 528 2823 -734 -2289
1487 -2289 1123 1204 -2226 -1086 1990 -327 -2526 565 1874 -1342 -1460 1924 1267 -1494 170 2319
1503 2319 114 -1479 1817 2042 -1198 -141 2882 694 -1570 1345 2859 -541 -1073 2028 1751 -1413
1519 -1413 141 2277 -98 -1854 1147 1734 -1647 -997 1796 587 -2005 22 2091 -974 -1251 1888
1535 1888 1355 -1635 -160 2244 622 -1287 930 2148 -399 -734 1762 1184 -946 -90 1514 -46
1551 -46 -975 440 825 -1226 -887 1209 -321 -1834 -356 1300 -662 -1108 883 0 -1507 -204 1531
1568 1531 -115 -1581 477 1301 -473 -420 1123 439 -918 642 1516 -280 -651 851 878 -1334 -774
1585 -774 1195 -332 -1572 28 1271 -1070 -1409 105 260 -1303 -326 783 -114 -1155 164 862
1601 862 -535 -204 909 336 -143 675 1203 -227 -317 1051 494 -963 -691 745 -251 -1149 179 226
1619 226 -1381 -950 495 229 -1062 -645 737 -200 -409 560 762 -316 143 1304 434 -342 439 849
1637 849 83 -77 795 398 -1176 -393 527 -244 -1044 2 406 -134 -329 618 405 -435 501 800 327
1656 327 55 973 999 381 549 691 150 -215 519 627 -410 -502 508 -58 -685 30 856 -141 -498 907
1676 907 1143 306 237 1082 799 391 888 1463 486 127 914 409 -456 -46 201 -119 -501 222 351 -230
1696 -230 -56 1295 819 141 1000 1857 1220 1042 2206 1619 1280 1420 2161 1708 882 1004 932 307 -249 144
1716 144 -121 -750 -476 -402 -703 -925 -375 49 -466 439 933 903 515 1102 1902 1446 1201 2152 1872 1223 1177
1737 1177 1770 772 491 903 897 -141 218 411 378 -154 548 851 263 514 1190 1366 670 1388 2016 1445
1757 1445 1006 1985 1698 808 762 1395 981 -84 247 781 -279 -595 37 -148 -731 -390 423 302 -632
1776 -632 118 815 362 592 1614 1244 539 1026 2094 1340 831 1974 1601 431 569 1442 994 747 1159
1795 1159 1370 744 571 1716 1370 531 1135 1691 988 389 1349 1194 146 -144 707 -13 -1221 -450 -9
1814 -9 -1338 -1578 -717 -838 -1538 -514 13 -517 -682 759 959 185 1036 2260 1965 1195 2206 2333 1228
1833 1228 1057 2346 1343 -67 170 896 -552 -1292 74 -41 -1700 -1057 -124 -579 -1488 -131 972
1850 972 -378 -355 1113 1211 -225 -36 1273 338 -708 601 412 -940 -1372 -444 -991 -2172 -1638 -863
1868 -863 -1933 -2292 -970 -815 -1969 -1183 617 84 -138 841 1697 426 729 2717 2030 479 1675
1885 1675 2526 811 -316 1058 967 -941 -823 641 -964 -2306 -1001 -77 -1617 -2569 -464 -526 -2237
1902 -2237 -1322 228 -994 -1788 29 585 -1082 -1217 922 -22 -1575 -124 1136 -581 -1051 775
1918 775 690 -920 -41 1829 423 -774 1236 2134 -154 -2 1885 1846 -670 742 1792 59 -921
1935 -921 845 1055 -1516 -932 875 -274 -2023 -161 922 -1194 -1406 668 334 -1424 -138 1838
1951 1838 214 -1154 799 1164 -696 -690 939 244 -1668 -274 723 -1490 -1716 296 52 -2176 -843
1968 -843 1150 -245 -1343 961 1637 -415 212 2356 1715 -306 1412 2768 95 -807 1745 1423
1984 1423 -1498 -1154 932 -1041 -2551 -1149 -417 -2596 -2822 -478 -1119 -3199 -1648 585 -1085 -2300
2000 -2300 237 927 -986 -244 1722 654 -768 873 1744 -362 -891 1191 930 -1564 -778 743
2016 743 -792 -1913 44 70 -1834 -1544 575 -233 -2378 -487 1109 -766 -1766 791 349 -1416
2032 -1416 -781 985 -448 -1987 12 1030 -1759 -2218 327 24 -2294 -1368 255 -1051 -2094 -100
2048 -100 77 -2156 -1313 698 13 -1998 -551 797 -749 -1423 272 273 -1321 -286 819 -524 -1599
2065 -1599 523 952 -1153 -1266 833 529 -1331 -78 695 -821 -1086 659 548 -1501 -815 761 -535
2082 -535 -2191 -304 581 -1345 -1685 221 -322 -2041 -661 1044 -738 -1781 412 1075 -1180 -1177 1505
2099 1505 974 -712 -103 1250 -225 -688 1136 646 -1462 -429 1209 -234 -2170 -424 369 -1226
2115 -1226 -1320 257 -317 -1299 -217 797 -1344 -1394 976 912 -1256 -669 798 369 -782 -49 754 -817
2133 -817 -790 724 244 -1463 -344 1231 -398 -1899 -282 737 -706 -1131 259 -504 -1389 69 737
2150 737 -940 -1402 709 1192 -1307 -649 801 568 -692 -9 399 -503 -353 754 113 -1154 -116
2167 -116 1166 -513 -1511 -383 353 -691 -516 -118 -584 -1134 296 715 -1110 -1051 816 873 -939 -924
2185 -924 553 384 -445 419 651 -743 -173 1082 56 -1554 18 885 -318 -1491 -303 451 -590
2202 -590 -469 297 -586 -1047 497 692 -1102 -968 965 997 -435 -670 703 791 252 635 131 -310 590
2221 590 1205 189 -996 183 1121 -1 -743 137 544 80 456 697 -86 -232 960 1237 -440 -103
2239 -103 1231 1098 -267 190 919 199 258 367 173 -244 462 1383 47 -874 171 1324 309 -567
2257 -567 227 641 351 441 656 -136 110 1167 1325 -406 -151 991 812 -100 -295 -133 -132 -118 432 -215
2277 -215 -688 68 735 -41 -1024 156 1267 139 114 280 555 757 636 565 -252 -47 1092 970 -633
2296 -633 -994 395 598 -840 -562 -586 -36 81 -164 -461 -1017 -84 816 -193 -1029 -158 960 13 -266
2315 -266 -143 -120 181 144 -157 -819 -815 123 287 -1402 -1279 -290 -57 -725 -948 -639 -340 127 16 -416 -601
2336 -601 582 908 61 -1069 -22 783 301 -445 -719 -523 -22 206 -547 -870 -783 63 148 -1087 -1042 -266
2356 -266 661 -436 -729 -503 -171 404 243 -244 -734 104 768 -223 -1296 -479 43 7 -869 -710 -778 -55
2376 -55 90 62 -1354 -224 1171 730 -244 -149 1119 1016 747 403 276 272 922 880 -505 -842 127 637
2396 637 -480 -1491 -901 -419 -554 -952 -1088 -842 -207 194 -169 -873 -523 1069 841 -242 -212 506 800
2415 800 382 135 -384 58 598 512 -852 -1286 166 757 -573 -1113 -617 241 247 -132 -476 -350 542 1264
2435 1264 207 -385 -57 1331 903 -464 -767 45 389 -241 -566 -1418 -1053 -88 -489 -1632 -1770 -523
2453 -523 245 -1075 -1500 -1133 -242 -27 -303 -862 -1110 -261 913 123 -1428 -321 1164 479 -687 -766
2471 -766 50 132 287 -247 -946 -650 572 351 -844 -1012 32 370 -520 -860 -272 59 -33 -357 -1138 -1458
2491 -1458 -775 -201 -902 -2188 -1758 -125 -591 -1263 -1320 -1023 -472 -100 -662 -1281 -596 951 847 -597 -935
2510 -935 557 1347 238 -152 -29 335 517 433 -603 -995 182 844 -586 -1483 -668 639 45 -654
2528 -654 -396 -175 75 589 251 -535 -284 1205 1485 -784 -861 646 1002 -131 -634 -801 -510 -147 302
2547 302 -967 -1571 -250 839 -603 -1212 -58 852 766 145 302 156 963 1385 1357 -191 568 1975
2565 1975 2098 -347 -370 863 1134 228 -305 -427 -173 190 708 -492 -1411 126 1031 -161 -1261 -84
2583 -84 704 387 218 -147 -32 578 961 707 -558 -303 1261 1003 -670 -649 480 507 161 -164 -391 -317
2603 -317 568 993 -191 -823 505 1623 200 -636 249 969 145 419 184 -130 169 646 349 -1268
2621 -1268 -992 968 659 -682 -688 596 271 68 -358 -46 -489 273 991 -415 -1561 307 1116 -313
2639 -313 -1386 -419 174 32 -358 -409 -949 -521 867 165 -968 -583 894 795 -422 -466 465 695 242
2658 242 487 47 -398 708 1245 -568 -1291 400 1040 -659 -1365 -481 -216 -497 -308 -796 -1288 -623 252
2677 252 201 -1458 -854 591 613 -841 -427 341 98 2 159 -650 -705 491 964 -635 -1384 -177 859
2696 859 -564 -1281 -251 -231 -741 69 -326 -1228 -725 954 277 -1375 -744 891 130 -472 -414 396 62
2715 62 86 313 -721 -576 406 1034 -790 -1501 -40 923 -451 -852 -677 -234 -172 388 49 -1429 -637
2734 -637 827 275 -1375 -1086 740 389 -714 -279 -122 -118 388 329 -652 -1072 435 989 -417 -1092 406
2753 406 701 -542 -675 -495 -351 -169 207 -509 -1004 -454 808 135 -943 -435 743 474 -472 -126 -19
2772 -19 -139 684 500 -775 -771 651 946 -184 -938 260 309 -133 -155 -307 -338 -229 522 -43 -1139 -451
2792 -451 921 312 -996 -345 507 464 -376 -109 -333 -179 461 369 -584 -570 783 464 -281 -657 135 605
2812 605 -21 -295 235 67 296 798 200 -1103 -44 1374 451 -582 -264 501 515 -325 44 -204 -218
2831 -218 477 717 -744 -817 924 1065 -155 -622 255 660 153 274 -9 -348 550 718 400 -424 -211
2850 -211 657 137 -844 -531 467 187 176 -487 -710 -213 357 391 -404 -776 669 772 -241 -552 -37 330
2870 330 8 51 32 -370 -289 458 -185 -1255 -348 559 19 -964 -850 28 -101 -421 -209 -670 -414 67 -50
2891 -50 -861 -746 295 518 -637 -1016 -448 -46 -636 -122 -445 -806 -133 -11 -615 -1389 -711 153 -249 -1306
2911 -1306 -967 -310 -291 -347 -453 -785 -676 7 -35 -1122 -893 81 28 -592 -680 -364 -262 -337 -356 -558 -1159 -395
2933 -395 -140 -238 -1127 -725 350 -352 -630 -726 -6 -150 -156 -113 -861 -498 -31 -306 -1014 -655 -189 139 -683
2954 -683 -788 -541 -530 -546 -49 -895 -988 -224 33 -105 -751 -200 634 231 -217 -131 -223 459 248 12 -366 -323
2976 -323 498 202 -400 -493 219 305 -420 -475 -34 -137 -4 202 -63 -426 237 611 -6 -736 141 469 4
2997 4 -121 -262 139 177 -28 -3 -425 -412 83 205 -591 -646 260 544 152 -67 63 247 498 921 334 59
3019 59 573 971 591 -224 664 682 418 31 39 48 117 141 138 -589 -341 317 363 -325 -527 266 746 140 -309 35
3043 35 31 144 470 -208 -162 -2 274 -128 -362 14 205 272 -52 -15 -142 216 428 353 -133 235 758 674 -15
3066 -15 10 534 544 245 49 67 385 46 4 -530 -912 -111 177 -583 -813 -564 -282 -251 -440 -513 -542 -346 25
3089 25 -102 -514 -356 -54 89 -324 -96 311 206 -35 -156 -239 -241 -209 232 -421 -613 -167 349 -213 -536 -136
3111 -136 172 238 128 247 -105 117 490 390 -194 -251 212 142 -339 -340 -32 -257 -575 -123 -478 -592 -395 -413
3133 -413 -498 -702 -160 -67 -456 -610 -130 -120 -265 -12 225 -375 -84 371 256 -158 -143 510 451 -182 -2 184
3155 184 2 38 143 59 -305 111 417 -27 -392 -22 287 -137 -148 -66 150 -164 24 14 -348 -347 66 -260
3177 -260 -642 -566 24 -49 -518 -49 -121 8 -7 197 -71 -131 337 447 19 -205 270 259 -10 -35 86 235
3199 235 110 234 127 -368 -297 442 428 -308 -58 224 -96 -143 58 -135 276 118 135 117 -122 447 368 -232
3221 -232 -117 -70 108 -243 -283 -334 -90 -345 159 22 -354 30 173 -85 -279 -37 386 261 353 488 203
3242 203 -110 175 317 125 -100 107 654 -52 -91 444 136 -180 -274 -32 -49 -284 -93 -131 -244 -73 473
3263 473 -213 -451 -95 -22 -223 -106 124 -8 -186 -171 60 -94 -297 350 188 -301 -2 278 -24 -543 6
3284 6 -14 -335 -219 222 -69 -613 -97 663 -50 -515 10 251 -178 -271 294 -208 60 62 285 -372 -456 113
3306 113 20 -131 106 303 -43 -7 238 231 -10 -165 37 204 -259 -58 421 -265 -384 100 133 -306 -13 129
3328 129 -472 -359 366 263 -192 -295 342 388 -527 -181 249 8 -27 322 338 -407 -230 -64 -154 -367 -83
3349 -83 150 -225 -283 82 15 -374 84 -93 131 -86 136 326 -385 -187 -5 274 -263 23 153 -203 -390
3370 -390 60 -174 -101 -228 37 -51 -522 -62 259 -316 -220 25 -204 -334 214 141 -67 -166 173 64 -171 29
3392 29 195 196 -262 -127 426 74 -223 175 133 -363 -5 171 244 -541 109 220 -122 212 49 150 -521 44
3414 44 -151 54 -73 189 -75 -299 31 284 126 -598 23 741 -415 -97 139 260 -104 -54 325 137
3434 137 -217 -49 118 -107 -86 154 -392 -419 243 151 -70 -468 616 67 -165 217 213 54 -77 176 451
3455 451 -57 92 147 110 -188 -119 30 -132 -208 32 200 -304 -40 45 -225 -41 141 143 -137 88 16 199 -177
3478 -177 -94 254 -71 31 -7 33 -346 42 184 186 -271 -300 251 -252 43 -67 -119 -362 -304 332 -269 -526 -62
3501 -62 49 -330 -23 -1 78 -377 -356 204 88 -116 -101 158 -221 -254 -157 -80 -385 43 148 -383 -325 196 173
3524 173 -69 -394 100 -95 -286 -18 15 -352 -231 -133 -26 -427 -69 160 -445 -210 109 -185 -294 -246 77
3545 77 -158 -345 -91 148 -345 -28 337 199 -112 6 341 197 10 -54 -180 -404 -8 -51 133 -323 87
3566 87 310 -117 98 233 117 -161 -146 217 275 -103 188 357 19 261 174 161 5 32 106 -196 -83 -126 266
3589 266 -112 -183 143 -45 147 139 39 244 4 359 297 113 116 198 64 -61 219 129 120 215 138 396 -77 17
3613 17 364 -37 -212 272 233 -242 380 251 188 -98 133 -61 33 -291 251 -59 -115 212 -91 -227 -515 -53
3635 -53 -12 -83 32 -40 144 -23 16 122 -303 -372 256 68 155 68 159 119 -46 492 230 224 -309 159 144 -30
3659 -30 -249 167 -95 -165 -19 -28 -11 -142 172 36 -239 -261 -90 -124 -359 -2 176 -85 -91 -59 -108 -326 -241 -115
3683 -115 145 -126 -42 -150 -332 -39 188 -47 -71 140 53 -217 -307 238 32 342 54 50 254 33 235 258
3705 258 214 270 5 -74 43 38 -127 -513 -36 168 -129 -355 59 -86 -269 128 20 -99 -236 -50 104 53
3727 53 -190 221 -349 -417 -74 -64 -132 -350 139 -39 197 -277 -63 76 -80 -27 67 90 436 133 131 256 133
3750 133 -174 43 102 54 49 -175 -158 -204 -34 -24 -63 -112 -72 -450 5 138 -291 -219 -78 -37 -380 -127 -15 -150
3774 -150 -146 137 -196 -192 131 -23 83 -11 -331 275 60 -311 -431 -3 -56 163 87 -83 193 155 196 -353 50
3797 50 217 44 70 463 44 62 -123 229 226 -496 -128 -46 -39 -63 125 -154 -220 -188 68 -170 -287 -322 -43 371
3821 371 142 228 357 -122 -56 150 397 93 -47 115 38 13 69 456 112 -223 278 174 -13 101 199 108
3843 108 -149 229 48 -222 83 132 -41 -207 118 182 80 -88 192 -174 -370 254 -92 -322 -4 266 69
3864 69 -395 -67 235 -170 -123 11 -22 -317 -106 55 97 32 -73 76 -165 19 97 131 -41 23 188 -2 68
3887 68 84 158 -325 -305 120 -31 -9 31 -55 -42 -310 277 74 -71 -212 -55 -172 -362 -101 239 -94 -40 63
3910 63 -67 -437 -373 -232 -205 -196 184 -141 -271 -101 -6 126 -232 31 34 -8 -322 126 21 -210 -266 200 12
3933 12 -41 128 -1 -533 143 60 5 -138 -95 55 -109 -82 113 -155 -46 24 -40 -142 -128 72 47 3 -144 -11
3957 -11 -126 41 88 4 -247 -342 -152 -104 -332 183 213 -135 -149 -34 130 -211 -120 -89 112 -358 19 237 22
3980 22 -79 101 107 -159 28 160 17 -59 231 169 111 -44 -227 41 83 28 228 -249 -10 -181 322 -332 -2
4003 -2 32 34 -98 -110 167 -166 -30 150 -294 -160 -315 3 -175 -112 147 127 -94 -176 128 45 39 -168 94 -127
4027 -127 -255 -44 331 80 131 411 14 229 185 143 80 113 357 221 137 305 -15 168 51 155 -42 -43 177
4050 177 185 26 -153 29 198 105 106 -74 -8 -95 -212 101 188 -114 293 -74 134 -73 86 65 -330 -100 229
4073 229 -93 4 282 397 -132 132 369 121 50 149 216 174 115 361 -127 -110 -28 200 362 14 -24 -91 -205
4096 -205 -104 200 -168 43 94 342 -17 -208 237 243 -302 -150 93 224 -186 239 54 -301 -23 178 -47
4117 -47 -201 -13 -30 144 -489 145 -105 -168 112 523 -115 6 299 87 -41 68 -127 42 -425 179 215
4138 215 253 -164 121 31 -11 -342 152 20 -520 18 -51 48 104 70 -2 -2 59 174 149 -53 109 -37 -81 -93 68
4163 68 -387 -293 -212 -59 -479 -76 222 -9 -212 -185 210 -73 -487 -77 127 -112 -12 -329 -219 -327 -247 -97
4185 -97 -4 -46 -59 275 -243 -230 -166 -64 -128 -69 40 -133 -173 90 -21 -286 -110 41 -46 -222 -320 34 -81 -272
4209 -272 181 -153 -46 269 71 -333 -177 -258 279 -284 -15 71 437 -242 50 86 -77 -140 119 194 -58 22
4231 22 61 -52 152 -71 156 -317 -89 -52 -47 -2 -61 240 -219 -97 206 299 114 -41 -27 117 -194 106 100 -116
4255 -116 -130 108 403 -6 -87 181 -86 -151 106 101 -93 -278 23 84 1 -227 40 -64 -384 209 0 53 136
4278 136 -52 -67 -81 193 -262 41 72 149 248 80 -49 -68 -148 -79 275 -35 27 251 -120 81 -55 -32 -115 -64
4302 -64 -106 -115 -169 -140 -387 -65 -101 -195 418 80 -113 -22 94 -343 -218 30 -205 -222 179 -209 -147 -149 -275 79
4326 79 15 -213 113 142 -212 211 -216 -180 92 -304 -45 -1 -49 -154 -258 90 70 -40 -299 -130 -255 -166 -130
4349 -130 -65 158 -51 -380 -49 -111 -198 -265 27 -79 -278 -97 44 235 -491 -105 57 -121 -319 5 -139
4370 -139 39 -108 -191 113 -157 83 336 -102 -22 72 159 -23 201 241 -121 47 131 49 -110 9 132 -253
4392 -253 11 -259 54 92 -79 198 62 8 109 130 -25 -138 -83 -63 -257 -192 -85 -228 -237 258 57 -60 -220
4415 -220 356 -355 60 138 289 -30 -347 111 -15 -43 245 173 -299 -2 -103 -299 231 45 109 -84 3 259
4437 259 13 -154 -34 78 -164 71 -34 298 -36 334 249 -46 29 -227 50 -76 -65 -14 152 -270 -41
4458 -41 112 61 -54 -30 -13 -114 -58 -13 -34 -255 -197 314 0 68 241 -34 311 146 -28 247 -109 126 -97
4481 -97 -56 -207 46 336 59 -432 -32 61 -143 -57 76 105 -41 168 0 -131 -91 137 193 167 -43 59 -145
4504 -145 -117 -302 60 105 166 248 129 -263 -127 60 -324 -85 136 257 -161 -147 333 -59 -61 129 -78 -193
4526 -193 -83 -68 103 -45 -38 95 263 -73 207 105 -100 37 162 -105 -124 -54 -43 -6 -55 30 127 -72 22 -129
4550 -129 -94 -307 -110 -59 -213 -170 329 254 55 -63 466 -78 -62 174 -40 -172 35 -49 15 -227 -64 232
4572 232 -275 92 -8 -187 -243 -258 -166 17 -149 -150 -76 -231 33 311 44 -64 103 -77 -187 -25 279 -3
4594 -3 115 70 90 254 -314 -78 -21 -174 -79 -13 254 -152 33 -172 40 -24 30 104 -23 291 -50 -78 -110 216
4618 216 -113 -97 129 168 273 -280 46 -40 85 -201 35 152 -158 182 6 56 282 8 -168 -382 -131
4639 -131 184 -23 -106 193 -142 -343 133 319 -76 -164 -114 95 164 -8 -54 -73 -261 -124 -125 -94 -238 -22 87
4662 87 87 -213 -209 230 -203 -11 -9 -11 89 5 262 -256 169 -237 -337 -81 -70 -45 -126 -129 -24 -37 -134 95 -51 -45
4688 -45 2 -179 188 -42 32 97 -108 125 120 -48 -385 210 -95 150 70 -187 -338 64 210 -39 73 -478
4710 -478 -116 65 175 -140 -343 -150 63 -178 -103 -44 -102 104 -231 -177 -59 323 -7 33 -110 -123 -129 -126 -147 -17
4734 -17 11 19 -8 2 -109 -116 130 -92 49 -191 56 43 288 -120 -51 -40 -129 8 -9 140 112 163 -162 -114 18
4759 18 -58 -123 45 3 -173 -102 -120 62 78 -48 138 201 220 -44 35 -30 -168 -286 -17 -7 237 86 -176 359
4783 359 68 261 180 -72 -45 190 164 -10 53 -50 -270 171 337 -100 119 63 129 -303 -33 80 3 -122
4805 -122 10 73 102 82 184 -193 -31 176 48 -19 -350 -69 150 -90 -207 -74 41 -52 -231 -45 -41 21 189
4828 189 -160 -101 -174 -28 -18 -121 0 -260 356 -103 20 -139 -68 78 453 33 -149 97 -5 -97 30 -25
4850 -25 175 -116 -63 -110 -48 111 -154 -95 -406 -140 12 -62 4 -78 -397 21 207 43 116 -89 294 -9 32
4873 32 4 149 211 53 230 -24 66 -93 -174 51 153 10 -15 209 -127 113 24 -23 -56 89 -284 -28 103
4896 103 -13 86 -56 18 210 -20 96 113 95 251 -31 -185 -240 -105 278 -39 91 63 220 -191 -339 1
4918 1 -123 -18 182 192 -29 241 306 121 -3 -124 209 165 -53 -67 237 271 -53 -41 26 -19 2 127 110 -35
4942 -35 -284 6 68 -102 -219 57 -229 21 -171 85 177 -335 67 -114 -28 -49 372 55 -228 8 109 -263
4964 -263 278 251 62 50 217 -35 -123 153 83 68 -93 -99 363 163 -14 -166 -170 -174 18 -19 66 191 -176 109
4988 109 148 25 43 -33 -81 -22 -32 10 -353 -61 -152 -87 -106 30 217 -230 -230 97 25 103 -132 50 -94 -157 5
5013 5 -265 -130 188 278 127 -19 8 -111 -7 14 -233 -63 326 -39 -40 -199 -193 264 153 -156 13 291 91
5036 91 -130 -28 -318 -2 -87 -100 -115 -197 179 -244 -41 7 -549 -199 68 -66 -127 -77 159 140 -15 -285 -195
5059 -195 207 158 83 -140 -90 240 -51 -41 157 -3 72 19 -90 128 -20 47 120 99 29 145 217 170 112 53 79
5084 79 -123 183 -179 -17 -316 -122 -333 56 -49 -398 -176 -150 -227 -188 -315 -95 -332 10 88 -149 -208 -71
5106 -71 -350 199 63 -244 -44 66 34 162 6 -550 112 285 134 -46 -321 101 -139 172 -44 -234 28
5127 28 194 132 -373 -103 -261 -24 25 -420 -167 -62 139 166 -156 -42 77 120 -66 -140 59 151 -29 46 -124
5150 -124 -210 -260 153 50 -43 -89 -122 -93 11 -733 -61 -38 94 -30 41 -45 -15 219 100 -30 14 4 138 82
5174 82 -170 -83 -424 -192 70 -183 -18 44 -189 -103 -17 -91 -39 -203 -65 -190 222 283 11 -139 -142 2 -109
5197 -109 -146 -128 73 20 109 13 41 -99 253 -44 -102 -97 111 -54 -228 -325 136 327 69 77 -17 9 267 71 134
5222 134 -110 116 289 -44 22 -277 -214 -33 -71 -463 178 19 -44 -331 25 77 -88 370 -43 1 52 -64
5244 -64 269 -46 -123 -108 -202 148 -49 200 -203 -224 97 -46 60 12 135 83 -271 42 116 294 -433 -13 40
5267 40 89 -145 -191 24 30 146 38 51 -164 207 54 -277 73 49 144 42 -105 -335 167 24 -33 -276 -65
5290 -65 -96 235 106 -101 32 -107 132 -210 206 -188 -122 219 78 43 -51 225 -38 233 156 184 -86 181
5312 181 -108 42 -115 415 -86 -205 34 66 -98 103 316 -7 159 266 222 172 -328 -194 -135 138 83 108
5334 108 -130 -68 129 63 108 -248 274 -147 -148 60 22 211 161 71 64 -77 -212 246 -181 102 216 -67 199
5357 199 63 132 -175 64 -95 -126 187 122 -70 48 -69 180 148 -7 176 129 176 102 122 97 93 124 303 -170
5381 -170 -112 91 101 -29 -213 -85 -34 -145 132 -281 22 33 87 105 -255 91 -553 122 44 -198 -414 -256
5403 -256 21 -53 139 57 -53 163 233 70 138 -221 81 -224 51 112 -384 -168 44 47 48 -230 219 113 -411
5426 -411 -262 -188 191 -80 -118 48 52 92 -181 -108 -80 88 -13 113 -96 -167 69 -39 -120 -271 0 -11 45 203
5450 203 -65 -288 157 -26 -186 -244 177 113 -138 50 108 96 41 -139 147 -33 -135 -349 -232 -72 -88 -70
5472 -70 -105 -243 -268 -67 112 168 -112 -72 191 -120 38 -25 -178 204 212 216 -295 147 16 149 -150 -66 -345 -207
5496 -207 103 233 -207 199 -218 317 -67 -146 178 69 143 155 55 -138 189 21 348 127 -112 -194 12
5517 12 -295 -108 -42 -6 291 172 -390 -11 -2 56 195 86 71 -104 -460 47 26 292 234 66 -27 -108 249 193
5541 193 -176 20 -39 -12 -30 -213 1 49 106 -120 48 42 22 197 -44 -192 -8 -257 -52 54 -14 83 107 -13
5565 -13 60 -172 -84 50 33 125 38 -6 204 26 -28 297 -110 218 -192 -283 -35 253 -89 131 91 -58 -172
5588 -172 224 -142 -56 -151 -155 104 69 174 64 71 113 -28 21 217 199 101 -167 -185 231 29 134 86 -17 -87 248
5613 248 57 23 -84 65 -36 34 -267 106 46 -166 151 -158 121 -151 47 94 -90 -225 -236 -2 -60 -278
5635 -278 41 51 -23 -65 95 -281 169 4 17 -336 -57 126 -267 30 -163 -142 71 97 -121 -12 -180 -39
5657 -39 -185 108 169 -337 62 -208 38 8 -181 63 -214 -218 6 52 -204 -289 91 158 -175 127 118 -42 -223
5680 -223 18 -28 208 14 61 -196 -252 -7 -205 133 11 173 279 -26 123 -24 21 -41 215 -201 40 -92
5702 -92 125 347 -168 -427 34 -97 88 27 -149 15 17 -216 -15 -214 217 140 -183 70 -172 -214 15 311
5724 311 24 233 199 270 146 -77 39 11 260 7 -74 -55 56 165 16 43 -116 -182 150 -117 59 90 8
5747 8 127 -43 5 37 245 -82 119 -354 -121 265 -17 -233 -76 -70 144 47 180 310 225 152 -25 234 -131
5770 -131 -86 92 81 27 112 -47 -225 70 -2 231 126 -83 353 -177 272 344 188 52 0 246 306 359 167
5793 167 109 -117 148 25 74 82 -69 4 146 -114 128 240 -318 88 -180 161 121 205 125 -330 86 83 161 -21
5817 -21 -11 221 -194 54 183 14 -159 -40 253 128 -21 -59 -96 164 159 -148 -132 5 -154 252 -35 75
5839 75 143 80 130 -239 -94 -186 114 -62 274 -80 -67 -33 45 22 146 -7 122 255 -173 96 -208 173 -183
5862 -183 114 -33 -96 -179 208 349 17 -156 70 -91 17 47 -35 50 60 152 -199 131 -62 239 20 88 -51
5885 -51 -84 107 -94 -143 -21 72 286 104 -167 161 32 -56 48 154 134 105 52 -317 53 149 142 150 178 290 -190
5910 -190 -104 9 -92 -27 -19 -77 242 -30 -202 128 26 -19 72 -114 252 329 65 96 227 -42 273 -31 75
5933 75 -190 370 261 -208 174 105 201 44 53 45 -281 224 -111 -80 284 31 161 -157 -309 43 32 116 60 -67
5957 -67 -181 -348 -11 -102 -227 313 -174 117 433 216 -123 239 -42 -97 -86 17 126 -24 -63 137 278 -131
5979 -131 -45 167 -45 -42 -169 287 -135 -70 133 58 21 -40 -66 -66 159 -119 106 142 -26 -171 190 27 29 -112
6003 -112 59 43 -64 -56 212 -90 76 20 -113 167 51 -238 -174 342 41 -13 146 -103 -204 -199 37 -340 -7
6026 -7 17 -109 -31 -178 27 -209 -278 -478 96 -158 48 149 -42 -33 -258 -123 74 97 299 234 -122 -175 94
6049 94 -128 139 93 84 -70 202 19 -160 -143 -145 -128 153 78 166 70 -8 -74 -257 -15 279 140 -86 -229 166
6073 166 -125 -280 23 -29 -420 162 -7 -162 -151 7 215 160 85 -210 -162 -150 71 -24 83 37 424 93 -151
6096 -151 -141 -48 -282 -209 -341 236 -153 158 -64 249 173 -58 -176 46 -87 -217 91 64 -47 -69 -251 -241
6118 -241 88 -268 -141 -10 -133 -4 137 -30 -96 90 -103 -43 68 -49 -279 180 -23 111 24 -150 359
6139 359 263 -15 -105 -307 87 131 -132 -189 -77 -23 2 91 310 -165 264 -19 -8 -59 -226 239 -13 -94 143
6162 143 13 -79 229 -76 361 -273 371 97 148 -115 -215 99 75 -152 103 -51 167 -31 -215 -178 -61
6183 -61 119 -1 -56 -246 62 -131 54 -36 83 -114 -184 185 157 5 -82 0 108 3 367 120 -23 -105 -27
6206 -27 -201 200 326 -219 -5 -50 74 -296 223 336 -88 341 111 -16 135 -53 -159 -84 -218 -271 -157
6227 -157 94 -1 -283 120 -93 -127 188 -38 -126 4 -142 18 -150 -72 274 -22 -49 156 -203 -90 -214 40
6249 40 33 -120 91 211 -142 70 -40 136 -337 31 226 -120 279 -192 -108 -170 321 68 -149 -12 5 -115
6271 -115 228 1 83 -176 -15 189 -2 -155 -356 6 -214 -165 -226 226 25 230 -169 303 -51 166 -19
6292 -19 -47 72 37 176 66 -127 -172 84 -39 -82 -100 240 143 -27 -13 -51 -56 134 -80 9 195 93 -236 43
6316 43 329 32 29 167 -278 -168 -146 376 208 -40 14 253 318 111 82 -48 -408 -294 -243 70 -60 117 217
6339 217 20 109 63 -104 -157 265 19 -336 27 23 -203 -116 74 19 -17 -65 2 -35 -83 33 -66 159 -156 -65 288
6364 288 -38 -132 9 -154 75 -359 84 261 188 -224 100 19 -180 -282 -116 -160 -315 -144 -261 -221 136 -228
6386 -228 129 243 88 108 -71 28 138 -81 -204 -81 -99 116 73 -86 -203 12 -15 -148 253 -21 -386 -333
6408 -333 -290 190 -24 -12 61 57 130 63 -8 163 -79 -20 134 -12 -150 -4 -39 45 193 -123 -75 -206 -9 -301
6432 -301 -280 -44 -243 -194 20 153 -182 19 -154 126 8 -33 -18 -28 -72 11 333 -230 -294 -75 311 -57 58
6455 58 157 20 -67 -128 -34 -92 141 262 133 -145 -33 160 66 1 13 -30 -104 -40 -168 -4 157 -79 -189 -69
6479 -69 6 -60 -278 3 -191 81 80 124 -132 -16 -180 -145 147 23 6 64 -105 -52 -62 107 -91 25 243 -157
6503 -157 -80 -245 -61 -243 80 -42 -132 -185 3 206 -182 110 6 -63 -116 -163 55 -12 30 -34 -188 -25 212
6526 212 44 -65 -204 40 -90 -41 212 -14 256 123 191 141 -112 165 138 -16 -169 177 -58 74 260
6547 260 -42 -137 -387 175 -9 141 -252 83 -140 -181 -334 77 -60 -30 37 2 184 -55 53 -333 -51 82
6569 82 301 283 5 185 369 68 -17 -59 10 -98 -18 42 -113 -15 278 53 -273 8 294 52 10 60 -244
6592 -244 -31 94 -85 106 -205 242 318 -4 158 -372 235 60 224 -164 44 -91 221 -145 -16 210
6612 210 230 -148 145 46 -158 -102 19 -158 -63 80 -61 61 56 -32 6 283 -97 11 -33 -9 -109 -94 68 9
6636 9 -120 -78 73 433 52 -32 137 -9 55 158 222 -46 11 34 -260 95 3 -168 -229 -138 194 277 50 -308
6660 -308 252 112 -39 -84 -150 121 -110 -58 -147 -197 56 -60 165 -89 95 196 120 100 -19 -116 -22 -115 -60 109
6684 109 -182 77 -224 -116 -16 213 -72 223 264 -47 107 283 11 -54 78 28 -95 -44 -20 3 11 -108 179
6707 179 54 197 19 -143 137 201 178 -158 -228 -30 167 119 96 107 23 -80 -201 52 22 96 -41 -118 63
6730 63 -145 -221 -1 110 46 -21 -175 59 105 71 -6 -119 -3 -51 -121 -98 127 232 -178 -43 14 -3 73 78 299
6755 299 42 207 -184 201 -121 7 95 79 225 -57 44 21 16 19 -6 108 180 -110 -32 -273 -213 280 -165 -110
6779 -110 -64 14 264 -264 239 175 -12 67 -160 264 -143 -77 84 -48 -32 -215 73 286 373 91 82 -116 177
6802 177 48 26 61 -75 146 121 275 -64 117 19 -221 237 -177 -88 84 -44 129 124 132 -57 -110 175 -192
6825 -192 -36 43 344 -88 247 96 -312 -291 225 -41 -283 -61 -182 64 58 203 -140 -8 -141 -73 84 -74
6847 -74 44 65 23 -4 51 -234 -200 184 72 -15 -105 101 -253 231 144 -34 31 40 -112 13 260 62 -52 -106
6871 -106 122 -186 30 108 2 -228 71 202 -102 47 -24 -270 -190 98 151 -11 -164 -74 -3 70 -227 -76
6893 -76 -54 -3 -10 240 24 43 -260 22 -70 -107 62 -114 49 -286 238 -144 100 -78 -110 -45 151 -187 -204 -100
6917 -100 66 127 -312 -249 -47 24 -46 78 283 -115 -203 114 -93 -179 -111 196 -79 5 91 -34 116 -42 -21
6940 -21 156 -53 -29 252 58 -97 -54 6 123 -48 117 172 -190 128 -51 289 333 39 73 -217 131 -134
6962 -134 257 1 -270 -39 35 -67 36 35 286 -151 -44 99 9 291 196 -253 208 -9 -255 -201 163 74
6984 74 -146 -30 13 -68 166 77 18 254 51 107 -50 -240 200 -77 -268 -65 -36 -75 -168 60 -216 168 -90
7007 -90 -217 33 -75 -68 -204 -75 -361 174 96 54 69 166 -285 153 234 -2 -19 38 253 -201 -59 -47 116 64
7031 64 159 -167 263 -75 -141 -67 -84 174 -376 314 104 25 -80 112 20 116 74 35 -121 -2 228 -105 -139 71
7055 71 7 -126 59 -74 -54 -119 -208 -32 154 119 -88 37 69 -16 106 116 -156 68 -37 -284 43 -132 -53
7078 -53 -139 -192 -183 -179 52 262 86 -133 43 232 184 136 -9 -183 198 25 200 -100 215 -260 288 126 316
7101 316 119 91 249 -303 130 -315 432 -170 -79 147 59 -129 59 -114 -64 -4 82 -130 33 -170 79 17
7123 17 -42 149 -240 140 -292 -93 -21 -137 174 -209 -49 -229 -18 237 112 142 24 -80 40 -33 -138 -155
7145 -155 69 71 -32 16 130 -186 18 347 -96 -262 350 133 106 276 -167 18 -166 0 -336 170 69
7166 69 76 -104 28 118 -112 39 -52 -29 136 10 -38 -2 -137 222 -353 -98 217 101 -159 37 8 211 72
7189 72 -145 -45 100 183 6 -94 53 -126 151 -67 63 200 167 -138 -3 -52 -81 109 -96 127 -18 -3
7211 -3 -101 46 -151 147 -45 -87 -114 -40 -220 8 -280 -138 -308 -110 -327 -115 155 -53 3 35 -29 -233 -223
7234 -223 -349 97 -41 -147 106 78 -337 144 45 -167 -114 74 -165 -64 113 147 -234 -80 -102 185 -381 256
7256 256 184 -203 -232 -67 210 -459 -2 -64 79 -101 240 -498 123 109 -9 152 -529 -269 -60 205 80
7277 80 -90 49 -99 11 -90 18 23 -26 207 155 -143 250 21 -74 -278 -181 86 -146 153 -79 -35 24 -248
7300 -248 -3 -100 -146 80 110 10 -93 -32 -160 -155 117 -210 78 158 133 155 -162 62 -26 158 7 89 -163 -29
7324 -29 81 -15 -43 -113 -82 1 116 -71 29 169 -9 143 -16 -165 76 75 94 -205 -170 -235 284 139 129 13
7348 13 32 -191 248 122 -124 -88 219 -31 166 -174 -245 -108 -43 -129 -45 -112 57 -19 143 264 96 -93 251
7371 251 -147 -12 -211 -288 359 -237 -86 -89 10 1 -193 131 -343 153 315 123 -269 39 121 26 219 5 43
7394 43 113 -38 37 -143 -64 259 -40 -179 69 -74 109 -97 -34 -209 -181 -238 -60 -20 -90 -56 -138 -258 69 -130
7418 -130 -2 -56 -45 146 -354 372 -111 29 -26 234 -50 -234 -48 284 85 -69 79 107 -127 139 122 -107
7440 -107 -39 -32 -256 -77 72 -6 217 -57 -5 169 -18 146 92 116 272 -89 31 38 -285 124 -96 -131 -102 385
7464 385 -51 -103 -37 -147 1 22 -96 196 6 44 -20 -95 47 -8 211 -72 -158 41 21 -11 -10 -316 240 -113
7488 -113 -176 52 -250 145 -4 -36 61 176 -336 48 80 -116 180 -112 -3 158 -308 -45 -103 220 147 87
7510 87 -361 30 221 -175 29 -64 74 279 -14 -216 2 345 113 -145 -144 -217 103 -172 97 -9 37 122
7532 122 -2 43 124 69 183 9 156 31 -160 78 -218 112 -218 -139 6 -146 -119 277 -201 175 -227 -243
7554 -243 201 35 -21 -36 259 164 221 178 -384 -56 172 66 113 -45 -97 153 53 -123 97 -55 -77 182 84
7577 84 -100 26 87 159 27 -48 144 -266 -4 -238 -108 254 291 44 -103 -79 -64 5 -112 -193 145 9 198
7600 198 -158 109 -215 171 148 -155 17 51 189 47 297 -67 -103 -123 -113 -233 132 -36 -63 215 51 -296
7622 -296 89 -103 -177 137 178 202 103 132 104 -113 -128 154 -88 -52 166 -227 -87 63 -294 -125 -16 194 42
7645 42 20 107 -22 -265 -73 81 170 67 -149 -7 35 15 12 -83 28 38 58 47 125 206 -173 178 -112 -200 338
7670 338 188 152 -19 -207 89 -17 107 59 -60 -98 160 14 109 164 211 -299 -216 37 59 10 -21 -118 -92 -325
7694 -325 -144 -3 -141 -121 181 -37 -285 63 11 62 -356 -58 174 24 180 -12 -170 95 97 116 87 -9 -216
7717 -216 54 -251 -194 -23 35 -26 49 25 -208 -77 -116 25 -105 26 98 -154 29 -187 154 50 -16 44 -177
7740 -177 24 226 48 -1 -44 -208 158 149 -82 259 93 256 -250 -9 -445 -95 96 11 -229 34 -22 -80
7762 -80 -17 324 -172 15 -357 -24 -26 -44 -69 -58 200 10 64 -152 49 -88 170 27 145 17 105 179 13
7785 13 25 -175 226 97 -119 65 71 -5 -56 -40 75 193 109 162 99 71 -103 -55 144 316 42 233 -26 -124
7809 -124 -88 171 60 -305 -248 -10 149 -120 130 63 29 33 -264 -37 -61 -164 49 212 -117 -217 132 133 -235
7832 -235 -28 -77 139 160 -88 -73 30 111 -106 97 209 161 -269 26 -211 233 -75 -169 43 -37 98 261
7854 261 -101 2 -7 -7 92 -55 -280 128 8 -106 -79 -203 67 56 -74 10 -24 -67 -84 -109 112 34 -88 132
7878 132 192 6 -73 28 272 92 62 -15 -180 188 -59 -302 225 -326 2 -193 -45 -292 41 -143 -12
7899 -12 250 -54 22 89 -5 -88 85 34 226 -201 211 -296 342 172 -440 7 32 98 -178 -81 -23 -233 -129
7922 -129 78 -101 -134 84 -18 -297 68 184 70 88 191 -37 -14 265 -89 17 38 -43 108 42 -284 90
7944 90 283 221 -79 -70 -195 47 -78 98 88 177 83 76 -3 -183 328 125 -217 106 -66 59 10 108 69 -20 -108
7969 -108 -4 106 18 114 199 -64 127 0 -268 -99 -73 216 159 -103 -144 -102 -30 271 288 131 -7 -328 62
7992 62 -116 -387 -136 -28 53 -114 -313 108 -156 66 -80 48 19 80 -167 -145 -56 -456 155 53 -30 -27 72
8015 72 106 129 -69 -113 -95 -335 128 217 -231 -446 -45 -99 -33 -203 104 -197 34 167 115 -5 -12 201 144 243
8039 243 30 274 116 61 -244 -170 -30 -76 -149 142 -49 -82 -130 -116 89 114 268 -69 -56 -241 -328 -99 16
8062 16 92 97 152 -83 -44 -63 -96 153 65 -121 -59 455 233 66 -337 -169 22 7 211 -79 109 83 -21 -416
8086 -416 -105 15 -16 -47 69 129 -328 -95 226 151 -35 234 -74 -13 154 150 38 27 242 140 39 -19 65
8109 65 -358 51 203 -80 -47 15 -330 -54 -12 166 -9 -104 -187 13 132 -162 189 -148 -243 30 97 -330 -147
8132 -147 -100 -138 -67 1 -149 -139 138 185 19 53 -97 63 -98 -111 126 -415 -37 302 117 -77 -67 -225 -44
8155 -44 -32 55 -168 -85 295 15 -64 50 -177 6 170 2 -54 306 242 -143 177 121 -184 -33 75 -15 -34
8178 -34 48 -34 14 -266 159 96 -222 178 -114 -57 121 247 -252
8191b52
$$ Imaginary data points
##PAGE= N=2
##DATA TABLE= (X++(I..I)), XYDATA
0 0 0 0 0 0 0 0 0 6 -8 8 -8 8 -15 16 -16 24 -24 32 -35 41 -48 56 -66 77 -87 101 -114 129 -146 166 -185
31 -185 207 -232 261 -291 323 -358 399 -443 490 -543 602 -664 736 -817 906 -1008 1124 -1257
49 -1257 1415 -1601 1828 -2107 2465 -2943 3608 -4606 6267 -9529 18369 -91230 -264416 -34697
63 -34697 103762 4762 -72947 10394 11137 -49372 -3036 71448 2282 -62277 -1219 48868
75 48868 -7459 -38168 -9363 -6138 -25340 -12571 -15708 -38644 -22333 1944 -28176 -37321 13726
88 13726 16234 -46871 -35169 44120 43114 -22869 -24643 13012 16508 23061 36668 -11446 -51614
101 -51614 17266 78433 6650 -61439 -3110 44685 -196 -6672 39134 5344 -45836 26697
113 26697 98246 13959 -61901 26450 103385 29686 -27096 37615 71268 14983 1483 49208
125 49208 47675 8995 14715 34909 24593 22097 31594 13939 -1605 23627 40773 19222 8950
138 8950 15592 3176 7584 47960 38011 -31769 -31736 50599 61374 -19548 -41886 15680 33560
151 33560 5647 4360 7394 -12190 3831 47536 29241 -21754 -546 51800 36183 1373
163 1373 21113 37501 10569 9134 40417 24695 -12860 5999 33500 -2508 -31020 7038
175 7038 24533 -25437 -48401 -4098 19162 -13428 -35639 -22260 -6465 5442 8667 -13319
187 -13319 -27586 2581 31792 10571 -17103 -5983 9614 7913 11430 7769 -21596 -27353 14598
200 14598 25605 -25948 -47143 -2289 17389 -17367 -29864 -5191 -686 -13270 -5166 3037 -8685
213 -8685 -4676 16210 6993 -14462 2150 26158 6206 -19306 -3414 15465 3565 -9324 -7860
226 -7860 -14260 -15634 3267 3705 -29161 -37297 -1353 15045 -13541 -32339 -14942 3295 4436
239 4436 -2 -10153 -15149 4164 22714 6280 -17015 -4258 19475 12518 -3511 -756 5093
252 5093 2662 5777 7532 -4929 -7621 11862 15493 -8708 -14229 10046 17721 -3116 -13022 718
266 718 10210 6348 724 -6257 -8315 5237 15742 -395 -18772 -5455 17187 11766 -7341 -9021
280 -9021 2717 10819 12153 5201 -5319 -826 18176 19879 -1285 -8024 9597 19753 8006
293 8006 -3099 -140 7001 10014 7534 -2951 -7376 4186 14689 3763 -9710 -2310 13143
306 13143 11148 -1319 -3270 4683 12426 13045 5076 -2699 2888 16620 15196 -1358 -6300 7006
320 7006 15871 6017 -5640 -4928 3569 9249 4184 -6439 -8495 3653 12388 2869 -9817 -5454
334 -5454 8885 11288 988 -5392 63 9716 10957 1895 -5862 -278 11662 11482 -2270 -7881
348 -7881 1758 10682 5673 -5195 -7121 1083 7312 3053 -6853 -8295 1360 7472 566 -9371 -6898
363 -6898 4073 7347 -1213 -8933 -4487 4199 6374 -1601 -8062 -2861 6528 5524 -4234 -8775 -938
378 -938 7336 3584 -6620 -9052 -1596 6084 1767 -8110 -10386 -1917 4819 -892 -10063 -9015 -34
393 -34 4098 -2645 -10063 -7167 1517 4573 -2434 -9479 -5442 3057 3816 -4510 -9222 -3999 3565 1945
409 1945 -6788 -10464 -3590 3504 760 -8367 -10422 -1883 3863 -1160 -8697 -8353 -582 3543 -1233
424 -1233 -8105 -7729 109 3125 -3914 -11083 -7667 694 863 -6923 -10581 -6061 -443 -655 -6163 -9289
440 -9289 -4346 3010 2406 -5844 -7474 1458 6991 1699 -4777 -3929 1882 5420 1541 -5783 -7949 -1790
456 -1790 2912 -3709 -12555 -10005 -2042 -2210 -8859 -11718 -8316 -3385 -1568 -3443 -7455 -5036 3300
471 3300 5539 -1344 -2793 4797 8907 3907 88 2605 5143 5386 3177 -1874 -4786 1096 5537
486 5537 -1855 -10872 -6030 3454 1333 -5490 -5781 -1422 2485 5351 3788 -2480 -1268 9965 13296
501 13296 3034 -1486 6340 10968 5950 2281 2380 1129 1934 5137 1220 -5776 -2130 5500 1189
516 1189 -5673 -548 6013 2686 -218 4287 6644 5767 9082 10319 4188 4972 15952 16501 3282
531 3282 1351 13679 16232 6551 3586 6985 6293 7111 10853 6200 -2734 3096 13952 8769 -2182
546 -2182 1066 8546 6315 3279 5007 1864 -1125 5489 8573 -1038 -4696 4583 6611 -3312 -2655
561 -2655 7123 5578 -1524 2913 8568 5693 6136 12134 8810 3414 11616 19390 9135 1369 10606
576 10606 16102 6662 2991 7375 2570 -2061 6718 8329 -8319 -12831 4872 9744 -6931 -10020
590 -10020 3144 4917 -2388 2462 7946 1063 -305 9901 10297 637 2047 9103 4457 -748 3878
605 3878 3202 -4832 -3779 1845 -3284 -7805 -320 449 -10238 -6596 9011 5906 -7966 -1624 13584
620 13584 10413 3198 9517 12155 5077 9926 19520 9720 -3369 6200 16305 3451 -6528 1441
634 1441 1764 -9195 -5494 3712 -7975 -19434 -4722 6295 -7794 -15124 751 5752 -5977
647 -5977 -4472 8773 6484 -3051 2405 10806 6163 3565 7163 5062 2171 8684 10096 194 -808
662 -808 8237 6208 -325 6209 9024 -3015 -2720 15341 14036 -6901 -4121 16022 11970 -4539
676 -4539 2081 12357 1057 -4109 9817 9464 -7562 -4271 12024 5341 -7700 1650 10645 -1066
690 -1066 -3868 11537 10458 -4327 634 15002 8834 -1577 7900 13807 1423 -108 13167 11624
704 11624 -1799 266 9819 7813 3303 5944 4836 1578 9112 14550 4143 1160 13149 14522
718 14522 4376 8766 17904 6834 -1135 13891 19212 -1152 -7610 11293 10938 -9309 -6997 7810
732 7810 -1022 -15095 -3447 7021 -6756 -12904 2180 6012 -5328 -1678 10165 4006 -2284
745 -2284 10234 16016 3729 1510 12935 11480 2435 6760 10595 -219 -3563 6831 5317 -7767
759 -7767 -6927 2003 -2576 -8357 -2689 -1856 -9036 -4767 4392 -2589 -9665 456 6578 -4280 -5412
774 -5412 6660 3175 -10354 -2593 9354 -2389 -13610 -1611 4348 -9746 -12592 1038 -864
787 -864 -15445 -9863 3024 -3987 -13833 -4549 2661 -5595 -6748 2003 -182 -7761 -855 5980 -2491
802 -2491 -7459 1043 2680 -5306 -3566 1887 -4425 -8752 -700 880 -8490 -9094 -27 -2969 -10084
817 -10084 -4832 -225 -8141 -10103 -752 -1607 -10967 -7521 385 -6017 -11494 -3022 422 -10008 -10365
832 -10365 1025 -557 -10112 -5538 3054 -3121 -7602 1455 3772 -5153 -4188 5334 2296 -5792 -1340
847 -1340 4563 -1751 -5086 903 149 -7236 -4821 1338 -3925 -9169 -3385 -811 -6800 -6708 -155 -2180
863 -2180 -7100 -2510 2414 -2269 -4138 2700 2940 -3071 -706 4870 827 -3944 1234 3323 -3133
878 -3133 -4068 1613 308 -5824 -2810 2115 -3168 -6324 -740 1490 -3654 -3486 2362 781 -2756 1244
894 1244 4294 449 -834 4354 4053 -832 1235 4966 1657 -2183 1747 3068 -1740 -2579 1620 -217
910 -217 -4156 -1750 1278 -1964 -3888 132 1138 -2643 -1994 1595 452 -1875 838 3016 -368 -720
926 -720 3039 2866 -206 886 2968 454 -1356 2025 2638 -1135 -1108 1932 762 -1845 -475 1438
942 1438 -1077 -2113 952 944 -2150 -1512 1433 322 -1714 343 1001 -1005 -752 2057 1164 -1397 -286
959 -286 2014 1043 -715 1139 1163 -1032 -647 1665 527 -1924 -812 856 -679 -1423 -84 17 -1633
976 -1633 -444 1079 -149 -2316 -444 1099 -339 -719 480 -367 -1448 -153 1238 -525 -1821 -368
992 -368 215 -927 -591 76 -1130 -1439 226 819 -776 -1113 310 443 -256 183 350 -429 -851 351
1010 351 975 -1098 -2012 -888 -637 -1447 -1271 -1181 -2216 -2135 -902 -594 -1841 -1725 -416 -276 -647 289 453
1029 453 -535 91 1587 1244 96 -44 685 450 -3 -227 -675 -1692 -1755 -1039 -1465 -2777 -2479 -1769 -1912
1048 -1912 -1692 -1404 -1519 -1489 -471 71 -61 -464 284 889 575 806 367 -28 -553 -106 221 -426 -1408 -1248
1068 -1248 -846 -1236 -1247 -715 -1611 -1486 -645 100 -365 -410 464 528 263 967 1315 267 467 1553 1192 -91
1088 -91 -430 261 -758 -712 -396 -839 -1640 -1624 -459 -743 -1660 -1044 -524 -852 -759 415 318 -391 -266 883
1108 883 59 -490 150 169 -1052 -491 321 -498 -1098 -380 690 -424 -534 1235 1162 462 1844 2901 1889
1127 1889 1132 2589 3481 1429 1083 2713 1657 -497 149 412 -1195 -2970 -1573 -1543 -3879 -3578 -1968
1144 -1968 -2311 -3625 -1906 -670 -1650 -634 1167 890 160 2257 3912 2010 1321 3688 3810 1280
1160 1280 1506 3144 1593 -1207 285 935 -1696 -2381 -719 -1344 -3210 -1579 341 -1346 -1946 283
1176 283 1725 -233 438 3018 1707 -467 2124 3063 -197 -1626 1215 989 -2851 -3135 -1132 -2724
1192 -2724 -5115 -3074 -2035 -4995 -4923 -1675 -1748 -3958 -1855 947 -1156 -1212 2444 2499 -442 1333 4559
1209 4559 2124 -440 2394 3586 -205 -776 2735 1391 -3070 -1437 1776 -1367 -3795 -825 286
1224 286 -3344 -3242 502 -1278 -4645 -2104 642 -2648 -4170 -1061 -1140 -4414 -2964 -371 -3305 -5171
1240 -5171 -1479 356 -3596 -3744 616 -304 -3120 -81 3118 -585 -1697 3196 3871 -719 262 4189
1256 4189 1282 -1949 1136 2689 -2294 -3769 867 20 -4716 -3097 169 -3141 -5250 -596 851
1271 851 -4117 -4007 1719 1133 -2682 -288 2542 -861 -2184 2357 1615 -3592 -2217 1481 -1398 -5003
1287 -5003 -1738 -774 -5063 -4477 -107 -2618 -5945 -1447 1988 -2152 -2851 2740 3627 -1238 1583 7205
1303 7205 3634 -413 4333 7056 1368 -64 4786 3261 -2897 -547 3450 -1448 -6147 -2512 92
1318 92 -5003 -5568 -1445 -2473 -6075 -2218 1091 -2776 -4079 1317 2562 -1213 -124 3656 1577 -625
1334 -625 2959 4225 -585 -551 3636 1926 -2175 599 3150 -1038 -2389 2403 2607 -2789 -888 4135
1350 4135 861 -2492 2442 4536 -1438 -1644 4913 3556 -2608 -565 4285 493 -3088 1327 2873
1365 2873 -3251 -2857 2567 962 -4285 -1465 2887 -617 -3307 1400 2043 -1945 -349 3256 558
1380 558 -2459 1291 3171 -882 -1036 3132 1591 -2496 683 3749 253 -1148 2983 3254 -907 963
1396 963 5466 2191 -1354 3389 5641 212 -616 4271 3222 -1918 234 4093 -623 -3996 1258
1411 1258 2333 -3736 -3902 1294 69 -4414 -1475 2470 -1333 -2945 1965 3228 -1089 371 4970
1426 4970 3113 -126 2905 5302 1305 530 4416 3117 -686 1048 3423 -15 -2201 1847 1654
1441 1654 -2613 -1727 2156 294 -2694 587 2825 -753 -1083 3350 2800 -1278 1462 4610 1115 -1332
1457 -1332 2872 4011 -764 -749 3405 1415 -2766 57 2287 -942 -2979 1349 1856 -2702 -1170 2577
1473 2577 431 -2279 622 2785 -223 -354 3389 2246 -881 1374 4210 1042 -670 2351 3345
1488 3345 -561 -250 2952 1482 -1402 1081 2592 -709 -1596 2253 1728 -1623 -210 2183 199 -1533
1504 -1533 1095 1837 -1043 -294 2329 995 -1489 1011 3107 -141 -987 2075 2334 -615 190 2761
1520 2761 1393 -896 1751 2862 -546 -632 2777 1872 -1254 6 2401 167 -1037 1296 1765 -1149
1536 -1149 -505 2201 771 -1247 779 2479 107 -840 1702 2027 -149 389 2643 1510 -104 1306
1552 1306 2015 -25 111 2259 1087 -1140 225 2036 -62 -641 947 903 -960 -68 1847 -9
1568 -9 -1377 576 1589 -556 -671 1264 810 -983 594 1496 -57 -936 1010 1792 -498 -144 1935
1585 1935 843 -558 532 1633 -370 -1152 933 985 -424 -257 609 -121 -1333 -372 660 -1028 -903
1602 -903 516 56 -645 140 525 -303 -478 779 659 -556 -375 956 360 -509 339 604 -667 -434
1620 -434 661 186 -1321 -679 237 -583 -1309 -374 -371 -1426 -909 248 -241 -1096 -240 654 -203 -47 732
1639 732 460 -684 -131 966 -41 -964 -310 -22 -654 -1568 -243 -545 -1475 -1240 -133 -617 -1157 -560
1657 -560 93 -603 -459 278 -230 -447 366 567 -546 -796 113 103 -514 -297 21 -817 -1364 -403 -188 -1112
1677 -1112 -901 -332 -271 -876 -195 269 -13 -572 239 372 -386 -222 442 -73 -427 -155 -621 -1248 -1119 -548
1697 -548 -1049 -1921 -1198 -683 -990 -1654 -890 -115 -803 -574 423 532 25 363 1338 995 855 1012 964 143
1717 143 282 487 -276 -919 -541 -882 -1523 -1206 -1058 -1523 -1890 -1413 -786 -1392 -1316 -340 -240 -829 -215 588
1737 588 208 -269 478 763 181 -245 305 46 -419 -399 -147 -1039 -1021 -336 -657 -1281 -630 -106 -573 -445 428
1758 428 974 387 238 1456 1045 207 712 1292 491 302 464 279 -609 -126 166 -462 -1062 -1068 -379 -1025
1778 -1025 -1192 44 -495 -1141 -423 166 -81 -514 493 535 -292 99 893 190 -200 653 644 80 -125 927
1798 927 739 294 625 1189 473 646 1673 1687 1195 929 2130 1917 1188 1690 1839 846 481 1241 470 -546
1818 -546 -455 131 -912 -1751 -448 -573 -1735 -1263 122 -530 -1089 -66 866 714 845 1929 1754 1049
1836 1049 1740 2954 1696 860 1895 1754 373 -9 1425 776 -543 -45 733 -307 -640 765 993
1853 993 -606 149 1446 1100 290 1672 2542 1213 934 2194 1731 368 734 1624 158 -876 96
1870 96 82 -1600 -1993 -314 -1030 -2411 -1344 -412 -1633 -1624 376 286 -1090 399 1841 1169 125 2068
1888 2068 2389 944 1139 2850 1778 -46 1162 2491 498 -354 1018 942 -833 -700 1254 -115
1904 -115 -1463 3 514 -915 -1225 796 164 -1396 -410 962 -808 -1737 -143 255 -1611 -971 708
1921 708 -580 -1836 -66 589 -722 -1238 1239 1126 -800 437 1827 560 -286 1709 2203 -365
1937 -365 50 2228 1042 -909 440 1749 -280 -1159 959 1098 -1407 -897 1701 184 -1116 608
1953 608 1314 -182 -473 1681 906 -746 227 1747 274 -489 952 777 -1334 -905 1081 -432 -2173
1970 -2173 -53 793 -1489 -995 684 629 -1317 555 2435 632 -377 2326 3325 661 1174 3447
1986 3447 2590 586 1712 2636 704 -459 2084 1105 -1143 -827 1261 -559 -2040 -209 412 -1403
2002 -1403 -1272 784 131 -1481 146 1522 140 -760 1626 1815 189 320 2248 1310 -87 1207
2018 1207 1618 -282 -450 1845 786 -1467 -239 1835 -326 -1477 536 1541 -843 -375 1797 811
2034 811 -1072 976 2380 -149 -796 1680 1906 -730 -578 1521 620 -1288 480 732 -1043 -762 1005
2051 1005 373 -1695 -522 1433 -349 -1436 407 618 -981 -426 706 -211 -1456 685 1276 -540
2067 -540 -1497 1020 967 -933 9 1105 137 -612 910 1265 -1098 -199 1775 554 -1334 431 1601
2084 1601 -446 -871 407 596 -1415 -630 698 -939 -2139 332 841 -1479 -1759 726 460 -1173
2100 -1173 -371 861 -47 -686 747 1215 -845 -16 1877 933 -987 444 1597 -176 -1012 565 325
2117 325 -1180 -49 518 -1076 -1518 476 837 -1177 -1457 951 469 -961 -225 1074 -123 -358 1149
2134 1149 800 -664 526 1707 548 -997 390 1407 -131 -947 198 164 -1127 -246 746 -728
2150 -728 -1372 662 631 -1247 -1118 1085 459 -779 68 624 -103 -376 793 142 -831 -86 1440 271
2168 271 -1347 251 1039 -181 -697 420 -62 -459 221 634 -743 -1194 611 628 -1027 -1038 747 191
2186 191 -617 -155 42 -492 -374 1097 391 -915 113 1273 -32 -931 166 1150 -107 -430 395 -332
2204 -332 -745 -11 520 -932 -1187 269 500 -1165 -1013 674 312 -511 61 276 -312 371 1054 367 -1185
2223 -1185 277 1539 452 -514 19 533 233 -51 283 -225 -264 747 627 -506 -642 1036 1102 -434
2241 -434 -90 795 803 266 465 485 136 399 1180 253 -812 506 1427 255 -959 376 445 142 200 467
2261 467 159 276 1400 1078 -82 -9 1470 1680 543 149 628 1011 887 1081 361 6 572 1162 474
2280 474 -804 459 1267 179 -872 128 916 597 332 822 527 511 1375 1478 143 376 1728 1815
2298 1815 623 132 891 1079 997 744 10 -84 650 1318 154 -534 520 1199 569 -112 177 1041 820
2317 820 1044 718 218 567 1413 1001 -385 -240 1063 1302 -309 -426 63 153 90 252 -441 -833 448
2336 448 940 -56 -715 750 1181 793 267 206 926 615 1056 370 -10 134 1133 677 -465 -481 429 656
2356 656 -101 -526 -387 275 449 183 -204 -495 797 1141 -85 -689 317 886 410 -410 -550 -110 87
2375 87 150 -629 -1242 -1027 288 335 -1138 -1060 288 785 101 -479 229 820 1264 1445 238 265 1397 2065
2395 2065 700 -207 460 1552 808 205 -396 -107 -184 93 -305 -1195 -493 660 -94 -910 -654 454 669
2414 669 -83 -356 129 593 1255 925 -29 -44 1001 1190 104 -224 -27 1041 601 0 -475 -306 542
2433 542 833 -7 -667 416 1512 1296 204 306 1544 1457 1089 658 439 901 1591 1188 146 -310 826
2452 826 1259 -109 -1016 -237 381 22 -385 -1154 -437 -22 689 -308 -1008 -261 1143 475 -691 -253 505
2471 505 914 227 56 -212 -177 1180 1115 -496 -597 708 1291 59 -573 414 1075 1058 469 167 75 996
2491 996 1135 276 -623 -53 1161 68 -1268 -929 -233 -303 -530 -1031 -1370 -1216 24 -315 -1475 -1639 148
2510 148 407 -868 -720 -359 246 346 356 -135 -354 470 968 109 -1026 -404 993 120 -904 -674 -45
2529 -45 -339 -329 -476 -1211 -535 752 295 -954 -733 799 1244 -45 -700 41 345 533 246 -695 -1170
2548 -1170 21 366 -1013 -2113 -856 -309 -750 -1599 -1592 -1113 -559 -273 -325 -1502 -963 817 493 -863
2566 -863 -530 842 1094 95 68 469 464 776 652 -25 -865 129 1153 -189 -1575 -95 633 -151 -833
2585 -833 -552 -491 -14 253 -20 -922 -546 1005 836 -709 -990 610 612 -288 -475 -259 -209 86 716 -364
2605 -364 -1230 484 1368 -6 -1339 293 944 474 109 290 476 359 1457 770 -688 -16 1375 1201
2623 1201 -694 -641 838 870 -53 6 150 -99 698 756 -509 -546 779 1535 302 -964 458 1049 544
2642 544 -384 -213 -306 -145 1073 8 -1297 -514 1213 534 -860 -820 657 429 -120 28 -94 -199 798
2661 798 1400 69 -492 807 1927 430 -319 570 1101 564 -48 299 -354 -222 869 163 -1214 -926
2679 -926 639 457 -970 -822 416 251 -20 184 -458 -64 847 1398 -408 -931 945 1359 142 -531
2697 -531 437 450 152 167 36 -543 -283 1032 351 -1345 -479 723 418 -827 -590 250 242 92 687 -362
2717 -362 -839 771 981 -136 -1220 1141 1040 -40 -759 117 514 -17 601 20 -782 -140 818 79
2735 79 -1256 -355 759 485 -673 -507 100 199 19 117 -596 -787 314 822 -575 -922 426 810 -117
2754 -117 -507 6 276 -63 96 -32 -813 -368 913 230 -1194 -621 542 138 -607 -346 243 22 -66
2773 -66 189 -479 -716 610 1013 -637 -978 132 1067 -215 -410 -154 16 269 569 -36 -744 -86 1108
2792 1108 132 -1471 -474 820 389 -552 -269 -148 6 176 327 -764 -715 491 858 -475 -787 43
2810 43 817 284 -59 210 -110 346 547 105 -580 411 1137 679 -814 -83 819 473 -449 -167 107 131
2830 131 695 590 -487 -419 899 854 -370 -402 449 1025 191 94 396 392 743 527 46 -482 191 1428 806
2851 806 -297 624 1021 848 206 395 449 276 548 897 -315 -186 802 1116 -114 -595 891 783 474
2870 474 147 451 636 592 1175 842 -208 190 1662 723 -298 118 919 754 335 316 333 493 492 762 -4
2891 -4 -50 897 1358 314 -11 581 1009 367 343 830 487 591 1120 324 -421 706 1272 235 -458 -198
2911 -198 660 271 -145 -45 80 -40 543 580 -192 -319 454 1227 5 -310 358 718 411 178 -339 -62
2931 -62 250 749 154 -513 -225 560 251 -538 -119 127 -22 54 -259 -16 -46 372 642 -74 -281 341 717
2952 717 -294 -407 32 4 -31 -529 -361 -668 -375 79 -500 -1185 -529 106 -118 -604 -399 93 -204 -42
2972 -42 -258 -393 -7 390 327 -205 -296 415 415 -168 -513 -290 -46 -398 -254 -337 -597 -349 460 -354 -610 -261
2994 -261 929 265 -336 -531 68 -16 140 84 -277 -137 94 130 -650 -482 317 364 -266 -722 -52 -103 -175 -150
3016 -150 -371 -744 -13 371 0 -391 119 727 204 -61 250 546 150 292 316 -131 13 421 139 -244
3036 -244 -259 624 428 327 50 462 473 240 565 354 -228 394 768 53 69 124 407 169 -210 -294 91 -36
3058 -36 293 -98 -619 -84 549 348 -275 104 577 721 383 292 627 505 938 894 559 220 747 1232 383
3079 383 -97 184 573 292 285 185 20 -59 1 -123 -221 -159 164 145 -223 -230 305 635 -17 400 -7 191 536
3102 536 507 177 -444 26 344 -222 -505 12 212 -78 -152 -131 -33 174 493 391 41 171 547 626 191 97
3124 97 691 505 412 363 357 132 66 124 -66 -407 127 -2 -296 -663 -195 -94 -266 -388 -413 -435 -436 -219 -160 -577
3148 -577 -517 293 80 -211 -142 230 -30 -61 107 -6 -104 176 298 -447 -303 224 537 76 -202 207 178 187
3170 187 28 326 209 197 408 230 -241 -97 443 -44 -407 -144 -457 -49 -373 75 -99 -393 79 242
3190 242 6 -622 272 353 -143 -63 305 249 -193 211 255 -141 -373 572 406 -498 -174 401 -11 -235 -46
3211 -46 35 -141 430 467 162 118 216 756 197 56 551 535 152 571 44 152 -94 98 178 -473 85 507
3233 507 -56 -593 -92 72 -601 -300 123 8 -186 270 299 173 -194 433 611 235 225 525 382 -152 -17
3254 -17 402 215 -235 413 17 -266 108 296 -43 -275 -137 294 34 45 102 503 -269 145 454 2 181
3275 181 506 484 -138 25 387 111 49 53 351 -62 102 456 165 -384 12 619 295 -99 -46 500 6 373
3297 373 254 314 -219 177 541 20 -245 333 321 -130 125 633 148 -279 -40 183 68 -215 606 219 -144
3318 -144 190 224 29 -190 84 128 -115 -375 136 460 -377 141 518 -221 -498 257 255 -426 171 443 -21
3339 -21 227 187 255 -179 -84 322 253 -352 69 109 28 -238 -51 22 -348 51 131 -130 -237 -144 24 -136 -558
3362 -558 206 118 -243 -60 16 -325 -219 64 175 -165 -73 474 256 -369 240 1 -126 -257 76 256 -137
3383 -137 -331 121 -331 -298 109 65 -377 -441 152 -131 -273 67 290 268 -495 -40 321 -210 -386 233 -134
3404 -134 -280 56 282 -233 -135 1 48 -366 -149 364 228 -300 30 348 -214 -464 203 135 -278 -458 145
3425 145 -278 -4 34 180 -83 -79 219 -149 -198 19 333 -23 -76 38 43 -488 46 212 3 65 -76 -121 -402
3448 -402 -260 111 52 -266 -24 -46 -271 16 166 158 -225 -148 229 257 -275 347 -65 -297 -86 15 336 -440
3470 -440 49 -29 -196 -550 286 -21 -386 80 253 -53 -400 3 242 -140 -272 213 46 -455 -216 108
3490 108 148 34 222 140 -234 94 74 -137 -152 -143 87 -360 -123 306 183 -303 7 237 -330 -528 235 552
3512 552 -413 -141 272 -413 -6 -258 -1 -136 -204 63 173 -225 -48 3 75 240 187 236 -181 49 -183 152
3534 152 -121 -36 -1 -197 -386 381 206 -376 -483 -49 -50 -420 -299 139 -244 -464 -9 -240 -435 -231 128
3555 128 -43 -234 -104 405 -47 -187 24 -25 -448 -49 -255 -121 -696 -87 -195 -85 -407 -42 -40 -21 -95 -51
3577 -51 -241 -242 343 67 -57 -151 44 173 -325 -210 -15 -214 54 189 185 -497 -80 28 -254 -471 -58 -44
3599 -44 -18 54 13 -224 -205 203 356 -93 -121 237 -39 -4 180 306 -2 -177 210 174 99 -71 170 222 -205
3622 -205 61 316 350 2 132 455 -163 81 473 -64 129 119 -40 10 -156 86 -65 23 -126 -134 154 -310
3644 -310 63 142 -242 -44 17 100 88 143 116 -75 -38 224 266 105 145 195 153 61 305 567 -43 93 48 159
3668 159 353 -194 119 300 -18 72 194 292 -173 178 142 -64 269 358 -192 70 156 310 272 84 125 -50
3690 -50 -89 252 191 -122 230 375 62 -289 41 44 104 -84 226 122 63 304 383 139 397 454 312 113 278
3713 278 346 261 27 337 466 112 117 201 209 -245 -24 10 -134 -116 91 18 -88 -82 255 249 -54 36 95 54 18 -346
3739 -346 -206 -178 117 -113 -64 -122 89 160 -195 15 145 451 -12 -127 268 396 43 377 483 -36 10 146
3761 146 61 -179 220 -94 81 -64 -44 -235 -18 5 213 42 -194 64 183 36 33 -100 -51 -101 107 138 -81
3784 -81 -140 138 -80 -149 2 28 123 -93 -145 170 164 -144 347 -213 187 296 160 138 -45 242 441 241 22
3807 22 27 23 242 203 298 -64 -317 12 23 -316 -286 79 -102 -306 39 334 15 -16 86 185 -238 70 -69 239
3831 239 16 16 247 -240 -79 -6 -197 -353 -32 -74 -21 47 142 65 213 75 234 -371 -112 13 98 -37 140
3854 140 156 73 -95 101 143 -23 22 197 126 -325 -173 -3 25 89 10 -139 -78 96 329 284 -57 168 18
3877 18 243 16 146 224 -19 -295 60 59 -151 180 106 -271 -247 117 -188 -59 124 38 130 104 87 251 18
3900 18 41 308 447 -47 8 -46 110 -272 308 -155 -69 -8 18 -182 -77 -151 78 -104 -233 94 80 26 -12 95
3924 95 173 179 234 153 114 132 318 -50 -51 162 -122 -209 -17 -11 105 -66 180 -122 -50 -118 245 108 46 -224 -56
3949 -56 254 -390 317 80 -59 20 200 -44 143 -158 -54 -275 5 297 163 -189 -57 -6 -419 -89 -213
3970 -213 -3 -19 -166 94 -203 -360 -116 7 -38 -122 -191 141 -338 24 -96 86 -32 -83 214 -153 -158 44
3992 44 -59 -180 -109 -149 -251 -157 -176 241 -224 -136 220 68 -208 140 272 -307 -182 11 187 -103 -262 180
4014 180 -228 -68 -12 345 -182 -23 260 -350 -449 92 18 -58 -98 -135 -84 -249 -159 307 -158 84 132 -150 -28
4037 -28 -380 143 235 -154 13 125 174 -195 -80 -60 -40 40 -50 -221 13 18 -57 64 -126 145 97 -70 148 197
4061 197 261 -332 46 223 56 -127 12 -233 -309 66 234 -203 -341 272 56 -157 -57 170 122 -54 111
4082 111 -115 -103 -112 76 153 -289 290 373 146 -123 141 60 -69 184 -52 -138 -5 6 117 30 -4 293 159
4105 159 -97 -98 -80 114 -1 480 124 -206 -157 -11 26 -390 -35 21 -77 -236 -54 59 -177 68 230 156 -178
4128 -178 218 35 -90 -185 166 5 225 43 -124 -13 -291 205 23 -139 53 -109 15 13 136 31 103
4149 103 -270 -38 72 -439 -309 179 -164 -51 160 128 -16 56 49 148 87 123 160 81 -318 -72 -41 -224 -43
4172 -43 158 -176 -410 -84 393 -42 -241 238 136 -98 -52 -179 1 -373 -182 -54 -333 26 74 -72 -65 64
4194 64 181 -80 -207 -232 -60 -164 -89 121 193 -194 32 117 -97 -299 -46 93 -50 136 135 15 -109 162
4216 162 -41 -79 -170 211 114 -42 -87 18 -195 -253 23 -380 -249 -169 41 -489 -293 -185 -269 -320 -363 40 -119
4239 -119 -379 -370 -59 -53 -67 -116 -286 -185 -59 72 49 140 45 -218 80 -90 2 179 117 99 335 7 -133 362
4263 362 -96 7 -194 19 122 -162 -183 170 -452 -42 219 1 -317 -162 25 -459 -8 109 -221 330
4283 330 -14 -71 -3 123 -65 -62 108 -258 130 5 326 -75 38 30 74 45 -38 -197 246 28 538 -2 -141
4306 -141 22 23 -191 24 209 -98 -58 49 242 -88 -53 76 131 123 -182 -296 -82 -343 31 -388 54 -154
4328 -154 -126 -328 -112 -138 21 18 239 173 -333 124 216 4 -293 158 -174 -14 -245 -70 61 -106 -64 276
4350 276 106 32 83 81 166 51 -99 298 -311 -153 16 -368 -111 -233 -292 -215 3 20 109 -466 95 -275 -21
4373 -21 -236 -105 -149 -301 -200 -342 -88 33 -20 113 -96 -302 -114 106 -20 -75 57 236 -41 -28 -23 -54 -132
4396 -132 119 -262 -307 -36 -121 -121 118 -221 -64 -293 -151 15 -50 -277 -248 3 -98 -264 -99 -191 59 47 120
4419 120 -136 -287 -19 -94 -286 -141 38 -84 56 -115 75 -48 41 -116 397 -12 63 69 95 164 -167 -456
4441 -456 195 -320 -56 -39 8 141 242 195 89 137 -23 -154 98 62 48 -212 71 -43 39 -56 389 149 128
4464 128 -151 202 19 203 32 -172 11 -149 173 -61 -214 -95 313 54 -225 92 -31 -35 92 31 80
4485 80 -265 -303 29 59 25 233 49 19 170 -163 -272 37 63 249 135 -39 46 -62 -341 127 339 -5
4507 -5 -59 86 32 -22 -72 -90 49 28 137 -158 -220 -150 273 88 300 -31 59 -261 -191 117 225 131 156 275 -31
4532 -31 -113 -70 107 -57 207 -206 80 -349 107 358 -105 103 202 67 -249 -273 153 99 -35 198 108 -210
4554 -210 -53 158 -55 121 -260 -22 203 -67 114 -55 -97 401 296 89 17 97 36 -78 76 171 -102 138
4576 138 146 8 -20 54 -8 -116 23 38 -111 -27 -20 -57 193 152 85 -101 104 -82 -62 76 -370 -109 303 -70
4600 -70 -269 -240 128 418 -386 300 159 -146 -101 182 4 251 66 32 -127 -191 -97 123 245 56 -229 38
4622 38 6 53 -154 -174 194 -1 80 286 -13 69 3 66 79 -479 83 28 288 75 201 339 140 -170 24
4645 24 -207 -4 208 42 40 141 130 175 70 -105 -160 65 200 -508 -435 4 -305 -99 67 34 144 8 -65
4668 -65 -107 -61 179 124 -73 -96 -199 -29 55 118 5 -114 109 223 -151 -35 -244 -84 116 46 -168 -111 -94
4691 -94 3 -296 242 -357 132 -17 -293 -310 154 -127 -389 -89 65 -105 -10 273 -16 110 9 73 -29 -92
4713 -92 133 172 -71 -215 224 175 -125 -135 -411 9 285 -93 23 79 182 41 25 -128 -34 144 156 -153 -86
4736 -86 -100 -127 89 171 -226 -150 -95 61 -26 -60 -149 -217 198 -63 -66 -51 155 -192 317 21 -19 238 186 13 -81
4761 -81 23 343 157 -70 -109 -134 133 416 49 -316 -102 104 69 -104 -133 -162 -81 317 317 129 10 44 -32 14
4785 14 -160 12 160 -50 -105 20 -114 -302 139 176 -46 -46 39 80 -122 -63 295 235 148 118 -155 50 254 -79
4809 -79 -135 -132 -183 116 36 -204 257 -26 86 37 -8 245 175 21 49 -182 90 -100 -71 78 -16 380 -122 -155
4833 -155 -1 -250 -137 -221 30 -242 -93 -198 -308 -2 103 103 334 92 -137 4 -177 -108 -102 2 -156 -86
4855 -86 47 0 -64 -96 -5 -271 -158 49 10 -226 -154 151 -23 162 -92 -70 99 -76 155 192 160 -97 -15 1
4879 1 -73 104 195 4 76 67 -198 -101 -40 -90 48 -99 -146 214 264 296 215 367 -190 86 178 0 -133 -58 -270
4904 -270 -162 327 -206 293 143 89 200 -115 50 -38 -74 -111 -108 15 -63 -202 202 106 -317 -285 168 -50 -253
4927 -253 98 -72 27 159 204 -233 -236 95 -9 -63 7 -169 9 -97 59 39 80 -120 -157 133 176 -28 -133
4950 -133 -43 -208 25 83 -120 -62 175 19 -80 172 -23 22 145 -85 -9 77 102 24 -89 -123 -202 0 -129 -105
4974 -105 -12 232 118 111 24 39 269 90 44 -122 -73 15 -217 -9 21 0 206 108 60 1 -103 -3 -150 -270
4998 -270 35 -238 22 -93 -118 21 301 38 -2 -268 -68 -121 -193 -54 -249 -217 19 125 4 -10 -190 192
5020 192 -56 -9 301 102 -123 294 -104 -47 -39 282 -24 -117 -39 7 180 -87 193 140 119 -92 -204 -138 -130 239
5044 239 -80 33 -412 98 14 121 53 221 66 -148 135 -186 -214 -212 48 -102 -174 -173 -35 99 116 27 -142
5067 -142 195 21 -163 -291 -55 -20 156 -87 -94 78 282 -128 -164 101 -64 276 -68 -56 -15 49 191 180 -77
5090 -77 104 22 57 -3 8 -189 107 -95 252 -486 88 -31 -111 10 -484 165 -116 -356 -62 -265 -11 27
5112 27 -178 12 -56 -65 -244 214 99 -122 -43 66 -222 -283 -98 -110 161 6 76 -277 144 -253 156 66 -169
5135 -169 267 229 -192 13 -486 -231 73 157 42 182 65 -40 -47 -78 9 -103 10 -163 -287 -72 253 -160
5157 -160 25 -85 11 -155 -260 -173 150 30 -104 -128 -243 -160 -28 -29 -147 2 -55 139 -231 179 39 210
5179 210 -246 -1 -96 -92 11 61 -89 165 -131 -215 -28 -18 -236 -187 -104 -20 227 -126 -368 143 -43 94 155
5202 155 -73 215 -8 181 44 -264 109 143 -136 -176 -121 -23 146 -21 89 6 -22 -140 35 142 -124 -26
5224 -26 46 19 43 -243 83 -121 -51 150 53 -38 -8 123 -17 8 485 127 137 161 186 -24 167 -212 -269 -5
5248 -5 -11 -219 -135 7 103 -131 -204 -127 -174 -69 -417 -87 184 -34 -32 -82 51 -34 59 36 329 -340 -194 175 -180
5273 -180 233 29 104 -137 68 -126 -89 194 201 109 -96 175 12 79 -175 86 10 -78 -18 77 -200 244 -155
5296 -155 150 -280 -65 -106 14 115 -8 -77 36 -246 52 -114 -235 9 -80 9 -168 -65 -75 10 -176 87
5318 87 65 144 244 -92 -148 -132 170 -29 -51 -181 -44 154 -214 -14 8 -26 -10 190 30 -148 -26 65 156 -53
5342 -53 109 264 -260 54 -38 84 22 127 224 -2 3 2 267 28 -233 24 368 8 -178 -41 -126 -104 -17 -31
5366 -31 -299 -224 63 70 2 75 44 -217 204 -14 -236 180 178 295 -88 205 139 -144 304 -214 150 57 126 111
5390 111 -36 -166 154 146 -111 -275 -44 32 -156 -4 -141 225 254 -167 223 -89 43 10 -83 5 -36 99 160
5413 160 73 -200 139 278 -225 -223 -188 196 -284 -212 -172 -209 -91 -76 -54 -53 278 163 -115 -61 -128 -240 104 237
5437 237 159 -33 149 -122 -6 196 65 105 111 -153 -147 -94 -68 225 -137 105 -240 -129 187 107 -8 55 -167
5460 -167 11 2 177 -40 -8 23 -72 57 -123 17 -344 -208 -221 160 -360 -89 -296 198 35 223 8 -80
5482 -80 -159 335 109 -155 -201 110 -8 -142 19 32 125 86 159 -107 -101 -200 109 -171 -46 -21 -72 -332 -132 -89
5506 -89 -138 -86 -62 67 -63 -110 151 -29 -154 108 130 -32 150 64 -75 -4 -188 334 260 78 93 -25 -116 -87
5530 -87 -127 52 -42 25 -16 -133 -113 -57 -77 -36 -179 -298 -38 113 61 98 4 -219 96 -27 -95 -22 -181 199 -4
5555 -4 -283 166 198 89 -94 -142 -112 -2 -130 -108 -151 -186 -22 -169 266 -256 149 -97 156 43 122 -48 -15
5578 -15 -129 154 -59 407 331 -125 281 -82 36 -143 -28 -310 -52 40 181 -256 -146 -331 -19 44 -216
5599 -216 -77 -62 -150 -129 -45 18 -151 -169 178 81 139 313 20 -174 290 36 -213 70 182 -77 64 39 140
5622 140 -7 -63 -263 52 -120 271 184 131 -318 53 328 -212 27 -181 -92 42 140 -9 47 54 -287 227 -104
5645 -104 199 -9 -73 87 118 157 167 44 25 41 -157 -166 -121 48 96 -115 -45 -69 -274 4 -130 -47 -78 73 -238
5670 -238 75 32 -76 -23 -168 37 132 -148 -258 2 -90 -67 -13 -1 284 -84 -151 -42 153 -80 -308 -160 -162
5693 -162 -103 -141 28 -156 27 -111 -15 -66 -94 5 3 -127 59 -129 -7 63 19 -68 80 202 -326 -109 94 -224
5717 -224 -111 0 7 177 -86 68 -236 -98 -40 -149 93 -130 -14 -144 -210 49 -130 124 -116 -238 -89
5738 -89 -119 -1 256 -27 -212 16 48 -43 -360 77 139 -62 -237 -453 -92 -109 -83 -75 -19 -76 -121 -213 -188 -289 124
5763 124 -180 55 -19 75 29 -41 -43 21 202 45 -479 232 329 -351 65 -26 271 -164 293 -33 59 69 -20 -5
5787 -5 -33 -7 -91 139 100 151 128 76 -210 -99 -126 -182 197 -9 19 96 -247 131 -256 97 84 145 -233 203 141
5812 141 15 134 294 167 -56 198 -171 -97 221 80 -253 366 102 122 227 -138 194 144 -44 -317 -46
5833 -46 -12 -52 5 285 -52 63 103 -160 219 -90 64 -310 152 70 -189 -116 153 -106 -78 -273 66 -138 75
5856 75 -28 32 -51 58 -22 122 -49 -224 -163 -96 -203 -440 -42 1 -64 -25 417 -77 -154 -239 -40 -114 61 -86
5880 -86 -167 -166 203 -54 -370 -183 176 87 211 -87 -42 130 47 190 -107 -158 85 -9 -15 -83 -179 102 -292 4
5904 4 169 -231 233 -104 -93 63 -173 -276 199 -18 -26 198 -340 2 -47 -54 12 217 61 -175 -141 -12 -200
5927 -200 -24 -8 11 165 -89 112 33 -46 -295 226 -29 116 8 -47 -213 -179 -63 96 -111 195 -2 123
5949 123 252 118 -103 -268 -104 134 155 -93 -144 7 -24 33 28 -88 -60 -73 13 123 -26 -146 -108 49 -60
5972 -60 -1 9 -62 80 66 123 -26 -68 115 -50 88 -19 -301 119 58 220 143 -69 236 32 78 87 49 -100
5996 -100 276 254 -232 -93 115 -16 228 68 -293 62 -26 72 33 80 25 69 86 -4 42 -166 -25 -98 83 -171
6020 -171 89 -46 -366 -74 -221 50 -319 324 2 18 -88 -30 52 -371 160 -17 61 126 -147 62 22 -24
6042 -24 79 52 106 -164 208 187 -197 315 12 193 -10 -171 200 212 275 -291 311 61 116 -34 51 261 163
6065 163 -169 -520 -45 19 36 43 -218 -178 313 -101 -190 -269 -196 -5 -173 -185 -125 -44 92 -5 12 28 -137 -217 -93
6090 -93 -285 -91 212 -132 168 98 -105 19 110 -160 -89 -320 101 106 118 227 -92 7 -151 38 21 8 93 73
6114 73 111 242 60 114 -10 -65 8 143 234 -86 4 -98 43 -58 -323 93 198 38 92 47 -137 172 138
6137 138 276 -123 -30 -222 -60 86 218 68 240 -164 -94 -173 -321 151 -32 22 -160 -144 -11 -110 -273 208
6159 208 -342 40 -65 173 -101 312 1 173 -168 28 399 166 -93 -63 26 -28 198 94 -192 52 11
6180 11 183 179 -47 -16 -154 -133 169 101 -67 -46 238 -188 161 25 36 -136 190 -52 -140 -193 -120 253 -101 -108
6204 -108 -72 -85 38 -128 -28 244 -40 -65 -70 -91 127 22 -154 319 -67 224 363 155 -293 113 -62 -240
6226 -240 115 -58 -4 142 105 161 -113 -43 7 -174 247 111 -273 -192 -82 181 71 53 -71 62 -29 147 13
6249 13 246 -13 -117 29 82 -125 -228 -135 257 221 74 153 11 141 388 74 -289 75 -38 97 25 99
6271 99 -275 240 72 75 0 9 104 134 162 -309 -187 -112 236 279 -185 32 -55 -407 -197 -140 74 -192 0 -351
6295 -351 274 45 68 134 150 -166 -186 277 -5 204 -504 -151 61 -302 24 46 131 166 -75 92 -56 113
6317 113 3 -67 -300 -176 -67 239 -78 -283 -154 203 200 -175 -33 -145 -161 21 113 -278 -210 -5 61 59 263
6340 263 -126 52 214 -50 -16 9 203 6 -78 120 199 -10 42 -112 -135 -8 -82 -89 -257 -175 60 -94 -164 -96
6364 -96 39 18 35 3 111 -160 240 -130 47 -109 -116 161 -88 -72 35 169 23 -33 36 239 -128 -194 69
6387 69 -66 131 -97 -78 276 40 -264 348 195 -70 135 136 173 -11 -274 -73 -16 -43 13 -239 311 -119 26
6410 26 -41 174 -63 23 -62 -43 -296 -184 151 -226 73 72 -150 -209 -274 -171 59 -75 61 -249 240 -7 120
6433 120 100 -246 -79 -408 -147 382 200 -183 -95 104 -136 200 219 257 263 -98 129 78 -131 17 91 171 -92
6456 -92 -213 120 -64 -230 -51 -139 141 -46 -10 149 -154 134 -82 -155 146 -164 62 -105 -178 122 -69 -180
6478 -180 160 -83 -8 121 13 43 -231 -21 -88 -321 113 218 -63 14 6 46 158 131 273 -232 27 -136 -65
6501 -65 -84 31 70 -81 -124 -119 25 -129 56 -38 22 -87 -135 -18 2 -146 -142 -74 -29 -64 -59 32 -28 -62 -6 -17 -244
6528 -244 12 -36 267 153 38 240 -17 -430 337 109 17 11 24 -17 -5 -40 -4 121 -118 -205 92 140 17 314
6552 314 30 22 85 349 -269 -184 68 -42 170 -81 -66 -230 -132 -174 -280 132 -47 18 199 51 -61 204 -5
6575 -5 250 -117 -113 -211 45 4 -44 171 120 32 -47 -231 48 54 -134 -278 254 245 -233 45 35 -157 -42 -34 17 223
6601 223 -364 90 -144 -263 -149 -315 20 2 332 58 -24 -142 -196 97 0 -88 53 86 -54 117 -65 -75
6623 -75 -96 -91 -86 53 47 -9 -95 -35 -136 -284 327 -88 216 -205 327 -66 -140 -50 77 -45 51 114 -118 263 -64
6648 -64 102 114 157 -31 239 -95 -14 76 38 101 97 -53 -221 15 75 65 -173 -231 40 120 -3 180 -350 -181
6672 -181 96 64 341 26 268 -152 157 153 15 -28 24 -296 -106 -312 -378 -250 138 137 -28 -57 408 -109 29
6695 29 -58 -204 73 -147 -139 -54 -433 51 156 -292 243 55 107 417 56 -284 34 -94 -104 110 93 156 -168
6718 -168 50 38 -35 -351 18 -131 -17 -165 266 -240 -12 -120 -342 -100 -125 28 -103 -47 228 75 -255
6739 -255 370 -122 37 196 166 70 52 -142 -112 -302 -54 113 51 -70 -9 91 -84 -33 32 32 -28 202 -134 -110
6763 -110 51 -139 -47 27 166 -392 -130 5 95 260 -127 139 -33 127 -169 -56 168 -16 -196 -148 124
6784 124 0 -193 -499 -179 172 102 -280 -63 -118 120 272 43 -46 -150 17 -165 58 -94 217 125 -10
6805 -10 -4 -113 -84 159 -145 -45 99 99 3 20 -120 -61 -71 205 86 -137 -43 205 133 -129 -28 -113 -44 -134 -150
6830 -150 -16 240 225 59 129 39 96 59 9 19 6 177 -392 37 -57 -117 -170 49 515 96 41 -117 148 -53
6854 -53 -3 -55 117 -78 -133 80 -35 -92 130 -166 75 -168 -7 -53 -50 -113 240 -39 150 -33 -232 -68 8
6877 8 -46 -58 -55 -255 86 89 123 -160 -82 -24 -264 42 -83 29 261 46 -44 21 -60 -205 -80 -100 250 158 -16
6902 -16 -22 319 -238 -228 -110 64 86 115 -59 9 20 18 -16 69 -1 290 80 186 27 135 -125 136 66 -5 2 76
6928 76 13 6 -42 -183 12 -75 -197 77 50 250 -34 -82 199 140 -15 81 -81 -76 -61 -108 101 114 -229 193 211
6953 211 97 -209 -50 73 -144 87 140 73 132 213 18 217 21 -66 -29 -244 -11 -97 37 112 11 -192 -20
6976 -20 123 -35 41 -109 248 -221 30 122 220 -289 -211 49 -120 -73 -128 30 73 4 50 -141 42 -63 131
6999 131 104 -90 134 -150 -157 24 253 -230 -83 89 -198 -29 -313 153 -215 46 41 -145 -151 -42 -114 146 -227
7022 -227 57 -174 64 -148 -336 182 27 330 364 84 -256 91 304 207 -16 -56 68 -25 -1 74 11 -143
7044 -143 140 94 46 61 384 33 -99 -97 -77 -130 -124 -121 218 59 132 -42 70 48 -191 -98 -115 84 56 230 128
7069 128 72 -64 297 277 -175 -79 166 148 -48 -165 260 12 -48 5 -166 207 -9 -85 -270 -283 75 119 -172
7092 -172 -32 157 -223 126 -108 251 56 70 56 60 74 -228 -119 22 45 33 113 75 183 -118 181 192 223 -70
7116 -70 -46 159 -125 -206 -91 -314 -184 -115 -123 78 126 -129 78 -33 70 -229 -99 -121 218 248 -29 -242 -145
7139 -145 293 32 54 -155 27 -269 310 -30 -178 0 -106 91 49 -5 76 -119 -222 -78 53 -119 102
7160 102 -166 10 49 20 -80 24 -93 -180 -56 -180 -280 -102 257 215 -328 -53 256 35 85 82 -111 -143 13
7183 13 -93 50 14 -180 74 -75 -125 -115 -12 101 135 91 -65 54 -157 14 0 -86 93 -138 28 -185 -35
7206 -35 -38 219 -149 -98 -125 -60 -282 -205 17 -48 -174 -140 -44 270 -242 179 227 -185 138 6 -7 135 164 -167
7230 -167 103 -113 -23 41 -77 5 188 154 -267 127 237 200 -100 -53 65 -70 107 -248 207 -81 -153 117
7252 117 -41 -27 -315 -206 256 154 107 103 50 -39 -81 -79 182 -309 16 -190 31 45 -75 -77 308 -67 -83 275
7276 275 -360 -166 -75 -380 -90 126 -300 -162 -276 228 286 -165 70 -134 -200 135 204 -175 -176 -101 -37 -46 -109 350
7300 350 52 -215 139 85 -47 1 -184 -8 -206 401 -121 108 26 -57 -146 -2 51 -162 51 -141 -248 -171
7322 -171 5 71 115 -121 83 146 182 221 -156 31 6 -38 -3 35 75 143 -149 23 111 -31 41 -426 47 12 -183
7347 -183 174 29 251 190 145 -107 289 167 -174 35 -289 -5 -17 414 -33 -271 -187 -346 69 -212 112
7368 112 28 172 50 -88 -159 160 95 -33 -251 -152 102 -26 -4 -113 19 -27 -188 314 -185 82 25 -73 -61
7391 -61 100 -158 77 116 -184 -218 -58 -30 147 -249 -38 163 95 -55 -35 157 32 63 43 -17 -37 74 -45
7414 -45 160 101 256 12 121 -298 -224 87 320 38 -110 -12 74 -222 -73 362 46 -135 104 -42 181 -219
7436 -219 35 136 -71 277 112 22 -211 -53 -169 105 76 -78 -81 71 216 9 -36 1 -354 14 -110 -76
7458 -76 -136 18 219 182 96 57 182 -33 107 -15 75 -94 23 146 336 -302 20 -31 -34 -10 217 -53 36 -160
7482 -160 118 38 -78 198 112 60 -173 -184 -114 10 26 -20 13 43 -61 -59 93 97 -125 15 222 127 32 69 166 -72
7508 -72 13 84 174 -100 30 -117 -43 -153 104 149 -26 -8 -101 134 -230 -89 97 -80 169 54 90 -371 144
7531 144 -301 -211 37 59 31 10 -200 136 -15 -62 -6 257 292 63 6 146 314 -215 8 -222 -162 79 156
7554 156 -46 27 116 -115 -16 135 53 155 -175 -245 66 52 -87 -408 24 155 274 180 -79 113 7 145
7576 145 124 177 254 322 -109 -95 -124 67 -45 184 -191 3 161 154 -104 -194 -49 -114 262 -9 -68 23 -46 -47 90
7601 90 117 11 18 19 -194 423 -89 119 -81 36 104 66 8 14 -47 -21 167 221 137 37 325 107 -94 -148 -58 16
7627 16 -126 9 -66 -196 -246 -126 340 43 -26 -30 -35 149 -115 -131 6 170 -110 227 465 -129 44 -161 -48
7650 -48 -104 77 232 -47 -3 -86 -220 180 200 116 15 76 -62 91 -111 309 -32 -33 -3 152 -249 -89 13
7673 13 -103 -156 -35 -101 -218 -233 -100 42 -116 313 -163 127 -29 35 -41 -62 60 -228 -3 -4 -153 87 85 -146
7697 -146 19 -102 103 -27 -66 -46 331 -210 338 -9 -74 20 -128 -174 155 -93 -80 105 -124 160 60 -309
7719 -309 -172 152 -53 246 171 7 54 -210 169 55 -107 -3 102 -102 -43 -284 47 145 156 131 97 79 82
7742 82 -153 -18 20 96 37 -111 169 -116 -78 40 193 -261 -239 -252 -218 -62 -149 38 -67 -113 -266 30 124 114
7766 114 18 -273 155 -239 82 38 -260 -181 147 -119 -98 -193 -192 109 192 -91 87 422 -381 -237 -194 78 -277
7789 -277 192 -160 40 -153 155 342 -111 101 -75 -113 314 329 49 131 -103 -43 -135 261 94 -63 -26 233
7811 233 84 26 50 -44 250 -151 -30 -219 -70 88 -182 105 -65 -129 -169 -384 -119 -198 -122 -30 -70 122 109
7834 109 21 138 30 -104 -156 -106 -15 -127 -24 -189 398 -51 -183 172 -303 259 -24 102 -64 56 29 -120
7856 -120 -39 -154 -141 15 40 169 -147 -159 -137 5 225 -159 -125 125 97 -120 -206 90 97 407 -153 -232 -70 -178
7880 -178 -130 -137 -246 -136 -82 -66 -136 -95 -133 -24 -6 -213 -137 -215 -60 -160 -100 142 15 -76 181 251 117 68 -145
7905 -145 -4 -238 -235 -85 20 -46 -76 171 106 -159 -34 124 263 -226 -132 139 191 -65 127 -112 -18 308 98
7928 98 176 28 222 272 13 84 -67 -68 51 -389 50 228 -79 266 75 81 39 77 158 -51 -122 -161 99 217
7952 217 24 -182 134 106 85 142 -14 -169 155 39 9 90 -123 -75 16 -87 117 -154 -57 157 184 309 292
7975 292 180 109 121 72 123 258 -307 -183 -48 -21 155 144 -74 14 -205 107 -15 155 185 142 -119 58 174
7998 174 163 -81 76 16 -288 44 -69 177 -98 23 -25 86 -21 136 119 98 170 -75 -59 29 -58 -111 -21 -276
8022 -276 -142 -41 -359 104 64 -116 46 15 -14 -252 95 75 -113 -161 -45 -20 -35 -114 -70 -106 -90 -285 10 -118
8046 -118 96 186 -29 -283 138 111 18 91 111 78 98 73 -333 -71 -35 26 64 -35 228 117 299 -38 96 146
8070 146 -70 -12 213 -150 -123 202 163 112 66 -21 -107 17 0 -13 -124 -146 90 -100 -529 297 46 -85 -165 -85
8094 -85 128 -155 37 17 279 -148 190 7 162 227 77 -3 65 220 124 270 -89 -148 202 209 102 209 22
8117 22 -10 46 -160 -184 -26 123 -117 -175 310 110 -383 -20 56 -22 119 29 -46 15 18 9 233 46 349 -55 -145
8142 -145 41 -331 -6 -30 173 131 -126 28 -35 84 -142 -82 -27 -152 -105 30 -91 2 -41 198 425 -12 -102
8165 -102 -145 -242 35 82 -91 -70 32 -72 74 -196 -18 86 59 -267 -56 196 -112 141 340 -33 103 116
8187 116 -159 101 -112 -184
8191a84
##END NTUPLES=NMR FID
##END=
