##TITLE=1H_SA_39.143
 CDCl3, 8 sc, 
 23.10.2019
##JCAMPDX= 6.0         $$ Bruker NMR JCAMP-DX V2.0
##DATA TYPE= NMR FID
##DATA CLASS= NTUPLES
##ORIGIN= UXNMR, Bruker Analytische Messtechnik GmbH
##OWNER= root
$$ XWIN-NMR		Version 3.5
$$ Wed Oct 23 16:16:00 2019 Russian Standard Time (UT+4h)  she@DPX200
##.OBSERVE FREQUENCY= 200.1315
##.OBSERVE NUCLEUS= ^1H
##.DELAY= (6, 6)
##.ACQUISITION MODE= SIMULTANEOUS
##.ACQUISITION SCHEME= undefined
##.AVERAGES= 8
##.DIGITISER RES= 18
##SPECTROMETER/DATA SYSTEM= spect
##.PULSE SEQUENCE= zg30
##.SOLVENT NAME= CDCl3
##.SHIFT REFERENCE= (INTERNAL, CDCl3, 0, 15.7039)
##AUDIT TRAIL= $$ (NUMBER, WHEN, WHO, WHERE, WHAT)
$$ ##TITLE= Audit trail, XWIN-NMR		Version 3.5
$$ ##JCAMPDX= 5.01
$$ ##ORIGIN= Bruker BioSpin GmbH
$$ ##OWNER= she
$$ F:/spectra/data/she/nmr/H-F/1/audita.txt
$$ ##AUDIT TRAIL=  $$ (NUMBER, WHEN, WHO, WHERE, WHAT)
(   1,<2019-10-23 16:14:15.70 +0400>,<she>,<DPX200>,
      <created by zg, POWCHK disabled, PULCHK disabled
       configuration hash MD5:
       00 E9 B6 7A A2 85 ED C7 34 08 36 98 17 FE 4E 26
       data hash MD5: 16K
       06 EC 75 6A D1 FC EA BB DC AE 0B 1B 72 3B 3C 5D>)
$$ ##END=
$$ 
$$ hash MD5
$$ D4 BF 4E 95 D7 81 A6 0A 92 DB 09 CC 00 5C 69 2D
##$RELAX= 
##$RELAX= 
##$RELAX= 
##$RELAX= 
##$RELAX= 
##$RELAX= 
$$ Bruker specific parameters
$$ --------------------------
##$DU= <F:/spectra>
##$EXPNO= 1
##$NAME= <H-F>
##$PROCNO= 1
##$TYPE= <nmr>
##$USER= <she>
##$AMP= (0..31)
100 100 100 100 100 100 100 100 100 100 100 100 100 100 100 100 100 100 
100 100 100 100 100 100 100 100 100 100 100 100 100 100 
##$AQSEQ= 0
##$AQ_mod= 1
##$AUNM= <au_zg>
##$AUTOPOS= <>
##$BF1= 200.13
##$BF2= 200.13
##$BF3= 200.13
##$BF4= 200.13
##$BF5= 200.13
##$BF6= 200.13
##$BF7= 200.13
##$BF8= 200.13
##$BYTORDA= 1
##$CFDGTYP= 0
##$CFRGTYP= 5
##$CHEMSTR= <none>
##$CNST= (0..31)
1 1 145 1 1 1 1 1 1 1 1 1 1 1 1 1 1 1 1 1 1 1 1 1 1 1 1 1 1 1 1 1 
##$CPDPRG= <>
##$CPDPRG1= <>
##$CPDPRG2= <>
##$CPDPRG3= <>
##$CPDPRG4= <mlev>
##$CPDPRG5= <mlev>
##$CPDPRG6= <mlev>
##$CPDPRG7= <mlev>
##$CPDPRG8= <mlev>
##$CPDPRGB= <>
##$CPDPRGT= <>
##$D= (0..31)
0 1.2 0 0 0 0 0 0 0 0.06 0 0.03 0 0 0 0 0.0002 0 0 0 0 0 0 0 0 0 0 0 0 
0 0 0 
##$DATE= 1571832855
##$DBL= (0..7)
120 120 120 120 120 120 120 120 
##$DBP= (0..7)
150 150 150 150 150 150 150 150 
##$DBP07= 0
##$DBPNAM0= <>
##$DBPNAM1= <>
##$DBPNAM2= <>
##$DBPNAM3= <>
##$DBPNAM4= <>
##$DBPNAM5= <>
##$DBPNAM6= <>
##$DBPNAM7= <>
##$DBPOAL= (0..7)
0.5 0.5 0.5 0.5 0.5 0.5 0.5 0.5 
##$DBPOFFS= (0..7)
0 0 0 0 0 0 0 0 
##$DE= 6
##$DECBNUC= <off>
##$DECIM= 24
##$DECNUC= <off>
##$DECSTAT= 4
##$DIGMOD= 1
##$DIGTYP= 9
##$DL= (0..7)
0 120 120 120 120 120 120 120 
##$DP= (0..7)
150 150 150 150 150 150 150 150 
##$DP07= 0
##$DPNAME0= <>
##$DPNAME1= <>
##$DPNAME2= <>
##$DPNAME3= <>
##$DPNAME4= <>
##$DPNAME5= <>
##$DPNAME6= <>
##$DPNAME7= <>
##$DPOAL= (0..7)
0.5 0.5 0.5 0.5 0.5 0.5 0.5 0.5 
##$DPOFFS= (0..7)
0 0 0 0 0 0 0 0 
##$DQDMODE= 0
##$DR= 18
##$DS= 0
##$DSLIST= <SSSSSSSSSSSSSSS>
$$ [...]
##$SUBNAM2= <"">
##$SUBNAM3= <"">
##$SUBNAM4= <"">
##$SUBNAM5= <"">
##$SUBNAM6= <"">
##$SUBNAM7= <"">
##$SUBNAM8= <"">
##$SUBNAM9= <"">
##$SW= 24.0689530833862
##$SWIBOX= (0..15)
0 0 2 0 0 0 0 0 0 0 0 0 0 0 0 0 
##$SW_h= 4816.95568400771
##$TD= 16384
##$TD0= 1
##$TE= 0
##$TE2= 300
##$TE3= 300
##$TEG= 300
##$TL= (0..7)
0 120 120 120 120 120 120 120 
##$TP= (0..7)
150 150 150 150 150 150 150 150 
##$TP07= 0
##$TPNAME0= <>
##$TPNAME1= <>
##$TPNAME2= <>
##$TPNAME3= <>
##$TPNAME4= <>
##$TPNAME5= <>
##$TPNAME6= <>
##$TPNAME7= <>
##$TPOAL= (0..7)
0.5 0.5 0.5 0.5 0.5 0.5 0.5 0.5 
##$TPOFFS= (0..7)
0 0 0 0 0 0 0 0 
##$TUNHIN= 0
##$TUNHOUT= 0
##$TUNXOUT= 0
##$USERA1= <user>
##$USERA2= <user>
##$USERA3= <user>
##$USERA4= <user>
##$USERA5= <user>
##$V9= 5
##$VALIST= <valist>
##$VCLIST= <CCCCCCCCCCCCCCC>
##$VD= 0
##$VDLIST= <DDDDDDDDDDDDDDD>
##$VPLIST= <PPPPPPPPPPPPPPP>
##$VTLIST= <TTTTTTTTTTTTTTT>
##$WBST= 1024
##$WBSW= 4
##$XGAIN= (0..3)
0 0 0 0 
##$XL= 0
##$YL= 0
##$YMAX_a= 615348
##$YMIN_a= -784130
##$ZGOPTNS= <>
##$ZL1= 120
##$ZL2= 120
##$ZL3= 120
##$ZL4= 120
##$ABSF1= 10
##$ABSF2= 0
##$ABSG= 5
##$ABSL= 3
##$ALPHA= 0
##$AQORDER= 0
##$ASSFAC= 0
##$ASSFACI= 0
##$ASSFACX= 0
##$ASSWID= 0
##$AUNMP= <proc_1d>
##$AZFE= 0.1
##$AZFW= 0.1
##$BCFW= 1
##$BC_mod= 2
##$BYTORDP= 1
##$COROFFS= 0
##$CY= 11.3945322036743
##$DATMOD= 1
##$DC= 2
##$DFILT= <>
##$DTYPP= 0
##$F1P= 20.1720416913024
##$F2P= 0.152960286110954
##$FCOR= 0.5
##$FTSIZE= 0
##$FT_mod= 4
##$GAMMA= 1
##$GB= 0.15
##$INTBC= 1
##$INTSCL= 1
##$ISEN= 128
##$LB= 0.24
##$LEV0= 0
##$LPBIN= 0
##$MAXI= 10000
##$MC2= 0
##$MEAN= 0
##$ME_mod= 0
##$MI= 1.114404
##$NCOEF= 0
##$NC_proc= 0
##$NLEV= 6
##$NOISF1= 3.799351
##$NOISF2= 2.8
##$NSP= 1
##$NTH_PI= 0
##$NZP= 0
##$OFFSET= 15.70392
##$PC= 1
##$PHC0= -9569.638
##$PHC1= 13.0008
##$PH_mod= 1
##$PKNL= yes
##$PPARMOD= 0
##$PSCAL= 0
##$PSIGN= 0
##$REVERSE= no
##$SF= 200.130013532006
##$SI= 16384
##$SIGF1= 3
##$SIGF2= 2
##$SINO= 400
##$SIOLD= 16384
##$SREGLST= <1H.CDCl3>
##$SSB= 0
##$STSI= 0
##$STSR= 0
##$SW_p= 3612.71676300578
##$SYMM= 0
##$S_DEV= 0
##$TDeff= 0
##$TDoff= 0
##$TI= <>
##$TILT= no
##$TM1= 0
##$TM2= 0
##$TOPLEV= 0
##$USERP1= <user>
##$USERP2= <user>
##$USERP3= <user>
##$USERP4= <user>
##$USERP5= <user>
##$WDW= 1
##$XDIM= 8192
##$YMAX_p= 0
##$YMIN_p= 0
$$ End of Bruker specific parameters
$$ ---------------------------------
##NTUPLES= NMR FID
##VAR_NAME=  TIME,          FID/REAL,        FID/IMAG
##SYMBOL=    X,             R,               I
##VAR_TYPE=  INDEPENDENT,   DEPENDENT,       DEPENDENT
##VAR_FORM=  AFFN,          ASDF,            ASDF
##VAR_DIM=   8192,          8192,            8192
##UNITS=     SECONDS,       ARBITRARY UNITS, ARBITRARY UNITS
##FACTOR=    0.0002076,     1,               1
##FIRST=     0,             0,               0
##LAST=      1.7004516,     0,               0
##MIN=       0,             -784130,         0
##MAX=       1.7004516,     615348,          0
$$ Real data points
##PAGE= N=1
##DATA TABLE= (X++(R..R)), XYDATA
0@%%%qJ6j6K4m0N6o5Q1j04J28j60J93k33K83l39M03m76N61o57P62q81J014j161
26f19J327j513J714j938K192k466K767l100L462l864M305m783N311n890O525p227
42c797Q000q854R809j0877J2071j3427J4979j6772J8869k1362K4389k8154L2984
55A7858l9443M8589o2639Q7236j42764M84238K8774p00620M22583K95459r1038
66C48233l7427L04542k06532m92120k9169M53390J07322j78724o6470K0966j59025
77F4986p0915J15652J27233L8918M1346j28131k53594j8182K85112J43455r4401
88B51479p1809n4961j79118j5260K88337J54966k32986k03623O3461O6776j2908
99E4354P8510K0553j70163l8321K21406M3213k25441j1621K26055j2604j53069
$$ plain form
0 0 0 0 0 -8 8 -8 16 -24 32 -33 48 -56 72 -88 105 -128 155 -184 219 -257 304 -353 409 -472 542 -619
26 -619 708 -805 909 -1029 1163 -1303 1464 -1636 1826 -2038 2267 -2516 2795 -3095 3430 -3797
42 -3797 4203 -4651 5158 -5719 6352 -7075 7904 -8868 10001 -11361 13028 -15126 17858
55 17858 -21585 27004 -35635 51601 -91163 393075 421849 -278771 143812 439271 348233
66 348233 310806 615348 408816 -83304 -112473 340917 448239 269515 203045 224011 64986
77 64986 -5929 109723 236956 275874 317220 189089 -64505 -82687 202425 345880 251479
88 251479 179670 124709 -54409 -69669 218668 373634 140648 -62975 486 67262 54354
99 54354 132864 153417 -16746 -55067 166339 209552 -15889 -27510 198545 185941 32872
110C2872J43992J66262k42315k06878K90760K56973k44727k10508K15065J12783
120C14279k65274j06394K44797R9698j71035o0211N3223j06965j11135J50694
130D1677K06501k2649j74856j65217p3789J46730K92369O0618k52618j83723L6792
141h8165K9327L4399K03533J06602k69592k82712R9614J97108k6085j7801J23550
152A09778n4314k68770p3713J91296J31419K1441M3346p6177k47376o6958K59525
163c0503K20212l1679r0942q4663j55979k3118K68762K15944j42965k29713j4031
174i8675M9723j9399O6033J30307m3977j68197m1224O0043P185J9694Q6300N737
186E3550r7731m0677K2230o556M7013J29644p171j80098n2252J44200M9051r3953
$$ plain form
110 32872 176864 343126 100811 -106067 184693 441666 196939 -13569 201496 314279
120 314279 49005 -57389 187408 287106 116071 55860 109083 2118 -109017 41677
130 41677 248178 225529 50673 -114544 -188333 -41603 250766 311384 58766 -124957 -88165
141 -88165 -58838 -24439 179094 285696 16104 -266608 -166994 30114 4029 -13772 109778
152 109778 55464 -213306 -287019 -95723 35696 57137 100483 24306 -223070 -290028 -30503
163 -30503 189709 158030 67088 -17575 -173554 -196672 72090 288034 145069 -84644 -98675
174 -98675 -48952 -68351 -2318 127989 84012 -84185 -125409 -65366 -58181 -38487 47813 53550
186 53550 -44181 -84858 -62628 -69184 -22171 107473 100302 -79796 -132048 12152 61203 -32750
198c2750Q503P7576p3522r8145R6777R5375j26436j12475J21347J24250p1344
209I156q8754J8305l403k2882R5026J15517n6421j33481j8915N7099M2553O5601
221G9401N7365o4476j22987k2910N5030L5369N0417O5168n0791j61270p5769P8632
233g6821J08284O9120K4137q8101j75070n8561J41209J66206M4567m9511j15842
244a0383j39923p955J82994J63252l0209j19332p9947o0416q600J32935J57561
255A79977k7440j60818q6555P218K2096P7898J29240J1719j56234j24319L4875
266i2343R6613P4187N8164j0223j21662j02803M8589J20749N3185j4369l9036
277G1051o7955n2437L7520Q2760J9612m0457l1025j9218k1857Q349L9176J2158
$$ plain form
198 -32750 -24247 53329 -20193 -118338 -21561 73814 -52622 -165097 -43750 80500 9156
209 9156 -79598 -61293 -64696 -87578 7448 122965 66544 -66937 -85852 -28753 13800 79401
221 79401 136766 72290 -50697 -73607 -18577 16792 67209 132377 81586 -79684 -155453 -76821
233 -76821 31463 100583 124720 36619 -138451 -197012 -55803 110403 154970 105459 -10383
244 -10383 -150306 -158261 24733 187985 157776 38444 -41503 -101919 -110519 22416 179977
255 179977 152537 -8281 -94836 -87618 -65522 12376 141616 153335 -2899 -127218 -92343
266 -92343 4270 78457 136621 126398 4736 -98067 -49478 71271 124456 110087 71051
277 71051 3096 -49341 -11821 70939 90551 50094 19069 -149 -22006 -13657 25519 37677
289C7677k4005j1755M509p984q715J2065Q101n993R734J9215p462k8996j4304
302a7913J500J0844L5340L4500k4229p1080l7724K4269M8552M7292K3945m5083
314C0213r7269m4738O0984R4087M6331j3823o5483r2223l4122Q3462J23511M0039
326A30969o0217r2766p1416o476Q9532J25688L2466r6174j24234m9115M1991R9295
338A9543R6203P564j07697j27366k8672Q1408J09550N8298k7724j02181j01898
349a22972j0093R4536J10730L1685o1898r8572o5115J6448Q8820R0748J2544p6892
361I969r3832l1997M7124P8674N1905j1073o6654o8084q816N4997O2085J6808
373D1106k7541m1013l0405p2L5616M0493M823k7030k1623j537N697Q088J2991
$$ plain form
289 37677 13672 1917 6426 -1558 -10273 1792 9893 3900 13634 32849 25387 -3609 -17913
302 -17913 -16413 -5569 29771 64271 40042 -31038 -68762 -44493 4059 51351 75296 30213
314 30213 -67056 -111794 -50810 43277 89608 75785 10302 -81921 -116043 -32581 90930 130969
326 130969 70752 -22014 -93430 -99906 -10374 115314 147780 51606 -72628 -121743 -79752 19543
338 19543 115746 123310 15613 -111753 -140425 -59017 50533 108831 81107 -21074 -122972
349 -122972 -133065 -38529 72201 103886 41988 -56584 -121699 -105251 -16431 74317 86861 9969
361 9969 -83863 -115860 -68736 9938 61843 50770 -15884 -83968 -92784 -37787 24298 41106
373 41106 13565 -27448 -57853 -57925 -22309 18184 23007 -4023 -25646 -27183 -21486 -13398 -407
386d07O823r440o838R581O816j4700j6569O967K1694J5852L298j4304l4207k9371
400e4805J4983N2357L7103j4193n0536m8124j2839L7305O8433M0602l1547p8856
412d0117n4289J4804O8259P0395K2265m8941q8528n2918L4105R3077P2080o884
424H3308p7046q8857l3021N2755J02564O6016l3797j02650p9922M541P6958R3116
436F3965M3271m6388j05689o7933L5498R8752P5704P677n7709q8386n1205M4194
448d8249J04175O1191k7994p5187o5363k1824M5147Q8259M3821m9319q0994l5742
460f2079J6728M1694N1261K4151l8405o1992j5658L3258L3473J7420Q532j6269
472C2114l6359j3309K3878K1323k55k388k938j6552j2047R993Q918r953o052J1989
$$ plain form
386 -407 6416 -3024 -9862 -281 6535 -8165 -24734 -17767 3927 19779 23077 8773 -25434 -54805
400 -54805 -39822 12535 49638 35445 -15091 -63215 -76054 -38749 29684 70286 38739 -40117
412 -40117 -94406 -79602 -11343 59052 81317 32376 -56152 -109070 -74965 18112 90192 83308
424 83308 6262 -82595 -115616 -62861 39703 105719 71922 -30728 -110650 -106109 -29151 63965
436 63965 107236 60848 -44841 -112774 -77276 21476 97180 104857 47148 -41238 -92443 -48249
448 -48249 55926 117117 89123 13936 -51427 -73251 -28104 60155 103976 54657 -26337 -62079
460 -62079 -45351 -3657 47604 71755 33350 -28642 -44300 -11042 22431 39851 48383 32114
472 32114 -4245 -17554 6324 27647 27392 25004 22066 5514 -6533 3460 12378 2425 -3627 8362
486H362Q471k691n674j2675j6795J3258M5618K6664j9152l5070k4080k946L8651
499B1941O6394J9685n8898o6301r646K9571M1855M8792P008p2817q1257J747N8879
512F953M4640K5866L070o0962q8121m416Q6713P2903J3219k2334o3456q4037O77
525f9285J15362R6206k3352p8317o1410m0042J7591J03065Q3934m7946j13475
536a7669m5507K1510L3454N3628N2922k7132r0023m2064L2024M5147M1067L6397
548I3754j8093p5420m0760L2395M9461L5438K3317l1514q8140l5734O5328N8382
560F8414j4340k6308j1694m0331k8474M8823N2773l4833n0015K1956K7125k6267
572a3171j1196L0848k2k1532K7576L1839l9611m1072L1963L2548k1298m19L2664
$$ plain form
486 8362 16833 14142 8468 -4207 -21002 -7744 37874 64538 45386 10316 -13764 -16710 21941
499 21941 88335 108020 49122 -17179 -26825 2746 44601 93393 100401 27584 -53673 -51926 6953
512 6953 51593 77459 80529 19567 -68554 -72970 13743 86646 99865 77531 14075 -69962 -69285
525 -69285 46077 142283 118931 40614 -20796 -60838 -43247 59818 143752 95806 -17669
536 -17669 -63176 -41666 -8212 45416 98338 71206 -18817 -60881 -28857 16290 57357 93754
548 93754 75661 241 -40519 -8124 41337 76775 100092 68578 -19562 -55296 10032 68414
560 68414 54074 27766 16072 -24259 -52733 -3910 48863 14030 -35985 -14029 13096 -13171
572 -13171 -24367 6481 6459 -15073 12503 44342 4731 -36341 -4378 28170 6872 6453 39117
585C9117k3554o0064J0590M8630j0293j9051M0201J0399p6189m4047N8846O3277
597C7862Q057k076k2486p0543k7804Q4391R0547l265m9940m7571n3999M23J04707
610D8303Q0441o1491r3441r371K731k5691M6305R7767k0713j25098m3180M9411
622e4027J4840O605P4420L0638j06224j00739L8706R1726M4381J6549k1864r1025
634e6014o5967N7776R6981K2999k6072l7582o5040l3308P2880Q3937k3236n6212
646b8858P793K629m2129J7626Q4721J6535n4658n874K4173k8382p563P7200M0671
659A03884o4265m0089L5377L030k6659M2741L8838p3522o2352P0236N4389p7561
671D047n3429O3286K7890n8271M114N8345m2168q7686M2519J06803o005p5500
$$ plain form
585 39117 15563 -44501 -33911 14719 4426 -14625 25576 35975 -40214 -84261 -25415 37862
597 37862 45919 43843 21357 -49186 -76990 7401 97948 94683 44743 -2828 -56827 -56404 48303
610 48303 128744 67253 -26188 -35559 -32828 -58519 -12214 85553 64840 -60258 -103438 -54027
622 -54027 -39187 -32582 41838 72476 -33748 -134487 -95781 -4055 40326 56875 35011 -56014
634 -56014 -121981 -64205 32776 55775 29703 -7879 -72919 -106227 -33347 50590 27354 -28858
646 -28858 -21065 -18436 -60565 -42939 41782 58317 3659 -2215 21958 -6424 -13987 63213 103884
659 103884 39619 -470 34907 37937 11278 54019 92857 19335 -43017 27219 81608 4047
671 4047 -49382 13904 41794 -16477 -12363 45982 3814 -83872 -41353 65450 59445 -16055
683a6055j5243J4168j2573J7722N3504K245m9707k9097q886n681L6186N4107j5017
696B5673n9017j2659N32k8309L2139J08665J8839j17915o9634N5341N1239J7753
708B2647O0308K4832j11022r9525P1299J18155Q004k8901o87n6035q1242M3932
720b8235J17327O702p2788j1571j705o6423r674J09856N8872p6269o4584J1581
732b6911q150j4755P1256P5047n2405j01873j2045M4489K8012K7842J3588n2321
744h226o1866J2464L8876J513M559J4440l7424m9552L1664N1133l1266l3414N1030
757a6069K8695o0862k1938O6774J7841n4003J0746O1584j9185n5729K8928M5967
769C2749l8877l3304N1964L0529m9092k8133K2263r993j8469M9961M3144n6525
$$ plain form
683 -16055 -31298 -17130 -29703 -11981 41523 43768 -5939 -35036 -43922 -49603 -13417 40690 25673
696 25673 -33344 -46003 -45471 -73780 -41641 67024 85863 -32052 -101686 -46345 4894 22647
708 22647 82955 107787 -3235 -102760 -31461 86694 94698 65797 65110 9075 -72167 -28235
720 -28235 89092 95794 23006 11435 9730 -56693 -66367 43489 102361 26092 -38492 -26911
732 -26911 -35061 -49816 21440 96487 44082 -57791 -69836 -25347 2665 30507 44095 -8226
744 -8226 -70092 -57628 -18752 -17239 -12680 1760 -35664 -85216 -53552 -2419 -33685 -67099 -16069
757 -16069 12626 -48236 -70174 -3400 14441 -39562 -28816 32768 13583 -42146 -13218 32749
769 32749 -6128 -39432 12532 43061 -6031 -34164 -11901 -21894 -40363 9598 52742 -3783
781c783o9026J6512M0323R506K7251K5743n4674p6646J9611P4538K3329q209j049
794B3426l9276o4382J2037P7200K8548k5152j5082k9896o1280L275R1308N0525
806E1251m3648m4780j4814l1132J409R0425P1699n3636q6710p452K6253J5449
818b5686M8961N3443m0906r2924j4372N4393K9221J0819K0457k3642p2091k0508
830g2835N2850L7482k682J805j2491n1334j9437N1952M4688j2375j5709j593k6371
843b6050j7992M1999M3115k1899l2592R692L364k1494J1960L3504j4144l6461
855b6998J4415K7242k1824k3457K2702J4398k1233L803L3140r932m2034L151L7272
868A0645Q099m785J4506p554m3115j0160M5168L1757r269j2681j6479l6469r276
$$ plain form
781 -3783 -72809 -56297 -15974 -6468 20783 46526 -8148 -84794 -65183 9355 32684 24475 23426
794 23426 -15850 -80232 -68195 9005 37553 12401 -2681 -32577 -93857 -90582 726 51251
806 51251 7603 -37177 -51991 -83123 -81714 8711 80410 26774 -59936 -67388 -41135 -25686
818 -25686 23275 76718 35812 -57112 -71484 -17091 12130 22949 43406 19764 -52327 -72835
830 -72835 -19985 17497 14815 16620 4129 -47205 -66642 -14690 29998 17623 1914 321 -26050
843 -26050 -44042 -2043 41072 19173 -13419 -3727 -363 -21857 -9897 23607 9463 -26998
855 -26998 -12583 14659 -7165 -30622 -7920 6478 -14755 -10952 22188 12256 -29778 -26627 10645
868 10645 18744 13959 28465 20911 -22204 -32364 12804 44561 35292 22611 6132 -30337 -39613
881c9613N0368M4882j4988l7159k3742j9322J426N0210N0170j6577n4973k9981
893c9299j44J8677M7007M3408k0773o6873l4388J7404L6327M0338K6011l0387
905C7308p1215l0498L7095M8704K4587K122l0362n8238k1924M6432N4531R522
917D8064j7859k3622l4451j5821L8130N3789O525l0860k4847j5606o909K6421
929B954M4925O047l9116l0141L83R111J5317K4014Q29l2424k2995J2268J7325
942H497J388l49K202r469r048P940Q294q805p326R519R075l647m843l315r708
957i595l949J3939J6411j717j2998j1580r632n93J8162K3226K119j9403k3600
970a9210j3842P111L3181L2824n142l9440l2771k628K5085M0007K6496j8282n3606
$$ plain form
881 -39613 10755 55637 40649 3490 -20252 -39574 -38148 12062 62232 45655 -9318 -39299
893 -39299 -39443 -20766 26241 69649 48876 -17997 -52385 -34981 1346 41684 67695 37308
905 37308 -33907 -64405 -27310 21394 45981 48103 17741 -40497 -62421 -15989 38542 48064
917 48064 30205 6583 -27868 -43689 -5559 48230 54755 23895 -952 -16558 -23467 2954
929 2954 47879 53926 14810 -15331 -14948 -5837 9480 33494 34323 1899 -21096 -8828 8497
942 8497 9885 9536 11738 2269 -6779 1161 9455 650 -6676 2843 11918 8271 3428 113 -9595
957 -9595 -13544 395 16806 15089 2091 -9489 -19121 -19714 -1552 21674 23793 4390 -19210
970 -19210 -33052 -25941 7240 40064 34922 -4518 -37289 -39917 -14832 25175 51671 33389 -20217
983b0217l3334J7729M3925L1886M522k6155m5983k5529K2735M8117K8046q716
995C7026l3034l7668j7410K3569M8267K7865j6232m1937l6787m916L3544M9081
1007C1368J7738l0740m7322k2422J4883L6951L4188K357l3391l9400q185K5860
1019a8115L2000J3000j0217k3337k0798l061J6955K2406R517j0298j9779j2925
1031b4652L234J3783J2568N140o364j3253q386P243J4009M346o580m306K698L909
1045C389P94j952o079m488O835J4047M132j2992j7226p305P951J9171J5998n058
1059A7217k5150k1124K347K0855K1595J1077r540k8348k3568O229L0758K7451
1071B9799M161k0081l2215k2244J0547L8079L1654l608l6284l8970j1485K5836
$$ plain form
983 -20217 -53551 -35822 8103 39989 44511 18356 -27627 -53156 -30421 17696 45742 37026
995 37026 3992 -33676 -51086 -27517 20750 48615 32383 -9554 -46341 -51257 -17713 31368
1007 31368 49106 18366 -28956 -51378 -36495 456 34644 37001 3610 -35790 -43975 -18115
1019 -18115 13885 26885 16668 -6669 -27467 -30528 -13573 8833 18350 8052 -11727 -24652
1031 -24652 -21418 -7635 4933 10073 3709 -9544 -17930 -10687 3322 7668 1088 -3218 -520 3389
1045 3389 4183 2231 -3848 -8336 -1501 12546 16678 3686 -13540 -20845 -12894 6277 22275 17217
1059 17217 -7933 -29057 -26710 -5855 15740 26817 17277 -11071 -34639 -28410 2348 29799
1071 29799 33960 13879 -18336 -40580 -30033 8046 39700 36092 -192 -39162 -50647 -24811
1083b4811M2602K2933j5864m1429l2983K074L7311M2317J0908k6698l9421k0561
1095d3622J3079L7325L4673K746l3098l7637j1115J9833L3752K5479o044l7146
1107a775l4606m20K8669K7913R885j1755k8991k4119P120L0840K1379k798j4443
1120F899j5029j0196N860K1519J4481o951j4302o331k751J527R817P874p585j1450
1134f618L07L879l120j393L251j561k663P669P716q684j3786J669J3082J0589
1148A0337O829r56j6750j7749M743K3481J5826j334j3129k2327j7286J0207L0836
1161A2728J5222j0223k0109k1244j3416J3574L8917K1781j8379l2366j8328n34
1173c2377K1800M0804K0166k8074m5065j4348J7829K9025K8999P644l5199m5993
$$ plain form
1083 -24811 17791 40724 24860 -16569 -49552 -47478 -10167 32150 43058 16360 -23061 -43622
1095 -43622 -30543 6782 41455 44201 11103 -26534 -37649 -17816 15936 41415 35371 -1775
1107 -1775 -36381 -36801 -8132 19781 29666 17911 -11080 -35199 -28079 2761 24140 21342 6899
1120 6899 -8130 -18326 -12466 9053 23534 16583 2281 -4050 -6801 -5274 4543 12417 4832 -6618
1134 -6618 -6311 -2432 -5552 -6945 -3694 -5255 -7918 -249 7467 -1217 -15003 -13334 -252 10337
1148 10337 17166 16210 -540 -18289 -13546 9935 25761 24427 11298 -11029 -28315 -18108 12728
1161 12728 27950 17727 -2382 -23626 -37042 -23468 15449 37230 18851 -13515 -31843 -32377
1173 -32377 -10577 30227 50393 22319 -22746 -37094 -19265 9760 38759 46403 11204 -34789
1185c4789n984L1204K7282J1609k039k6694l8895m322L7385L1084O54r593j6742
1198A60k7925o087L6519L8838l162k5948j8154j1484J020K7617K9485r679l3462
1211b262j6193L187P342J4125J3016j2322k5696l472J2689N69j696J1338J962
1224B587j6782l646J4735K98j1926Q426J6367r719j4019R686P332j4973n283J7970
1238A053N531j3172j458M018j5610r695K4715K4153j1188j9719m640m283J951
1251a8344L1535K9861j8667l9023n535J7160J2673J8677J9450j8987m4913r612
1263b5725K8014J8763L886O933j3710m0840j7484K9202K9507L094k814j3845l8254
1276c3273j8732L8499M5385j941k4891j6588k0611j0892L6180M8533q069m6717
$$ plain form
1185 -34789 -40773 -9569 17713 29322 27283 589 -38306 -42628 -5243 25841 26495 16902 160
1198 160 -27765 -33852 2667 41505 38343 12395 -5759 -17243 -16223 11394 40879 31200 -2262
1211 -2262 -18455 -15268 -7926 6199 19215 6893 -18803 -22275 -9586 -9017 -10713 625 2587
1224 2587 -14195 -17841 -3106 -2808 -14734 -6308 10059 340 -13679 -3993 3339 -11634 -16917 1053
1238 1053 6584 -6588 -8046 -4028 -19638 -29333 -4618 19535 8347 -11372 -16012 -20295 -18344
1251 -18344 13191 43052 24385 -14638 -20173 -3013 9660 28337 47787 28800 -16113 -25725
1263 -25725 2289 21052 24938 31871 18161 -22679 -40163 -10961 18546 21640 18826 4981 -33273
1276 -33273 -52005 -13506 31879 29938 5047 -11541 -32152 -43044 -6864 41669 33600 -13117
1288a3117j9379O093L743J5984K9561k960l9833k0463J4188J2181P216J8634L406
1301A5254k8374j8315J5448J5952N880J5559O830k7745k1147K3140K6579o479
1313B2582n947R253j0480k2992J3629K9323j2653k6524J0794J7805j5467j3037
1325c714J4666J296j9928P986K7425q876l0354K732J8391n588j675K1057j111
1338B2307l3578j0950K3078Q354p862R793M913k9965k5133J8148K5816L351j225
1351G047m808k8428k1881K5349L9791O753j3829j3457k1723j2186L3957M6314
1363D2899k829l3602j2391k460q390K0664M4670J379m6737k2963J4247N095L858
1376C440L1360J3712m1846l9276J5207K8450O522J0328R722l0103l8236J2467
$$ plain form
1288 -13117 -32496 -26403 -22660 -6676 22885 19925 -19908 -40371 -26183 -14002 -6786 11848 15254
1301 15254 -13120 -31435 -15987 -35 5845 21404 28234 489 -20658 2482 29061 22582
1313 22582 16635 25888 15408 -7584 6045 35368 22715 -3809 6985 24790 9323 -3714
1325 -3714 10952 12248 -7680 306 27731 18855 -11499 -8767 9624 4036 2361 23418 22307
1338 22307 -11271 -22221 857 9211 1349 11142 16055 -13910 -39043 -20895 4921 8272 7047
1351 7047 2239 -26189 -48070 -22721 17070 23823 9994 -3463 -25186 -37372 -3415 42899
1363 42899 40070 6468 -5923 -8383 -16773 3891 48561 49940 3203 -19760 -5513 -418 3440
1376 3440 34800 48512 6666 -32610 -17403 11047 17569 27897 37619 7516 -30720 -18253
1388a8253M0604J0604j0427k705j5612k6114P543L6260Q115k1684r047r08j3558
1401a5182j452K5337R773k0736j0063Q871m389q137J7006J5290j5039j2799J4271
1414B751N844j3546M064J7470o366j5319J2785J4180j7623j5412J6089J1005j0920
1427E002J415J2461j5153k5220J2737K9025j098j3070J754q042j9915J0239L6216
1440B6351P500k3811j2418j636r238P692L3215J2040k9691k5723Q19M293P597
1453c010K6242J2213l0923l5166L806J9893J1010J5084R053k6922l6896N075L2962
1466B421J6295J369P19j9745l1551K580L8432K0778j0669j3686j2357j9769J791
1479b3392L3581K1504j7077k2245o515m789J393K3840J9659j6167k5485r85P797
$$ plain form
1388 -18253 22351 32955 22528 19823 4211 -21903 -14360 21900 30015 8331 -716 -1624 -15182
1401 -15182 -16634 8703 18476 -2260 -12323 -3452 -7841 -15978 1028 16318 1279 -11520 2751
1414 2751 8595 -4951 -887 16583 10217 -5102 7683 21863 4240 -11172 4917 15922 5002
1427 5002 6417 18878 3725 -21495 -8758 20267 19169 6099 7853 -189 -20104 -9865 26351
1440 26351 33851 10040 -2378 -4014 -13252 -5560 27655 39695 10004 -15719 -14900 -10607 -3010
1453 -3010 23232 35445 4522 -30644 -26838 -6945 4065 19149 28202 1280 -35616 -30541 2421
1466 2421 18716 20085 20804 1059 -30492 -27912 10520 31298 20629 6943 -5414 -25183 -23392
1479 -23392 10189 31693 14616 -7629 -14144 -18933 -17540 6300 25959 9792 -15693 -16678 -8881
1492h881m4J1372J6325q713k4611k426J4476K561q08R442j420j9264m929J5080
1506a840M767q872J681N906q565n963J0987L931j2979k657J5766M450j0316j315
1520e019K849q653r51J9326J1134j5195j4369J730K089J666J4872J1229j5821
1533D887k1801m09J0334N940J0678R756j4396k7644m277J9584J4841O069K885
1546A6447j4109k8457o709K7494K6126L68j3375j7533j7879K29K7430K5123m845
1559B0310k2207j7084p689P017K4156J8520q339k3047j2387k34P179J9231J7501
1572B2927p571k6085j3344P580J2829J2795J1477p305k4913j3277J3325J7921
1584F359O924q04q135j5907o777J3708J4155k123o113j682n018n477O150J0185
$$ plain form
1492 -8881 -8925 2447 18772 10059 -14552 -16978 -2502 59 -749 8693 7273 -11991 -16920 -1840
1506 -1840 2927 -5945 -4264 1642 -6923 -12886 -1899 2032 -10947 -13604 2162 6612 -3704 -5019
1520 -5019 -2170 -10823 -11774 7552 18686 3491 -10878 -9148 -7059 -5393 9479 20708 4887
1533 4887 -16914 -17323 -6989 -1049 9629 19385 4989 -22655 -26932 -7348 7493 13562 16447
1546 16447 2338 -26119 -32828 -5334 20792 21160 7785 -9748 -27627 -27398 32 25155 20310
1559 20310 -1897 -18981 -26670 -19653 4503 23023 14684 -8363 -20750 -20984 -13805 5426 22927
1572 22927 15356 -10729 -24073 -16493 -3664 9131 20608 13303 -11610 -24887 -11562 6359
1584 6359 13283 12479 4344 -11563 -18340 -4632 9523 7400 1287 -395 -5413 -10890 -4740 5445
1598E445j998p707K093L539o011m277O553M958m799j776M661n30o762j186L693
1613d104J258K669M256k366r428n830L517Q221Q240M035r022j8236n513J4259
1627h044J6565M635n976j2526j4975k398J8237K0293K013j4717j5472q313M117
1640a6561J7569J7448j68j6156j6921o810P099J9700J7758m084k2266j8522j95
1653b2109J3079J8379J3353o954k5967j8538P745K2642J4615L88j1029j7808j1210
1666b3414Q652K0564J2044m571j3928j2555l948R149J4580O973n461j0972r788
1679a2675k771Q824J3396M377q586j0899l500L311N967P004J976o378p494J094
1693f354N490K966k74j269j368J363J937o29l932j880K841K895J856O29l913p983
$$ plain form
1598 5445 3447 -4260 -2167 1372 -4639 -8916 -2363 2595 -2204 -3980 681 151 -6611 -7797 -4104
1613 -4104 -2846 -177 4079 1713 -7715 -13545 -10028 -1807 6433 10468 1446 -16790 -22303 -8044
1627 -8044 8521 13156 7180 -5346 -20321 -22719 -4482 15811 17824 3107 -12365 -20678 -16561
1640 -16561 1008 18456 18288 2132 -14789 -21599 -14500 5200 22958 18874 -3392 -21914 -22109
1653 -22109 -9030 9349 22702 15748 -10219 -28757 -21012 1630 16245 16633 5604 -12204 -23414
1666 -23414 -14762 5802 17846 13275 -653 -13208 -17156 -8007 6573 13546 8085 -2887 -12675
1679 -12675 -15446 -6622 6774 11151 2565 -8334 -11834 -8523 -2556 4448 6424 46 -7448 -6354
1693 -6354 -864 2102 1828 559 -809 554 2491 1862 -2070 -3950 -1109 1786 3642 4271 358 -7625
1709g625l380P754R177J651m484o297o301k389Q422J3924M463r213j2345p006
1723a3649K855J2504J4546J839j4392j7229m960Q401J6413J2202l952j9265j7285
1736b1972N26J5201J6400O746p094j8842j5045M166J9679J6853K135j2982j8054
1749a2283r887Q479K0159J3899l132j6567j6802m812J2498J8939Q099r581j5807
1762f798j0837L02J2404J5847M370j1836j3639m241N095R657J0681L099j0434
1775C670j1894o93P235P337M784m38p690q684J206P612K992k159j099j728l451
1790c000Q83M747l55m903J017N694J606k943j628j106k179L726Q666K250o580
1805E895p012j880P77N640R050J770j0790j1698j580M999Q387R308Q68j4167j6027
$$ plain form
1709 -7625 -11005 -3251 5926 7577 3093 -3204 -9505 -11894 -3472 10452 14915 5702 -6643 -13649
1723 -13649 -10794 1710 16256 18095 3703 -13526 -18486 -10085 6328 18530 14578 -4687 -21972
1736 -21972 -21446 -6245 10155 16901 9807 -9035 -24080 -19914 -235 16618 18753 5771 -12283
1749 -12283 -22170 -13691 6468 20367 17235 668 -16134 -20946 -8448 10491 18590 9009 -6798
1762 -6798 -17635 -17333 -4929 10918 15288 3452 -10187 -14428 -9333 324 11005 14104 3670
1775 3670 -8224 -8917 -1682 5655 10439 10001 2311 -6373 -5167 2445 5437 3278 2179 451 -3000
1790 -3000 -2117 2630 2275 -2628 -1611 4083 5689 2746 1118 12 -2167 1559 10225 12475 5895
1805 5895 -1117 -2997 -2220 3420 12470 14240 3450 -8248 -9828 -4829 3558 12866 13734 -433 -16460
1820a6460M55J3538J2779O313m722j6187j5152M900K0208J3874j013j0510j6133
1833h110r872Q715K0928J0601p482j3318j1482o389P947K0694J1441j0840j7255
1846d422p429M84Q334J8620J1467j2189k1631n815R892J2280J0708L869j2138
1859A2030j8886k979J3329J1056J747k755q744j2052j462J1507P794l920l196
1872C469k175o581l626Q123Q272l193n728R17j097l776M108O506k664o701J966
1887b180L884l053k429J881j823l456O260P519p252j1321J664P399K879M401N164
1902I537q417j4929K032J6748Q327k773k041n412j1251L21J7076J1441m973q665
1916G021p113q357K3J7199J3977o963j4875q588m685L257J8199J5915j0617k3759
$$ plain form
1820 -16460 -16005 -2467 10312 16625 11903 -4284 -19436 -14536 5672 19546 18533 8023 -8110
1833 -8110 -17982 -9267 11661 22262 14780 1462 -10020 -16409 -8462 12232 23673 12833 -4422
1846 -4422 -11851 -11367 -3033 15587 27054 14865 -6766 -12581 -2689 9591 20299 24168 12030
1859 12030 -6856 -9835 3494 14550 16297 13542 4798 -7254 -8716 2791 10585 6665 3469
1872 3469 1294 -5287 -8913 -790 7482 4289 -1439 -522 -1619 -5395 -1287 5219 2555 -4146 -2180
1887 -2180 1704 -1349 -3778 -1897 -3720 -7176 -916 6603 -649 -11970 -10306 -2907 -28 4373 9537
1902 9537 1120 -13809 -11777 4971 13298 10525 8484 3072 -8179 -7858 9218 20659 15686 7021
1916 7021 -92 -8449 -8426 8773 22750 15787 912 -7676 -12361 -9104 9095 25010 14393 -9366
1930i366p873P320Q729J1363J0611r811k5239q249J4928J3177L660R8o696j8171
1944a5519q201J3446J5056J141m183o073j3111o007J3856J6363j62q408n101n795
1958a2698l475J2296J6837k221j4115l438L349K8M540J0356j371j2347k523P563
1972B781O61l955M331L354p342k675Q237J65r560J588R929k072o939M779M491
1987G773j0153n562J1520P765p295m019K797o744q137Q851J4595k773j2578n444
2001i404k129j429J0014J4790l599j7175q070L266N155J0864J2173n216k0316
2014a1076q334J0234J0287O039P255l946k0122j1202J3916J6095K778r58m449
2027F517j5995j1482J3874K1464K604j0277o863q569o738J1621K1979J960j6123
$$ plain form
1930 -9366 -17239 -9919 -1190 10173 20784 10973 -14266 -22515 -7587 5590 9250 9348 2652 -15519
1944 -15519 -23720 -10274 4782 5923 1740 -4333 -17444 -23451 -9595 6768 6606 -1802 -6903 -12698
1958 -12698 -16173 -3877 12960 10739 -3376 -6814 -3465 -3437 1103 11459 10088 -2259 -4782 2781
1972 2781 3442 -513 3818 7172 -170 -2845 5392 5557 -4003 -2415 7514 5442 -1497 3282 7773
1987 7773 -2380 -7942 3578 11343 4048 29 2826 -3918 -12055 -3204 11391 8618 -3960 -9404
2001 -9404 -11533 -12962 -2948 11842 8243 -8932 -17002 -13736 -8581 2283 14456 9240 -11076
2014 -11076 -19410 -9176 1111 7150 14405 10459 -9663 -20865 -6949 9146 11924 10966 6517
2027 6517 -9478 -20960 -7086 14378 16982 6705 -158 -8727 -15465 -3844 18135 20095 3972
2040C972r526k39j130O496J7037K980j7618j2252M453N201J811Q130L384j3027
2054c28j2694N292R595k26R76L117o718r830M632J0119j308m010L143n3o626J483
2070c436Q327j976p952L725O757m450m780M348M94p523J412J1404J05j0488k774
2085f807L306j739J644J1073K849j3843r022N311O389L098P103J004j4778j2608
2099a7020P632J2937L688O38j671j3406j3010Q290J8589M854o684n727q254r391
2113a8535O415K0152P313j0893j1133n176k967O910J8042P510j3637j5720k696
2126a4415M505P916J2554M758j4373j6930Q19J0752O306M979K540j0987j5014
2139a6590K413J3411O091j739m38n280j0351l08J2582P119l872l808k734n307
$$ plain form
2040 3972 -5554 -5793 -6923 -427 16610 19590 1972 -10280 -5827 -626 1185 9315 12699 -328
2054 -328 -13022 -7730 1865 1639 2615 5732 -986 -10816 -6184 3935 2627 -1383 1760 1707 -4919 -3436
2070 -3436 4891 2915 -5037 -1312 5445 995 -3785 563 1057 -6466 -5054 6350 6455 -4033 -6807
2085 -6807 -3501 -5240 -3596 7477 10326 -3517 -12539 -7228 -839 2259 9362 10366 -4412 -17020
2099 -17020 -9388 3549 7237 7875 6204 -7202 -20212 -11922 6667 11521 4837 -890 -9144 -18535
2113 -18535 -12120 8032 15345 4452 -6681 -11857 -14824 -7914 10128 17638 4001 -11719 -14415
2126 -14415 -9910 -1994 10560 15318 945 -15985 -15166 -4414 1892 6871 9411 -1576 -16590
2139 -16590 -14177 -766 5325 3586 3148 -2132 -12483 -12791 -209 6910 3038 -770 -3504 -8811
2153h811q17R737O635o169o296J499N99k457M315N091m896n442M176M861l979
2168a954l644L121J639j970L500L764n119p071K563N815J359J163J363o137p724
2183i332K015R801L173j710j266n117r453J439J3686Q319n477p687m763n569K262
2198i679J4425J0558p436j4913n959K138P015J2014O308r207j6113m550P130R320
2212A051P615K577q934j4947l464J0243J0710L867j085p630j2634l179J1162J2604
2226G956K352n362q997q887J02J1669J1088j397q270o809l812K392R231Q270m382
2241E144r568k494J920J134L538N301j264p313l019L659J760m22K580J240m078
2256a882l306K859K567j738o74K011O2q97R36K80l665j671M514M363o49k740k695
$$ plain form
2153 -8811 -9628 109 6744 575 -5721 -4222 -3623 -6080 -1765 3326 -1570 -7012 -2836 2025 -1954
2168 -1954 -5598 -2477 -838 -2808 692 4456 -663 -7734 -5171 644 2003 3166 4529 -1608 -9332
2183 -9332 -7317 2484 5657 3947 2681 -2436 -11889 -10450 3236 11555 6078 -1609 -6372 -11941 -9679
2198 -9679 4746 15304 7868 -7045 -13004 -10866 -3851 8163 14471 5264 -10849 -15399 -8269 1051
2212 1051 8666 11243 2309 -12638 -16102 -5859 4851 8718 7633 3 -12631 -15810 -4648 7956
2226 7956 10308 4946 -4051 -12938 -12836 -1167 9921 8524 254 -6555 -10367 -7975 1256 9526 5144
2241 5144 -4424 -6918 -4998 -3864 -326 4975 3711 -3602 -6621 -2962 -1202 -1624 956 2196 -1882
2256 -1882 -5188 -2329 238 -1500 -2174 -163 -101 -998 -62 218 -3447 -5118 -604 3759 3110 370 -2325
2273b325l598J79O974O710j514q431m874j44L897P654N322l888r910n598K586
2288f960O762P621M054o192j0848m991N076R015O516J259o934j1949n103Q426
2302d248J1841N332l455q823r820k750R976J2968K899p423r621o312J189J0152
2316A905J0438Q42r384q895j965L419Q627P273q63r360q016O15N443N905M054
2331A0038j546q060o715J957O372M402M71k658n044l425J914N273K270j551k040
2346A658j437j083J182K362q1j766nJ166l94j662n0m42n79J519L261r13l869k425
2364c558M18J723L745L339j747o465l848J524N208M973K367l166q447n155M424
2379d665Q069M596k74n684q772l890N544J0468M750l925q288p537j760P893J0670
$$ plain form
2273 -2325 -5923 -5744 1230 7940 6426 -2005 -6879 -7023 -3126 4528 9850 5962 -3948 -9546 -6960
2288 -6960 -198 7423 11477 5285 -5563 -10554 -5478 3537 10053 11312 4378 -7571 -12674 -4248
2302 -4248 7593 12925 9470 647 -9173 -11923 -1947 11021 13920 6497 -3124 -9436 -8247 1905
2316 1905 12343 13185 3801 -5094 -7059 -3640 4987 12260 11397 2037 -5979 -5364 79 5984 10038
2331 10038 8492 432 -6283 -4326 2046 6448 6919 4261 -783 -4208 -2294 2979 5249 3698 1658
2346 1658 221 -862 320 2682 2601 835 830 1996 1602 -60 -110 -552 -1131 388 3649 2736 -1133 -3558
2364 -3558 -3140 -1417 2328 5667 3920 -2545 -6393 -4869 339 5312 7679 4513 -3934 -9089 -4665
2379 -4665 3404 8000 7726 2042 -6730 -10620 -5076 5392 10142 6217 -2071 -9608 -11368 -3475 7195
2394G195L858o910j0540n197J907R030R345J569r090j0845k660N276Q504O746
2408H188j865r314r234l09P080P707L754l372q795o893J869P877O269J306m187
2423H1p259m374L303P770M441j445m890l706j511K695O095K020k930m065l74L78
2439c771J117K571P48k086j418J552P26j441j41J523K65m69J604N90k563k603
2455c796J480K449J223J113l89m588m542J624N859L393j124l239o426l194L159
2470f998Q522M467m205o723n243r95O074R487K450o599q342l621K473P288P728
2485E763J623q077r440j806N131P072O335N74q914r861p06Q516Q031M116k063
2500F294r401q108J592J0610P773J01n067p040n208K586J0263O126l699o030l827
$$ plain form
2394 7195 11053 4143 -6397 -11594 -9687 -657 8688 10257 1167 -9678 -12338 -7062 1442 8188
2408 8188 6323 -2991 -12225 -12534 -5454 2253 6007 2635 -6160 -13053 -11184 -3307 2962 4268 81
2423 81 -7178 -11552 -8249 -479 3962 2517 -2373 -6079 -7590 -4895 1200 3220 290 -3775 -4149 -3771
2439 -3771 -2654 -83 665 -1421 -2839 -1287 -561 -2002 -2143 -620 -355 -824 780 1370 -1193 -3796
2455 -3796 -2316 133 1356 2469 2080 -2508 -7050 -5426 433 3826 2702 -537 -6963 -10157 -6998
2470 -6998 1524 5991 1786 -4937 -10180 -11175 -5101 4386 6836 237 -8105 -11726 -9253 -1965 5763
2485 5763 7386 -691 -10131 -11937 -6806 266 6601 7175 -1739 -11600 -12306 -3790 4241 8357 6294
2500 6294 -3107 -11215 -9623 987 8760 8861 3794 -3246 -8454 -5868 4395 10521 6822 792 -3035
2515c035k145J569P326N226l848p022k378P32J519L953M006k657o482k196K523
2530b909J938J985J329j976m297l10L329Q22k035J21O09j402k78K233r64m020
2546e825L16N026J018k143j164j026k266J057N809L353l371m282r78j04J966O429
2562C815L860m668o736j401J722L303O251L589n871r861k042O088N893M126R55
2577I023o842j0302j356Q924Q282Q17l188o113p681m22R822P871j436n927n185
2592c713n047N03Q472Q374k658q546m860j595J574P175P411k845j0004m891K503
2607h147M343M632L714k513q523l211M317N055J605Q99j692n476k493M931L668
2622A109o52m73L85k857k648L207M203j613k252J732K37k327K59L418p83l306
$$ plain form
2515 -3035 -5180 -3611 3715 8941 5093 -1929 -4307 -3575 -2056 1897 5903 3246 -3236 -5432 -2909
2530 -2909 -971 1014 2343 367 -3930 -4240 -911 -89 -2124 -2003 -1394 -2796 -3074 -841 -1805 -5825
2546 -5825 -5509 -483 535 -1608 -2772 -3798 -6064 -5007 802 4155 784 -3498 -4476 -4580 -2614 3815
2562 3815 7675 3007 -3729 -5130 -3408 -105 6146 9735 3864 -5997 -8039 -1951 3942 8068 9023
2577 9023 2181 -8121 -9477 -553 7729 8546 5358 -755 -8436 -8858 964 8835 7399 1472 -3713
2592 -3713 -8760 -8257 215 8589 5931 -2615 -7475 -9070 -7496 -321 7090 4245 -5759 -10650 -8147
2607 -8147 -3804 828 4542 2029 -6494 -9705 -5388 -333 1272 2171 479 -4997 -7490 -2559 1109
2622 1109 457 -16 369 -2488 -5136 -1929 2274 661 -1591 141 378 -1949 -1690 1728 945 -2361
2638b361K355L602k157l424P87O74j148K423M264j983o894j576L546K272J559
2653A939K187k104p931l158N917N886N95o29l275o896k700O860P800K18l601m314
2669c206n145j488P276R312l29p584m654k618M63P036R227j252j0183o095J641
2684g599L418N661O204j541r988o246L294O207L728L600j637q583n797L984P802
2699B507K617q51j855n724m994M367P883J578l832k610j666k786K044O654J196
2714D528m527l096J302q16M07L324J596m062j841K254P66k244J314K067j626k254
2730b908K552J549l645k064L022K061j489J123J282m209l978L557N093R24j940
2745I30j327l597l121M228P047J097m442l191k420j892M515Q238R80o901n804
$$ plain form
2638 -2361 -6 3596 1439 -1985 -1198 -524 -1672 751 5015 3032 -3862 -5438 -1892 380 1939
2653 1939 4126 2022 -5909 -9067 -3150 2736 3331 2702 -573 -7469 -10169 -3309 4491 4709 1108 -3206
2669 -3206 -8351 -9839 -2563 6749 6420 -1164 -5818 -8436 -7973 -937 8290 7038 -3145 -9240 -7599
2684 -7599 -4181 1480 7684 6143 -3845 -10091 -6797 -590 3138 6738 5101 -3482 -9279 -5295 2507
2699 2507 5124 4273 2418 -3306 -8300 -3933 3950 5528 1696 -914 -2580 -5366 -3322 3332 4528
2714 4528 1 -3095 -1793 -2609 -2202 1122 2718 -1344 -3185 -931 -165 -2409 -1095 972 -654 -2908
2730 -2908 -356 1193 -2452 -4516 -1494 567 -922 201 1483 -2726 -6704 -3147 1946 2870 930
2745 930 -397 -3994 -7115 -2887 4160 5257 815 -2376 -4796 -6688 -2173 6065 7045 144 -5660
2760e660LJ136L877P052J526q380p659J027M822M570M860l31q029q154J843P791
2776B94N007J463k502p178o472L121R124M077j942l977m833l831K708Q513M114
2791G686m325n180k155j161J945O467L717m423o030q05J472J701M121K792m315
2806A507n759L70L666J487K53J105j576m191O56L559Q23k231J92J230j325j105
2822a339J937L11k559K56K767N55j807p94M0j527M25L406J850k643k363j116p24
2839c325J506M551K631m249n503q76K060K558M440K014n116p555m86N248M837
2854B735K093n80n597o774L75O772O191l04l195m795n042R33P880N822j495n579
2870e60m428k504J863P099N480k297p259m347J78L451O054L809l493p513l168
$$ plain form
2760 -5660 -5657 -4521 -644 6408 7934 -446 -8105 -7078 -2256 2314 7174 6843 -1186 -9340 -7497 294
2776 294 5301 6764 4262 -2916 -9388 -6267 2857 6934 4992 1015 -3818 -7649 -4941 3572 7686
2791 7686 3361 -1819 -3974 -5135 -3190 3277 6994 2571 -3459 -4264 -2792 -1091 3030 5822 1507
2806 1507 -4252 -3882 -216 1271 1524 2629 1053 -3138 -2482 1077 1900 -331 -139 1091 -234 -1339
2822 -1339 598 909 -1650 -1394 1373 1928 121 -673 -633 -2160 -1735 1671 3521 878 -1485 -2601 -3325
2839 -3325 -1819 2732 5363 1114 -4389 -5265 -3205 -647 3793 5807 691 -6864 -7350 -2102 2735
2854 2735 4828 4248 -1349 -8123 -7748 -976 5215 4911 1716 -3079 -8121 -7188 692 6514 5019 -560
2870 -560 -4988 -7492 -5629 1470 6950 4653 -2606 -6953 -6775 -3324 2730 6539 3046 -4467 -7635
2885g635K451M780L558J369l521n982j921L645L910J684J8k710m114j401L507
2900b362L816j81j115j253j702j463K965L207j178k188l42P73o35J83K219p20
2916B4j860R64J779n83j606l72N14K05J529K088j299l589j396K321K274J749O42
2933C384k439m105j547L606M221J117j346l397l979p30M725M834O39k792m733
2948b542k998P83N371N069k3n428m674j815K359N867M938j532o956m486N62M265
2964a240M848K832k173o652m232K178N082M362M30k913n819k968L418N542K804
2979E499j276l111m369j482K959N533J300k285l858j751r7K429L746Q19k958l141
2995b043o29J234J195J809K2k249j962M72J128K27K47K00r80p12J085L07p32j210
$$ plain form
2885 -7635 -5184 -404 3154 4523 1002 -4980 -6901 -3256 654 2338 2356 -354 -4468 -5869 -2362
2900 -2362 1454 1273 158 -1095 -2797 -4260 -1295 1912 734 -1454 -1796 -1023 -1658 -1475 744 24
2916 24 -1836 -872 907 324 -1282 -1654 -1140 -935 594 2682 1383 -2206 -3602 -1281 993 2742 3384
2933 3384 945 -3160 -4707 -1101 3120 4237 2891 -506 -4485 -5215 -490 4344 4983 2191 -2542
2948 -2542 -5540 -4757 614 5683 5660 232 -4442 -6257 -3898 1969 6907 5375 -1581 -6067 -5505 -1240
2964 -1240 3608 6440 4267 -2385 -6617 -4439 643 5005 5435 2522 -3297 -6265 -2847 2695 5499
2979 5499 4223 1112 -3257 -4739 -1780 3753 5053 2768 -1090 -2841 -2938 -509 3237 4056 1098 -2043
2995 -2043 -2672 -1438 -243 1566 1588 -661 -2623 -2151 -1023 -796 -549 -349 -1329 -2041 -956 -649 -1381 -2591
3013b591O60R57O34J3m42j899j191J350K972Q97j370j834k271m61K922L500J187
3030C033k661l043j966M12L888M675k5m399l991q94K274M415L793n15n635n286
3046e925O58M593L777K186k243n811l848J449N010M598o9l566n204k416K450N442
3062A081L421j370m093m302j529L190N712K069k460m680l157N38L029M411J371
3077C231l331m186j371J972L179K281K0k418l009M43J790J846J079j71j624j608
3093a877O71J763Q21m91J31m38o77J07J015J50r22m16R82O77l59m61p18q99P38
3112b03K142J081j439k065j586K72K162K856O56l598l379n96K039K929J913j74
3128C010m195m183K72L753L734N02j376m067l552P40M864L857J97k724m494k538
$$ plain form
3013 -2591 -1931 -974 -340 -327 -769 -2668 -3859 -2509 463 1360 -10 -1844 -4115 -4576 -1654 1846 3033
3030 3033 372 -2671 -4637 -4225 -337 4338 4313 -86 -4077 -4971 -2697 1718 5511 4996 -639 -5925
3046 -5925 -5267 -674 3103 5289 3046 -2765 -6613 -5164 -154 4444 4375 809 -4395 -6811 -4361 1081
3062 1081 4502 3132 -961 -5263 -6792 -3602 2110 4179 1719 -2961 -6118 -5580 -2551 1860 3231
3077 3231 -100 -4286 -5657 -3685 -506 1775 1795 -623 -3632 -3189 -1399 447 1526 1355 -269 -1877
3093 -1877 -1206 557 1378 887 1018 580 -97 10 1025 1175 253 -163 819 1496 1137 676 -42 -941 -203
3112 -203 1939 3020 1581 -484 -2070 -1798 364 3220 3876 278 -3101 -3697 -1658 1271 3184 3010
3128 3010 -1185 -5368 -5096 -1343 2391 2893 1517 -2550 -6102 -5362 -498 3359 3556 832 -3662 -6200
3144f200K177N582L465j100m264m181j149L394N535L057k953n508k344P63L517
3159b09M434J459l612n214r09K333L214L032Q6l011m050q53L159K939J184l29
3175C653k277l716l08L246K486k02j494j352j889m0K553J804j446k123K20J50
3191g35p2M28Q88q39j064R09J092n97j041K41j34L87J279O72j838j914J94J279
3209h65P23Q70Q83k193k730j55K829K299R79j204k034l271K01M010M006n22k869
3226I57l000k158J653M357L770j397m403k998p87K423M551K803k461n168k076
3241c934P66K883L524J956k952n166k035K600L485K514K45k596m978j499L299
3256a888M370R77j236k967l634o54L704L910m55k728j536j639r2K497L495o70
$$ plain form
3144 -6200 -4023 1559 5024 3924 -340 -4521 -5670 -2276 3259 6316 3363 -2145 -4489 -3726 -209
3159 -209 4225 5684 2072 -3142 -4051 -1718 1496 4528 4614 1603 -2447 -3300 -141 2798 3982 3653
3175 3653 1376 -2340 -2648 598 3084 2882 1388 36 -1853 -1893 660 2464 1018 -1105 -885 -735
3191 -735 -807 -379 509 -330 -1394 -485 607 10 -1031 -790 -924 -537 742 1414 -424 -2338 -2144 -865
3209 -865 -142 728 1611 -582 -3312 -3467 -638 1661 2640 1436 -598 -3869 -3668 342 4348 3826 957
3226 957 -2043 -4201 -2548 1809 5579 4182 -221 -3219 -4006 -1583 2968 5771 3310 -1858 -3934
3241 -3934 -3168 -285 3239 5195 2243 -2923 -4958 -2358 1127 3641 3886 1290 -3688 -5187 -1888
3256 -1888 2482 3459 2223 -744 -4378 -5032 -1328 2582 2127 -601 -2137 -3776 -3868 -1371 2124 1454
3272A454k672j741M39K99J316K273l32k112j226J092N75N42K29J74j265l02J310
3289E3l9q76J94Q83P5o03R83M71k380o94K136J700m02m69p62j468q55K617K751
3308C315m96k667j511p92J45L253K808r45m045k336J95J500K744K761j234m898
3324b203k978K102K803K748J221j850m801k246K496L892K158l59k560m099j520
3339e196L388M699R85k103k656k721q65L305M740N23k998k972r32O0K558L773
3355C588M52l755k601L73J112J754K105N66l163k653N88K047Q50O06M13k336k047
3372b101Q12K272J84p42K07l93j219L76J556k73j415J81J186m77l34Nk03j060
3390a438J068J952k17j788j040K07L13R63K278K05l072k168Q49J562J571J423
$$ plain form
3272 1454 -1218 -2959 -2520 -2221 -905 1368 1036 -1076 -2302 -1210 -635 -93 136 310 -955 -1257 53
3289 53 14 -862 -668 215 290 -313 670 1141 -1239 -1933 203 1903 1501 1032 270 -1198 -2053 564 3315
3308 3315 2819 152 -1359 -2151 -2006 1247 4055 3110 -935 -3271 -3076 -1576 1168 3929 2695 -2203
3324 -2203 -5181 -3079 -276 2472 3693 1843 -2958 -5204 -2708 1184 3342 2983 423 -3676 -5196
3339 -5196 -1808 2891 3876 1773 -883 -3604 -4469 -1164 3576 4099 1101 -1871 -2803 -2743 -185 3588
3355 3588 4040 285 -2316 -1943 -831 923 3028 3594 431 -2222 -1634 413 1263 1869 2282 -54 -2101
3372 -2101 -1289 983 1167 425 632 239 -980 -604 952 679 -736 -555 631 154 -180 -175 -378 -1438
3390 -1438 -370 1582 1365 -423 -1463 -1256 -943 20 2298 2503 -569 -2737 -1888 -326 1245 2668
3406B668n29k990k484R93L120J751P85j104l790k603J882M374J940j075k073l079
3422b214j868J956N015J758k032l558k319J18K071M238J350k670m005j245J127
3437b278K118L340Q21k821m129o89K187K223J986K07l034l579L23L178K259N6
3453B168k98k288k671M27L132J754j079q77j144r48N4K088J324q56j843N33k06
3470g30j22R16Q46q73j243N93N95j65m94K56J95m62Q18N56r64j558j02J152N49
3489b37O12M17j532k390M52J735J919k88n45k123k024J103L220J666j003j669
3505f87k014j080J282L241K478k057l327j320k90J674L558J741k211m136j590
3520d738J495K448L092O61k678m201q91K708L052J429k00k341l723m68L148L370
$$ plain form
3406 2668 2139 -851 -3335 -2342 778 2529 3314 2210 -1580 -4183 -2301 2073 4013 2938 865 -2214
3422 -2214 -4082 -2126 2889 4647 2615 -943 -3262 -3144 -1073 3165 4515 1845 -2160 -3405 -2278
3437 -2278 -160 3180 4001 1180 -2949 -3638 -1451 772 2758 2965 -69 -3648 -3325 -147 2112 2168
3453 2168 1870 -418 -3089 -2662 470 2224 1145 268 -876 -1824 -1770 318 1642 786 -1057 -524 -730
3470 -730 -852 64 910 37 -1206 -613 -18 -183 -677 -421 -226 -688 130 686 -278 -1836 -1938 -786 -237
3489 -237 375 792 -740 -3130 -2678 -943 976 688 143 -1980 -4004 -2901 319 1985 982 -687
3505 -687 -2701 -3781 -2499 742 3220 1163 -2164 -3484 -3774 -2100 1458 3199 988 -3148 -4738
3520 -4738 -3243 -795 2297 2958 280 -3921 -4812 -2104 948 2377 2177 -164 -3887 -4355 -1207 2163
3536B163N40j624k277k188j52K776K689J32k153k140r34N3K828K001l01k466j192
3553b245pO52J667J181l16k079q35R20Q28K87N92j91j506m13Q33N35n98M7N28
3572a20m3k28N31J4r62l75J205J023q0p65k23j042l7J950J495m59j701q76o67
3591a360O16J727K074o89l320j601P85J520J580J646j555l379j333J169K256J943
3607B079N50j942k849j536J964L304J450n56k538k789q35K818L054J270k114k661
3623a331j900pK820L128M12k751k307n34Q77K450K131J99k639k096j73J643J778
3640A700J388p24k196k065Q31J649J150O17r36j634j295N06J337J020n36j077
3656b65o75k05M85Q98J66p07l86Q53q5m54j5L8l87N39O46j0j221m23N9N04N72
$$ plain form
3536 2163 2703 1079 -1198 -3386 -3538 -762 1927 2059 -94 -2234 -3168 -3115 -287 1714 1413 -1053 -2245
3553 -2245 -2252 -1600 67 1248 932 -1147 -1982 -1062 -234 53 645 454 -1052 -1465 -632 -97 -695 -648 -120
3572 -120 -163 -391 140 154 -808 -1183 22 1045 965 200 -23 -1065 -1102 848 2343 1884 183 -693 -1360
3591 -1360 -744 983 3057 2368 -952 -2553 -1768 -248 1332 2978 1423 -1956 -3289 -2120 136 2079
3607 2079 2629 687 -2162 -3698 -1734 1570 3020 2464 -74 -2863 -3698 -880 2174 3444 1330 -1331
3623 -1331 -3231 -3238 -418 2710 3122 371 -1936 -2470 -1593 857 2988 3187 548 -1548 -1721 -78 1700
3640 1700 3088 2364 168 -1897 -1066 583 1733 2350 1414 -220 -1515 -1009 328 1348 812 -265
3656 -265 -940 -1145 -660 238 404 -303 -689 164 79 -375 -390 -352 -739 -200 446 436 -785 -1208 -1149 -645 -73
3677g3N80j5j161j265J57J154J608P76j58k253j406P57K311J587N11j247k371
3694e08j238J079L053J380q12k135k426m60J682L344J036j995k569j530L72J728
3710AK897P51k270k981r01J530J981J922Q1k586k725n97K275J841J509r73k749
3727i94j974Q8K435J599L46j350j839j260P97K096J300n2j345q11o46J011J384
3744G85Q59o16j047j08l0K41Q75M38n20p40P8P3k02J53M15k35m83N97N66n90j127
3765f18M20N04O34M58m7j213j498P32J499R41j1j037j784j172N87K490J077r41
3783A021j963j261m49J026K223J526j311k401j397O06K169K065R21j987k814j120
3799c146J194K623J931nk661k392n35J931K621R83q68k253k264L6K571K015R39
$$ plain form
3677 -73 507 492 -669 -1934 -1777 -623 985 1761 1603 -650 -2056 -1299 1012 2599 3110 1863 -508
3694 -508 -1746 -667 2386 3766 2954 819 -1607 -2067 -385 2959 3995 2000 -569 -2099 -1727 1
3710 1 2898 3649 1379 -1602 -2503 -973 1008 2930 3011 425 -2300 -2897 -622 1219 2728 1755 -994
3727 -994 -2968 -2880 -445 1154 1500 150 -1689 -2949 -2152 -56 1244 1192 -153 -964 -1610 -599 785
3744 785 1644 1028 -19 -127 -157 84 959 1397 877 137 215 288 86 239 654 419 -64 533 1099 509 -618
3765 -618 -198 306 940 1398 1351 138 -1360 -628 871 1812 1801 764 -1020 -2192 -1605 885 1962 1021
3783 1021 -942 -2203 -2652 -1626 597 2123 812 -1589 -2986 -2380 -211 1854 2775 788 -2026 -3146
3799 -3146 -1952 671 2602 2597 -64 -2456 -2991 -1060 1561 2544 1676 -577 -2841 -2805 -234 1781 2720
3816B720j435k376j302O46K670J922k51j563j865p38R66K227J625j144k094j070
3832a062J10Q21J287J051j088j682q49J066P66M41L00n68q09k94R28M04k88m65
3850F9J20P3r1K19j9m63o8O20J36k52m6r45n09l19J772Q51o68j063l86o99P31
3871i37J672J408j182j673j273L93J573J652J226j949k248r72J264J851J502J25
3887B432k007k334p17J877K432J003j048j716j676m62J963K902N64j766j983j352
3903a888L16K421K439k04k286j895p49Q06K183J847o36k766j792N08J305J416
3919A025J091r01k359j347J058J571J144k58j006r02p90O60J567K69j89j027l09
3936g03o14O90R41R2q98J52P5k12L73K20j44o23N63N52k0n14J17j03L25J79J349
$$ plain form
3816 2720 1285 -1091 -2393 -1747 923 2845 2594 1031 -834 -1572 -606 1621 3246 2102 8 -1062
3832 -1062 -952 -131 1156 2207 1119 -563 -1412 -346 420 861 1161 593 -216 -510 418 822 534 69
3850 69 189 262 171 390 371 -92 -160 460 596 344 298 -647 -1156 -1475 297 1148 480 -583 -969 -1668 -937
3871 -937 735 2143 961 -712 -1985 -1592 -19 1633 2859 910 -1338 -2310 -1046 805 2307 2432
3887 2432 425 -1909 -2626 -749 1683 2686 1638 -78 -1754 -2216 -253 2649 3213 1447 -536 -1888
3903 -1888 -1572 849 3288 3084 798 -1097 -1846 -1040 1143 2990 2354 -412 -2204 -1696 -391 1025
3919 1025 2116 1215 -1144 -2491 -1433 138 1282 1024 18 -884 -1674 -1014 553 822 633 -394 -703
3936 -703 -1317 -627 314 406 -492 -340 -265 -477 -104 116 -28 -651 -88 464 444 -70 47 -56 269 448 1797
3957A797p74j013r54L95O64R53P63q19j569j294J386J297R62l95r19k161m82J187
3975i76K326O69r19j650j762k71J901K416N00j859j919q83p5K348K086J65k335
3992b38j588q56J164J951J667m98k624j723M75J604J665P65q92j995j651J153
4008a621J636J420K19j027j480j289P18K364O19p00o86j014r99R68J415O68r24
4025B87o34l83k76N12Q26K80o03p39N71j03k5o6L67l48m72Q91N6m87o83N19M94
4046a6j1M92l28q06n97M50J167N28k95o33n59j202J046J767O77p05j168r24l04
4065a421J315J862L84j195j993m95L98J468K024L5j519k437n94J759J630J369
4081B590l95k220j689k75K003J776M07m12k336j962N52K053K268j95j512j448
$$ plain form
3957 1797 1023 10 -944 -549 115 1068 1831 1012 -557 -1851 -465 832 1794 1399 480 -1681 -2163 -976
3975 -976 1350 2019 1100 -550 -2312 -2583 -682 1734 2234 375 -1544 -2427 -2502 -154 1932 2097 -238
3992 -238 -1826 -2682 -1518 433 2100 1602 -1022 -2745 -2270 -666 999 1764 872 -1123 -2774 -1621
4008 -1621 15 1435 1654 627 -853 -2142 -1424 940 1559 859 173 -841 -1840 -872 543 1211 287
4025 287 -347 -730 -1006 -494 332 612 9 -730 -159 -262 -287 -353 14 -334 -806 85 141 -346 -1029 -510 -16
4046 -16 -27 465 137 -669 -1266 -816 351 879 584 -49 -608 -1810 -764 1003 1680 975 -193 -1117 -1421
4065 -1421 -106 1756 2140 945 -1048 -1543 -1145 323 2347 2382 863 -1574 -2168 -409 1221 2590
4081 2590 2195 -25 -1714 -1989 14 1790 2197 1785 -551 -2513 -1961 92 2360 2165 653 -795
4097g95j317R90K311J245o87j763j070j48M81J910P29r43j381m77N1R28R84O08
4115A656q54j529J17M72N33L67Q2l54p21k88J079J65l27n6J70l22J3M67K89j268
4135c09O4P66M04n1q79l37l33O2J140P63o23j002o62j48J001J119P10r16j669
4154i00n41P91R52Q60N08j397j806n05J582J395O63K4j647k039j91J843J943J97
4172A732l32j983j466k27K948J378J7j204j866q08P23K219J400l44k070j616l9
4189a538J172J748R80o16k126j347O27J019J275N19r69j810o59N29J569O70P9
4206A122p41j007n13P30J510l1m65q68n0j96J07J049j30o64l19L40k4L74k49L09
4226B84o49L07M43k82j62l7J05L1L62P19j20r45o72O11P10O29L20p74j493o57
$$ plain form
4097 -795 -2112 -1122 1189 2434 1747 -16 -1086 -1234 -753 1157 1886 943 -438 -915 -864 64 1048 1656
4115 1656 802 -727 -610 -138 395 762 844 490 -231 -519 560 725 398 342 512 190 203 670 959 -309
4135 -309 -245 521 925 874 -5 -342 -675 -613 527 1290 667 -335 -997 -1145 -144 975 1685 769 -900
4154 -900 -1441 -650 302 1162 1670 273 -1533 -2038 -456 939 1602 1626 -21 -2060 -2251 -408 1535 1732
4172 1732 1400 -583 -2049 -2276 672 2050 2067 863 -1003 -1811 -1088 1131 2531 2187 117 -1499 -1538
4189 -1538 -366 1382 2362 1746 -380 -1727 -1100 -81 1194 1713 744 -1066 -1725 -1196 373 1043 1122
4206 1122 381 -626 -1139 -409 1101 1070 605 -263 -313 -509 -402 647 517 -147 -466 -126 -150 224 -25 284
4226 284 -365 -58 385 103 -59 -96 9 40 402 1121 1001 56 -616 -5 705 1334 1654 880 -613 -1270
4246a270J076J107N29k68r66j508l68J281J553L52r22j302o56J16J125J687L69
4263A935j322j996n03O55J912J399l38j960j817m42J548J561J097o79j955j596
4279b501N98J727J539N09j038j347r50N61K033Q61k41r99j085m99O99J655P55
4296B277o41j252j031J06O77R94P47j409o18m66K89L51O01O12r63m47K58K71r7
4315B59J4K88m17k20M12l19Po42K30P1k47K88j35o17j60L40O88Q0k06K10j186
4336a262K1N95J340M75o45r48o39J74J243J483R2j193j633k23O13J458O54J76
4354A781j319j667m86J301J176R36n91j148j609r2J903J627j23n19j980j138Q18
4371a130J763J359p06j355j316q41Q09J998N22r48j408r07k25R12J588L14r27
$$ plain form
4246 -1270 -194 913 1442 1174 208 -1300 -1668 -387 1166 1518 596 -706 -1362 -1246 -121 1566 1935
4263 1935 613 -1383 -1886 -1231 681 2080 1742 -218 -2035 -2477 -929 632 1729 1050 -905 -2501
4279 -2501 -1903 -176 1363 1872 834 -513 -1463 -902 1131 1992 1751 752 -333 -832 -133 1522 2277
4296 2277 1636 384 -647 -541 136 1130 1877 468 -150 -616 -327 24 625 1237 274 -173 85 356 259
4315 259 273 561 144 -76 336 17 24 -618 -388 -317 -564 -276 -411 -1028 -1188 -848 -160 -80 -286 -76 -1262
4336 -1262 -1241 -646 694 1169 524 -424 -1063 -889 354 1837 1929 736 -897 -1120 -507 951 1605 1781
4354 1781 462 -1205 -1691 -390 786 1722 1131 -17 -1626 -1718 185 1812 1689 1170 -810 -1948 -1130
4371 -1130 633 1992 1286 -69 -1385 -2226 -1417 581 1103 155 -1253 -2160 -2385 -1473 115 429 -498
4388d98j193k48K57J006J240P6p95j056l0N47O71O81P5o79o79l26L60R25l31M3
4408D6k63k38l13N05K37k67k10Q25j93J36j86j12j59qJ083M4k58p40n20J43M61
4429A3O47L00o56j387l38P31J063M36p9q60j484k12J091J428N87j93j530j243
4447a686J75J526J767j63j011j256r03K62J638J451o18r08j544k52O10J742Q84
4464A714n21j744j090J39J078J406Q36p38j348p54Q9J264J270M4j457o86o76Q88
4482b86J204M66l87p69r77l96R50J092j77l64p60J5J80M14N03J80m55k96j69L79
4502C47o0M83k9m43N1N2K04j00l72k81K82L03r2k5p68m20P5O31N43L71j061q46
4524a155N7O33J198K72l28j124r60k0J385J004L86j146r49p79J91J553J321n66
$$ plain form
4388 -498 -1691 -1939 -1682 -676 564 640 -155 -1211 -1241 -694 -23 658 733 54 -625 -951 -591 334 3 46
4408 46 -217 -455 -768 -263 -26 -293 -503 322 129 265 79 -33 -192 -200 883 927 669 -71 -591 -448 13
4429 13 660 960 304 -1083 -1421 -690 373 809 730 -130 -1614 -1826 -735 693 1280 1087 -443 -1686
4447 -1686 -1511 15 1782 1619 608 -648 -1551 -1289 349 1800 1182 274 -1270 -1522 -912 830 1714
4464 1714 1193 -551 -1641 -1502 -424 982 1818 1080 -268 -1022 -933 331 1601 1645 188 -498 -1174 -286
4482 -286 918 1384 997 228 -749 -1145 -195 897 720 356 -404 -389 -209 205 708 888 433 137 -32 347
4502 347 287 770 741 298 349 401 605 505 133 -148 134 437 345 320 -448 -868 -793 -162 381 752 -309 -1155
4524 -1155 -1098 -465 733 1005 677 -447 -1407 -1427 -42 962 1348 202 -747 -1526 -1335 218 1539 973
4542I73r24j499k26J011J202J056n33j253j267Q9J209J307J105j081j376j105
4558a312L52J614J106k9r36j503j007J219J624M85m96j060j037k28P85J484K48
4575A309p82q85o31K55L22J465N7p03j017j45L41O75L75r5p52n17L12K25K41J30
4595A80k26k80j02K95j49M16k11k9K04L47j06p6m28k16L65Q67J27n13k81q07j33
4616g56P12J030K51o37r98k08j6J014J166m13j224q88K23j76J592J102m72j690
4634c88j142L33Q72J109L61m72j496o28K72J198J222m21n42j417q19P12J675R99
4652A428o70j131r14l75Q92J546N26r48p92p53K11P97J245J97q17j316m05O21
4670f58J351N80l36o72j199J29O49O10J33n0n07n97j10N48N30j18r6m57m36L77
$$ plain form
4542 973 49 -1450 -1676 -665 537 1593 1060 -193 -1460 -1371 -162 1145 2250 1169 -207 -1312
4558 -1312 -960 654 1760 1731 795 -708 -1715 -496 1128 1613 1117 57 -980 -1208 -423 1061 1309
4575 1309 527 -358 -989 -734 -412 1053 1110 407 -610 -755 -414 261 636 541 -211 -728 -416 -191 50 180
4595 180 -46 -326 -428 -133 -282 134 -77 -106 98 445 339 263 -165 -381 -16 851 978 465 184 -623 -756
4616 -756 -44 986 1237 600 -398 -606 -622 392 1558 1145 -79 -967 -744 -920 672 1774 1302 -388
4634 -388 -1530 -1197 -325 784 1145 673 -823 -1451 -1179 19 1241 820 278 -1139 -1958 -1246 429 1428
4652 1428 758 -373 -1287 -1662 -770 776 1302 354 -438 -1191 -980 -183 1062 1259 442 -874 -1279 -658
4670 -658 693 1273 937 265 -934 -805 -156 454 587 537 30 -567 -677 -129 401 283 187 -270 -706 -329
4690c29M47q5l54J08J28K11j83M8o5o08N17L51M06o01k80l18L7N15N29K56q12
4711h2p94J84M90P00N57p8j013r28J6J182Q72k4m85r29o52j3J674R02q9j085j075
4732f70o97N75J723Q67n98j336q27l92N00J825P30q21j591o55o6J307J387K29
4750A490r81j626m79Q14J083O45L42r83j285n7O61Q71M04l30q39p23j42R52Q24
4769F41N4p63k6n57R1N44O16j30n08j77K2L27j16M59j6n87ol0M62l20M2K1j65
4792a22M04p4k42n16l63K58O23K52J34n89r90r8J060R47Q3o23l46r78L27R62N89
4813F98j4o72q71m12p6J609P33m35j095j094j2P03J220Q34o86j135o90L14J004
4832g7J244L85q10j628o68R89J275M60R1j231r63n96J126J077O20r33q77r64j49
$$ plain form
4690 -329 118 33 -321 -213 -85 126 -57 -9 -74 -682 -165 186 592 -9 -289 -607 -570 -55 474 730 -82
4711 -82 -876 -692 -202 498 1055 977 -36 -964 -948 234 1106 1082 597 -332 -984 -997 677 1579 1490 405 -670
4732 -670 -1367 -792 931 1798 1200 -136 -963 -1355 -855 970 1700 879 -712 -1367 -1433 -126 1261 1490
4750 1490 509 -1117 -1596 -782 301 946 1288 305 -980 -1037 -376 495 899 569 -270 -993 -1135 -183 641
4769 641 695 -68 -94 -651 -560 -16 600 470 -38 -215 -193 134 18 477 461 -126 -132 -162 300 -20 22 43 -122
4792 -122 282 208 -34 -550 -913 -655 -32 220 354 -235 -1225 -1323 -263 684 767 144 -202 -1180 -853 109 698
4813 698 684 12 -859 -1271 -1347 262 995 560 -535 -1629 -1641 -938 282 1116 430 -705 -1395 -1081 -77
4832 -77 1167 1552 742 -886 -1554 -565 710 1170 1261 30 -933 -1529 -403 674 1294 361 -516 -1480 -1629
4851a629J247J094o1p54k91q00O5J202O52K3o99p89j83P15N02K73j26o40n18p9
4871g96R32j28k5j05l58l68L61K91j19l5J55K75J06j24J15om14Q14qJ35K0l41
4893C77o13j86P75Q18j78q31k42n34R1P40P84J0r31j074m5O93Q52Q30l24j323
4913c11j166N94J176P24R6n07j559o52P12J256O62l25r28r81p24R03J436N89n96
4932C99j076p08J05J001J512L41j132n58o88N56Q64J087N4r15j230j69Q18N20
4950G81P15k03q81q77L52M17N41J55k07o08m43K38O50K84j27k61n16J0q3N70K52
4971G59m70J47j51m50J62J78n26l57J79N87k10l04j71m3j68N81M22J18k08q65
4991g90L58K49P67K49L23j310k46Q0Q77M37J00o81o15m38Q5J031R58l21q70r76
$$ plain form
4851 -1629 -382 712 651 -103 -394 -1194 -1129 73 725 748 49 -740 -923 -208 294 567 441 -199 -717 -796
4871 -796 136 8 -17 -122 -480 -848 -487 -196 -315 -350 -195 80 186 62 177 171 -243 571 563 698 718 377
4893 377 -236 -422 353 1171 993 162 -80 -614 -523 217 1001 1011 80 -994 -1039 -346 506 1336 1012 -311
4913 -311 -1477 -883 293 1017 1113 606 -953 -1605 -893 363 1025 700 -228 -1209 -1933 -1030 406 995 399
4932 399 -677 -1385 -1280 -279 1233 1574 442 -116 -804 -248 616 1703 1757 842 -388 -557 261 781
4950 781 1496 1293 412 -465 -113 304 845 1000 793 185 -258 -20 630 914 787 526 10 20 -63 507 759
4971 759 289 436 285 -165 -3 175 -351 -708 -529 58 -152 -456 -627 -670 -838 -257 165 283 75 -790
4991 -790 -432 -183 584 833 1156 -154 -400 -320 557 994 1094 413 -202 -640 -555 476 1434 1113 243 -733
5011g33M8M37J167Q36p78r66o05j21R32J179K61p18j458n33P56O77Q63K44j493
5030er18p6M13R80P67n50j071j106N27P33O32K38k88r25k01J02P31Q22p0p51k13
5051b29k12J2O96O03m24n61k48K48J96R7K29m85r3j28J84L49Oj25k05j6P73km96
5074A69j28l29P90Q8J22R0l33q37P4N37N10l0j86q57m76L59O97Q08k86n37o34
5095c89k50O02R38O46k34j282o87K59R56P93K10n06j485o97O40J286N69q7r93
5114B89j064m65P23J142M23Rj156r63n2J280R06K25l38j389k91j5R76R95j12q68
5134B55r91k52N03M53Q54m55q04k69L35K86J10M53m64l20k35K38N09K26K82m61
5154B53j9k41K23J46K32l43j06K27q0L8j87k5m21M34L08k22K48m70p79L38P06
$$ plain form
5011 -733 -685 -248 919 1755 977 11 -594 -715 217 1396 1657 939 -519 -1052 -296 381 1244 1488 -5
5030 -5 -923 -999 -586 394 1161 611 -460 -1566 -1039 -306 326 564 276 -649 -850 -748 -17 805 735 -16 -229
5051 -229 -441 -429 267 870 446 -115 -363 -115 81 178 407 -78 -171 -299 -115 234 240 115 -90 -106 667 665 169
5074 169 41 -288 502 590 712 802 469 -368 -294 243 753 723 537 -320 -796 -437 260 1068 782 245 -389
5095 -389 -639 -37 901 1547 1313 31 -656 -397 559 1352 1562 1056 -429 -1126 -486 800 1369 1282 289
5114 289 -775 -1240 -517 625 1048 1057 -99 -1062 -1114 166 1072 1297 959 -430 -721 -736 240 1235 1123 255
5134 255 -736 -988 -485 -32 822 367 -437 -706 -371 -85 25 478 14 -306 -541 -303 206 432 714 253
5154 253 234 -7 216 362 594 251 145 372 292 330 143 118 -303 131 439 217 465 -5 -784 -446 260
5175B60N03l67l35n92k72N98N59M61r8j293k54K5N58O60N08q62j053m55O19R79
5195A49P73Kj438p34j73J051J060L79l28r77n89j48J074Q36M51o62j164l35J30
5214f43J162R31k13q71j011m1M84J113N90n56q50p22k95Q43M76O31l26r56o64
5233i18O23O06M15k17o40k75m58K88Q96M7l16J02p56p4L87M43j31j16j79J62L7
5254g4j29J31J16k55J59K16L77n44j83j12R9L77M39k67n00m03L38J36O94J58n38
5275B35n95l80L47N04O34L9o85q39k95M05J093R5k81q16m88j24P14R91M95p09
5295C40r23o00L20O89P63K46n96j030q0K39P84P38N8j300j013L38M04J030N87
5314I94m69j128l72J89P69Q86l46m38m97l96K49J066M11m17o34j46q8r4R40M14
$$ plain form
5175 260 763 396 61 -531 -803 -205 354 815 717 -576 -830 -805 -247 413 921 59 -994 -1449 -830 149
5195 149 922 924 -514 -1248 -1421 -370 690 1069 741 -236 -825 -973 101 937 1388 726 -438 -773 -643
5214 -643 519 1450 1237 366 -645 -686 -202 911 1501 945 95 -627 -922 -79 397 1028 702 -254 -918
5233 -918 -295 311 726 509 -131 -406 -864 -576 320 367 51 153 -603 -677 -290 153 22 -94 -273 -111 -74
5254 -74 -203 -72 44 -211 -52 164 541 -3 -186 -298 -199 178 617 350 -150 -553 -215 -79 615 773 235
5275 235 -360 -740 -393 111 745 784 99 -740 -1035 -630 463 558 277 -539 -1027 -1151 -437 554 1049 340
5295 340 -583 -1183 -863 -174 589 835 239 -791 -871 -632 152 890 948 -352 -1365 -1027 -623 407 994
5314 994 525 -603 -975 -786 -17 869 523 85 -412 -808 -559 507 918 501 -133 -279 -367 -461 479 893
5334H93m03o12q9l63M92L21J05l69m46K56M26k48k63K08j00J57N1q6J48j51j59
5355b32J35L70J41k60k21l15j17P97K92m1l50l30o10Q35M19L92n46o88m03P3O81
5376B2R69M26p43n85n03J88Q49N03L25r65j097k78N50P72O44J23j077n10o66R05
5396a48J011J26m45q08n77n1J118Q79P2r20n86n85M82J038M26K8q49n09m29K92
5416d35R49L73m56n75q13O66k45J066L54m50o28P4J37K40L37K06k93j56l11L27
5436C67K73l74J38J3J0p4k24M66m84K11l44L02j01k31o4k07L8M27M65k36m58k94
5458c81n4O51O88l23j08n18m06J43L87O77o0l70r31m71Q76O68M84m41o82r32K6
5479a077J158P74N37p54r18m52J03J039P25K27j087m80k54J55Q89O39j61j295
$$ plain form
5334 893 490 -122 -211 -574 -82 239 344 -25 -471 -215 211 -37 -300 -92 -192 -35 16 -70 78 -73 -232
5355 -232 -97 273 414 154 -67 -382 -499 298 590 549 199 -131 -741 94 513 905 359 -329 -732 -659 22
5376 22 991 1417 674 89 -414 -226 623 1126 1451 486 -611 -889 -339 433 1077 1200 123 -387 -1053 -148
5396 -148 863 989 544 -264 -841 -892 226 1105 1177 257 -329 -914 -432 606 1032 1060 211 -298 -727 -435
5416 -435 514 887 431 -144 -957 -291 -536 530 884 434 -194 -120 17 257 594 800 507 351 40 367
5436 367 640 266 404 417 427 353 129 595 111 322 -22 280 179 -52 -116 -323 -285 142 607 371 -87 -381
5458 -381 -435 216 904 581 473 -45 -451 -308 79 756 696 326 -605 -1076 -200 468 952 511 -171 -1103 -1077
5479 -1077 81 855 1392 638 -280 -732 -629 410 1135 1362 275 -205 -459 -304 585 1224 1063 -232
5497b32o75J53N33N88M88j37j108n66K51P87N09l4j49o44m27K58P44O1K1l21j013
5518i13K64J96O15j14N9o66J32j18L9M31J60k25r3J1J77n4J41P8j58o1M41J00
5540D42K05o75K34R4L18j18j88n82r1M74j5K31J88m82n05k2M53L95K68n4n30m69
5562d29%O56N65P8q7r51o44O20L23N46L43p68p12m39J56N96P28j39o40n49k38
5583i85L84R82K32l17o79m68j10P47R54J67k01p53l93K94N63N88N8r35l27j01
5603c00M07N78K25l11q17qO1L66L36K11l00j39m68N2M91M28k36J50n2l97j53L45
5625D69K04j86j54l63J88J0p1n99M31p2j32M0j04j0q3LO62p2K22l31l92k33N31
5648d2N30j02K47n01r06J53P73K38K99m96p08k11K63N77M73M05q88q74J86L06
$$ plain form
5497 -232 -907 -754 -221 367 855 718 -390 -956 -705 82 591 557 408 -236 -663 -405 339 400 421 100 -913
5518 -913 -649 -453 162 48 107 -559 -427 -545 -506 -75 85 -140 -233 -222 -45 -99 42 120 -38 -99 342 442
5540 442 647 -28 206 300 618 500 312 -270 -361 113 98 329 517 35 -470 -492 -39 356 624 570 40 -429
5562 -429 -429 227 792 870 783 -168 -812 -192 131 677 1020 252 -460 -899 -743 -147 581 442 -198 -747 -985
5583 -985 -601 381 613 296 -383 -851 -961 -214 740 907 706 -47 -440 -146 417 1005 1063 128 -199 -300
5603 -300 107 685 910 599 -218 -226 -165 201 537 748 448 309 -159 -107 384 812 576 726 674 277 124 469
5625 469 673 487 333 -30 158 168 97 -502 -71 -143 -275 -235 -339 -349 -432 -429 233 161 383 52 -340 -573 -42
5648 -42 488 386 633 132 -774 -621 152 390 689 193 -515 -726 -463 114 587 992 104 -770 -584 -278
5668b78Q74N94l40q10l12m37Q43P64J28m23p55p05J90Q93R24k36j083k45o42M27
5688f29R65O35n33o78n37O9O57M43J55k91o64l23L41M22L94M23p26l88k24J07
5708c82Q74n49J60j83m87M3J71M94q6l01L6K33k36K59J25k00NjL54j30n9j86N
5731d1r3L21K40k72k55m03J54Q4K35M69l73j49m09L01K85K89q3m88m17j4N74O04
5753E59J98k12j62o29l22L16P45K18n70j52p73J22Q90L85k48k91q94J0L90M23
5773CP07P7j132l15n4M38Q12P9l09n15p08K02N97M56K03p09j82n28L53N54K50
5794B79j72r8o33l4N56K35J89m53J48j85n1K67J63L08l84m9j1J32k62J25ok1j5
5817B8K63k44LO5J4k3l36P94j97k80m75K64M42n3J29J58j045J69N8Q15j12k19
$$ plain form
5668 -278 596 1190 850 40 -272 -709 134 898 1026 603 -152 -857 -667 226 1150 914 -169 -414 -1056 -629
5688 -629 336 971 438 -240 -777 -708 -51 392 547 256 -408 -731 -390 32 426 849 123 -265 -489 -382
5708 -382 492 -57 103 -80 -567 -524 -353 141 55 -246 -210 23 -213 46 171 -29 -24 -25 329 199 140 -46 -41
5731 -41 -134 187 427 155 -100 -503 -349 -265 -30 439 66 -83 -492 -191 94 383 300 -188 -605 -619 -45 559
5753 559 757 545 383 -246 -568 -252 493 711 141 -11 -784 -662 228 613 365 74 -820 -810 -420 3
5773 3 710 787 -345 -660 -714 -276 536 615 306 -209 -917 -715 -118 338 541 -168 -350 -878 -525 29 279
5794 279 107 9 -624 -658 -102 133 322 -131 17 -168 -219 48 211 519 135 86 75 207 -55 70 64 43 28
5817 28 291 47 50 115 129 106 -230 564 367 87 -388 -124 318 265 394 552 -493 -324 -266 549 437 218
5839B18j27p07O4M36O33J13m57o37p1m3N09P47l9q45q8k46K60O77K39o7n36p83
5861g50L96O34J95O30l59j053n1J41P09K09J45n12k97n51P20J81L04j34l63k47
5881e3j36j27Q83J68n15k07l98K71J10N42J24n56p4m68N93j52N3K34k31n27K83
5902a83o1L61j58j9pJ83%L69k94k41j9J16k19K30L6j60L80l19K49K37l04k85j39
5925b47q4K11N46R3j90p04K71l05M43N93j18k74o20n6J28J47Q61k65l42p41k28
5946h81O40L70O82n36n68o82N01K71Q36J10m97q32J04J13N23M47j26o17m44j46
5966g32N73P49j6l44k98j95m82R81K34L47k11o37j80N3J68O17j67n38k94J07M61
5987A96L55j12j22m87k79J78J36L56k43j25j07R2j4M56l35J0M0q6J51K35k03k00
$$ plain form
5839 218 91 -616 -552 -116 517 630 173 -464 -535 -578 -69 678 639 -206 -294 -540 -280 397 636 569 33 -750
5861 -750 -354 280 475 1105 746 -307 -358 -217 492 701 846 334 37 -514 206 387 691 557 194 -53
5881 -53 -189 -316 567 735 220 13 -385 -114 -4 538 662 106 32 -436 157 5 58 292 61 -466 -183
5902 -183 -244 117 -41 -60 -67 116 116 485 191 -50 -69 47 -172 58 94 -66 314 -5 244 481 177 -108 -247
5925 -247 -331 -120 426 519 329 -375 -104 -409 34 627 509 235 -385 -441 -313 -166 695 430 88 -653 -881
5946 -881 -241 129 811 275 -293 -975 -474 -203 633 743 246 -586 -482 -369 154 601 475 -142 -586 -732
5966 -732 -159 590 574 230 -68 -263 -745 236 470 817 606 -31 -211 -158 10 627 460 -78 -372 -265 196
5987 196 551 439 317 -170 -449 -271 -135 221 -22 -147 -254 -162 -176 280 -55 -45 -5 -91 60 295 92 -108
6009a08j11j6M77J27m08L6k58KN35j14K04l25l70o5L80N1K04J62k82l25R2J79
6031F7L02L59k44n40l08j24O79N58m1n65m91j39N0P44L22k80p37j26j02J06J030
6052E20M7l31n00m22J73O30K95J28k99o09j11J31M11M32L7k58o72l79N69L68J08
6073B68l8m68k60q5M99K97j92J40k35l9R0J28L55m32J50k86K13j43L67j42m44
6094b57J10m8M0K05j09K4o5p9J60L70k62K7j23j99M3L00J41m29P0m06M86J06J27
6117B32q5l20O8k97K78K91l2k28l50j05J3M29K91j65j64k25k48M50N47K75r8p40
6139a83n33K25O80M89j21j40n29n96J89N98M41q3l13q39K4M23P71j75j3m56o84
6160h25N90J72N98j01k83k93km10P80K68l94k84j49N5j76M36Q0m06K5O4k71L88
$$ plain form
6009 -108 -219 -235 242 369 -39 -3 -261 -259 276 162 366 41 -329 -394 -14 37 241 403 121 -204 -112 67
6031 67 369 728 484 -56 -364 -488 191 749 708 143 -348 -487 -437 307 629 349 -388 -514 -616 -510 520
6052 520 567 236 -264 -686 -513 117 412 540 241 -368 -479 -348 63 495 532 274 -398 -777 -208 160 268
6073 268 230 -238 -498 -583 -84 213 21 161 -74 -113 -23 105 460 28 178 -108 105 -38 329 187 -257
6094 -257 -147 -195 -155 50 -59 -35 -100 -179 -19 351 89 116 -7 -206 -163 137 278 -151 -81 -487 -1 105 232
6117 232 147 -173 -105 -402 -124 167 135 -93 -443 -548 -535 -106 185 20 -144 -369 -617 -167 380 655 557 -183
6139 -183 -716 -491 189 678 557 417 -112 -708 -519 79 520 437 124 -715 -691 -268 503 328 315 -141 -825
6160 -825 -235 -63 535 434 151 -142 -144 -554 226 494 100 -184 -333 -278 -454 -18 62 -344 -319 -255 -526 -138
6182a38J01k13J65k23K77M4k19M8J89n5o3K39k74K03m8M6J12Qj28p1m4l07K87
6205f4J79J51k2k86j7J42k07N15K56k55n4n49lN18Q2M21r1n73o17K67K02M31J7
6228D43l83j97m54M9O79L96j38l45j118L51K73J085L3q20O8n73N9O08M01n5k57
6249A05l67k60p8P43L27K94o77m81j37L86L43O1P3k99j78J36K79QK06j86r8m87
6271b87R4K91M95j29m54J15l15L85O9j59p6q1M6K12n4k54J48pl83L46l02J68r5
6294b27J32j57K29N2L15n49Pk86L86O3J90N2m65k53J02M35K39p2k51k04p85P48
6316b99K66M65L63q81j16k32K41K95O42k80o08n9k09N28K80J75l08n21l19L46
6336b31L26K48j15k5n55j98K14P00R0r6k55n18K50K68L74o6l28k82kP9L09J15
$$ plain form
6182 -138 -37 -250 -85 -308 -31 13 -206 -158 31 -24 -87 152 -122 81 33 79 191 199 71 0 -44 -351 -64
6205 -64 115 266 244 -42 -59 83 -124 391 647 392 338 -211 -214 304 386 807 716 143 -474 -207 -5 426 443
6228 443 60 -137 -591 -542 137 533 395 50 -1068 -717 -444 641 674 -146 -78 -651 -592 16 417 362 105
6249 105 -262 -522 -600 143 470 764 87 -394 -531 -145 198 259 332 33 -145 -9 270 278 484 298 200 -287
6271 -287 -193 98 593 464 10 125 -190 195 264 105 29 -52 -6 206 152 -102 46 39 -344 2 -300 -132 -227
6294 -227 -95 -252 -23 29 344 -205 -198 -484 -98 -35 155 207 -258 -511 -409 26 265 193 -58 -262 -1047 -299
6316 -299 -33 432 795 -86 -202 -434 -193 102 744 464 -144 -203 -412 116 396 571 263 -258 -577 -231
6336 -231 95 343 228 203 -352 -550 -336 364 454 358 103 -415 -165 103 477 411 83 -199 -201 -122 187 302
6358C02j57L5l78j36NM80J30M1m93j68J05K00K74l7j56m2q1P9L40j99K43m02L10
6381B95L3j53j69J31l20o0NK41L3j66l66M22K7Kj63M72m34k27J97L12K54O8m32
6404Bl10K04J69J10L10j41m80J7K4J68K56L91l09o32l13L79J36O15q7o42j80k04
6426e17L73M18K46l89j16j90L4l9M81L8m40j97P0q5K54K83M1p1n36j48Q8Q31k39
6449A90j92J98m02oK16J75j48O8j72n2q9L26J07J03j57j62j22M70j75J11j61l8
6471H8L53l11l31L57O0l28J43J72Q4j82m9j98N0J01L65p2l61k85K86J74j32M10
6493C94p0o20K09l45N15J93po3m34o47N81P5P44j66k07l71j58L71L79j24J1k59
6515Ak53j77K33P33k05l37k43p5K3K21N09L8l47j59l94K06O10j2J56n48l02j69
$$ plain form
6358 302 145 180 -198 -334 -329 151 281 322 -171 -339 -234 -34 240 203 47 5 -76 3 343 144 387 -15 295
6381 295 328 175 6 137 -183 -243 -238 3 36 -130 -496 -74 -47 -45 -208 264 -170 -397 -200 112 366 434 2
6404 2 -308 -104 65 175 485 344 -136 -119 -95 73 329 720 411 -221 -534 -155 -19 596 509 -133 -313 -517
6426 -517 -144 274 520 131 15 -175 -141 -180 301 339 -101 -298 -228 -313 -59 224 265 194 -342 -490 -402 429 190
6449 190 -2 196 -206 -212 4 179 31 99 -73 -125 -214 112 219 322 165 3 -119 351 176 287 126 88
6471 88 441 130 -201 156 216 -112 31 203 287 105 56 -142 -92 9 374 302 -59 -344 -58 116 -16 394
6493 394 324 -296 -87 -432 83 276 269 206 -228 -875 -294 -219 525 359 152 -219 -377 -6 373 249 260 1
6515 1 -252 -429 -196 537 332 -5 -248 -323 -300 -79 430 468 121 -38 -432 -226 384 372 528 -20 -322 -491
6537d91L26K26j12L01n13L2k02O02K16R9o52k56l1K27J30L4R2j90l07L95k56K53
6559g7j15K22l76K10QJ46j31j81K22j77J90M21o00k9K70k76K92j43N21m84M8j67
6581b06k2L76l8r1k07k03j1N39M7k20q8k43j3J79L88J90k78l43j66J17j29M31
6603IL67l25j43j78j53N04M8L33k80n13j1pM84L29J3q00J29k47M30K82L26k21
6625C76p15J32j19Q7M52K95l10n26j12M60K28J95p5j05o44k12L89M06m0j89J48
6646A21l32K07JQ4k96K71k97O6L9J37J84j61L1m70L90l6M7j19P1r3O9Q2k0L0o43
6671f37M70J44K55m1k34q5k14R8L84m0L3r0n4l81K97N02J34k67j83m24J93L37
6693A97K86j10l27j83j56O2N02J6N2l10n15J98M67j75M43l45j20J00l25L18L88
$$ plain form
6537 -491 -165 61 -51 250 -263 -231 -433 169 385 484 -168 -424 -455 -228 -98 -64 28 -162 -469 -74 -330 -77
6559 -77 -192 30 -346 -136 -128 18 -113 -294 -72 -249 -59 362 -238 -267 3 -273 19 -124 397 -87 -39 -206
6581 -206 -228 148 110 19 -188 -391 -402 137 184 -36 -124 -367 -380 -201 187 377 99 -244 -410 -293 -422 9
6603 9 376 51 -92 -270 -423 81 129 462 182 -331 -342 -349 135 464 477 -323 -194 -441 -11 271 597 376
6625 376 -339 -207 -326 -239 213 508 198 -328 -440 20 248 443 368 263 -381 -593 -204 202 162 -27 121
6646 121 -211 -4 -3 81 -215 56 -241 -175 -136 1 185 24 55 -415 -25 -61 -14 -133 -62 -155 -86 -4 -24 6 -637
6671 -637 -167 -23 232 191 -43 -128 -342 -244 140 100 133 43 -11 -392 -95 407 541 274 91 -333 -140 197
6693 197 483 373 46 -137 -293 -231 271 287 339 29 -486 -288 179 4 447 102 -18 82 -243 75 463
6714D63j10k73j60j44J65J06K85r2L5m67j09J24J43N45j91n61j86P6N89k19P6
6735I5%k55K12k7J51J41k01K3J2l13L28k50OK17j72Q6L2K96k77j42k67L32K1l62
6759c14O08j08n31M39j05J26m7j55q6J16N4R8k37M52n93M9Q1L84j17J03l53j34
6781b70k49J72M75L2J39k43l99J60K01J69M85m21o51J45q3L62L51j08J33o92j14
6802d06J49J61O88j83m79l06J94nL00J95K32o53N7J31j02L25rk73m15O5L34P7
6824G7m8K97k98j97j87Q0K63m2J54m29M3N1j8K29q5k7P9j27J24j11J88k63O5J91
6848Ij97M49%m60J47N6J32K9j3l13k06M24j19K14J36j27p8k32L13M4M5J24m05
6871b8j44K8R8M88r2j19m0m61O9L05K85k12p4k22j86M4M91J25N1l43n42O5L87
$$ plain form
6714 463 353 80 -80 -224 -59 47 332 240 275 -192 -301 -177 -34 511 320 -241 -427 -351 238 19 95
6735 95 95 -160 52 25 176 317 116 139 151 -162 166 -84 -78 139 -33 53 85 381 104 -38 -305 27 48 -314
6759 -314 294 186 -345 94 -11 115 68 -87 -173 -57 -3 95 -142 310 -283 -234 -153 231 114 217 -136 -270
6781 -270 -519 -347 128 160 299 56 -343 -183 18 187 672 251 -400 -255 -338 24 375 267 400 -292 -406
6802 -406 -257 -96 592 409 -70 -376 -182 -187 113 308 540 -113 -56 75 -27 298 289 16 -399 -334 0 77
6824 77 29 326 28 -169 -356 -276 -13 -55 99 -330 -287 -236 -254 -25 -110 -137 -58 -185 -61 -172 16 -247 -182 9
6848 9 -188 261 261 -199 -52 4 136 165 152 -161 -367 57 -62 152 288 161 83 -149 164 208 253 377 -28
6871 -28 -172 -144 -46 442 350 231 191 -270 -201 104 389 177 103 -119 -305 -261 230 355 406 63 -479 -414 -27
6894b7L20J84m25k51l37K54J55M64j63k07l90K33k17L04K51n2J48k76m77L55K34
6915H0J0k85n7nl7K44K93J77l29k58L35k31Q2K41m3k12k62J46L01Rk93L8J25j08
6939c9K01Ol00r1Q6Q9J15K59k54J5n46M91K80l24K21j66q8j46L1K89m3mj75j65
6963b58Q7j5L20K5j12l51kk27O37K2R9n55n2J26J14N26j52j25k94j46Q2l0L18
6986C7J96q0m48Q7J14L2L00J9j95l94nJ5N99O9k2n75qR1J67K75l4j41j9j46J11
7011D5NL09j33m11j07J54j03N67j76j51J38kl51L09M8K3O6j82r1K42l44M41k29
7034F7q6J27k60J84j66J60L2j92L5J93k67K4K3K3N1J58Kk57j94j4L28o2L70j71
7058A08k40J1L13l06L20l5J84k30l40M7ML56J51l3l35l51n1K22L08L76n27k73
$$ plain form
6894 -27 293 477 52 -199 -536 -282 -127 337 174 -33 -423 -190 -407 -103 148 96 244 -32 -509 -154 80
6915 80 90 -195 -252 -257 -294 -50 243 420 91 -167 168 -63 19 260 217 5 -257 -111 190 199 -94 -56 69 -39
6939 -39 162 168 -132 -223 -137 -48 67 326 72 87 -459 32 312 -12 209 43 -45 -191 -160 129 86 82 -93 -258
6963 -258 -171 -186 134 159 47 -304 -306 -533 104 126 225 -330 -382 -256 -142 384 232 107 -187 -333 -251 -281 37
6986 37 233 153 -295 -208 -94 -62 238 257 62 -332 -337 -322 277 346 324 -251 -259 -168 -1 274 240 99 80 -66 45
7011 45 50 359 226 -185 -292 -138 -241 326 150 -1 137 135 -216 93 141 164 230 48 -43 199 -145 296 67
7034 67 -19 108 -152 32 -134 26 58 -134 -99 94 -173 -149 -126 -103 -52 106 108 -149 -343 -357 -29 -91 279 108
7058 108 -132 -121 192 -114 206 171 355 125 -215 -168 -164 192 343 310 -25 -376 -427 -205 103 479 -48 -321
7080c21K45J01j4M82l24m49J01K68j25L02j53j06k58N1j44K51J81o2k70j0k78
7101e32N80MO0K61m60L0K63l22O42m58j6J19j43j03K77k91K31l01k2K53jn9M5
7124E7J23k74J32M7j29L7J06j75J63K87l14j75j36O01l56K36L8k12k12j17L75
7145A02k4K81k90J20k38l56n0N85r2M1n3j98k57M01K08K22l20P7m83j31M78K64
7167B87k52J95M0m13l97N65K98p0j03k42j25R7K61j34k46K35k31r6L6M08J82K3
7189C18l41k96p2L25L48j34J74o31N6J79J85r3K69m35r4%J29K1L16l83L30m36
7211b65L52l30N8K89j40P7j57M3J42o2P4K6j07J01OJ70l29K96j88Q8k5L7j9k72
7235a35J66k3L36j65o3k50N2R0j84M87j91j70o2r6K06M62l53N7j57k85J14J91
$$ plain form
7080 -321 -76 25 11 493 169 -280 -179 89 -36 266 113 7 -251 -200 -344 -93 88 26 -244 -254 -532
7101 -532 48 52 112 373 -87 -57 206 -116 526 68 52 171 28 -75 202 -89 142 -159 -181 72 71 12 57
7124 57 180 -94 38 85 -44 -7 99 -76 87 374 60 -115 -251 350 -6 230 268 56 -156 -273 102
7145 102 78 359 69 189 -49 -405 -455 130 38 79 26 -172 -429 -28 180 402 82 159 -324 -455 23 287
7167 287 35 230 270 -143 -540 25 323 253 150 -92 -217 -120 141 7 -239 -4 -235 -331 -295 113 295 318
7189 318 -23 -319 -391 -66 282 148 322 -309 -253 -74 111 18 287 -148 -242 -242 -113 -92 224 -159 171 -265
7211 -265 87 -243 -185 104 -36 41 -116 -73 69 7 81 107 0 101 107 277 -52 244 56 144 119 156 137 -135
7235 -135 31 8 344 179 116 -134 -82 8 -176 311 120 -50 -112 -208 -2 460 107 164 7 -278 -164 27
7257B7J67J17k10o44J43J83N45q6p9j15l78nJ03J08K05j37Pk39K54n7J20K25j17
7280A37k76Q8k90N72k68K06N0m88P1k4M05K05j91m19K49n26O38m9M1k41j8K42
7302A14J00l73L10rk67J55nn2Q0k5j92k14M90j67k85j3L76r2P3n8Q2M5j93J50
7326C0j26J58m1L23n10m4K39k01L81k18R5j89l53L86K88j78J01J22p64L38LJ37
7348b3J42J29k86j94Q1l3N25j88q3k36p3L46K03k98K65l63j69o9L83q4K42K18
7370D35n02J02j72J65kP0J11m32j31R2K65J00P8j01m50K67k11N51l8j43k55K13
7392A2j15k8M05j56n9k71M48k12j64K50r1N0j30j85L52k7J18k8K37m15M9K7K74
7415C41o07L18j84P7J21k9j27j75N48l32K3O1L7k20m33O26k33K16j80L6j40O0
$$ plain form
7257 27 194 311 101 -543 -400 -217 328 242 163 48 -330 -335 -232 -124 81 -56 -49 -288 -34 -91 29 254 137
7280 137 -139 -51 -341 231 -37 169 219 -269 -198 -222 183 388 197 -222 27 -499 139 90 131 -110 -128 114
7302 114 214 -159 151 142 -125 30 25 -27 53 28 -164 -378 112 -55 -340 -353 23 -69 4 -54 28 73 -120 30
7326 30 -96 62 21 344 -166 -210 29 -172 209 -9 86 -103 -456 -70 218 40 141 263 -501 -163 -160 -23
7348 -23 119 248 -38 -232 -151 -184 341 153 70 -166 -239 107 310 12 277 -86 -255 -324 59 -25 217 435
7370 435 -67 35 -137 28 26 96 207 -225 -356 -264 1 101 179 78 -372 -105 -316 235 197 54 -201 12
7392 12 -103 -131 274 118 59 -212 236 24 -140 110 19 69 -61 -246 106 79 197 169 406 -9 40 67 341
7415 341 -266 52 -132 -55 66 37 -90 -265 283 -49 -26 35 72 -148 -581 45 -188 28 -152 -116 -256 -196
7437a96J13k81N81m70L23m30J92p0J42K78Mn01J13M0K90J02r8k50j32J92J54j56
7459f0K83J92k33j62j32N0K97n8R2Q4n09J30K07L82p59L54p9p6M4j09K14j2P6
7482B16k21k26p8K93J2O5k51K0P5K37j01K59n82J95N5O1j13K41j76L60n17K71
7504I5k38O1K15l76J12n9O3p8K17j30K30j71j09J02N0J63j61R8q7K31k0l21j70
7527b83J59K45k28J02jR2k87K65OL41k40k18J20j98j96K71L6N90p73K56j70j32
7549b43L34J99m73K58j41k6J68jL36j78j99k32J63%L86j49j66k43J73k72J90J61
7571D5o4o2m9j8J40J58j93p8m1O9K43J71k43L6j94k55L97l1M02k87j66J5r8K25
7595A22q7j44J33J20k60j55L80J3j82l9j11M48l40L18k97K06r1J05lp0p2J11k13
$$ plain form
7437 -196 -83 -364 217 -253 70 -360 -168 -238 -96 182 186 -315 -202 -162 128 230 132 -118 -250 -58 96 -60
7459 -60 223 415 182 20 -112 -62 235 177 269 353 -156 -26 181 563 -196 158 79 3 47 -62 152 140 216
7482 216 -5 -231 -309 -16 -4 61 -190 -170 -95 142 41 300 -282 -87 -32 29 -84 157 -19 341 -176 95
7504 95 -143 -82 133 -243 -131 -190 -127 -205 12 -118 112 -59 -168 -66 -16 147 -14 84 -3 228 208 -113 -283
7527 -283 -124 121 -107 -5 -6 86 -201 64 70 411 171 -47 73 -125 -321 -50 -14 576 -197 59 -111 -243
7549 -243 91 290 -183 75 -66 -92 76 75 411 233 34 -198 -35 -35 351 202 36 -207 -34 -306 -116 45
7571 45 -19 -81 -130 -148 -8 150 -43 -121 -162 -93 150 321 78 114 -80 -335 62 31 433 146 -20 -5 -103 122
7595 122 35 -109 24 144 -116 -271 109 122 -60 -99 -210 238 -102 216 -81 125 34 139 136 66 -6 105 -108
7618a08r2J29M72K9k28j79n1j70J57J48j55K28k55o7n4N51k91J50k48o8j92J73
7640a21R4J89k7m09J49K76o3L18J35l99l18L8q5K69K5k06J36m5l7Q4L67l12p8
7663b0J6j42J13pN44l15J0r9J67m16J06K51j02l22J09J19k61L01rj49J96n7k66
7686b33L16L8j27O6j17J87J44k25k6m3p9O0M99m22j81J03l26L15k10M51k38j35
7708a83k25J45o2j83P61m99K49k19R1L28K81l78k90m7K12J29J75j68k58J22l86
7729d05J60K2L73j2k88J74l14K80L03J00j22k22j77p8L49OM3j60Qj28N3J01M9
7752A15l12K33o1j4M5Q9N6k16j30J27nJ98J09r0j39q4N6p1M41m27P1R8k99j06
7776c16J74L48k1k77K17Mj18Q5J6N7p1J53n49K65J92q1m8r7k0K77m34K92j97n3
$$ plain form
7618 -108 -200 -71 401 430 202 23 -28 -198 -41 107 -48 180 -75 -142 -196 355 64 214 -34 -102 -294 -121
7640 -121 -27 162 135 -274 -125 151 88 406 541 142 -176 -138 -223 46 71 -135 1 -44 -81 3 370 58 -20
7663 -20 -4 -146 -33 -40 504 189 199 100 267 -149 -43 208 106 -216 -107 12 -249 52 43 -106 90 33 -233
7686 -233 83 121 -6 60 -57 130 274 49 23 -20 -99 -39 460 38 -143 -40 -366 -51 -261 190 -48 -183
7708 -183 -408 -263 -325 -508 253 -246 3 -216 -125 203 484 106 -184 -231 -19 110 285 117 -141 -19 -405
7729 -405 -245 -223 150 138 -150 24 -290 -10 293 393 271 49 -128 -206 143 149 192 32 40 -88 -35 66 115
7752 115 -197 36 -25 -39 6 95 151 -65 -195 -68 -73 125 234 144 5 -79 -23 -94 347 -80 -9 89 -210 -316
7776 -316 -142 206 185 -92 125 129 11 96 112 169 98 251 -298 -33 159 78 30 -67 -87 190 -244 48 -149 -202
7800b02K54p6K28l4j54k81K48n6kK36k53rj10J34L42k74J93k27m5j47J29K59o9
7823H4K8j95J02k83M00k5j47L07l30p1o3K26%K7j7k39K52j33k2L56l08m0K7M8
7847a6n0pp1M2L7N3j73K63J75j60j05j02O1NK29j59M1j7m41L22K19l87L06j25
7871f0J39k39J74P3Nj77j57K72Q3o7J83l22k3k3K61j39j03L45l40j92N20j38j97
7894a22K11j29l29L91J92l04O9N0j42k53K04J31K31k69Q4j88J08J36R5K1j27K47
7916C07q14K97L39J34J59m75J56j29r3L56m44L45K0n46K36K38L9J07k78o8O1L8
7938a5J36O4j35J7j24l85N41K52j42M0l78PK54k16j84K44RK66j76j12k68P01m16
7961b0j82K28J71m21K89O8k85J87m3J04j37j23J61J48k22jK14j83J21k55L1j05
$$ plain form
7800 -202 52 -24 204 170 16 -265 -17 -73 -75 161 -92 -101 -211 -77 265 -9 184 -43 -88 -235 -106 153 84
7823 84 112 -83 19 -264 136 111 -36 271 -59 -130 -193 33 33 60 43 -196 56 -77 -99 257 -51 -91 -64 -16
7847 -16 -66 -73 -144 -102 -65 -12 -185 78 253 93 -12 -114 -53 -48 181 22 63 46 -395 -73 146 -241 65 -60
7871 -60 79 -160 14 87 92 -85 -242 30 113 46 229 -93 -116 -139 122 -17 -120 225 -115 -307 213 75 -122
7894 -122 89 -40 -369 22 214 -90 -21 29 -113 -366 -162 -31 200 -69 15 -173 -65 71 166 187 60 307
7916 307 -507 -210 129 263 422 -53 103 -26 -119 237 -207 138 158 -388 -152 86 125 232 -46 -114 -53 -15
7938 -15 121 185 50 67 -57 -442 99 351 209 249 -129 -122 132 -84 -268 -24 -15 251 75 -37 -305 396 -20
7961 -20 -202 26 197 -224 65 133 -152 35 -8 96 -41 -164 -3 145 -77 -78 136 -47 74 -181 -150 -255
7983b55L97l27J25l2J23q1R0J71n1k65j18O2J06p7K83k76K9J54j92J75jRn1l74
8007c76L72N1J24k52M2O8K5r0K9J44j83K17n97N91k64J50J21p8j30J09l16J28
8029a15J34j26J67J3n49M53k53J97K10j87l1m1j42J51M73j71J0l71M5J86k45L14
8051A22M9k00J45l30L39K14m17R1N3p5J5J03j1l43L05k61O6L41j34j29M51p52
8073c58L83J70pk36j37J13r4O2J1R2K5L2l25L65k6K6p0k26J03KJ81K87m01l4k03
8098b65p0K08P8J48J18j73k7j95J38K26j17k05k42L53%J58j73J50k24m2K38k23
8120a41L46K57l13R8j10j16K18j75lm4q8J76Q9j48J63k8j15j90L9J12k79L94j49
8143gn6O8K00m06n2K41J80k04r0L49k00M2J34j81M1k29l4J98J29k0j51l0R5j07
$$ plain form
7983 -255 142 -185 -60 -92 31 -50 40 211 160 -105 -223 -161 -55 -132 151 -125 -96 58 -134 41 40 49 -2 -376
8007 -376 -4 47 171 -81 -39 29 54 -36 -7 137 -46 171 -426 165 -99 51 172 94 -36 73 -243 -115
8029 -115 19 -107 60 73 -476 -23 -276 -79 131 -56 -87 -128 -270 -119 354 183 193 -178 -133 53 -192 122
8051 122 171 -29 116 -214 125 339 -78 13 66 -9 6 109 98 -245 60 -201 -135 206 72 -57 394 -358
8073 -358 25 195 188 -48 -185 -72 -166 -104 -93 -1 24 56 -269 96 70 96 26 -200 -97 -95 86 373 -28 -62 -265
8098 -265 -335 -127 -49 99 217 44 17 -178 -40 186 69 -136 -378 -25 -25 133 -40 110 -114 -156 82 -141
8120 -141 205 462 149 247 137 21 239 64 61 17 -71 105 194 46 209 181 66 -124 -85 27 -252 142 -7
8143 -7 -63 5 205 -201 -253 -12 168 -36 -126 223 23 65 199 18 59 -170 -204 -6 123 103 -48 -78 17 -90
8167i0L34n4j20J6j18P7j63M2j29L0j21M48j52K0K35l88O7K44q7J39k91j34j3
8190b08L20
$$ plain form
8167 -90 244 190 70 86 -32 45 -118 -76 -205 -175 -296 152 0 20 255 -133 -66 178 91 230 -61 -195 -208
8190 -208 112
8191A12
$$ Imaginary data points
##PAGE= N=2
##DATA TABLE= (X++(I..I)), XYDATA
0@%%%Qj6QqJ6j6K4l2M0n4O2p1Q7j04J21j43J70k00K33k68L09l54M04m61N21n90
29c14O69p53Q44r46J056j179J314j457J619j798J990k202K439k702K993l316L679
46A936m090M560n103N729o469P369q479R883j1729J4276j8031K4119l5611O4620
60D2980k63713n63397N68879N07578j53623j64757K01073j28650l90545J12097
70b32078N30215Q8315l15818j22772P1723o6243k9829J59602J16756n2134o8278
81G9459j15960j56291P2712L07631J02175j96624j34375N107m6213N0215K62593
92B30429R1198k83534k03417J39807J42176l2903N97r23j44576m6063J87231L1130
104A11152k36313l6547K26759M871j88107P5212J57269j88843j68626K94310K56328
$$ plain form
0 0 0 0 0 8 -8 0 -8 8 -8 16 -16 24 -30 32 -39 48 -56 65 -78 92 -108 125 -143 166 -188 216 -245 276 -314
29 -314 355 -398 446 -500 556 -623 691 -766 853 -945 1045 -1157 1282 -1420 1573 -1743 1936
46 1936 -2154 2406 -2697 3032 -3437 3932 -4547 5336 -6393 7883 -10148 13971 -21640 42980
60 42980 -220733 -784130 -215251 292327 138704 -26053 175020 46370 -344175 -232078
70 -232078 298137 386452 70634 -52138 19585 -46658 -76487 83115 199871 147737 79459
81 79459 -36501 -192792 -120080 187551 289726 93102 -41273 -36166 -82379 -32164 230429
92 230429 321627 38093 -165324 -25517 116659 83756 84353 83430 -61146 -107209 80022 111152
104 111152 -125161 -161708 65051 69922 -118185 -42973 114296 -74547 -243173 51137 307465
115C07465k55538k28632K37602J74471k23128q7927K76156J12283k13234r2912
125F606J00778k3767o7570J46898J58003j13779k25826q7922O2548J86904K04672
136C47545n2381l06697j49244J51224J41471L5188J00338J9063k68624k12338
146a94455J95090K67817m3400j12558M6002n7513k23560j1589K46935J14467r7480
157A29756q0917r0748j68270J5857K85045J63089j55724j86406n0195k8455O4669
168a02299K52511J37278k18550k46289N6397J53991K4218K8434P4906p4391j72823
179h6617j0538J16815L2983j5024L3583k4465j13467l5249O2747K8560K2265O9551
191H1144l6134j64612k2587J74123O5289j11493k0501Q2673m3111q7782Q6441
$$ plain form
115 307465 51927 -176705 60897 235368 12240 -75687 200469 312752 99518 6606
125 6606 107384 83617 16047 162945 320948 207169 -18657 -106579 -44031 142873 347545
136 347545 295164 -11533 -160777 -9553 131918 167106 267444 286507 17883 -194455
146 -194455 635 268452 225052 112494 158496 100983 -122577 -134166 112769 227236 129756
157 129756 48839 -41909 -210179 -194322 90723 253812 98088 -88318 -138513 -166968 -102299
168 -102299 150212 287490 68940 -177349 -120952 33039 57257 85691 160597 86206 -86617
179 -86617 -97155 19660 52643 37619 71202 46737 -66730 -101979 -39232 -10672 11593 81144
191 81144 45010 -119602 -142189 31934 97223 -14270 -34771 47902 4791 -82991 3450
202C450R4936j16883j07647J23514J13656j10228j22937L3592M1245j4307N3828
213g781O3603r1825j38109J9255J10892N0797J6396O095p5595r7145K9328J11023
225c066N2236Q128Q145o9030j27923r262J39516J10754m027o3105j08989j18365
237a84988K2039J82807J30706n3437j34279j07021m9866P5480J93801J03485j15107
248F3620j65316m1601L5254O1678J24195R2811r4854j85500m5734Q9338P5385
259I276N3031N4109n3826j69976q1470J04104J32272L4842k1688n9467j07648
270a06441m7418J02905J35365J6341o9790n6479l3400o94O8948Q3853l075o5902
282B4213l3826N505O119J9358L5118J414l6873j8882R125j348o439J0807R396
$$ plain form
202 3450 98386 -18497 -126144 -2630 111026 798 -122139 -88547 -47302 -61609 -7781
213 -7781 55822 -36003 -174112 -154857 -43965 6832 23228 29323 -46272 -143417 -114089 -3066
225 -3066 49170 57298 65443 -3587 -131510 -140772 -1256 109498 105471 42366 -66623 -184988
237 -184988 -162949 19858 150564 97127 -37152 -144173 -194039 -118559 75242 178727 63620
248 63620 -101696 -143297 -108043 -46365 77830 170641 75787 -109713 -155447 -66109 9276
259 9276 62307 116416 62590 -107386 -188856 -84752 47520 82362 60674 1207 -106441
270 -106441 -153859 -50954 84411 100752 30962 -25517 -58917 -59611 9337 93190 90115 24213
282 24213 -9613 -4108 2011 21369 56487 57901 21028 2146 11271 9923 3484 14291 23687
295B3687q313K36J0983j1734k6145j560K1359K0043K0633R012l8008o0296n721
308d5824N6822N2959J3519k2191o2740p1843K412R2161Q1295q537o9367p4967
320e6301m7548K5130J08355R3554k4731j09793q3254o743O0290J04895P9235l5877
332A07212j32165r4354K6680J03947R6739L3390o0402j25639q1251M6265J26311
343D6733Q6876j2260q7664j02940m5395N7512J19908P4177l7453j05599q4003
354i0108m135P2485R5588M5969m7867j02275o7292K4064Q4901O9890M858n6216
366B9862p5286l6945L2923P3563M4588k0687n5018l9361n764K4950M0759K5032
378C8616j7690l9818j8933J1106J6027Q359O318o34j2253p916Q585O497j1059
$$ plain form
295 23687 15374 15610 26593 14859 -11286 -12846 8513 28556 49189 58201 20193 -40103 -45824
308 -45824 10998 63957 77476 55285 -7455 -79298 -76886 15275 96570 88033 18666 -56301
320 -56301 -103849 -78719 29636 123190 98459 -11334 -94588 -101331 -41041 63854 143089 107212
332 107212 -24953 -119307 -92627 11320 108059 141449 81047 -44592 -125843 -79578 46733
343 46733 133609 121349 33685 -69255 -114650 -57138 62770 136947 99494 -6105 -90108
354 -90108 -94243 -21758 73830 119799 71932 -30343 -97635 -73571 11330 81220 86078 29862
366 29862 -45424 -82369 -49446 24117 68705 48018 -7000 -46361 -52125 -27175 13584 38616
378 38616 20926 -18892 -37825 -26719 -10692 -2333 3985 3351 -8902 -16818 -8233 -1736 -12795
391a2795r169J4637K3634N962j1996j9076k1377m327L2971M7720J1006m1778n4368
404c8956k1254K3854N3543M7562k910o3871p3712j3870N6666P5633L4055l0784
416D5956p5965o7679K77P6528R0059K3447o1629r3338n1373K8586Q8068Q2536
428H5473N002q5830j04986l2123O3006R6110N4457k4624r0197r3370j3223Q4727
440e5578J02194K8314n4357q4050n9382Q813Q5016R6509J4323p5305q2827k5077
452a01407L4989P2689O7724j878q1536p6309J933N5596M9890K2902j4471n6895
464b6773n3534J0068N4597L3095m679j4747k2160k5972L737L6849K4349q400j2069
477e639k962q806m617J4749J1961j0621q395R218L468j2635j2141q289n749J5642
$$ plain form
391 -12795 -21964 -7327 16307 22269 10273 -8803 -30180 -34507 -1536 46184 57190 15412 -38956
404 -38956 -60210 -36356 17187 64749 61839 -2032 -75744 -89614 -32948 42685 76740 45956
416 45956 -30009 -97688 -97411 -20883 69176 92623 30994 -62344 -113717 -85131 2937 85473
428 85473 90475 4645 -100341 -132464 -69458 26652 81109 56485 -33712 -127082 -140305 -55578
440 -55578 46616 74930 20573 -63477 -122859 -114046 -29030 67479 81802 6497 -76330 -101407
452 -101407 -66418 6271 73995 72117 -9419 -85728 -83795 -28199 21691 44593 30122 -26773
464 -26773 -80307 -70239 -15642 17453 12774 -1973 -24133 -50105 -46368 -9519 14830 6430 -5639
477 -5639 -8601 -17407 -22024 -7275 4686 -5935 -14330 -5112 -1644 -14279 -26420 -34709 -40458 -24816
491b4816L3044M473l9260l6972j222K4939M2718M1910j0981o9485m6452L1752
503e0352O2819L9436J3506k4205p1903m9295M3984Q2590L0579k0102l4862n9065
515c6870n1825L4950J01308M7383m2461o2804n1610l0820M6799J19762N7588p6196
527E5204j01891k7331K6293N8401Q8657L6484q8130j15507n489P3969N3118K4067
539G7845M049n6146q6779j3128O7339N5152J0815q765m0621o4485j0565O6467
551A178O0631J0600j4277m0456n8896M180Q9497N9360l7405m8473o086j0339o456
564C058M8127M1763m6939n9604K1405L4648k7248k1035K7284M606k6765J2558
576A1858K4734l4839l5911M0008M2946k2646j5334K5325j4370m7424J9581N8589
$$ plain form
491 -24816 8228 12701 -26559 -63531 -64753 -39814 2904 44814 33833 -35652 -82104 -50352
503 -50352 12467 51903 65409 41204 -30699 -79994 -36010 46580 77159 57057 22195 -36870
515 -36870 -88695 -53745 47563 94946 52485 -10319 -61929 -92749 -45950 73812 131400 55204
527 55204 -46687 -74018 -47725 10676 99333 135817 47687 -67820 -73309 660 53778 77845
539 77845 81894 25748 -61031 -74159 -6820 48332 59147 50382 9761 -54724 -65289 1178
551 1178 61809 72409 58132 17676 -41220 -37040 52457 111817 74412 25939 19853 9514 3058
564 3058 51185 92948 46009 -13595 7810 42458 15210 -5825 21459 26065 -700 11858
576 11858 36592 1753 -34158 5850 48796 26150 10816 36141 21771 -25653 -6072 52517
588E2517p831l6253J8082N455o5629k7963P2625N8077k8721m3361k6794l7711
600f7507N097R1991O9657m5449p9900k7319M663M1459R7949M8354q7857r8041
612d6903K2170N6164N430L1618O1295m6409j27448k0008Q9471L7389j5980K4169
624G0958m246j07236p2630P9901J09696R659m3990m7121o4869j9973Q8628R5530
636I4307j4564p1352m3607k6711N549P7970O4225n3564q3697L036K2896k4354
648d9866J1106O5783m263p7457j8584L8401n782p102O1305K8429p0951l9835N6106
661a2710L2394k0292K7264L6286n6508m8669P6130O2149p3264n4474P0155M1134
673G9595o2795j6773N2475k8223p3709M5810R9668k7821r8996r648M4828P808
$$ plain form
588 52517 44686 8433 26515 31970 -33659 -61622 11003 69080 40359 -3002 -29796 -67507
600 -67507 -62410 29581 99238 53789 -26111 -53430 -48767 -7308 90641 138995 51138 -46903
612 -46903 -24733 31431 36861 68479 129774 83365 -44083 -64091 25380 62769 46789 70958
624 70958 66712 -40524 -113154 -33253 76443 86102 42112 -5009 -69878 -89851 -1223 94307
636 94307 79743 8391 -35216 -61927 -56378 21592 85817 32253 -51444 -48408 -25512 -49866
648 -49866 -38760 27023 22760 -54697 -73281 -34880 -40662 -47764 13541 41970 -28981 -68816 -12710
661 -12710 19684 -608 26656 62942 6434 -42235 33895 96044 22780 -31694 38461 79595
673 79595 16800 27 52502 24279 -49430 -3620 96048 68227 -30769 -40417 4411 12219
685A2219R864L7564j1666n9355k0132K3049J7958K8452K9727l4047o9190q596
697d4153K7884l288J9525O5088j9265j30671n3307R0600P2480j0604J805p553
709H541r5087o1050J07438J28153k1698p5739j2017j6642l1901O6497J14609j3852
721I7252j02009j8995L1281k3239O393R6648L3241j04095p3933L8731L3156k992
733A1439M7334M3289p1912r6888K1354Q3146L1481l282j0475m8044m2380L4876
745f2N7446j876j9936m12k9587l7945L1588M9411l4171m6901L4402K4663o1224
758c4604k8210O3715K0529o0188l518N8245j4070n7951K7464N5651k9788l5227
770c7952M9580L3615n1735l0415L7473J2556j5913L1601K6382o1818o2309L7898
$$ plain form
685 12219 22083 59647 47981 -11374 -31506 -8457 9501 37953 67680 33633 -35557 -44153
697 -44153 -16269 -19557 -32 65056 45791 -84880 -138187 -47587 24893 14289 16094 8541
709 8541 -86546 -147596 -40158 87995 66297 -9442 -21459 -38101 -70002 -3505 111104 97252
721 97252 -4757 -23752 7529 -15710 -9317 87331 120572 16477 -57456 -18725 14431 11439
733 11439 58773 102062 30150 -66738 -45384 37762 69243 65961 55486 7442 -34938 -62
745 -62 57384 55508 35572 35160 5573 -32372 -784 48627 14456 -32445 1957 26620 -34604
758 -34604 -62814 901 21430 -38758 -42276 15969 1899 -56052 -28588 27063 -2725 -37952
770 -37952 11628 45243 -6492 -36907 566 13122 -2791 28810 55192 -6626 -68935 -31037
782c1037O0405J112q021N14n0245n4385M4144Q6687Q359m3612j9969k1291l1006
795e8345L5998Q1750J2300n6828l2476j0633k2841K3381Q3954K2673p8647o3018
807f2732N216P961J6026O7236L2204q3950r2119K0101O4553K3455J8735J6868
819C3554n3872p9824J5874Q4996L3612j7685q367k5891n1968M136P0388L5455
831D0408k8574k5329j4446l1561j851N7465L5762l4077l5779q15p043l854M0857
844h837L4053l2285m0278J4423J9707j1766P162K9481j3118l6870J2825L1340
856E837j9013k6674K0974J9063k3197p390K4187j0362l9422P831M3209N382k1293
869b0868J115l587k8717M312N2529K5842k7759k5801p056j0441J0858N1254K9979
$$ plain form
782 -31037 29368 30480 22459 22973 -27272 -81657 -37513 49174 57533 13921 -6048 -27339 -58345
795 -58345 -22347 59403 71703 14875 -17601 -28234 -51075 -27694 56260 78933 286 -62732
807 -62732 -57516 -49555 -33529 33707 65911 -18039 -110158 -90057 -25504 -2049 16686 33554
819 33554 -20318 -100142 -84268 728 34340 16655 8288 -17603 -69571 -65435 4953 40408
831 40408 11834 -13495 -27941 -59502 -61353 -3888 31874 -2203 -37982 -38797 -45840 -49694 -8837
844 -8837 25216 -7069 -47347 -32924 -13217 -24983 -17821 11660 -1458 -38328 -25503 5837
856 5837 -13176 -39850 -18876 187 -23010 -30400 -6213 -16575 -55997 -48166 -4957 425 -20868
869 -20868 -19753 -23340 -52057 -47745 4784 30626 2867 -22934 -29990 -40431 -29573 21681 51660
882E1660l6405m9828r324J0582J9731M1360K4554m1110o2813j1327L2098L3881
894C059L0407J1272m2210o4133p849N0329M6313J7887q874m4518n6426R38O2838
907i67M9454m456l0150l8210l6723O592O0568M5206j9468m4217k5442j1289Q346
920d0756M4441M1250j6839m8825k1052P551J5125K9398L0975j1864m6931k1674
932c9201K0798K5302J3199Q712j0008l2125j4491K3302K3564l487r458j130o939
945a962o508R011R293q061o781R614Q551p736q008r71j865J595J4017J1098j0045
960A1242j8069p226K367Q017J7085J2530j1401k6593j6406L787K0183K8698J3213
973C7427k4333m3552j6445K2710L6859K6454o87l6344m7399p960M3127M7373J0892
$$ plain form
882 51660 15255 -34573 -43897 -33315 -13584 27776 52330 11220 -51593 -62920 -30822 3059
894 3059 33466 44738 2528 -61605 -69454 -19125 27188 45075 36201 -8317 -64743 -63805 -967
907 -967 48487 44031 13881 -24329 -61052 -54460 6108 51314 31846 -12371 -37813 -49102 -40756
920 -40756 3685 44935 28096 -20729 -41781 -34230 -19105 10293 41268 29404 -17527 -39201
932 -39201 -18403 6899 20098 28810 18802 -13323 -27814 -4512 19052 15565 6107 4977 -1962
945 -1962 -8470 541 9834 1773 -5008 4606 13157 5421 -2587 -3558 -5423 -3828 10189 21287 11242
960 11242 -6827 -14053 -11686 -3669 13416 25946 14545 -12048 -28454 -24667 -4484 24214 37427
973 37427 13094 -30458 -46903 -24193 12666 39120 38433 2089 -45310 -53270 -10143 37230 48122
986D8122k3362l7556l0652J840M2468M5482N020l4272l8702j9245J1188L9655
998I986M0150J622l9603m3168j3174K3357M3721L2563j0959m8152l9990L526L7049
1011c072L7690J2559k1880m1222k5794J4547L9027K5648n659k5343k4023p455
1023b4977J2723K3224J6258m345j9951j9377l407J3313J6211O304n725j2978j1701
1036a4428j795J1577J2674p44j0702m664M329M534l7k174l012O84Q871R780k514
1051A2379j5255j1667M330J5643J5516K920j5606k5015j0343J5926K5443J2142
1063B6413o849k1466k4446p171K1654L3536J3376j5950k9598k2131N86K8097L6992
1076C3043J2857k6026m1422k1918J5104L9634L1804k999l7175m1226j1897K5898
$$ plain form
986 48122 24760 -12796 -43448 -41608 860 46342 51362 17090 -21612 -40857 -29669 9986
998 9986 50136 51758 12155 -31013 -44187 -20830 22891 55454 44495 -3657 -43647 -40121 -3072
1011 -3072 34618 47177 25297 -15925 -41719 -27172 11855 37503 31844 6501 -17522 -24977
1023 -24977 -12254 10970 27228 22883 2932 -16445 -19852 -6539 9672 15976 10251 -2727 -14428
1036 -14428 -16223 -4646 8028 7284 -3418 -8082 -3753 781 744 -1430 -4442 -3758 5113 14893 12379
1051 12379 -2876 -14543 -10213 5430 20946 23866 8260 -16755 -27098 -11172 14271 26413
1063 26413 19564 -1902 -26348 -33519 -11865 21671 35047 19097 -10501 -32632 -32046 -3949 33043
1076 33043 45900 19874 -21548 -43466 -28362 11272 43076 40077 2902 -38324 -50221 -24323
1088b4323M2374K3450j6165m2859l2391L315L3033L7255J4297k1148m0252k4061
1100d7475J4041L6554K9808M894k4438l7782j7207K1912L7792J8069j0712k5967
1112e11k5762q026K0797L2547R149j9460k2594r792K957J4286K0794O212j5181
1125E416j6237j6P151P499R012M208r424j0881K956P296j655k822K174j016m166
1140e05K928K941j0174j1784N861J5244N749l836p762j2986p386J5011K5810P968
1154B7079j3397j7585j2377J25K1386K8279K873k4347k3977r034M552K2057K9541
1167C5175J790l5732l4180k165J9610K6150K4477l092m0954l7810Q241L8824K9743
1180C0077Q728j4213l8114l0384J6982M5835K2422j0324k1112k6434k2381J3141
$$ plain form
1088 -24323 18051 41501 25336 -17523 -49914 -46599 -13566 23689 37986 16838 -23414 -47475
1100 -47475 -33434 3120 32928 37822 13384 -24398 -41605 -19693 18099 36168 25456 -511
1112 -511 -26273 -34299 -13502 19045 28194 8734 -13860 -23652 -20695 -6409 14385 20597 5416
1125 5416 -10821 -10837 -3686 3813 12825 17033 7609 -3272 -316 6980 5325 2503 4677 3661 -505
1140 -505 2423 5364 -4810 -16594 -10733 4511 10260 6424 -1338 -14324 -21710 -6699 19111 27079
1154 27079 13682 -3903 -16280 -16155 5231 33510 36383 12036 -11941 -20975 -16423 5634 35175
1167 35175 36965 1233 -32947 -35112 -15502 10648 35125 32033 -8921 -46731 -38490 334 30077
1180 30077 38805 24592 -13522 -43906 -26924 18911 41333 31009 9897 -16537 -38918 -25777
1192b5777M3788K0601k0763k7089j5118j0624Q856L8529K6488k0993l6819j0044
$$ plain form
1192 -25777 18011 38612 17849 -9240 -24358 -34982 -26126 12403 38891 17898 -18921 -28965
$$ [...]
8191e
##END NTUPLES=NMR FID
##END=
