##TITLE=1H_SA_38.140'
 CDCl3, 8 sc, 
 22.10.2019
##JCAMPDX= 6.0         $$ Bruker NMR JCAMP-DX V2.0
##DATA TYPE= NMR FID
##DATA CLASS= NTUPLES
##ORIGIN= UXNMR, Bruker Analytische Messtechnik GmbH
##OWNER= root
$$ XWIN-NMR		Version 3.5
$$ Tue Oct 22 16:18:39 2019 Russian Standard Time (UT+4h)  she@DPX200
##.OBSERVE FREQUENCY= 200.1315
##.OBSERVE NUCLEUS= ^1H
##.DELAY= (6, 6)
##.ACQUISITION MODE= SIMULTANEOUS
##.ACQUISITION SCHEME= undefined
##.AVERAGES= 8
##.DIGITISER RES= 18
##SPECTROMETER/DATA SYSTEM= spect
##.PULSE SEQUENCE= zg30
##.SOLVENT NAME= CDCl3
##.SHIFT REFERENCE= (INTERNAL, CDCl3, 0, 15.7039)
##AUDIT TRAIL= $$ (NUMBER, WHEN, WHO, WHERE, WHAT)
$$ ##TITLE= Audit trail, XWIN-NMR		Version 3.5
$$ ##JCAMPDX= 5.01
$$ ##ORIGIN= Bruker BioSpin GmbH
$$ ##OWNER= she
$$ F:/spectra/data/she/nmr/H-F/1/audita.txt
$$ ##AUDIT TRAIL=  $$ (NUMBER, WHEN, WHO, WHERE, WHAT)
(   1,<2019-10-22 16:17:08.75 +0400>,<she>,<DPX200>,
      <created by zg, POWCHK disabled, PULCHK disabled
       configuration hash MD5:
       00 E9 B6 7A A2 85 ED C7 34 08 36 98 17 FE 4E 26
       data hash MD5: 16K
       D6 D3 09 4C 91 B6 EA 92 1B 69 BA F5 E4 47 2C 64>)
$$ ##END=
$$ 
$$ hash MD5
$$ 88 D7 A3 8A 9D 88 53 3C D0 48 73 A8 BC E5 B5 B7
##$RELAX= 
##$RELAX= 
##$RELAX= 
##$RELAX= 
##$RELAX= 
##$RELAX= 
$$ Bruker specific parameters
$$ --------------------------
##$DU= <F:/spectra>
##$EXPNO= 1
##$NAME= <H-F>
##$PROCNO= 1
##$TYPE= <nmr>
##$USER= <she>
##$AMP= (0..31)
100 100 100 100 100 100 100 100 100 100 100 100 100 100 100 100 100 100 
100 100 100 100 100 100 100 100 100 100 100 100 100 100 
##$AQSEQ= 0
##$AQ_mod= 1
##$AUNM= <au_zg>
##$AUTOPOS= <>
##$BF1= 200.13
##$BF2= 200.13
##$BF3= 200.13
##$BF4= 200.13
##$BF5= 200.13
##$BF6= 200.13
##$BF7= 200.13
##$BF8= 200.13
##$BYTORDA= 1
##$CFDGTYP= 0
##$CFRGTYP= 5
##$CHEMSTR= <none>
##$CNST= (0..31)
1 1 145 1 1 1 1 1 1 1 1 1 1 1 1 1 1 1 1 1 1 1 1 1 1 1 1 1 1 1 1 1 
##$CPDPRG= <>
##$CPDPRG1= <>
##$CPDPRG2= <>
##$CPDPRG3= <>
##$CPDPRG4= <mlev>
##$CPDPRG5= <mlev>
##$CPDPRG6= <mlev>
##$CPDPRG7= <mlev>
##$CPDPRG8= <mlev>
##$CPDPRGB= <>
##$CPDPRGT= <>
##$D= (0..31)
0 1.2 0 0 0 0 0 0 0 0.06 0 0.03 0 0 0 0 0.0002 0 0 0 0 0 0 0 0 0 0 0 0 
0 0 0 
##$DATE= 1571746628
##$DBL= (0..7)
120 120 120 120 120 120 120 120 
##$DBP= (0..7)
150 150 150 150 150 150 150 150 
##$DBP07= 0
##$DBPNAM0= <>
##$DBPNAM1= <>
##$DBPNAM2= <>
##$DBPNAM3= <>
##$DBPNAM4= <>
##$DBPNAM5= <>
##$DBPNAM6= <>
##$DBPNAM7= <>
##$DBPOAL= (0..7)
0.5 0.5 0.5 0.5 0.5 0.5 0.5 0.5 
##$DBPOFFS= (0..7)
0 0 0 0 0 0 0 0 
##$DE= 6
##$DECBNUC= <off>
##$DECIM= 24
##$DECNUC= <off>
##$DECSTAT= 4
##$DIGMOD= 1
##$DIGTYP= 9
##$DL= (0..7)
0 120 120 120 120 120 120 120 
##$DP= (0..7)
150 150 150 150 150 150 150 150 
##$DP07= 0
##$DPNAME0= <>
##$DPNAME1= <>
##$DPNAME2= <>
##$DPNAME3= <>
##$DPNAME4= <>
##$DPNAME5= <>
##$DPNAME6= <>
##$DPNAME7= <>
##$DPOAL= (0..7)
0.5 0.5 0.5 0.5 0.5 0.5 0.5 0.5 
##$DPOFFS= (0..7)
0 0 0 0 0 0 0 0 
##$DQDMODE= 0
##$DR= 18
##$DS= 0
##$DSLIST= <SSSSSSSSSSSSSSS>
$$ [...]
##$SUBNAM2= <"">
##$SUBNAM3= <"">
##$SUBNAM4= <"">
##$SUBNAM5= <"">
##$SUBNAM6= <"">
##$SUBNAM7= <"">
##$SUBNAM8= <"">
##$SUBNAM9= <"">
##$SW= 24.0689530833862
##$SWIBOX= (0..15)
0 0 2 0 0 0 0 0 0 0 0 0 0 0 0 0 
##$SW_h= 4816.95568400771
##$TD= 16384
##$TD0= 1
##$TE= 0
##$TE2= 300
##$TE3= 300
##$TEG= 300
##$TL= (0..7)
0 120 120 120 120 120 120 120 
##$TP= (0..7)
150 150 150 150 150 150 150 150 
##$TP07= 0
##$TPNAME0= <>
##$TPNAME1= <>
##$TPNAME2= <>
##$TPNAME3= <>
##$TPNAME4= <>
##$TPNAME5= <>
##$TPNAME6= <>
##$TPNAME7= <>
##$TPOAL= (0..7)
0.5 0.5 0.5 0.5 0.5 0.5 0.5 0.5 
##$TPOFFS= (0..7)
0 0 0 0 0 0 0 0 
##$TUNHIN= 0
##$TUNHOUT= 0
##$TUNXOUT= 0
##$USERA1= <user>
##$USERA2= <user>
##$USERA3= <user>
##$USERA4= <user>
##$USERA5= <user>
##$V9= 5
##$VALIST= <valist>
##$VCLIST= <CCCCCCCCCCCCCCC>
##$VD= 0
##$VDLIST= <DDDDDDDDDDDDDDD>
##$VPLIST= <PPPPPPPPPPPPPPP>
##$VTLIST= <TTTTTTTTTTTTTTT>
##$WBST= 1024
##$WBSW= 4
##$XGAIN= (0..3)
0 0 0 0 
##$XL= 0
##$YL= 0
##$YMAX_a= 11850
##$YMIN_a= -30454
##$ZGOPTNS= <>
##$ZL1= 120
##$ZL2= 120
##$ZL3= 120
##$ZL4= 120
##$ABSF1= 10
##$ABSF2= 0
##$ABSG= 5
##$ABSL= 3
##$ALPHA= 0
##$AQORDER= 0
##$ASSFAC= 0
##$ASSFACI= 0
##$ASSFACX= 0
##$ASSWID= 0
##$AUNMP= <proc_1d>
##$AZFE= 0.1
##$AZFW= 0.1
##$BCFW= 1
##$BC_mod= 2
##$BYTORDP= 1
##$COROFFS= 0
##$CY= 11.3945322036743
##$DATMOD= 1
##$DC= 2
##$DFILT= <>
##$DTYPP= 0
##$F1P= 20.1720416913024
##$F2P= 0.152960286110954
##$FCOR= 0.5
##$FTSIZE= 0
##$FT_mod= 4
##$GAMMA= 1
##$GB= 0.15
##$INTBC= 1
##$INTSCL= 1
##$ISEN= 128
##$LB= 0.24
##$LEV0= 0
##$LPBIN= 0
##$MAXI= 10000
##$MC2= 0
##$MEAN= 0
##$ME_mod= 0
##$MI= 1.114404
##$NCOEF= 0
##$NC_proc= 0
##$NLEV= 6
##$NOISF1= 3.799351
##$NOISF2= 2.8
##$NSP= 1
##$NTH_PI= 0
##$NZP= 0
##$OFFSET= 15.70392
##$PC= 1
##$PHC0= -9657.588
##$PHC1= 24.60082
##$PH_mod= 1
##$PKNL= yes
##$PPARMOD= 0
##$PSCAL= 0
##$PSIGN= 0
##$REVERSE= no
##$SF= 200.130013532006
##$SI= 16384
##$SIGF1= 3
##$SIGF2= 2
##$SINO= 400
##$SIOLD= 16384
##$SREGLST= <1H.CDCl3>
##$SSB= 0
##$STSI= 0
##$STSR= 0
##$SW_p= 3612.71676300578
##$SYMM= 0
##$S_DEV= 0
##$TDeff= 0
##$TDoff= 0
##$TI= <>
##$TILT= no
##$TM1= 0
##$TM2= 0
##$TOPLEV= 0
##$USERP1= <user>
##$USERP2= <user>
##$USERP3= <user>
##$USERP4= <user>
##$USERP5= <user>
##$WDW= 1
##$XDIM= 8192
##$YMAX_p= 0
##$YMIN_p= 0
$$ End of Bruker specific parameters
$$ ---------------------------------
##NTUPLES= NMR FID
##VAR_NAME=  TIME,          FID/REAL,        FID/IMAG
##SYMBOL=    X,             R,               I
##VAR_TYPE=  INDEPENDENT,   DEPENDENT,       DEPENDENT
##VAR_FORM=  AFFN,          ASDF,            ASDF
##VAR_DIM=   8192,          8192,            8192
##UNITS=     SECONDS,       ARBITRARY UNITS, ARBITRARY UNITS
##FACTOR=    0.0002076,     1,               1
##FIRST=     0,             0,               0
##LAST=      1.7004516,     0,               0
##MIN=       0,             -30454,          0
##MAX=       1.7004516,     11850,           0
$$ Real data points
##PAGE= N=1
##DATA TABLE= (X++(R..R)), XYDATA
0@%%%%%%%%%%%%%%%%%%%%%%%%%KqJ4j6J6j6J6j6J6j6J8k4L0l2L3l5M0m6N0n6O4
46C4p2P8q7R8j07J26j50J74k08K58l37M70p29J427o403j9162J9509J6931j7639
65e789j3264J5399P384j3374q59J4650k127j3570M960J4588l176j1228K223Q045
79C862l02k945k86j436n70L406J5n019n02L310k302l126M323K002p495k139R550
96C46K799r528k155R088J412p107J239O122l652n148O026M933p134m595O961L433
112C040o072j429M928j253m214M090M352n728m136O688M099o133k717N680J015
127B210n116J125N070k827n286L474N254l284m518K602K998j930r26J958o87k023
143a906J954K507j872k013J433P84j140P62O58l218j826L875J919m948k940M068
$$ plain form
0 0 0 0 0 0 0 0 0 0 0 0 0 0 0 0 0 0 0 0 0 0 0 0 0 0 0 2 -6 8 -8 8 -8 8 -8 8 -8 10 -14 16 -16 17 -18 22 -24 26 -30 34
46 34 -38 40 -47 51 -56 70 -80 94 -114 144 -193 277 -452 975 -5428 -24590 -5081 11850 -5789
65 -5789 -19053 -3654 3730 -9644 -10503 4147 2020 -11550 -6590 7998 4822 -6406 -4183 3862
79 3862 3560 615 329 -1107 -1677 1729 1744 -3275 -3777 -467 -2769 -5895 -1572 430 -7065 -9204 346
96 346 3145 -6383 -8538 550 1962 -5145 -3906 2216 -1436 -6584 -558 4375 -2759 -7354 -393 3040
112 3040 -3032 -4461 467 -786 -5000 -910 3442 -2286 -6422 266 4365 -1768 -4485 1195 2210
127 2210 -2906 -1781 3289 462 -4824 -1350 3904 620 -3898 -1296 1702 -228 -1154 804 117 -1906
143 -1906 48 2555 683 -1330 103 887 -253 509 1167 -2051 -3877 -2 1917 -3031 -5971 -1903
159a903K294l591j202L166j93l039J825L973k166m157K410M544j424l498J054
174a907K276p59p52J046o11j974N51J910p20j917PP44J22P32N00j569q92K651
192e62K180k033k081J832J961j131q10J145l44j689R91K235j431l088P71K802
208G48n59k469m1J236k69k93Q40k51j419M30J940l9j682j06J245J56m13K84j85
227h47r52L89J491k69j665J6J503K18q44J72N42l88J8J216K30j318k36J455N50
246A281j003m41N04J18o7M35k6q18O9J118J59r35j60P36N1k78L45J43p01lJ055
267A582J56j099j79R18k3q58O4M88o03n92O72M72q84m69Q87N01n88j07N89l5l75
288E17M41M68n37m30O85M80n42l29M75J57l80O4K96l25l69L97L14m59k66M89K22
$$ plain form
159 -1903 391 -3200 -4402 -1236 -1429 -4468 -2643 1330 -836 -4993 -2583 1961 537 -2961 -1907
174 -1907 369 -390 -1142 -96 -707 -2681 -2130 -220 -940 -2857 -2850 -2106 -1984 -1252 -752 -2321 -3213 -562
192 -562 1618 -415 -2496 -664 1297 166 -644 501 157 -1532 -541 1694 263 -2825 -2054 748
208 748 189 -2280 -2321 -1085 -1354 -1647 -807 -1058 -2477 -2047 -107 -146 -1828 -1934 -689 -533 -946 -662 -847
227 -847 -1799 -1410 81 -188 -1853 -1837 -334 -116 -960 -788 -246 -634 -616 600 830 -488 -724 731 1281
246 1281 278 -163 341 459 392 827 801 -17 52 1170 1329 394 234 970 1021 743 1088 1231 530 527 1582
267 1582 1738 639 460 1378 1355 497 561 1049 446 -146 526 998 114 -355 532 1033 445 338 927 892 517
288 517 958 1426 889 459 1144 1624 1082 753 1228 1385 1005 1069 1365 1040 671 1068 1382 923 657 1146 1368
309A368l26K2M40l0k85K13K82k79k20K30M8l10o0K30j42l25R5K11k25k56J39J22
331I42k30p4K08k2k08O9J91j22j76J34J30k16j23J81J4k20o6J60J5j44LOp7nJ29
356D99jj63j0K55R4j29q4R9J00j5o1p9q7oJ03l4j77q8J02P4p8j23k3M1j3m5n3
383I8n1m3J0Q3K6o8k7P7O2m7l9l2o4r4L3%r2j57OJ49jj53r9Q0Q4n2p9m0l4K5P6
414c63l1j25mJ67O4j23r7N9O8r0q0l6l0n5L8Kj01n1O4L9j25n5Q6J8j04L2R9p0
442h04p1J02O8j06n9J29K8j42J9J20j09j31J50J23k31j56J90J48k24j38J55kj46
465a087J18J36k16j56L35K32l55k73K90K07k20j12J44r2j64K47J75l82l10L67
485a116K95l58k86J95J18k09J02K16k48k62M07M15l05k90L67K46k23L7L22k05
$$ plain form
309 1368 1042 1064 1504 1474 1189 1402 1684 1405 1185 1415 1463 1153 1093 1323 1181 856 951 1162 937 681 820 942
331 942 712 638 846 824 616 685 876 754 578 712 842 626 503 684 698 478 412 572 587 443 446 452 375 370 499
356 499 498 335 325 580 674 545 461 560 660 645 584 505 418 412 515 481 304 216 318 392 314 191 168 209 196 151 98
383 98 47 4 14 97 123 55 28 105 167 120 81 49 -15 -109 -76 -76 -168 -325 -319 -170 -171 -324 -423 -343 -259 -311 -390 -430 -464 -439 -363
414 -363 -394 -519 -523 -356 -292 -415 -512 -453 -385 -475 -555 -591 -621 -676 -638 -636 -737 -788 -724 -685 -810 -865 -779 -761 -865 -833 -734 -804
442 -804 -875 -773 -705 -811 -870 -741 -713 -855 -836 -716 -825 -956 -806 -683 -914 -1070 -880 -732 -956 -1094 -939 -941 -1087
465 -1087 -969 -833 -1049 -1205 -870 -638 -993 -1266 -976 -769 -989 -1101 -957 -1049 -1213 -966 -791 -1173 -1483 -1116
485 -1116 -821 -1179 -1465 -1270 -1152 -1361 -1259 -1043 -1291 -1553 -1146 -731 -1036 -1326 -959 -713 -936 -899 -577 -782
505g82l61M16N42m13n61L39M90k67k44K55p6l54L13N81m00o83M27Q12j67n02K12
526d23K72j12J78L62l84n82M61P01m23o76K57L15l37j7L64m33p26N53R28n71r74
547a267M95Q71l73l83N93Q4p33L06J182k77j303K48J305p5r45R4M50k98J0O91
567F75k44j031K41J229q7r95M9O35o9j3N35l06r03M99J295l87j371K25J088k25
587H40o16M42J05q95J63J266k14j514R0J319r0r31J89K80o93Q7J138l83j643K55
607h05J634l12j416L55Q75p78l56J433J59j904K3K379K49k187j79J927N2j351
625b02M36R24j044p95J352O61j635q48J209N67q27k57K21l55J52J008j71j224
643h28L72J357l15q61Q10M53j355r7J956j95k689p1K610j92k704M4J923q18j684
$$ plain form
505 -782 -1143 -727 -185 -598 -1159 -820 -330 -597 -841 -586 -662 -1016 -703 -122 -522 -1205 -778 34 -133 -635 -423
526 -423 -151 -263 -85 277 -107 -689 -228 473 50 -626 -369 -54 -391 -408 -44 -477 -1203 -650 278 -293 -1267
547 -1267 -772 99 -274 -657 -64 20 -713 -407 775 498 -805 -557 748 673 -272 -178 272 -26 -16 675
567 675 431 -600 -359 870 783 -212 -163 472 403 390 925 619 -284 215 1510 1123 -248 -23 1065 840
587 840 224 666 771 -124 39 1305 1091 -423 -333 986 896 -35 154 434 -259 -172 966 583 -1060 -805
607 -805 829 517 -899 -544 331 -447 -803 630 789 -1115 -1092 1287 1536 -651 -830 1097 1149 -202
625 -202 234 1158 114 -681 671 1332 -303 -1151 58 625 -202 -459 -238 -593 -441 567 396 -828
643 -828 -456 901 586 -275 535 988 -367 -464 1492 1297 -1392 -1463 1147 955 -1749 -1705 218 -600 -2284
662b284J244J216k008j166K350J245k188j007J954Q05j215L0R05o87o10J295N38
679D17j614o09J336K02j063J72N04r91l34J625K60k017k57K084K98j605J82J271
697a39o55p61J458O60j970o09K114M91j990l49J416l62j066J027O89j835o66K325
715b22O57k383n60K159K37j778L92J421j152j355J652J294k032j368J822J152
731f4j530p17J177J38p92O08Q91q42o69J133P70p27j93N39k67j64R90L3j582q5
751a353J778j8j860R1J496n22j282J111J111j556r24K129J134k017q51K088P75
768A330j685k42J474l27j388O65J197j113j343R50R43j029p54P20J61p00L00P36
786a05o06o37Q76P63o64l29P36J33n19L83O08p29o62Q77O17r92o06Q37K56p83
$$ plain form
662 -2284 -1040 176 -1832 -2998 -648 597 -1591 -2598 -644 161 -1054 -1024 -119 -806 -1416 -121 417
679 417 -1197 -1806 -470 -268 -1331 -1159 -655 -1646 -1980 -355 -95 -2112 -2369 -285 13 -1592 -1410 -139
697 -139 -794 -1555 -97 563 -1407 -2016 98 589 -1401 -1750 -334 -696 -1762 -735 -46 -1881 -2547 -222
715 -222 435 -1948 -2508 -349 -112 -1890 -1498 -77 -1229 -2584 -932 362 -1670 -3038 -1216 -64
731 -64 -1594 -2311 -1134 -996 -1788 -1180 -289 -1131 -1800 -667 103 -624 -817 -278 -545 -709 281 314 -1268 -1353
751 -1353 425 407 -1453 -1362 134 -388 -1670 -559 552 -1004 -1928 201 1335 -682 -1533 555 1330
768 1330 -355 -597 877 550 -838 -173 1024 -89 -1432 -482 461 -568 -1322 -602 -441 -1141 -841 -105
786 -105 -711 -1348 -472 291 -373 -702 34 167 -352 31 639 -90 -752 125 742 -250 -856 -19 237 -546
806e46R4P69m76p16Q29Q98q39p08J000O47q28k87R13m1r11L28R34o27j026N85
826hQ16p37p17O61L51p84p7Q63j61q50L34Q94l51o87M49M61n16k07N75j16p54
847e61J96O80m26p58M44N28n38l28O45J78o43J25Q15j18o92L54P39l75n01N16
867B80L80n69k24O21N0o91L7N55k34n40L43L61m89k29O05J70n93L5O62r3n69K97
889A65M78m10m16M78K39o08k30N58j6n95Q3N30k61n04L82M43m46l17N01K23m41
910a64rM71j53m21L19M55m35m14M27L12m31k17L69J8l38J84M06k87l15M34M23
931F34l32k14L57J34k96Q1K99k43l58K74K75l69l47K59J38l12k8K53j65l14K68
952fL76k75l22K91L11j46r8K14n3j94K03K73l17l76K12K96k42k79Q1L9j77R7K04
$$ plain form
806 -546 -452 317 -159 -875 -46 852 13 -695 305 952 124 -163 750 709 -202 126 1060 433 -593 -8
826 -8 808 71 -646 15 366 -418 -495 368 207 -643 -309 585 234 -453 -4 457 -59 -266 309 193 -561
847 -561 -365 315 -111 -869 -425 103 -435 -763 -118 60 -583 -458 357 239 -453 -99 640 265 -236 280
867 280 660 91 -133 488 538 -153 -116 439 205 -335 8 369 -120 -349 256 426 -167 -132 530 437 -132 165
889 165 643 233 -183 295 534 -74 -304 254 238 -357 -274 256 -5 -509 -127 316 -130 -447 54 277 -164
910 -164 -173 298 145 -276 43 498 63 -351 76 388 -43 -260 109 127 -211 -27 379 92 -223 211 634
931 634 302 88 445 579 283 364 663 420 62 336 611 242 -105 154 292 -20 -48 205 40 -274 -6
952 -6 370 95 -227 64 375 229 131 345 292 98 301 574 257 -119 93 389 147 -132 -51 -12 -189 -92 112
975A12k19k63K48L68j22k67J28K23k6J9J10m4j58J49K54q0k39pJ36K3k7m5j67
998A06j04J93J50k20k56J08K07l5p4K8o7o1J85J79j74k75J12L19j4k53o0J12Q6
1021A92L4j1j11r6Q6J52l0j58j02L4Q8P3q4j93l3J84J31j47j63J02J12pPK6p0
1046A6m7J51J78j03j94L2K30Q4j40j36J6P5N9n8j38r7N2Q3j9q4q8j2Q6J25l9j75
1072a43j1K07R7j26r0P4Q9j9mK8o4n5R4R2r3j33nO7rn5n1o9j1J06L9j17p1J25
1100a08R6o1k5K7oj6J25M2j49q9J76J30j33j37J05Q3n5m7K1o1o6R3O2j38q9J18
1126a02R4r4m1J04k1m2J18Q8j44p9J82J13j74q7J65N5j45K3J27j10j27J27J44
1149A74j75j64J44J02j12o4J01m8p5J43J15j84j34K44J44k10j11J83K0j56Q0J56
$$ plain form
975 112 -107 -370 -122 246 124 -143 -15 208 182 201 311 267 109 258 512 432 193 186 322 345 318 273 106
998 106 2 195 345 125 -131 -23 184 149 75 103 36 -25 160 339 165 -110 2 321 307 54 -6 106 192
1021 192 226 215 104 8 94 246 216 58 -44 -10 78 151 67 -126 -159 25 156 9 -154 -52 60 53 60 86 16
1046 16 -31 120 298 195 1 33 263 347 207 71 87 162 221 163 25 -72 -20 63 44 -40 -128 -140 -54 71 32 -143
1072 -143 -154 53 150 24 -66 8 97 78 74 102 38 -17 77 169 76 -57 -62 5 -4 -59 -110 -179 -190 -84 -45 -162 -233 -108
1100 -108 -12 -73 -98 -71 -77 -93 32 74 -75 -164 12 142 9 -128 -23 60 5 -42 -21 -82 -148 -55 7 -131 -220 -102
1126 -102 -8 -102 -143 -39 -60 -102 16 104 -40 -119 63 176 2 -85 80 135 -10 13 140 30 -97 30 174
1149 174 -1 -165 -21 81 -31 -95 6 -42 -117 26 141 -43 -177 67 211 1 -110 73 93 -63 17 173
1171A73k09k00K70K22k92k41K49K17k12j26K11j5j97J28K49j60k70K12K57j38
1191A28j37J38K5j38J39J78k44k46K72K55k61k16K38P7k24R3K68k39l56L28M33
1212E11l40m24K87L61k37j85K49%l15J69M09k57m58K38M24k29l05J82P7k54J28
1233C1L35k50m21L27M66k88l51L08K00l05L3M35j86n22L05O14k75n81K61M62k79
1254C19k15L30l1m41J54N73k18o14K39N13k26k99K72Q2l61J48N52k86o47L14O41
1275G99l34n38L45K95m62r6N85r2p50J65P99k18p31J95N49k80k96L81R1n48O6
1296g5O57j37o45J57M91k04k50L20j2n07K05O90l25p70L70P47m10n25M92K92o35
1317g4q0Q34j17r70J54R83k32q74K28O43l83m18N27K03p02r3P65J3p12K7N62j49
$$ plain form
1171 173 -36 -236 34 256 -36 -277 -28 189 -23 -149 62 47 -150 -22 227 67 -203 9 266 128
1191 128 -9 129 154 16 155 333 89 -157 115 370 109 -107 131 208 -16 77 345 106 -250 78 511
1212 511 171 -253 34 395 158 -27 222 222 -93 76 485 228 -230 8 432 203 -102 80 157 -97 31
1233 31 366 116 -305 22 488 200 -151 157 357 52 85 520 334 -188 117 731 456 -125 136 598 319
1254 319 104 434 403 -38 116 689 471 -143 96 609 383 84 356 438 77 225 777 491 -156 158 799
1275 799 465 -73 272 567 105 9 594 502 -248 -83 716 498 -233 -38 511 231 -65 316 407 -141 -75
1296 -75 582 445 -200 -43 448 244 -6 314 302 -205 0 690 365 -405 -35 712 302 -223 269 561 -74
1317 -74 -154 680 563 -407 -253 730 498 -376 -148 495 112 -306 221 424 -278 -371 394 407 -305 -278 284 135
1339A35l13L10R6m90K0O20j46o75J27N76k78m32L84J54o02%P52j06q34J80Q15
1360B93k01o45L39M63m57k26O66Q1p90LQ25p5p87J67N84l27m22M81K58o86j39
1381e95P69Q4p65MO74j06m98K80L65m54k51N83J58o53j41N57Km73R9K79k91j87
1403e60M41Q0n53k2N89l5n02J70M07k94k78M67J81n97j09O47K1o66O2N65j78n22
1425f86L21L99m45l29N70K79n59j47N72P1m59J21M19k40l50L74K92m55k38M29
1445f1J21m60k0L84j37l61K58K87l58k35M17J77l94n3M15n0l58J93L23k57k97
1466d66L65J93m01j18M03j2m23J04M15k13l94L03L39l19k26L98J65m01k8M37m0
1487H1m10J42L83k03l09K75K14l14j07L73L0l69O2L81j23l20K24K67k80j58L67
$$ plain form
1339 135 -178 132 228 -262 -242 378 232 -443 -316 260 -18 -450 -66 88 -514 -514 238 132 -702 -522 293
1360 293 92 -553 -214 249 -208 -434 232 313 -477 -474 351 276 -511 -344 240 -87 -509 -28 230 -456 -595
1381 -595 174 258 -507 -503 171 65 -433 -153 212 -242 -493 90 248 -405 -546 11 13 -460 -361 -82 -373 -560
1403 -560 -119 -39 -592 -614 -25 -60 -562 -392 15 -279 -557 -90 91 -506 -615 32 53 -613 -551 14 -164 -686
1425 -686 -365 34 -411 -740 -170 109 -450 -597 -25 46 -413 -292 127 -113 -463 -89 203 -252 -490 -61
1445 -61 60 -400 -420 -36 -173 -534 -276 11 -347 -582 -165 12 -382 -435 -20 -70 -428 -235 88 -169 -466
1466 -466 -101 92 -309 -427 -24 -36 -459 -355 60 -153 -547 -244 95 -224 -450 -52 113 -288 -316 121 81
1487 81 -329 -187 196 -7 -316 -41 173 -141 -248 125 155 -214 -152 229 106 -214 10 277 -3 -161 206
1508B06R6m27l3M47n3m28R1L46j78k94K44J99l47j28M06J01l80j7L72k2k11J31
1530A21J70k09o2L11Kl44L1L12r4k86J30J69k73j26L67P1m56j9M68L0l82O4L46
1553C41r4k33K63K21l15j71L92J38l78j12K56L3k25M6J20k27j19K81R6l43q7K90
1575A73M6k07N8J74j63j03K75J33l13j28L14J17k59n3J47l8j35J49R0k40j16K31
1597A52Q7k04p0J36m2p7J65O4k72q2L50Q9l06r9K73M2j91O9J52j56j67K50J99
1620C62k58k29K20J99j49j37P7Rq1O8Q5j62j14J09J07r1p9L3l4KJ37K3j90n8K30
1645G9J10j70q8J47J7p9N7Q3j49j29J72J42j78j85P3J22m2p9Mm5j2Q9P6j25q8
1670a98J15J01l8k9L1k8j0J07N6j62r8J47J13j24j13L7N2p6J6M7r2r1Q2J00m5
$$ plain form
1508 206 302 -125 -158 289 236 -192 -101 245 67 -227 17 216 -131 -259 147 248 -132 -149 223 201 -10 121
1530 121 291 82 20 331 333 -11 20 332 238 -48 82 251 -22 -148 219 290 -166 -185 283 313 -69 -5 341
1553 341 247 14 277 498 183 12 404 542 164 52 308 341 116 162 282 55 -64 217 313 -30 -117 173
1575 173 219 12 70 244 81 -22 253 386 73 -55 259 376 117 64 211 173 38 187 277 37 -79 152
1597 152 239 35 -35 101 59 -18 147 211 -61 -143 207 296 -10 -109 164 206 15 84 236 80 -87 163 362
1620 362 104 -125 95 294 145 8 85 94 13 81 166 4 -110 -1 106 15 -64 -31 -65 -63 74 97 -93 -151 79
1645 79 189 19 -69 78 95 16 73 156 7 -122 50 192 14 -171 -98 24 -18 -97 -93 -138 -150 -61 15 -110 -198
1670 -198 -83 18 -20 -49 -18 -46 -56 51 107 -55 -153 -6 107 -17 -130 -93 -41 -117 -101 -54 -146 -237 -155 -55 -100
1695a00j16PQ4L6%k5o1J6J08L7j03n3R3K2m6oK8p2m0J11M6j40j00J23R1q2q4L6
1723a90M0k7PM8o1l5N1O8k2n2LN1J5J7qo7J3P6J9q7k2N7J7n5L0L0p5m7J05N4j02
1754a49q0J05Q2p3m2O1K1k9K7N1m5j9P2K8m5l1O1Nm5K1L3n7k1Q0J7j08j2J13J1
1783C2j08J5R4k9p2O3O8p0m4J01N2q7l8P9K6n4K8L2m9k9Q7L7j19j4J01J2q4K9
1811E9O3p5k8J23L2j52k8J74N3j65j6J30qq3P2O2j01o7J59N4j60m2J34J9r5K8
1837A42O5r0n3J30P1j83n0J71L2j22j6J09o5p3J22R5j81r0J98Q8j62q1J34Lq0
1862A14O4Q2j46q0J91R1j96p5J59L9j12M9R2j50p7K07J00k42j13K49O7j89k4J65
1886B65o2j69J67J53k20j73K22J59k01j08J55J2j32R8J16j75j55K09J64k15j35
$$ plain form
1695 -100 -216 -209 -125 -89 -89 -114 -175 -159 -51 -14 -117 -170 -77 -55 -101 -107 -79 -151 -191 -80 -34 -174 -274 -151 -60 -142 -226 -190
1723 -190 -150 -177 -170 -122 -183 -218 -167 -99 -121 -173 -170 -119 -104 -87 -95 -162 -149 -73 -54 -141 -163 -106 -89 -144 -114 -84 -159 -206 -101 -47 -149
1754 -149 -229 -124 -42 -115 -157 -96 -75 -104 -77 -26 -71 -90 -18 10 -35 -66 -5 0 -45 -24 9 -48 -69 11 28 -80 -92 21 32
1783 32 -76 -61 33 4 -68 -5 63 -7 -51 50 102 15 -23 56 82 28 56 88 39 10 97 134 15 1 102 114 30 59
1811 59 122 47 19 142 174 22 -6 168 221 56 40 170 162 79 151 213 112 45 204 258 98 56 190 209 114 142
1837 142 207 117 64 194 265 82 32 203 235 113 97 206 141 68 190 285 104 14 212 300 138 57 191 194 114
1862 114 178 260 114 34 225 316 120 45 204 243 131 180 272 122 45 252 352 110 -3 246 313 124 100 265
1886 265 203 34 201 354 134 -39 183 342 141 33 188 200 68 166 282 107 -48 161 325 110 -25
1907b5J74N4j43N0J18j72j45K24J76k70j63K54J08k24k2J97r9k08K00K16k44k26
1929a70K52J98k30j19J91J0k14J14J89j70k26K23J91k07j63J85P8k03M2K06j40
1950C7k37K10K38k39k07K18J20k09l5K14j05k21J73K52k21k70K53J96k41j02K27
1971E1j4k46J20K63j88k79K32K59k48j71K24R0k46K9K69j39k69J72L00k04k27
1992b22J99J54k11l5K30m1k70J26K82j68k48J61K18j91j08J99Mk22Q3K60j58k49
2014b07J83K16j90j51K29N4k53N0K60j09k84J62K66j86k43K23J62k57p2K92Ml22
2036a73O9L18r3l03J56K37j70j59J95R5k29k1K54l8k40O7K17j25j51J49Q7j76
2058c4j5K17o0k13Q5K27j53j65J85J33k35n6K59ok75M7K78j14k74J63K38k12j90
$$ plain form
1907 -25 149 203 60 110 228 56 -89 135 311 41 -122 132 240 16 -6 191 92 -116 84 300 56 -170
1929 -170 82 280 50 -69 122 132 -82 32 221 51 -175 48 239 32 -131 54 132 -71 -29 177 37
1950 37 -200 10 248 9 -198 20 140 -69 -104 110 5 -216 -43 209 -12 -282 -29 167 -74 -176 51
1971 51 37 -209 -89 174 -14 -293 -61 198 -50 -221 3 93 -153 -124 145 6 -263 -91 209 5 -222
1992 -222 -23 131 -80 -115 115 74 -196 -70 212 44 -204 -43 175 -16 -124 75 79 -143 -60 200 42 -207
2014 -207 -24 192 2 -149 80 134 -119 -69 191 82 -202 -40 226 40 -203 20 182 -75 -147 145 149 -173
2036 -173 -104 214 121 -182 -26 211 41 -118 77 172 -57 -78 176 138 -102 -35 182 57 -94 55 142 -34
2058 -34 -49 168 108 -105 -20 207 54 -111 74 207 -28 -84 175 169 -106 -59 219 105 -169 -6 232 20 -170
2081a70K28J21k37q4K64Ok43M4K36j03j78J35J44j68q3J95J4k12M3K10j01j92
2103a31J52J73j95j20J97P4k17j7K52m4k45R9K49j24k27J48J85j57j17J65N3j76
2125b3J7J83p1j79J06J37j09j07J54L1j77N5J83j00k09J60J98j72j71K12J07k27
2147bm3K33j2k64N3K70o6k65J05K06j14j33J62N8j64MK12n0k05O8J86q6j19J10
2171A44N5j58RJ72n0k21Q4K07r0j81J11J24j34n8J80L5k33J5K28j3k16L6J56o8
2195A34q7Q2J3j53K0J67m9j85N8J52p6r0J11M5j81K5K24n1k44M6K61p1k12P7J28
2220A44j15q8J58M4k18k5J97L4j98j3J24no9N3K8r9j0J29J0j48J8R1l5n4O2k2
2246gj35M1J58m6j91J7J74k5j26N2P1j08j8J67J2j77k3J61K7j61qR7l2o4P4K1
$$ plain form
2081 -170 58 179 -58 -142 122 128 -115 -71 165 62 -116 19 163 -5 -88 107 121 -91 -48 162 61 -131
2103 -131 21 194 -1 -121 76 150 -67 -84 168 124 -121 -22 227 103 -124 24 209 52 -65 100 153 -23
2125 -23 -6 177 106 -73 33 170 61 -46 108 139 -38 17 200 100 -109 51 249 77 -94 118 225 -2
2147 -2 -45 188 176 -88 -35 235 169 -96 9 215 101 -32 130 188 24 28 240 190 -15 53 239 153 34 144
2171 144 199 41 50 222 172 -49 35 242 152 -29 82 206 72 14 194 229 -4 11 239 226 10 46 202 134
2195 134 47 129 142 -11 9 176 127 -58 0 152 76 -14 97 142 -39 -14 210 159 -85 -39 222 151 -61 16 144
2220 144 29 -59 99 143 -75 -100 97 131 -67 -80 44 39 -30 23 51 -48 -58 71 81 -67 -49 42 7 -47 15 -7
2246 -7 -142 -101 57 11 -180 -163 11 -14 -140 -88 -17 -125 -143 24 36 -141 -164 -3 24 -137 -145 -48 -80 -144 -70 -49
2272d9j29k1J35K8j43k1J01J5o8M7O1r8k8J34K8j20m1J01K0q1RK2n3j4P9Oj11
2299a91k7J11J4o0ML9m1KQ0Lj00qJ14Rq4l0Q4l6n0N4K5q5l7J02N0j01l2R5J5o0
2329a41RN4m1k6O7L4n8l6O4K4m7j6L9l1k2M5L4p0l3P6K1l9j9M7rj5M5J3m8k6N8
2360d7J9m1k9L8k0j6J8L3n9j9O2K1n5j5O5qk4J6M3l5l6L6O3m6k8M3J4l9kL1ll3
2392e3JK8j4l4M0J3k3jN1l3j3K8K2l0j1L2%l8J4M2qp0NO8k8n1L1J6l4rM5pl6n
2426f2N8j1n4K3K7j2j2J5Nn3J2N4j0o3L2K6j2l9L6J5n6J1N5Jp0KP2qm0J7J9k5
2458d7j2M8Np7PP3j4m9jL0k6NM4j0p8L5P8Lq8mO4j1j7L4j3p5K0J07j8q5QN3J3
2491Bm2K2J3n4RQ9qr6mJ01Qo6J6M7n9J5P4mj06J0J13J0r9lP8j2k4M2Or9KJ17J6
$$ plain form
2272 -49 -178 -199 -64 -36 -179 -200 -99 -84 -152 -105 -44 -142 -170 -36 -8 -128 -169 -68 -48 -129 -120 -98 -151 -165 -86 -80 -191
2299 -191 -218 -107 -93 -153 -149 -110 -151 -149 -69 -66 -166 -174 -60 -51 -135 -165 -81 -117 -167 -113 -88 -173 -210 -108 -58 -159 -191 -96 -81 -141
2329 -141 -132 -78 -119 -145 -78 -44 -102 -138 -74 -50 -97 -113 -74 -105 -127 -82 -48 -118 -151 -75 -54 -93 -112 -65 -74 -89 -44 -31 -79 -105 -47
2360 -47 -28 -69 -98 -60 -80 -96 -78 -45 -104 -123 -61 -40 -95 -110 -45 -53 -77 -61 -18 -53 -89 -53 10 -36 -64 -21 -7 -46 -48 -17 -20 -53
2392 -53 -52 -24 -38 -72 -32 -19 -42 -43 8 -25 -38 -10 12 -18 -29 3 3 -35 -21 21 13 -57 -52 16 -12 -63 -32 -16 -50 -59 -14 -21 -57 -62
2426 -62 -4 -15 -69 -46 -19 -31 -43 -28 -23 -76 -64 -10 -20 -83 -51 -25 -37 -76 -40 -25 -81 -70 -15 -14 -84 -82 -10 -18 -58 -41 -22 -47
2458 -47 -59 -11 -6 -83 -76 -3 -17 -66 -67 -37 -63 -58 -14 -24 -102 -67 11 14 -74 -78 -14 -25 -42 -8 -21 -96 -76 31 13 -72 -64 -11 2
2491 2 -40 -18 -5 -59 -50 39 31 -65 -69 32 40 -26 -10 37 -22 -7 67 63 -43 -33 80 90 -9 -12 66 54 30 72 78 -21 -19 98 114
2524A14j03k5P9Nl0L6Lo3%J04%j28J1J08pp5L6M0p9l4J31Nj35j8J43J4j17NP5
2553I5l7n0Q7L4j20l7J19N1r9l7Q1%m1M1J7q5k3J22J5j17k3R7rp4M4M4r5j7J23
2582A06K4j43m3J36J5j08J9O0n3m9P9N8j38m4J25L8j16k6Q8j8o4O6M8j08p0J52
2608C4N3j24n4J28rj00M5P1q4p2J14P1j27n9J18L7r7kQ2n5o0J00M9j04n4J20L2
2635E3j05qQ8m1q1R8O4j10r5J40O3j37l9J24rj03L8J02p6j04J05R0j09o8J04K6
2661A0p9j3J12p2q3Q7O4p9o8R6O1r4l3Q8k0q8N2J00o9r0J13O6j20m4J37Oj08K7
2689d1J01o3j03Q9Q5j05p9J09L8j19LJ09m1r3M3J01p7q3R9N6r9m2J07jj12L7R8
2716A7o0j17Q6Q0j07n1R1L6j20NJ14l4j05P2Q7q5p1J21M7j07k1J22qj03M6Q9o9
$$ plain form
2524 114 11 -14 65 70 40 76 79 16 16 120 120 -8 3 111 104 29 65 105 26 -8 123 128 -7 -25 118 132 15 20 95
2553 95 58 8 95 129 9 -28 91 142 43 6 87 87 46 87 104 19 -4 118 133 16 -7 90 81 7 51 95 0 -17 106
2582 106 130 -13 -56 80 95 -13 6 66 13 -36 43 101 -37 -81 44 82 -34 -60 28 10 -54 12 60 -48 -118 34
2608 34 87 -37 -91 37 28 -72 -27 44 -40 -112 2 73 -54 -113 5 42 -55 -57 25 -30 -90 10 59 -45 -99 21 53
2635 53 -52 -60 28 -13 -94 4 68 -42 -137 3 66 -71 -110 14 5 -98 -60 42 -34 -138 -33 57 -52 -120 -16 10
2661 10 -69 -82 30 -42 -125 -38 26 -53 -121 -25 36 -58 -91 -3 -23 -111 -59 41 -28 -118 -5 61 -59 -103 34 40 -68 -41
2689 -41 60 -3 -106 -17 68 -37 -116 -7 31 -88 -85 24 -17 -110 -67 34 -43 -126 -27 29 -70 -112 -5 -6 -118 -81 17
2716 17 -43 -160 -74 6 -101 -152 -61 -25 -145 -140 -26 -60 -165 -93 -6 -91 -162 -41 6 -101 -122 0 -8 -111 -65 24 -45
2743d5q5P9P1j01o0J00K8j11RQ9k4r7O9Q9r2o7J20L2r4k0J08j2q8L6P3p5q3Q5
2771f6O5r6n3J01L0j13J5R6n2n6N5Q5p4o6J02N4j02j2J02k0q1N6Q0p3q2R7O5r8
2799d1j7Q9j0p1M1R6o0q5R4Q4r8n9R1L6r4rJ02l7j10P2Q9q0r2Q1P8r6j8P5No8
2829a2N0Q7m3r3P1P1o3m2O7ro2J7O1m7j01P9P2o0o4Q5M0p0J4Q7l1o6O4J13n8q4
2859G3Q2N6p6j9O6j6r6M0P5o9q7O2O8o5n0O5L4o6K3P6k0q0N0Q9n2o3L3L4n1j6
2889A00M7j1r0K7N4n1m8M0K8l3j5N0lm3L1P4m5n7N1M5n2j4M1j4o4J7P4l8r2L1
2919D0P4l3m3L2L4m7j0P1Jo5MP6k8o8K8M4n7l6L7Pq2LM8k6n7kN3j7JOJ9l4OM8
2953B7ko8L6L4l9k9OQl2j5L2j5o1K7M2j1l4K2M6k5j0L7K3m1RN2j0l7QL8l4m3K3
$$ plain form
2743 -45 -130 -51 20 -81 -141 -41 -13 -124 -115 -26 -50 -147 -78 11 -81 -148 -28 4 -90 -110 -2 -14 -102 -66 7 -68 -151 -66
2771 -66 -1 -97 -150 -49 -19 -132 -117 -21 -73 -129 -74 11 -63 -129 -27 27 -75 -87 15 -5 -86 -30 50 -23 -105 -8 57 -41
2799 -41 -58 31 21 -50 -9 87 27 -58 36 120 22 -37 54 90 -4 -13 89 52 -58 14 103 23 -69 12 90 -6 -24 51 56 -12
2829 -12 38 125 82 -11 60 131 68 26 93 84 22 39 100 53 -48 31 103 43 -21 64 104 34 48 135 104 38 102 215 157 73
2859 73 155 211 135 116 182 166 70 110 185 116 29 91 159 94 44 109 143 77 100 176 156 76 126 215 163 100 133 167 116 100
2889 100 147 136 46 73 127 76 28 68 96 63 48 98 95 52 83 157 112 55 106 151 99 85 126 112 48 65 139 101 9 40
2919 40 114 81 38 70 104 57 47 118 119 54 58 134 106 38 66 110 53 17 54 61 -21 -18 30 4 -53 -55 -2 -19 -18 -12 7 -27 -21 27
2953 27 25 -43 -7 27 -12 -41 -35 -27 -59 -74 -42 -57 -118 -91 -49 -60 -94 -72 -26 -51 -61 -24 -1 -42 -33 19 9 -28 -20 18 -16 -59 -36
2986c6J6m4j1L8j6m0J0M4j4k5L5K8l3j0M5Nl5KL8j5m7J6K7l5k6K7J8l1rK7mk0
3018g5J6K5kj6L2L4k5jM1Rm6J2M6k9l9J5L0l2j9K2J7l8LM8rj9PL9kj5J1J1PjJ4
3053G1j0l4J0J7j2l9J0Pj8j2L2j5l1K0L5k5k6J5M2mj0J6%j0nM0j0n5K7J4pk8k
3086CJ7NkOjk3K2K7k0k5PK0j4QJ5j7k9J7L9l6k1jM2k8nQj3k0J3M8k7l8RK9kl4
3122b1KKj3J6Rk5l1J4L1rl2PL0k8J0N0k2m1L1O3k7l8PK9k5j0L1pl2pM8j3n1lM1
3157a4Kpj5Mk6L4K5j2l3J7N4k2k2POj2J1L0m1l6ON2rn1j3L8j4k3L2Ml5oN6qm7
3192f8J9K5pKPJ2k5J9M9j3m7%M2rk8K2kl9rN2jp2PN0Ln4j1M2j1j0M2Mn3QN4Pl8
3229c1KJ9j2nL3j5m9QM7j9m7kM0j8k7L9J1n7%Q4%o1NO3mm6K0M0k2k5L7L2m6l8
$$ plain form
2986 -36 -20 -64 -75 -37 -53 -93 -83 -39 -53 -78 -43 -15 -48 -58 -13 -8 -43 -41 -3 -18 -65 -49 -22 -57 -83 -56 -38 -69 -78 -51 -55 -75
3018 -75 -59 -34 -36 -52 -20 14 -11 -12 29 38 -8 4 50 21 -18 -3 27 -5 -24 -2 15 -23 -20 28 19 0 7 46 44 29 40 51 58 57 71
3053 71 61 27 37 54 42 3 13 20 2 -10 22 7 -24 -4 31 6 -20 -5 37 33 23 39 39 29 24 64 54 -1 26 40 33 5 3
3086 3 20 25 23 29 28 5 27 54 34 9 16 36 22 30 45 28 -1 16 55 19 -2 -3 39 11 6 14 1 -19 -6 42 15 -23 -14 15 13 -21
3122 -21 -19 -17 -30 -14 -5 -30 -61 -47 -16 -25 -57 -50 -20 -48 -38 12 -10 -51 -20 43 16 -22 -15 14 -11 -21 10 3 -29 -36 12 -1 -52 -55 -14
3157 -14 -12 -19 -34 -30 -56 -22 3 -9 -42 -25 29 7 -15 -8 -2 -14 -3 27 -14 -50 -44 8 -1 -52 -65 -27 -41 -64 -32 -28 -63 -69 -13 -21 -68
3192 -68 -49 -24 -31 -29 -22 -10 -35 -16 33 20 -27 -27 15 6 -22 0 -2 -41 -50 2 1 -71 -64 -14 -11 -65 -76 -34 -45 -55 -13 -9 -62 -54 0 7 -31
3229 -31 -29 -10 -22 -27 6 -9 -58 -50 -3 -22 -69 -71 -31 -49 -76 -37 -26 -83 -83 1 1 -60 -55 8 4 -42 -22 18 -4 -29 8 40 -6 -44
3263d4N8Pm3oL8j5k8K6K0m2j6M8%k9KK0j9qL7Jm5lM9%l7nN2j8l1J3N3n3k2M8J9
3298B7m8pN6Nm6jN1k1m6M4L6o3rL9K0l2MK4pk6L1L5m0k4M5K8m9lL9rm9K5K9m7
3332A1l5L8J9m9j7N8ql9j1M5rn3L8L4j7k3K9J7l5J1K6k2j4MM3l8k5K8K9m8oN8
3364C9j2l6NM5Km2J9M3rl4K3K9n0lM3j1k4ML0k3l8K4Qk0j2K9km8K3L0l6k7M4J6
3398B9m3j2O4j4o9PN4pn8J7N0k5n1M5K0m5k2N1J8m4rL6Qj8JL4k7mL5J1n0J1L9
3431C2j2m1L4J9m7mM3Jn6KM4On7J0L3k7m0N2J6o2lM7Kn9NK7rk1K1J8n0j5M1On4
3466i8nM2Ql9K0L2k7j8M4J6m1mM9Oj7j7L7j5k1J5L9n1j9N0Pk4mM2j3j4J6L2m8
3499b0j0N3Om9%M4k2k6J1K2m0k9M3K6o4k1N5Ro0J8M3k5l3M8L5m1k7L8L3l8j3L7
$$ plain form
3263 -44 14 21 -22 -28 10 -5 -33 -7 13 -29 -45 3 3 -26 -24 -4 -23 -31 6 7 -38 -41 8 8 -29 -34 18 0 -31 -18 35 -18 -40 8 27
3298 27 -21 -28 28 33 -13 -14 37 16 -30 14 50 -13 -22 17 37 5 9 33 26 0 31 66 26 2 47 75 26 23 62 53 4 29 58 11
3332 11 -24 14 33 -16 -33 25 17 -22 -33 12 3 -50 -12 22 5 -18 11 28 -7 4 30 8 -6 -2 41 3 -22 6 35 -13 -19 39
3364 39 27 -9 -4 41 43 1 20 63 54 20 43 72 22 19 62 51 27 31 61 38 0 24 32 12 0 29 27 -21 2 32 -4 -31 13 29
3398 29 -14 -26 38 24 -45 -38 16 9 -49 -32 18 -7 -58 -13 7 -38 -60 -9 9 -35 -44 -8 0 -18 -17 17 -10 -14 21 32 -18 -7 32
3431 32 20 -21 13 32 -15 -19 24 25 -31 -29 15 21 -36 -26 7 -20 -60 -8 8 -54 -57 -10 -8 -67 -62 -35 -44 -65 -44 -26 -76 -91 -50 -44 -98
3466 -98 -103 -61 -53 -92 -72 -40 -67 -85 -41 -25 -66 -70 -21 -15 -32 -49 -12 -27 -48 -33 6 -45 -64 -14 -7 -31 -35 7 -6 -20 -4 28 -20
3499 -20 -30 23 29 -20 -20 24 2 -24 -13 9 -31 -60 -17 9 -55 -76 -21 -12 -72 -54 -11 -36 -69 -21 14 -27 -54 -16 17 -21 -34 3
3531Cqj5j2M3k6j1L4Mj9j2L0J2k3K2L6m1OM9Pl1j5L8J2l1J0J3l4k2K5K3l0m5L2
3564B4J4k6j2K4Ql1J8K4k6j6K2J2j9j8POk8lJ7pm7K3L9l9nK0K2j6mL4jk8J7M0
3598D5j4l7L9Ok5mJ4jk0jJ3j8rK2J8j1j8K0J1oLL6k9k4J9J8j9l0K3jk2j5J2k9
3632c4l3J4K5j5j9J2J8k4J1J9lOJ5Rj3oJ3K8k3j9K9%l6J5J1l1j3K1K8k5j6K1L1
3665A6j5j6L8Mj1OL3ll2J6J4j5j2L%j9kRmk5K4Kk7j0K5K2l6nK2rk8K1Opk6J1J5
3702a5j4oQ%rQJ4lk3L1L0jk3J2Lj0K3mok8K8J1k3k5RJ5nLJ1Jk2J6K4Ll1J7L5j6
3740C8Nknm%kj2k7OJ7k3j9ppkQJ3j5k0L5J6%mJ7OkJ1K3j7j2J5J1pl0J1Kjj9J3
3779A0oojPJ0j4J0QJ%QMj2K8J1nk4J4RJk5NKj4J9j0j5rlK7k3k1JJ1klNj2j0J6
$$ plain form
3531 3 -5 -20 -32 11 -15 -26 8 12 -7 -19 11 23 0 22 58 17 23 72 79 48 33 71 83 52 62 75 41 19 44 67 37 -8 24
3564 24 38 12 0 24 32 1 19 43 17 1 23 35 16 -2 5 11 -17 -20 -3 -10 -57 -34 5 -34 -39 -19 3 -13 -17 17 16 -12 5 45
3598 45 31 -6 33 39 14 10 24 23 3 2 15 -3 -12 10 28 17 -1 19 30 24 27 63 34 10 29 47 28 -2 21 20 -2 -17 -5 -34
3632 -34 -67 -53 -28 -43 -62 -50 -32 -56 -45 -26 -29 -23 -8 1 -12 -18 -5 23 0 -19 10 10 -26 -11 0 -31 -44 -23 5 -20 -36 -15 16
3665 16 1 -15 23 27 16 22 55 52 20 36 50 35 23 26 26 7 5 14 10 -15 9 11 -16 -26 -1 21 -15 -20 2 -7 -35 -14 -8 -15 -41 -30 -15
3702 -15 -29 -35 -27 -27 -36 -28 -14 -17 -40 -9 21 20 -3 9 12 2 25 21 15 -13 15 26 3 -22 -13 2 -3 0 11 12 -10 6 30 33 2 19 54 38
3740 38 43 41 36 32 32 30 18 -9 -3 14 -9 -28 -35 -42 -44 -36 -23 -38 -58 -23 -7 -7 -11 6 12 10 21 44 27 15 30 41 34 4 15 17 16 -3 10
3779 10 4 -2 -3 4 14 0 10 18 19 19 27 31 19 47 58 53 29 43 52 53 28 33 35 21 40 30 15 6 3 30 7 -14 -13 -2 -4 -7 -2 -14 -24 -8
3819hK3j0j4J6PmkJ1Kj0J1K7j4j6nJ0Mk1nK9k9mJ8jl0J6Q%qmJ3rJ1P%j3J1L2k3
3858B6j5LJ9mj5J6pk0rJ6j6qj1MJ3j3JkJ0j8K8JqPJ3Nj5NJj0J2J9nk4J1Rjk5J
3897fJ9j4j6K4ok3JL4lk4jJ8opNK1rj7L2Nj6j5K4kqJ5Km1MK2nj9pJ7lj5j1K5j0
3936a6j3K1l%J0J5J5k2nK4qj2J8Oj9pOJ9k5mRoj6QLJnRNj9%J5KqLK2j1j6QK8j6
3977A6k0QJ3k6NK0j1nRQj7O%J9rnJ1onJ8jlj7J7Pj5Rkmj9%L4j4k4L8J2j5j1J2
4016C3J0j8LLjj4lK0nk3J2Mj6QKJj0J1J0lqKJ5j0RNprJ3J2nl0K4J3pk4K0J3k0
4055C0j0L6j0k0QK2nk9K1RnqJ5j3mj1K3k6n%J2j7jJ0j3k2J6J2nl8K4K4k3j8J8
4090cJ0k5NJ6rj5KK6k0j6oK2k2J6J3qnoL2Rl0PK6j4k2K3J4k6jK2kl8K0K2j8k1
$$ plain form
3819 -8 15 5 -9 7 14 10 8 19 21 11 22 49 35 19 14 24 28 7 2 31 2 -2 16 15 -15 1 9 9 1 -3 10 1 12 19 19 6 17 49 26
3858 26 11 14 33 29 14 30 23 3 -6 10 -6 -14 -25 -21 -8 -21 -20 -22 -12 -30 -2 -1 -9 -2 11 16 1 6 7 -3 9 28 23 -1 10 19 18 -7 -6
3897 -6 13 -1 -17 7 1 -22 -21 13 10 -14 -15 3 -3 -10 -5 16 7 -10 22 27 11 -4 20 18 10 25 27 -14 -10 12 7 -12 -19 -2 -5 -20 -31 -6 -16
3936 -16 -29 -8 -11 -11 -1 14 29 7 2 26 18 6 24 30 11 4 10 29 4 0 9 3 -13 -5 -2 -1 -6 3 8 -11 -11 4 6 -2 1 23 12 -4 4 32 16
3977 16 -4 4 17 -9 -4 16 5 0 9 17 0 6 6 25 16 11 22 16 11 29 28 25 8 25 32 17 26 24 20 1 1 35 21 -3 35 47 32 21 33
4016 33 43 25 28 31 30 16 13 33 28 5 17 21 5 13 15 16 6 17 27 24 16 18 33 23 32 37 30 21 34 46 41 11 35 48 41 17 37 50 30
4055 30 20 56 46 26 34 56 51 22 43 52 47 39 54 41 37 26 49 23 18 18 30 13 12 22 9 -13 3 15 10 -28 -4 20 -3 -21 -3
4090 -3 7 -18 -13 3 -6 -21 -19 7 -13 -29 -35 -13 -35 -19 -6 -14 -19 -25 7 16 -14 -7 19 5 -17 6 20 -6 -7 15 13 -25 -5 17 -1 -22
4126b2NK0k3kJ1Lk1MRJ0j9JJ6k0lJ4j0j7PJ2nj7J2oPk8K4J3m3K0J7Ok3jL3j6j9
4163e1K1J4j3j4M3jk6LK8lj4%OMj2J0jkj7J2J0pnQJoQkjk2J7%k1J1Pj3j5K7qm
4203b8k4ORj6nK4oj0J0J0j1mK2on%L2mk7%K1pk1K1Rj7JL1oj8QONlJ3MqrJ4kkm
4245CJJ6jp%k3PKkk7OJ0Lj9RKj2J0NMj2qRJ8k2NKLj3MKKj4J9J5j8qK5Jj2J2J6
4287A3kj3K2Pj5j1J0LlKpNKlJ0j2QOJ2k0lK3rj7K3pj9j3K8Mk8j4Q%lroOj6KK0
4328a6jj5J4J1pJRkQkOPLpLrnQJj1OloqNNRj7J3K3j3KJ6jpmJ5nj9J0Pj7%Rj3k0
4374a7J1oj3j2J1Pj5OJ4j1PKmPj7J4J9k8kJ2J6j3%LOpNJ5j2PKrQjjoJ1J3j2KJ
4415A3Rnj1KK0j7R%Rj5%J6Jj3lKLKllkj5nJ0nk7J5J2qmJkMj2J5LmOJ2j0JlK5j3
$$ plain form
4126 -22 -17 3 -20 -22 -11 -8 -29 -25 -16 -6 -25 -24 -8 -28 -31 -17 -27 -44 -37 -25 -30 -47 -35 -41 -34 -62 -38 -25 -68 -48 -31 -25 -48 -49 -16 -32 -51
4163 -51 -30 -16 -29 -43 0 -1 -27 -24 4 1 -13 -13 -7 -3 -15 -5 -6 -8 -25 -13 -3 -10 -15 -7 -6 -12 -4 -6 -7 -29 -12 -12 -33 -22 -15 -28 -43 -16 -24 -28
4203 -28 -52 -46 -37 -53 -58 -34 -40 -50 -40 -30 -41 -45 -23 -29 -34 -34 -2 -6 -33 -33 -12 -19 -40 -19 -10 -27 -26 5 -1 -19 -11 -5 0 -3 10 14 6 -3 11 9 7 3
4245 3 4 20 19 12 12 -11 -4 -2 -4 -31 -25 -15 -12 -31 -22 -20 -32 -22 -17 -13 -25 -33 -24 -6 -28 -23 -21 -18 -31 -27 -25 -23 -37 -18 -3 -21 -29 -4 -3 -15 -3 13
4287 13 11 -2 20 27 12 1 11 14 11 13 6 11 13 10 20 8 16 22 34 14 11 34 25 8 31 24 5 -8 20 24 -4 -18 -10 -10 -13 -22 -28 -22 -38 -36 -16
4328 -16 -17 -32 -18 -7 -14 -13 -4 -6 2 0 6 13 16 9 12 3 -2 6 7 -4 2 -1 -7 -15 -10 -5 4 -13 0 23 10 12 28 27 20 16 31 26 7 17 24 7 7 16 3 -17
4374 -17 -6 -12 -25 -37 -26 -19 -34 -28 -14 -25 -18 -16 -20 -13 -30 -16 3 -25 -27 -15 1 -12 -12 -9 -3 -10 -5 10 -2 5 7 -2 6 5 4 -2 9 22 10 12 13
4415 13 22 17 6 8 28 11 20 20 29 14 14 30 31 18 15 17 20 22 19 16 14 -1 -6 4 -1 -28 -13 -1 -9 -13 -12 -14 -10 -22 -7 -4 -8 -2 10 0 1 -2 23 10
4459A0MjQk9mL0j1j2NjJ4j2J0mj2RLQj3J5Nj0QQj5PkJ1j0k0NQj1qPj5oJ2%kqn
4501b4J5kmoK0noMQoj9K9okjQqKRnlnJoPj0J5k%mkJQJ9j2olJ5j5J0jll%J7k2k
4548ekOkMnRj1OopJ4oQj1pmJ1qlP%Mj6RPo%J6o%Kj2PnLQoqKJ4qLQprJ6J0j8PJ1
4598A4Jk1OpjNMj3KOPjj3RLjj0J6J7k5j0J5Npj7J3Jr%J1k2J3QqkNQllKJ2Jj2j
4642bK0j2rRlNjLnjL%lJJ0J2j4qK1k6MJ9nRk3K0Ppk3K7oj1PRjj6NKMpPJrjJ1j
4688B2rJ0mJk2K0j0KpJ7j0j3J0kMlKKLjRLMj5PJ2orJ4j4nRj3JKKJ0k1JM%nLK6
4732C1j5qK2j2MkLkj2J1lmL%j2kkJ0jmLJ3j9Q%J5j6RmMk1J4J4mqjKoj0K3pkoR
4776A5oKMjMj4J1lKj%J1lj0RrkNJ0j2MP%kLLqOoLnlJ1q%nJ5nj5MQqj0K4j7J3k0
$$ plain form
4459 10 14 13 21 -8 -12 18 7 -5 0 -1 13 1 11 7 -5 4 7 15 2 17 22 12 20 28 13 20 18 29 19 -1 4 12 1 -7 0 -15 -21 -9 -9 -11 -19 -24
4501 -24 -9 -11 -15 -21 -1 -6 -12 -8 0 -6 -25 4 -2 -4 -5 3 -5 -3 6 1 -2 -7 -6 -12 -5 -15 0 -2 -2 -6 -8 -7 1 20 8 2 -1 14 -1 9 8 5 2 2 19 -3 -5
4548 -5 -7 -1 -3 1 -4 5 -6 0 -6 -13 1 -5 3 -8 -15 -19 -8 -16 -19 -12 -12 -8 -24 -15 -8 -14 -14 2 -4 -4 -2 -14 -7 -12 -9 -1 -7 -15 -13 1 -7 -4 4 -3 -12 4 14 -4 3 14
4598 14 15 -6 0 -7 -8 -3 1 -12 -10 -4 3 2 -11 -2 1 0 -10 6 23 -2 -12 3 8 1 -16 -3 -2 -11 -11 0 -22 -9 -1 -9 -11 -6 2 -1 -4 -2 10 11 -1 -2
4642 -2 18 6 -3 6 3 8 7 10 5 4 7 7 4 5 15 27 13 5 26 0 4 23 18 27 4 24 31 24 1 28 22 11 18 27 26 10 15 17 21 14 21 22 13 12 23 22
4688 22 13 23 19 20 -2 18 8 10 3 20 10 -3 7 5 9 6 8 10 13 12 21 24 28 13 20 32 26 17 31 17 12 21 8 9 11 13 23 2 3 7 7 2 5 31
4732 31 16 8 30 18 22 20 23 21 9 20 17 13 16 16 4 2 0 10 9 5 8 21 2 10 10 25 9 18 14 18 -3 11 25 21 13 12 14 8 -2 21 14 12 6 15
4776 15 9 11 15 14 18 4 15 12 14 13 13 24 21 11 20 11 9 14 24 12 16 23 23 21 24 27 19 25 19 22 17 14 25 17 17 12 27 22 7 11 19 11 1 25 8 21 1
4823AK0j3J4lJ1j8KKojpQknlJ0j8mJ2LljMj3J8j7J0KpJ3MKmJj4MKrOj5K2j5J0
4866CoPjj6J1Qoj0QjQj3kJ2ojOljnOjoLoJPpMQj1j1QPqOj1J3jNqJ1J%mQkKj0O
4916BlPj5RNpJ1LorQJ1j2j0J8nj2PKlKlPpmRNqrJ3%j1JJ3j8npK4mllpLLmRj2J
4964a4LJ1nklkJ4npLKnKJ1kllLK0j1j0mJ2oMJJl%mPpQnNqJ3klOj3pJ2j5J1%Mo
5012bp%oQLj2j1L4j2pKJ3%j6OJ3mnrJ0NrJ0Lj8J0jnJ1KqnMJ0rLmN%%rJ5j3J0N
5057A0j3NJqJ9j6NNj2Pk0J5%nj0QlJ2j2J1j0mQlMo%J2r%nMqROMJkJJrQNmkPj0
5104cQmMJoJ7oOj0NllkJ1LpQjlj2LRJj2oMj1J7lk%Jj4OJ1rKnLJ6k6J0RlrJ7Mp
5152IlJ5j3JlJ5j7P%jQj0J1mkkOJnKL%%QKj0%kLj1KLJ2Lj3nMj6MJ7j3L%ok%lO
$$ plain form
4823 1 21 8 22 19 30 12 14 16 10 9 2 10 8 3 0 10 -8 -12 0 3 0 -1 3 -10 8 -9 1 3 -4 9 13 15 11 12 -2 2 4 -5 1 -14 8 -7 3
4866 3 -3 4 3 -13 -2 6 0 -10 -2 -3 5 -8 -10 2 -4 -5 1 -2 -3 -8 -2 -3 -9 -6 -12 -11 -4 -11 -7 1 -10 -21 -13 -6 -14 -8 -19 -6 -7 -2 -10 1 2 2 -2 6 4 6 -4 2
4916 2 -1 6 -9 0 5 -2 9 12 6 -3 5 16 4 -6 12 7 -5 2 4 1 3 0 7 0 -4 5 10 2 -7 6 6 -5 -4 9 -9 -14 -21 3 -1 -4 -7 -14 -11 -8 -12 -3 -15 -14
4964 -14 -11 0 -5 -7 -10 -12 2 -3 -10 -7 -5 -10 -8 3 1 -2 -5 -2 18 7 -3 -7 5 -1 3 4 5 2 2 -2 5 -2 6 1 6 -2 11 9 6 12 -1 -8 4 -11 0 0 4 -2
5012 -2 -9 -9 -15 -7 -4 -16 -27 7 -5 -12 -10 3 3 -13 -7 6 2 -3 -12 -2 3 -6 4 7 -11 -1 -2 -7 4 6 -2 -7 -3 7 -2 1 -3 2 2 2 -7 8 -5 5 10
5057 10 -3 2 3 -5 14 -2 3 8 -4 3 -17 -2 -2 -7 -17 -9 -12 0 -12 -1 -11 -15 -7 -10 -6 -12 -12 0 -9 -9 -14 -10 -18 -9 -3 1 2 0 1 2 -7 1 6 2 0 7 -3
5104 -3 5 1 5 6 0 17 11 17 7 12 9 6 4 15 18 11 19 18 15 3 6 15 16 4 -2 2 -9 8 5 3 3 4 -10 -4 7 -2 0 -5 -2 14 -12 -2 7 4 -5 12 16 9
5152 9 6 21 8 9 6 21 4 11 11 10 18 8 19 15 13 11 17 18 13 15 18 18 18 26 28 18 18 16 19 8 10 13 25 28 15 10 14 -2 2 19 6 9 9 3 1 1 -2 4
5200Dj2LJ3j0n%oOQj3J4j3J9n%pJKPpMJ%pPj3MPjJ3j7nKRNnJ%jLpQlkLkomMpO
5251dj0OQrl%kPj5NKJmJ%jOLkMnNLLkPpJ1jLloJ4mj8N%KPOlloR%MJrNpJ1Oj5l
5305CJ0jqMJ4kj2MroJJjj1J1%R%j3lQPPq%J4ml%jjq%LkkRLNj6J7j1oJ2nJ2j1Q
5353A8qj5RLJlJJnlQPLj0J0%k2KPj0KkNKj3mK3j8kNJrJ0J5j6lJNPllJ2LoJ4Nk0
5400EJ0kKoQ%r%LKj1lQQj6JJ2nKKN%nNkqkJ9j6mlOnj2K3pj8K1Jj8QRjrj2J4Ro
5448CJ4j2Rj3KJ2lpkNJ2j1J4j1OmNj4J1jlOrKMnnQLKj2J2%jOoPj7kJ0qjQnJNj1
5495DJ4j2%J1j2RrkPmQqkK6nlqJ1jj2MKL%kNj0OLj2JJ4joj0NNj0MOMqjOoJJJ2
5543B8j3mJ3j3%%pK2j6qO%pRLmLJJ2j3P%nPMj3Qj0J3Oj6ORmLj4RRj5MjOmNj8M
$$ plain form
5200 4 -8 -5 8 -2 -7 -7 -13 -7 1 -12 2 -11 8 3 3 -4 -3 -1 6 -1 3 4 4 -3 4 -9 -5 2 1 14 -3 -8 -6 3 8 3 4 4 3 6 -1 7 4 2 5 3 -3 -7 -3 -10 -4
5251 -4 -14 -8 0 -9 -12 -12 -14 -7 -22 -17 -15 -14 -18 -17 -17 -18 -12 -9 -11 -7 -12 -7 -4 -1 -3 4 -3 8 7 10 7 1 15 11 -7 -2 -2 0 7 13 10 7 1 10 10 14 15 6 11 4 15 21 6 3
5305 3 13 12 4 8 22 20 8 12 3 -3 -2 -1 -2 -13 -2 -2 7 7 -6 -9 -1 6 13 5 5 19 15 12 12 11 10 2 2 5 3 1 10 13 18 2 19 8 2 14 9 21 10 18
5353 18 10 -5 4 7 8 5 6 7 2 -1 7 14 17 7 17 17 -5 -3 4 -6 -4 -6 -1 1 -12 -16 7 -11 -13 -8 -7 -16 -6 9 -7 -10 -9 -4 3 0 -3 9 12 6 20 25 5
5400 5 15 13 15 9 17 17 8 8 11 13 2 -1 7 15 -1 0 12 7 9 11 16 16 11 16 14 6 4 23 7 3 0 6 1 -11 12 5 -13 8 9 -9 -1 8 7 -2 -14 0 9 3
5448 3 17 5 14 1 3 15 12 5 3 8 20 9 23 12 18 14 19 5 16 15 12 18 9 11 15 10 5 13 16 18 6 18 18 17 23 17 24 7 5 15 7 6 14 9 10 15 4
5495 4 18 6 6 17 5 14 5 3 10 6 14 6 4 30 25 22 14 25 24 12 16 18 21 21 19 24 14 20 23 11 12 26 25 19 9 14 19 9 13 19 23 15 14 20 14 15 16 28
5543 28 15 11 24 11 11 11 4 26 10 2 8 8 1 10 13 9 12 13 25 12 19 19 14 21 25 12 20 10 23 29 13 19 28 24 27 13 22 31 16 20 19 25 21 26 8 12
5589A2J3rJ3j2MrmMjRoPj3JMj1K%JOjrJ6j1J8q%oRj4PLoJ5j1MKLj2%Qj8J2LjN
5635A9j4J5jmJ1%k0OJ1rmj1J4pJ0pokJ4loMj%j0J0jJ0j3%mJ7j8pJ2nJOoKj2K3
5677A4q%%RlKKlk%NrMKRNj3J0j5OqQ%jKNj2rJ4j9Q%RJomJ0j1RmoJ2olkomOKOj1
5728e%OnmmOqnJ0QlOoljJ1moLRoj0J0KPoKjJOj3Rklj%Lojj5J8jnpRRplKKllj2
5781b0J8%KQj0%%J3j4OJ0mj3LRKrj0P%K7k8K9j6nLJ1ojLj2NMQj9J1mJjKQj2kQ
5825A2Mj1%M%kOrmOrmJ0j3ONjMoPj0PlmJ9o%Oj0MjMnOqkRkj7J6kMMM%nKOrj3J2
5876A1jPj2lQmMrJ7j2Qj9JJ1llnrRj3RPJMqJoJ3j1MMrJ2oKLLopJ6j0J4rPj1J2
5922A2lLLnlNMj7Qj5J5mrRKMj2OlpPMj4OLj1lJ1onLJ2j2Lj0J4oj0J4OjJrJ5pk
$$ plain form
5589 12 25 16 29 17 21 12 8 12 11 20 14 21 8 9 13 2 4 4 5 11 10 1 17 6 24 16 16 10 19 5 12 15 9 24 13 17 19 22 10 10 18 0 12 15 14 19
5635 19 5 20 19 15 26 26 6 12 23 14 10 -1 13 6 16 9 3 1 15 12 6 10 9 9 -1 9 8 18 5 5 1 18 0 -7 5 0 1 7 1 3 -9 14
5677 14 6 6 6 15 12 14 16 13 11 11 16 7 11 13 22 27 14 24 9 15 7 15 15 14 16 21 9 0 14 -5 3 3 12 13 7 3 13 2 11 7 1 13 7 4 2 -4 -8 -2 0 6 -5
5728 -5 -5 1 -4 -8 -12 -6 -14 -19 -9 -1 -4 2 -4 -7 -8 3 -1 -7 -4 5 -1 -11 -1 1 8 2 4 3 4 10 -3 6 4 1 0 0 3 -3 -4 -19 -1 -2 -7 -14 -5 4 -3 -6 -4 -2 -5 -8 -20
5781 -20 -2 -2 0 8 -2 -2 -2 11 -3 3 13 9 -4 -1 8 10 1 -9 -2 -2 25 -3 26 10 5 8 19 13 12 15 3 8 12 20 1 12 8 9 8 10 18 6 4 12
5825 12 16 5 5 9 9 7 13 4 0 6 -3 -7 3 -10 -4 1 0 4 -2 5 -5 2 -1 -5 14 8 8 14 4 8 7 11 6 12 4 2 11 9 -8 8 6 10 14 18 18 13 15 21 12 -1 11
5876 11 10 17 5 2 10 6 10 1 18 6 14 -5 -4 7 4 1 -4 -13 -4 -17 -8 -1 0 4 -4 -3 -9 4 -7 -3 1 -8 4 -2 0 3 6 0 -7 9 -1 13 4 11 0 12
5922 12 9 12 15 10 7 12 16 -1 7 -8 7 3 -6 3 5 9 -3 3 0 -7 0 4 -10 -4 -1 -12 -15 -4 -10 -15 -12 0 -12 -9 -19 -5 -11 -21 -7 -1 -2 -1 -10 5 -2 -4
5968dL%qOKkJ5lJk%rJ5j8J3jmPKppJ9nnlmLJJKMkpOookLNkLnLj6J6qOrOlJ0jj
6021BqNPqjJK0k7MMJ0q%J2mKj1K3Ok8J9j2J4qmQnLJk%qQpMnkOnjKjn%qPkN%j0
6071gJ0qnnK0lMkPrJ9j1pJ1mKLlj1J4j8mJ6J5k0nJ6nnPKJpOJmj4NJ1j4PnMj2J2
6116Ekj3KLKOkj5J5mk0K0KrmkoJ6Rj0%KLKPj7OLlmJ8j1pJ4rJ3qjQlLljkLJkrQ
6165DNj4LJ0j0%nK1oqkJqnRj3J8j0Kj0J0j3J8jj7K9j3LRj0rkLJ0nOMpQj2PJnJ3
6209ImJoJKlkJ3%j3NJKKpJLojOoj1J6pjJqLoNjjkLO%Kj1ROj9Qj9K4pRmjJOmPk
6262@PrKNlRMomJ1qnO%Qj0lJ1knkqKNPmj0J1ljj0J3KKpKm%kNnpLNLqJl%rK2mM
6315Hj1N%K%J8j5MjjQj2mKJ7jklLnl%kOpPj3J2mlqRNolK%lRkj4LQLj0%JQ%MoO
$$ plain form
5968 -4 -1 -1 -9 -3 -1 -3 12 9 10 8 8 -1 14 -4 9 8 4 11 13 6 -1 18 13 8 5 1 4 5 6 8 12 10 3 9 3 -3 -5 -2 3 1 4 -1 2 -14 2 -6 0 -9 -3 -6 4 3 2
6021 2 -6 -1 6 -2 -3 -2 18 -9 -5 -1 9 1 1 13 9 11 0 23 29 1 20 8 22 14 10 18 13 16 17 15 15 7 15 8 12 7 5 11 6 5 7 6 1 1 -7 0 -2 3 3 -7
6071 -7 3 -5 -10 -15 5 2 6 4 11 2 21 10 3 14 10 12 15 12 1 15 -3 -7 9 24 4 -1 15 10 5 12 14 15 8 14 15 11 -3 2 13 -1 6 1 5 -7 5
6116 5 3 -10 -8 -5 -3 3 1 -14 1 -3 -23 -3 -1 -10 -14 -16 -22 -6 3 -7 -7 -5 -2 0 7 -10 -4 -1 -4 -8 10 -1 -8 6 -3 10 2 1 9 6 9 6 5 3 6 7 5 -4 4
6165 4 9 -5 -2 8 -2 -2 -7 14 8 0 -2 -1 -9 -14 -5 -18 0 -10 -8 -18 -8 -21 -3 -4 -21 8 -5 -2 7 -3 -12 -14 -11 -1 -6 0 4 -3 5 -7 0 1 -4 9
6209 9 5 6 0 1 3 0 -2 11 11 -2 3 4 6 8 1 2 5 -1 -2 4 -2 -13 3 -4 -5 -4 -12 -9 -15 -10 -11 -12 -14 -11 -5 -5 -3 -14 -5 1 -18 -10 -29 -5 -12 -3 -7 -8 -7 -1 -5 2 0
6262 0 7 -2 0 5 2 11 15 9 5 16 8 3 9 9 17 7 4 15 13 8 6 -2 0 5 12 8 -2 9 6 5 -5 8 10 12 5 7 3 3 1 6 1 -6 -3 2 5 -3 -2 -5 -5 -14 8 4 8
6315 8 -3 2 2 4 4 22 7 11 10 9 17 5 1 3 20 19 17 14 17 12 9 9 7 13 6 13 0 12 8 5 -3 6 11 5 2 4 4 1 10 8 -6 -3 5 8 -2 -2 -1 7 7 11 5 11
6367A1qMPj4J6j2Rj0PlpLPJKqjJ1j4J0jNlj5kJ4lNk%j8J6Lrj%PqOklj9K4pnQj0
6414iqOqRNlj1J4%LLnNQKj2pKQqRJ1nLmKJ2j1%j0J8lPj0MnJ1j2J1rOoOnj5%RM
6462A2qqJ1j4J4%j1Mj2J3kpJ2j3J3pLKj6J6J1j2Jkj0J2nK1j8PJ0k3RMNkJj%NM
6503A9oQj4kPoJ0j1MpmJ1pKjOj6J2JjKk2J7rpLQkJ2kqj7J5NpJ2Kj0nJ9lnlLJ1
6548A4j2j1J6qjJ4oLKj0KK0k8K4Mj5J0Jj3OLorOJ8j9jJ1Pj3j1mJ5qjKkmj2QJ0
6589BqQoKkjLoPlj0K2omKoRomJ1LLj8J1Mj3J2kKOPj6LoKLkqJ6j2mPMjoj0J4Kj
6638Dj6Oj1K4j3mmQQrkOnoJ5kLqLrJ1kLMj0PNo%OJ3j4LqJ8j4LmmJ6np%J2j4J6
6684A7j3j5J2Qr%%LqLQk3RRjkJRj7L%NqnKRj1J1PrQMmmrJ4qPJ5ojpLRj0P%J6j7
$$ plain form
6367 11 3 7 14 0 16 4 13 3 10 7 0 3 10 11 13 5 4 15 1 11 10 15 12 -3 -5 9 6 11 9 9 -9 7 10 1 0 0 7 -1 5 3 0 -19 5 -2 -7 1 -9
6414 -9 -17 -11 -19 -10 -5 -8 -19 -5 -5 -2 1 -4 1 9 11 -1 -8 -6 2 -6 3 14 9 12 8 10 22 11 11 1 19 16 23 13 17 12 23 11 22 13 19 13 19 14 -1 -1 8 12
6462 12 4 -4 7 -7 7 7 -4 0 -12 1 -1 -8 4 -9 4 -3 0 2 -14 2 13 1 2 0 -10 2 -3 18 0 7 17 -6 3 7 12 10 11 10 10 15 19
6503 19 13 21 7 5 12 6 16 5 9 2 -2 9 2 4 3 9 -7 5 6 5 7 -15 2 -7 -14 -11 -3 -5 7 5 -3 -20 -5 0 -7 5 7 -3 -8 11 8 3 0 3 14
6548 14 2 -9 7 -1 -2 12 6 9 11 1 3 23 -5 19 23 8 18 19 6 12 15 9 0 6 24 5 4 15 22 9 -2 -6 9 1 0 2 0 -4 -16 -8 2
6589 2 -6 2 -4 -2 -4 -5 -2 -8 -1 -4 -14 8 2 -2 0 -6 3 -3 -7 4 7 10 -8 3 7 -6 6 4 6 12 19 3 6 0 2 5 3 -5 11 -1 -5 2 6 5 -1 -11 3 5 4
6638 4 -12 -6 -17 7 -6 -10 -14 -6 2 -7 -9 -3 -8 -14 1 -1 2 -6 -3 -12 -1 -3 0 4 -6 1 6 0 0 6 19 5 8 0 18 4 7 3 -1 15 10 3 3 15 1 17
6684 17 4 -11 1 9 0 0 0 3 -5 -2 6 -17 -8 1 0 -2 -1 8 -9 -6 -6 -1 -9 -14 -12 -3 -14 -3 4 -5 3 7 3 -1 -10 4 -4 3 18 12 11 4 7 16 6 13 13 29 12
6733A2j3NMl%J2qPj0OJ1j7RqoJ0j7LJ2%rPj0RnjmNnRklNLj7ONKmMoJ3Oj4%oK1
6780A8j2KjrJ7kkqK4j4mJ3pMLj6pJ0jRkLjlQoj6J0j2J1Pj4KnJ3nNj3LJ1mkmj0
6824g%QjkOjpJQlNNrj1QJ7k0J0pk%J9jLj2MKj3MoJ3%j4MNnmRrpJ2Nj4N%%%Oj9
6873a5J5Lk0J4Kj3LmMJoJ4j1J0j5RJ3j6OJ2j1PqKOplQLj%pKPj5K5j1Lj0KJ2rj
6916@%moJ4lQj3pJ0opMOj3RlnNpJ1oJ1nJ3j5NMj3JMLoNJ2j2MOj4J9j5PlKkPj1
6962fJ3J1j1oRQk2OjKNjj4J3j1nJ9k0J6j6LJJ5pjRmnj4RpKQj7K4j5QLj4%LjJ6
7005EpJj0J5j7J1OqNJ4kLrpkJJ1MQk1J5rj3%J4Pj2J2l1K3J3ok3J5pJ4j2LkPj4
7046eQmJ6j8NKlj3PJ3mnMkkLJ1j1knRj0Oj0K1j0PlNrQomR%NjmmJJ0rMkj8K5nN
$$ plain form
6733 12 -1 4 8 5 5 17 9 16 6 12 23 6 15 7 1 11 -6 -3 9 9 0 7 -3 6 1 0 -4 1 -4 5 3 0 5 8 -9 -3 2 4 0 4 -2 11 17 3 3 -3 18
6780 18 6 8 7 -2 15 13 11 3 27 13 9 22 15 19 22 6 -1 9 8 17 15 18 17 14 22 16 0 10 -2 9 16 2 4 -1 12 7 12 -1 2 13 9 7 3 -7
6824 -7 -7 1 0 -2 4 3 -4 -3 5 2 7 12 3 -8 0 17 -3 7 0 -2 -2 17 16 19 7 11 13 0 4 -2 11 11 -3 1 6 1 -3 6 -3 -10 2 7 -7 -2 -2 -2 -2 4 -15
6873 -15 0 3 -17 -3 -1 -14 -11 -15 -11 -10 -16 -2 -13 -3 -18 -9 4 -12 -6 6 -5 2 -6 -4 2 -5 -8 0 3 2 2 -5 -3 4 -11 14 3 6 -4 -2 10 1 0
6916 0 0 -4 -10 4 1 9 -4 -11 -1 -7 -14 -10 -4 -17 -8 -11 -16 -11 -18 -7 -13 -2 -7 6 -9 -4 0 -13 -12 -8 -5 -11 -6 6 -6 -2 4 -10 9 -6 1 -2 0 -2 5 -6
6962 -6 7 18 7 1 10 18 -4 2 1 3 8 7 -7 6 -5 -10 9 -11 5 -11 -8 -7 8 1 0 9 5 0 -14 -5 -12 -10 -2 -19 5 -10 -2 1 -13 -13 -10 -11 5
7005 5 -2 -1 -11 4 -13 -2 4 -4 1 15 13 16 7 0 -2 -1 10 14 22 1 16 7 -6 -6 8 15 3 15 -16 7 20 14 -9 6 -1 13 1 4 2 9 -5
7046 -5 3 -1 15 -3 2 4 1 -12 -5 8 4 -1 3 1 -1 2 13 2 0 -5 4 -6 0 -10 11 1 8 5 10 1 9 3 -1 8 8 13 12 8 4 5 15 6 10 8 -10 15 10 15
7094A5j5nJ0JpjLmJ1rjpNqKKNJj4QQkqJ2p%mPMj3J9nKMkPlkj6JMJ8nJpQLj6J3
7143A3%%olJ0j1kJ4j4nOOMj4KjlJNj2mK0qnmO%PqjJNLj0nJ6pLj0J0JJ0j0nJ0J
7189FmJ0j6KJ7k2J6rJJ4j2R%%rjmJ2pmQLj5J4olLmj0J3JlmpKPmOjqKMJ8k0%jM
7236bmNNjJ2j4J4j3rK1j0Qj0NkKQqlNRMj8J7rlKoJLOj1jq%%OnkJ5qO%lj3J0lj0
7284a2MkQOljjJ0mMj7Rj0K8j8MpLLMrLlQPj4J4OqlmrPJJmqJ6j5J5Nj2nkJ4qKO
7332IJk2NJ3qMj0POj9LMlJ2nJ1j5PPj4nOJJ1%KKprJ3%qJ0qnQJ0%rpOMpPkqK%j
7381aJ1j4jqQm%LRj1J8j1j2MJ0j3OJ0j1P%mkOMj3PqjK5j4%OKoJ1JmKJlqJ1Lmk
7427A0mMkLLKolrLjJ1oJMmj2RmnJJ1j1%JNmJJl%JjNj3NJ3Mj3mQPpMjJj3QRj1L
$$ plain form
7094 15 0 -5 5 6 -1 -2 1 -3 8 -1 -2 -9 -4 -12 -10 -8 -3 -2 -16 -8 0 -2 -10 2 -5 -5 -9 -2 2 -11 8 3 5 9 7 14 11 9 -7 -6 -2 16 11 12 5 13 16 0 13
7143 13 13 13 7 4 14 3 1 15 1 -4 2 8 12 -2 0 -1 -4 -3 2 -10 -14 6 -2 -7 -11 -5 -5 2 -6 -7 -6 -1 2 -8 -13 3 -4 -1 -11 -1 0 10 0 -5 5 6
7189 6 2 12 -4 -2 15 -7 9 0 1 15 3 12 12 12 3 2 -2 10 3 -1 7 10 -5 9 3 0 3 -1 -11 2 3 0 -4 -11 -9 -2 -6 0 -1 -9 -7 -3 15 -5 -5 -6 -2
7236 -2 -6 -1 4 3 15 1 15 2 -7 14 4 12 2 7 5 7 15 7 4 9 18 22 4 21 12 9 11 5 6 9 15 4 3 -5 -5 -5 1 -4 -6 9 1 7 7 4 -9 1 -2 -12
7284 -12 -8 -10 -2 4 1 0 -1 9 5 9 -8 1 -9 19 1 5 -2 1 4 8 -1 2 -1 7 14 0 14 20 12 9 5 -4 3 4 5 1 -7 9 -6 9 14 2 -3 -5 9 1 3 9
7332 9 10 -12 -7 6 -2 2 -8 -1 5 -14 -11 -7 -10 2 -3 8 -7 0 7 -7 -12 -6 -5 6 6 8 10 3 -6 7 7 -1 9 1 -4 4 14 14 5 -2 4 8 1 8 6 -2 0 0 -1
7381 -1 10 -4 -5 -13 -5 -9 -9 -6 3 -8 10 -1 -13 -9 1 -12 -6 4 -7 0 0 -4 -6 0 4 -9 -2 -10 -11 14 0 0 6 8 2 13 14 10 12 13 10 2 13 16 12 10
7427 10 6 10 8 11 14 16 10 7 -2 1 0 11 5 6 10 6 -6 3 -1 -6 -5 6 -5 -5 -4 1 -3 -2 -1 -4 -4 -3 -4 1 -12 -7 6 10 -3 -7 1 8 1 5 4 5 -8 0 9 -2 1
7478ANLmmRNjLj1KJmNKqnORj3q%KlNNjjoJ1rJrROojkMj0Rj3NJ7k5J7nRnNj6J5
7529AqJ1nRrOOj1LPlJ4j4mQj0NkJ0j6N%rJ8lqLJJjj4K4r%qpL%qQJ2k7J8Llnjo
7577a5Qj8J5jj2J8Pp%K%jMLPmllLlKOMlJpJoQoNkmJ0MmrJ1knpJ4j8QpNJ1orMn
7628fMj1J3j4jJ6kMjj6K1mpJjOnQ%lNj3K0%pJ3j3omP%J2j0J1j2Nno%LOj5K1j4
7672@MooJ6Jj3RJrl%J5j7RJroJ3jj7J7k0J4kJ0jkKk%PjkkJ1oKjoKJ5pj0J0J1j
7718B0j3OKj2jQqMnoKMklRj4J0pj5K8k1J3llJoQKj5RJ0j2Qj9K0j1Rj2J2ljJ0n
7761bJ0j0MlkK%Qj1J7mMnj0KJ0LnJNpkPj0LmJjPk0J6j2J3Mqj0jJ1pj0JRMNKj3
7807hMkkNjKJ9j6kJMlnJ6mPnplJ4%lmJ1j2Qj5J2kkLjKnJ0k0J9ojpkK1j8Qkj0P
$$ plain form
7478 1 6 9 5 1 10 15 14 17 6 8 9 5 10 12 4 -1 5 14 1 -7 -7 -5 -8 -3 2 1 0 -6 5 -4 -3 -12 -3 3 -3 -4 -6 -2 -12 -3 -16 -11 6 -19 -2 -7 2 -3 2 -14 1
7529 1 -7 4 -1 8 -1 5 11 0 3 10 7 21 7 3 11 1 6 4 14 -2 3 3 -6 12 9 1 4 5 6 5 -9 15 6 6 -2 -9 -6 -6 -14 -6 6 -21 -3 0 -3 -8 -9 -15
7577 -15 -7 -25 -10 -11 -23 -5 2 -5 -5 -3 -3 -4 0 3 10 6 3 0 3 0 2 8 12 9 10 3 4 -2 6 0 5 3 -1 9 13 9 0 11 9 4 -3 11 -7 1 -6 -1 10 4 -5 -1 -6
7628 -6 -2 -13 0 -14 -15 1 -1 3 2 -14 7 3 -4 -3 -4 2 -3 5 5 2 7 -6 14 14 7 20 7 1 -3 4 4 16 6 17 5 10 5 -1 -1 2 8 -7 14 0
7672 0 4 -2 -8 8 9 -4 5 6 -3 -6 -6 9 -8 1 2 -7 -13 0 -1 -18 -1 -21 -7 -9 1 0 -2 0 -2 -2 5 4 2 0 11 5 7 6 0 2 17 10 0 10 21 20
7718 20 7 13 15 3 2 10 2 6 1 -5 -3 1 -1 -4 5 -9 1 -6 -21 7 -14 -1 -4 -7 -6 -12 -4 -2 -17 -8 2 -10 -2 -21 -1 -12 -3 -15 -3 -6 -7 3 -2
7761 -2 8 -2 2 -1 -3 -1 -1 7 -4 13 9 13 8 -2 0 10 13 8 9 14 7 5 12 2 5 1 2 1 8 -12 4 -8 5 9 1 -9 -10 1 -6 -16 -15 -6 -2 3 5 -8
7807 -8 -4 -6 -8 -3 -4 -2 17 1 -1 0 4 1 -4 12 8 15 10 3 0 14 14 11 7 18 6 14 -1 11 9 7 10 9 11 6 16 -4 15 9 8 1 -1 20 2 10 8 -2 5
7854Eo%jmKLOJj5Rkj3J5nmQOrlJ4pPMj2kPPj1QJ7j4pJ1rR%lkj3QJ7onoQpjLLm
7904GMj7J0jPpmJ4j4rJRKjj2oJ1KqJ0Qj5NJ0j2J0j0J5j6MKOOpNj7K1rqQJ0lmp
7948@J1jlp%J1k0J2Pj2MJ1pJ3rqJljKMpNj3J3j9J2oLpJ2k%NrrJ5jj0PPqR%J1p
7994FJlkJ3j0OkkJ0j2%J1%%j4KQnmQlkrJ1pJ6%k0J4nMj8J4lj2J4JlkJMj2Rm%l
8040dj0J4JrOKLnJ0Mj2%OnKPjmnO%j1LPOmJ3qKj8Pj4J2kjJ0qoLJ1Kk0POrkMkj8
8089b4RJ6j0J0j4J1%nNnj3J6Rlj0PLkomJ8qJJrK2rk6L4j8PRj6J2qJ4j2nOLNj5
8131dJ5j4%MPKj3lknK3j5NmJ1j2oQjOj4PJ6qnLjmnJ5%JLj1J2j1mJ5oQlj3J1On
8176Ikj1J8ojM%lJ3j4Lj3Mnl
$$ plain form
7854 5 -1 -1 -2 -6 -4 -1 5 6 -9 0 -2 -15 0 -5 -9 -1 5 -4 -7 7 0 7 11 -1 -3 4 11 0 8 25 11 4 15 6 15 15 12 10 -3 5 22 16 11 5 13 6 5 8 11 7
7904 7 11 -6 4 3 10 3 -1 13 -1 -10 -9 0 2 1 -11 -17 -6 -4 -12 -2 6 -9 -4 6 -6 4 -6 9 -7 -3 -1 5 11 4 9 -8 13 4 -4 4 14 11 7 0
7948 0 11 10 7 0 0 11 -9 3 10 -2 2 13 6 19 10 2 3 0 -1 1 5 -2 3 -10 3 -16 -4 -10 -7 -14 -2 -4 -4 1 -8 -17 -2 -3 -13 -6 1 -7 2 2 13 6
7994 6 7 4 2 15 5 11 9 7 17 5 5 16 16 16 2 4 12 7 3 11 8 6 -3 8 1 17 17 -3 11 6 10 -8 6 3 -9 5 6 3 1 2 6 -6 3 -1 -1 -4
8040 -4 -14 0 1 -8 -2 0 3 -2 8 12 0 0 6 1 3 10 9 5 0 6 6 -5 -2 5 11 7 20 12 14 -4 3 -11 1 -1 -2 8 0 -6 -3 8 10 -10 -3 3 -6 -8 -4 -6 -24
8089 -24 -15 1 -9 1 -13 -2 -2 -7 -2 -7 -20 -4 5 2 -8 -1 2 0 -6 -10 8 0 1 2 -7 15 6 -20 14 -4 3 12 -4 8 0 14 2 -3 3 6 11 -4
8131 -4 11 -3 -3 1 8 10 -3 -6 -8 -13 10 -5 0 -4 7 -5 -11 -3 -4 2 -12 -5 11 3 -2 1 0 -4 -9 6 6 7 10 -1 11 0 -4 11 5 13 10 -3 8 14 9
8176 9 7 -4 14 8 7 11 11 8 21 7 10 -3 1 -4 -7
8191g
$$ Imaginary data points
##PAGE= N=2
##DATA TABLE= (X++(I..I)), XYDATA
0@%%%%%%%%%%%%%%qJ6j6J6j6J6k4L2l2L3m1M8n6O4p2Q0q8J04j16J28j44J60j80
37i6K00k20K45k72K99l29L66m05M48m99N56o19O93p81Q87j016J173j374J646k031
57a129K622l666O042k0865o042K5847k1527j1736J5439J3110j4653j937J3713
70d782O52j4365N038J4042l501j3544L271R460q64n978N5K58N6K420N57m529j26
87a1880M416k87k967L835K886n426j605R155K786r414k444R627J965q079k35O524
103a143k560n653M801M907o862m914P152M104o568k510N575K19m352K875M325
118f04m884m114O477M327o402l402O058K047n154K17N168j861m894L506N607l228
134a136m674L212M101j974j760K107K59j764J584K423j950k340J668J443j320
$$ plain form
0 0 0 0 0 0 0 0 0 0 0 0 0 0 0 0 -8 8 -8 8 -8 8 -16 16 -16 17 -24 24 -32 32 -40 40 -48 56 -60 68 -76 84 -96
37 -96 104 -116 129 -143 156 -173 193 -212 236 -263 293 -326 367 -414 473 -543 630 -744 902 -1129
57 -1129 1493 -2173 3869 -16996 -23038 2809 -18718 -30454 -15015 -1905 -16558 -18495 -4782
70 -4782 -4130 -18495 -13457 585 -2916 -16460 -13189 -3729 -4593 -10571 -10516 -10258 -10202 -7782 -7225 -11754 -11880
87 -11880 -7464 -7751 -10718 -6883 -3997 -9423 -11028 -1873 913 -8501 -10945 -1318 647 -7432 -7667 -1143
103 -1143 -3703 -9356 -4555 352 -6510 -11424 -4272 -168 -6736 -9246 -3671 -3452 -7804 -4929 -604
118 -604 -5488 -9602 -3125 1202 -5200 -8602 -2544 -497 -5651 -5434 -266 -2127 -7021 -3515 2092 -1136
134 -1136 -5810 -2598 1503 -471 -2231 -124 135 -1629 -45 2378 428 -1912 -244 1199 -121
149a21j43P49k062j210L698J953m411k366M760K963l638j665L515O88l005J148
165H53L516k116m173K325M330k073m263J013K777j044j687O58j37j607O44K044
181A060o15j886N23J608L44J85L53j004m77K351J652k300k169J968K084j476j426
198G75R93J77j433P01J917j317k737J159L023o43k670K67J963No51N60J3j151
216I51M02J714l13j952j30J404N0r68j08n0p45K30J144m36j744N8J592J07j259
235e3j01O42k75k37P68L2j337k58J397L95j295n38P52L52k16J90J4n96J16J048
255H00J04j025j45R09J77m72J48K35n17p6Q69K1j179k48R70J0r72k6O18l80n46
276g25O44N20p93m58R12N01p51l47N38k7n38J76L41n70n08N73L92o98m57M60J95
$$ plain form
149 -121 -264 485 -1577 -2787 911 2864 -1547 -3913 847 3810 172 -1493 2022 2710 -295 853
165 853 4369 2253 -1920 405 4735 2662 -1601 -588 2189 1145 -542 116 -21 -1628 -984 1060
181 1060 445 -1441 -918 690 1034 1219 1572 568 91 2442 4094 1794 -375 1593 3677 2201 775
198 775 1768 1945 512 1213 3130 1813 -924 235 3258 2615 -55 212 2175 2180 1529 2089 2102 951
216 951 1353 3067 2754 802 672 2076 2126 1158 1050 1000 255 485 1629 1193 -551 -493 1099 1206 -53
235 -53 -154 488 213 -24 744 776 -561 -819 578 973 -322 -860 -108 244 28 218 232 -364 -248 800
255 800 904 -121 -266 643 820 348 496 731 214 138 1007 1028 -151 -399 571 581 -391 -417 201 -179 -725
276 -725 -81 439 -354 -812 100 601 -150 -497 41 14 -524 -348 -7 -577 -1085 -512 -120 -818 -1275 -815 -620
297f20m71p9L12k05l16M08L84l94k12N52L35l31m0M35ql45J26K83k56k54K38J60
319b98k78n9K83k7k63J28K85j47k06K02K30j67o2K20J5k17N4J77j25k15J08J13
341b49k22j40J36M1k19p2J85L1j64pQ2j7NJ19K6j38K4K31N8j90j14J12Q0p3j01
366e76m5l7N7J02qj08j4J63J21n6q9L5J02K6m2%QK1N3P9K6p0k9P3K7p4q9j0m5
395c99l0L4M3l1q0P8J55K2j58l3J18J20n7o7J0L6P3O9j3p0L2J46M7j57r0R1P5
422c6q0p5L9J8LL4M2m1l4J11N4r2k3J09M1o7PJ18n0p8Q5Q4j01o8J38K7j42RJ30
451A62o1j35J40J41j73j24K33J82j95j23K24J30j22Q2J73j30j25K98K31l41k60
472B07L25K66k52k00J84K2j44J46J72l21k59L93K86l85l13K75K17j95nK05j56
$$ plain form
297 -620 -1091 -1170 -858 -1063 -1379 -971 -587 -981 -1193 -641 -306 -637 -677 -242 -250 -595 -469 -186 -442 -696 -458 -298
319 -298 -576 -635 -352 -379 -642 -514 -229 -376 -582 -380 -150 -317 -379 -159 -144 -361 -307 -130 -255 -470 -362 -249
341 -249 -471 -611 -475 -434 -653 -725 -540 -509 -673 -680 -598 -615 -610 -491 -465 -603 -579 -348 -290 -480 -594 -482 -402 -475 -576
366 -576 -621 -658 -601 -499 -507 -615 -629 -466 -345 -401 -490 -455 -353 -327 -369 -369 -361 -340 -287 -208 -182 -252 -281 -208 -181 -255 -344 -354 -399
395 -399 -429 -395 -352 -383 -463 -385 -230 -208 -366 -399 -281 -161 -218 -285 -275 -239 -166 -97 -110 -180 -148 -2 45 -112 -202 -111 -36
422 -36 -116 -191 -152 -134 -131 -97 -55 -96 -130 -19 35 -57 -80 29 70 3 10 128 78 0 85 169 68 0 138 165 23 32 162
451 162 101 -34 106 247 74 -50 183 365 170 47 271 401 279 361 534 404 279 577 808 467 207
472 207 532 798 546 346 530 552 408 554 726 405 146 539 825 440 127 402 619 424 419 624 468
493D68k36L41L29l84l96L09K71l23j52K09j55l67L21M24m74n76L78N38k99l65
513a39K60Q8k44K49N14l44n68M62Q11k51o44K05M11j28o4K29l18n10M25O30m72
534F02p56L10N08k89j97L28k12n36N44Q50n68r66N58R47m20o30M17K10o79Q9R12
555A022l78j328K16J304k10j186K3O76j87k03M43j31q56K94J182j20j090R7Q80
574D48K8k67L15j36o91M62J151m29j338L23J311j71q30L44L76o03Q5J132k02j426
594a18J60J472p3j153J09N88m31r6R05k68j434L20J686k66j558L04J180n13n92
613B22J101K27j669o7K179P3k374k80K044Q5j676P4J060p85q65J213O74j512p37
632a013J502Q05r68l52O16P2R9Q04q0j058L33J356k92j128M86O04j106l24J582
$$ plain form
493 468 232 573 902 518 122 431 702 379 227 436 281 -86 235 659 185 -391 -13 525 226 -139
513 -139 121 209 -35 214 728 384 -184 278 1089 838 194 399 810 682 618 847 529 19 444 1074 602
534 602 -154 156 664 375 178 506 294 -242 302 1152 584 -382 176 1123 703 73 490 700 21 110 1022
555 1022 644 -684 -468 836 626 -560 -537 139 -48 -251 192 61 -795 -501 681 561 -529 -432 448
574 448 476 209 524 388 -303 159 1310 881 -457 -134 1177 1006 176 520 896 293 378 1510 1308 -118
594 -118 42 1514 1441 288 397 985 554 458 1363 1095 -339 -19 1667 1401 -157 147 1327 814 222
613 222 1323 1550 -119 -186 1993 2066 -308 -588 1456 1541 -135 -61 999 214 -651 562 1236 -276 -1013
632 -1013 489 1294 326 -26 590 662 761 1565 1485 427 760 2116 1824 696 1182 1786 680 356 1938
651A938j51k441K0K636r9k734O5K335l75j751J056J461j596j114K269J243k304
668D58j147K098Q99j647n01R33m67q41Q98M46j628o71J437L72j262o9P85n64l74
687h45J385L22j822k04K160L64j851n5J468l92r90J063O65j766o18K064N51k121
705f22m60J733M8j206O97R01j441o24K138O71k413o58K307L93k022j3J545q44
723A30j442J392J253j943j381J944J293j718r68J363M63r71K49Q31p77p87J005
740f4O74j006n81N74r8l85N64Qj346q9J709O9j832M9J774j83j284R29J280j236
760d74r05J944J103k053r88K071Q29j898n89J502r9j479M38J245r61j325J052
777e87J168r79q43R11N05o46J24P51m25o41P89P15p94o11O57J77o72N9M70o54
$$ plain form
651 1938 1787 -654 -634 2002 1903 -831 -766 1569 1194 -557 499 1960 364 -750 1519 2762 458
668 458 -689 1409 2308 661 160 1093 626 -215 683 1129 -499 -1170 267 639 -623 -692 93 -471 -845
687 -845 540 862 -960 -1164 996 1360 -491 -546 922 530 -460 603 1268 -498 -1116 948 1499 -622
705 -622 -1082 651 699 -507 190 1091 -350 -974 1164 1835 -578 -1236 1071 1464 -558 -571 974 130
723 130 -1312 80 1333 -610 -1991 -47 1246 -472 -1440 -77 386 -585 -336 495 -282 -1069 -64
740 -64 610 -396 -977 -403 -501 -886 -322 -314 -1660 -1749 -40 29 -1803 -1754 20 -163 -1447 -518 762 -474
760 -474 -1379 565 1668 -385 -1373 698 1527 -371 -960 542 443 -1036 -598 647 -314 -1639 -587
777 -587 581 -398 -1241 -330 175 -471 -347 404 -21 -662 127 842 48 -563 94 271 -401 -342 128 -526
797e26o96P69O16r75o36R13M82p58l1Q12k30o63P28Q70p99p62R51P31q89m67Q78
818C18J07r01K01R26m87r83O49R91o36p34P52N82o68j48Q45jq29K59Q93l44q25
839c3L54N42n30l84M84l0p15J42P09l55p25M30O69m62m17O14K65o23rP46j16p72
861b16K28O86l73o59M09M17n71l21N79J28o73K0O46j22m80L04M99l45k55O12K51
882G64n83k1O50m2o21J73N11l74n15M33L18n75k60N80J03n87K9N71j83n26L30
903A75M67m27m09M67K65n12j50M24q6m97J97M02m20m62M09L62m54k67M07J20l52
924c41J36L97k26l33L86L84l88l23L37J80l50n4K54j74l47K77L01l38l08L33K59
945F2k41n2K90j4k45K52L79k57l27K71L17k18k13J39l8k25R8J82l32l81K28L09
$$ plain form
797 -526 -1222 -453 163 -812 -1448 -535 -53 -811 -842 -30 -260 -923 -195 675 -124 -886 65 796 -93 -560 318
818 318 425 -476 -275 651 164 -819 -170 821 185 -549 203 785 117 -31 814 813 -16 243 1136 792 -33
839 -33 321 863 333 -51 433 403 -312 -170 539 184 -541 -111 558 96 -321 293 558 -65 -74 672 556 -216
861 -216 12 698 325 -334 75 492 -79 -400 179 307 -366 -346 300 178 -302 2 501 156 -99 513 764
882 764 181 160 810 768 147 320 831 457 -58 375 693 118 -142 438 541 -46 -17 554 371 -155 175
903 175 642 215 -194 273 538 26 -124 300 214 -283 -86 316 -104 -566 -157 205 -249 -516 -109 11 -341
924 -341 -205 192 -34 -367 19 403 15 -308 29 209 -141 -195 59 -115 -462 -185 116 -222 -530 -197 62
945 62 -179 -231 59 45 -200 52 431 174 -153 118 435 217 4 143 105 -120 -22 160 -172 -553 -325 -16
967a6k51l15J40J51j03O7J96j26k05K58L52j67l38J45K51p1j16N3m3j44R9J91
989Hj47k65K4J82Kr9k5o6k2K01J76k32j68J91K72m5j21K8L3pJ28J24k01k40J65
1014a04L00p0l02m4J75Q0o1o6p4q2Q3J13p4j87m5R2Q5Rq7j31M3K16R2j67j29J17
1040b18J77k0q0J2l1j6J23J31j38k03N2K21J7k02j29O9J01Jo0j19k7J16J11j8
1064a30o6lP4J01R6n1j54L3K10P3j75j04J02Q5n0n2K0o4n0Q7O3j09j33M6J07k
1090d6n7l2K1M5J14K8r4k6J27R5o6o0N7Nj5O6M2j38q5J61J31j67j50J22J04r1
1116I1r1M3j4l6Q3P3j01o9J53J11j18l8J10J7n5N5O0j10j02J73R9j99r7J60P2
1141B70j67k4J43p1j26J01J46j57j48J67J53j17p6J07K9r0J08R9j77j13K18J44
$$ plain form
967 -16 -267 -582 -442 -291 -394 -327 -131 -257 -462 -204 148 -19 -357 -212 39 -32 -148 -95 -138 -282 -183 8
989 8 -139 -404 -380 -198 -196 -295 -320 -386 -408 -207 -31 -263 -431 -240 32 -13 -134 -106 -73 -80 48 172 -29 -269 -104
1014 -104 196 126 -176 -220 -45 35 -26 -92 -166 -248 -165 -52 -126 -313 -358 -266 -181 -172 -259 -390 -347 -131 -39 -206 -335 -218
1040 -218 -41 -61 -141 -129 -160 -176 -53 78 -60 -263 -211 10 27 -175 -304 -235 -134 -133 -193 -312 -339 -223 -112 -130
1064 -130 -196 -199 -125 -24 72 21 -133 -100 110 183 8 -96 6 91 41 -11 9 -55 -105 -18 45 -64 -197 -151 -44 -46
1090 -46 -103 -135 -114 -69 45 73 -21 -47 80 175 109 49 106 111 96 162 204 66 -19 142 273 106 -44 78 182 91
1116 91 0 43 29 -7 76 149 48 -21 132 243 125 87 197 214 159 214 274 164 62 235 334 135 38 198 270
1141 270 103 79 222 151 25 126 272 115 -33 134 287 170 94 201 230 140 248 347 170 57 275 419
1163D19k36j54J82O0j94K7J54j57j96K37K24k98k56K77K39k42j74K02M8k04Q4
1184D2K30j53k74J99K51j64k16J20J01j36L0J51j84k29K66K43k69k37K59J58k03
1205a5K1K36j51k97K87M06l30m50L48M05k77k64K36Q6k82R7L49k32m69K35M51
1226C90k38l76J94J97k19M1K79j92l71K97M50l13m17K94K88l07r2L38j18m70K25
1247a20N74l05o25K76N12k61l45K94R8l91J09N17j93n89K47O07j95m29K45K05
1267B31l09M7M60k40o01L05O66l48o07L33M21l97j93N25k3o63J36P79j97p83J81
1288b77O51k14m37L01J93m68rN89j10o61J42N53j79l82K65R7m08J09O19k83p39
1309f48L53P74l81o43M30M26n84j55P19l5q93J36J003j87r43K33Q02k82n26M51
$$ plain form
1163 419 183 29 211 271 77 104 258 101 -95 142 366 68 -188 89 328 86 -88 114 162 -42 42
1184 42 272 119 -155 44 295 131 -85 35 136 0 30 181 -3 -232 34 277 8 -229 30 188 -15
1205 -15 6 242 91 -206 81 487 157 -293 55 460 183 -81 155 241 -41 56 405 173 -296 -61 390
1226 390 152 -224 -30 167 -52 -11 268 76 -295 2 452 139 -278 16 304 -3 -95 243 125 -345 -120
1247 -120 454 149 -476 -200 312 51 -294 0 98 -293 -184 333 140 -449 -202 405 210 -219 26 231
1267 231 -78 -31 429 189 -412 -107 559 211 -396 -63 358 -39 -232 293 270 -393 -257 522 325 -458 -277
1288 -277 374 160 -277 24 217 -251 -260 329 219 -442 -300 253 74 -308 -43 54 -354 -245 374 91 -648
1309 -648 -295 479 98 -545 -115 311 -273 -428 291 256 -637 -501 502 315 -628 -395 407 125 -401 50
1329E0L30n90j27P61P1p68J9O48o8m47K11J95m19j8N35q8o99J37O17k11m89L10
1351d0K93m66p3O84m5p88J49Q53j96p38K52N57m02l52N46J39p46m1Q20o2q26J21
1373c61P09k41n06M29L57n79j70P61J07p76k0P55n5n86K12M18l78l00N19J98o40
1394a47j50O21O8n23K7M02j90k24L98J27n00l7N92k2n58R8M37k33l67L78K18n65
1416a50j64O27N8o83rO50j36n49K68M69l76l45N28L23n72j84N71J16n24J3M65
1437C96j91m05L00L30m32k90M69J83m62n4M22m3l57K25L39k84k48L90K10l80j05
1458A3M04Kl95J22L23k33l35L02K44l99j74L84N6m25O5M28j75l99K62L69l03k99
1480a63L57K04l84j18M28pm46Q2M03j63l73K31K79k71j70L41Q7l74K7L91r0l51
$$ plain form
1329 50 380 -210 -337 424 495 -273 -254 394 326 -121 90 285 -134 -152 383 295 -404 -267 350 139 -350 -40
1351 -40 253 -213 -286 398 353 -435 -286 567 371 -367 -115 442 40 -312 234 373 -373 -414 406 344 -482 -361
1373 -361 348 107 -399 30 387 -192 -362 399 506 -270 -290 465 410 -176 36 454 76 -224 295 493 -147
1394 -147 -297 324 392 -131 -104 298 108 -116 282 409 -91 -128 464 442 -116 -18 419 186 -181 197 415 -150
1416 -150 -314 313 371 -312 -321 329 193 -356 -88 381 5 -340 188 511 -61 -245 326 442 -82 -69 396
1437 396 205 -200 100 430 -2 -292 177 360 -102 -156 266 223 -134 91 430 146 -102 288 498 118 13
1458 13 417 419 24 146 469 236 -99 203 447 48 -126 258 314 -111 -46 382 207 -192 70 439 136 -163
1480 -163 194 398 14 -104 324 317 -129 -47 356 193 -180 51 330 59 -111 230 317 -57 -30 361 271 -80
1502h0J80K87k55k06L37J07l98p2M40k8m43N3L96j28l07K27K43l01j33L93J21
1523D33m07n0L64J2k97M9J89j80j38K34Jl59k2L28q0l11J06K37k21j23L19R7l91
1546b10l5M80M2m16J0L81o7k98J83K01l03j85L27J39l94j63L09O9k56J1J66j32
1568a41j11K65J15k89q8L40P8k44OJ91q9j36K01J22l09j41K95J19k94j08J88r
1590c9j56R4Q1j92j25K54J11k31j00J94K0q7R4O0k26n5L24P0l14j16K97P1k20
1613a91oJ73j05j52K18J60k62k08K33K12j88j78J02N9p2M7M9j02q1J28J26j01
1635a39p9N5L2KR4J1j63l7K15Q7k15j13J65N3j04j0N5j20j18J59J30j90j93J47
1659b76J65n5j05K9K0J4R2N4j15o1J39Q5p2o3M1j3nO1K1j46r3J47J10j47j12P2
$$ plain form
1502 -80 100 387 132 -74 263 370 -28 -100 340 312 -131 -78 318 190 -117 110 353 52 -81 312 433
1523 433 26 -24 340 352 55 104 293 113 -25 209 210 -149 -171 157 77 -234 -128 109 -112 -235 84 181 -210
1546 -210 -245 235 277 -139 -129 252 185 -113 70 271 -32 -217 110 249 -145 -308 1 70 -186 -175 -9 -141
1568 -141 -252 13 128 -161 -249 91 169 -75 -69 122 33 -103 98 220 -89 -230 65 184 -110 -218 -30 -39
1590 -39 -195 -101 -20 -212 -337 -83 28 -203 -303 -109 -89 -176 -82 -22 -248 -303 21 91 -223 -339 -42 29 -191
1613 -191 -197 -24 -129 -281 -63 97 -165 -373 -140 72 -116 -294 -192 -133 -205 -158 -109 -211 -292 -164 -38 -139
1635 -139 -218 -163 -131 -129 -35 -24 -187 -224 -9 78 -137 -250 -85 -32 -136 -146 -91 -211 -329 -170 -40 -230 -423 -276
1659 -276 -111 -166 -271 -242 -222 -208 -116 -62 -177 -238 -99 -14 -86 -149 -108 -121 -126 -65 -44 -190 -283 -136 -26 -173 -285 -213
1685b13P9l8rM8l8o9J06J29p1j19N1J16L1l2m0l3L1J02Kj14n7R3L5n0k9K7m8j9
1713a29R2M3j35o4J32R9q9q9P2O5l4jM9j7m3N2P7k2q0K2M4OJ0l0l0oP4J6r7j7
1743c0O7K9n8J5L6l5m3Q5O1r2o2J21O7p5n2P1N3n0J1K2m0l6O1L0p1l9O4J1o1P
1773F7L7m5k9O9L4j03k3J12Rj06OJ06j8q7L9Q2p5p0Q9N5j06l4Q9J6p5J7K7n5k1
1802GP7Pr7k5J10J5r7LP6n2m5R8M0j47k8J75L6j69m5J57jj01K0P6q7o7J34N3j61
1831c8o7J64L1j24lR1p0n3J29N6j62o4J86N1j56l4J28l6q1Q8Q5j54p8J73R4j95
1857c9p8J39M1j00L7O0j10p6J85Q6k08q8J74M8j16LJ06j05q1J77R4k37j21K49
1881D0J07k28n3J78l3j48J19J58k01j76K27J70k05j48J71P7j44L2J14j39j18J79
$$ plain form
1685 -213 -134 -172 -181 -133 -171 -240 -134 -5 -76 -195 -144 -28 3 -29 -69 -102 -71 31 33 -81 -138 -45 -10 -60 -89 -62 -110 -129
1713 -129 -37 6 -129 -193 -61 38 -51 -140 -68 -3 -37 -38 11 -6 -49 3 80 58 -22 0 44 50 60 30 0 -6 68 84 -13 -30
1743 -30 37 66 8 23 59 24 -19 66 127 35 -27 94 161 86 34 105 158 108 119 141 101 65 126 156 85 46 110 121 60 67
1773 67 104 59 30 99 133 30 7 119 128 22 28 134 116 29 68 150 75 5 94 149 43 9 98 114 39 56 83 28 7
1802 7 84 91 -6 -31 79 94 -3 0 76 24 -21 77 117 -30 -58 117 153 -16 -61 96 95 -6 14 90 3 -64 70 123 -38
1831 -38 -105 59 90 -34 -37 54 -16 -69 60 116 -46 -110 76 127 -29 -63 65 29 -52 36 121 -33 -111 62 156 -39
1857 -39 -117 22 63 -37 0 60 -50 -126 59 145 -63 -151 23 71 -45 -42 64 -41 -122 55 149 -88 -209 40
1881 40 147 -81 -134 44 11 -137 -18 140 -61 -237 -10 160 -45 -193 -22 55 -89 -57 57 -82 -200 -21
1903b1J54k09j52J90P4j49JJ23j06j41K15J59k80j56K58J38k36r1K06j5k10J44
1925a04J96k13k32K36K20k32j59K07M7j81M0K02j39k24J97K41k34k01K23J18k02
1946a94kK03j21k06J77K35k39k23K39J71k12r6K26n1k12J30K55k10k54K35K44
1967I5k39j59K29N3k39O2K46j55k71K23K68k30k22K49J22k38k0K58q4k89J73L02
1989A34k00k60K05K07k06j13K46j7k50R9K84j56k70J89K27j76j51J96M9k05N6
2010a12K34j21k49J61K67j94k01K35J01k45J0K55p9k82J51K89j93k50K25K01k30
2031b7j28K76M4k85K3L50q9l14J32K72j65k16K03J36k19p9K65pk56N4K49j09j72
2054f2J35J27j61n7K10k0k08Q8K13j11k06J80J47k09j14K71L1k90L5K78p8k81
$$ plain form
1903 -21 133 -76 -228 -38 36 -113 -112 11 -95 -236 -21 138 -142 -298 -40 98 -138 -229 -23 -38 -248 -104
1925 -104 92 -121 -353 -117 103 -129 -288 -81 -34 -215 -175 27 -112 -336 -139 102 -132 -333 -110 8 -194
1946 -194 -196 7 -114 -320 -143 92 -147 -370 -131 40 -172 -268 -42 -93 -305 -175 80 -130 -384 -149 95
1967 95 -144 -303 -74 -21 -260 -198 48 -107 -378 -155 113 -117 -339 -90 32 -206 -226 32 -52 -341 -168 134
1989 134 -66 -326 -121 86 -120 -233 13 -4 -254 -155 129 -27 -297 -108 119 -57 -208 -12 37 -168 -112
2010 -112 122 1 -248 -87 180 -14 -215 20 121 -124 -114 141 62 -220 -69 220 27 -223 2 203 -27
2031 -27 -155 121 165 -120 -97 253 164 -150 -18 254 89 -127 76 212 -7 -86 179 172 -84 -30 219 110 -62
2054 -62 73 200 39 -18 192 172 -36 52 265 154 -52 128 275 66 -48 223 254 -36 -1 277 199 -82
2076h2J44K52j86k28K39J58k24j06K55M0k49K6K34n8k15J00J80j57r7J55M7j92
2098C6MK16p7k06J20J83j76j30J99R4k20l1K47l0k35N4K73j10k52J30J92j49j61
2121b9J69Q5j86j8J75l3j84Q7J56j10j12J24N3j43lJ83o7k07J29J85j40k02J70
2144H2J41k02q7K26Nk57N5K65p9k57P8K51j26j55J26R4j53l0J80k9k07M7J70o6
2168G2j49Q7Q4j26k0J60l6k02P7K09o9k06J00J60j10j03J57L4j86j8K20j5k29
2191a09K1J76n9j17P6M8j21LJ69k9j78N1J74o4j18J00N5j25LJ80l2k45M9K65p2
2216A01k39P0J71r3j21J48O4j83l7K10N0k12k8J78K4j07L0M8p7j7J05Rj41NJ09
2241F7k1p2L3J5r5K1J45k4j83M1J76j8j48N3R9q2n7J37Rj75k2J85K6j76k6J31
$$ plain form
2076 -82 62 314 128 -100 139 297 73 -33 222 262 13 39 273 215 0 100 280 123 26 181 228 36
2098 36 40 256 179 -27 93 276 100 -30 169 263 43 12 259 229 -6 48 321 211 -41 89 281 132 -29
2121 -29 140 225 39 21 196 163 -21 66 222 112 0 124 177 34 31 214 147 -60 69 254 114 -88 82
2144 82 223 21 -66 160 165 -92 -37 228 149 -108 -30 221 95 -60 66 160 7 -23 157 128 -79 -32 138 72
2168 72 -77 10 94 -32 -52 108 72 -130 -53 156 87 -119 -19 141 31 -72 85 119 -67 -85 135 120 -109
2191 -109 -88 88 29 -88 -12 36 -85 -82 87 58 -120 -69 105 41 -77 23 78 -47 -44 136 104 -141 -92 173 101
2216 101 -138 -68 103 10 -111 37 101 -82 -119 91 141 -71 -99 79 103 -4 26 74 -3 -20 85 94 -47 -42 67
2241 67 46 -26 7 22 -73 -52 93 69 -114 -73 103 85 -63 -10 89 7 -50 87 96 -79 -101 84 110 -66 -92 39
2267C9j7r4M8M8r9k1J33K7j32l2J34J3q9L1L2p4k6J13J5j32m1J06K8r6j8M7k5
2294h2l0P6K1r8j8R4L6r1mM6jl6N8Rr8qJ01%j15j7Q9qn8L4L1o7k7J01M0j06k5
2325a53R0L2o9J1N9l5n3O5K1p4k8O4K0m7oK6rk0M2J5m5j6P5L4n7k4N7J4m5J5K6
2356a5m8j5O2J9n7k3M4J1k3J1K4l0pO1K2n7oP6on4K4N1k5l8M7K6l9k9M0J7l7j8
2388HL8J9l5ML6j0j4K2L2k2NLK0m4K0L2k8j0K3J1m3nL7km6QN6j5o0K7M8k6k8M4
2422A05J3n1JN0j5m0LL9k2k7K0Ql6kO5k0o5J9O0j5l3K0J5m3j1N7Mp6OP4j4n8J7
2455D8L0m1NK6lo5MP5no8ML1k0j4M9j8o2J4Q2j1r4OO2on2L4J2o4OP8nr0j9P7K1
2490B7o7QK2m0JN2Oq9j1R9Kp5NM5l0k0O0Lj00PJ02Lj08KO9jl8J9J3p7JR8Pr7k2
$$ plain form
2267 39 22 -72 -24 24 -75 -96 37 64 -68 -100 34 47 -42 -11 21 -53 -79 34 49 -83 -124 -18 10 -86 -104 -57 -82
2294 -82 -112 -36 -15 -113 -131 -37 -1 -92 -96 -50 -51 -87 -29 -20 -118 -126 -25 -25 -140 -157 -68 -76 -134 -100 -69 -136 -163 -62 -22 -128 -153
2325 -153 -63 -31 -100 -89 -30 -65 -118 -53 -32 -106 -134 -70 -50 -97 -103 -77 -86 -106 -64 -49 -94 -110 -35 -1 -58 -82 -25 -11 -56 -41 -15
2356 -15 -63 -78 -16 3 -54 -77 -33 -22 -45 -34 -10 -40 -47 14 36 -21 -27 49 43 -11 13 64 39 1 48 74 35 6 46 63 26 8
2388 8 46 65 30 34 70 60 46 68 100 78 83 86 106 62 82 114 86 76 99 110 67 62 99 97 51 59 115 100 40 67 115 89 61 105
2422 105 118 67 68 118 103 63 66 105 83 56 76 84 48 46 111 91 26 45 105 90 57 77 92 49 38 95 99 23 29 103 89 31 48
2455 48 78 37 42 68 65 0 4 79 74 6 10 41 21 7 56 38 -24 -10 72 61 -33 -27 35 29 -23 11 23 -41 -35 43 38 -52 -71 6 27
2490 27 -40 -32 -10 -50 -49 3 9 -80 -91 8 10 -65 -60 -15 -45 -65 -5 -2 -102 -95 7 10 -98 -96 -27 -28 -66 -47 -34 -111 -110 -12 -5 -102 -124
2525a24R1Ko6L3J3o2RR8j2j20mJ38k5r5L0M0n5l3J18Mj37mJ28K1j23rQ9ro0N2
2555g2L3q6k8J12M5j11n1Q8K6o9J5L8p0j9J19Qj26j2J09K1q8J6N4o4l0J22K1j24
2583a23m4J42L4j34rR3l2n3O7O7j28m8J22O2j22l9J00J7q0L7O5q9n9J20O5j35
2609a04m8J21K4j03J5Q1o3p2J00P9j35n9J26N8j14j7J04k9n9M6Q9j16o0J27M3
2634C4j08l4R4j3q2N6Q1j10p7J39N5j19n2J09L9j14K4R6m9r8R9P8j09q1J14N6
2660B8j15l0R1j6r4P1Q0j00p1J05O6j18k0J03Rj11O4Q5p7r3J11Q2j17o6J15L6
2686A8j15rJ24m3j15P7J11j10p3R4P1j10k0R9qq9M6J00o4q0R0O5j05m3J12J2j22
2713h7J0J07l9j06O8R1r2p7J11L6r5mJ14j3j02M8R5o9q1J00N7j09l1J14%j22L4
$$ plain form
2525 -124 -33 -31 -97 -64 -51 -113 -104 -6 -18 -138 -142 -4 -29 -124 -94 -54 -109 -142 -24 -20 -157 -161 -33 -12 -135 -144 -55 -64 -124 -72
2555 -72 -39 -125 -153 -41 4 -107 -158 -70 -44 -113 -98 -60 -130 -149 -30 -22 -148 -160 -51 -30 -118 -102 -48 -112 -142 -20 1 -123
2583 -123 -167 -25 9 -125 -134 -41 -73 -126 -59 8 -120 -168 -46 16 -106 -145 -45 -28 -108 -71 -6 -95 -154 -34 31 -104
2609 -104 -152 -31 -7 -110 -95 -14 -77 -149 -49 30 -105 -164 -38 20 -94 -111 -7 -36 -95 -49 40 -76 -136 -9 34
2634 34 -74 -108 -14 -27 -109 -53 28 -82 -159 -20 35 -84 -136 -27 12 -102 -78 18 -31 -129 -30 48 -61 -142 -28 28
2660 28 -87 -117 -26 -42 -136 -65 15 -85 -156 -51 15 -103 -123 -20 -11 -122 -58 27 -50 -143 -32 50 -67 -133 -18 18
2686 18 -97 -106 18 -25 -140 -63 48 -62 -135 -41 30 -80 -100 -1 -9 -98 -52 48 -16 -96 -6 59 -46 -89 23 35 -87
2713 -87 -77 30 -9 -115 -47 44 -48 -125 -14 22 -73 -77 37 24 -78 -30 65 -4 -85 15 72 -37 -68 46 46 -76 -42
2740d2R5n2j04Q1R0j09n7Q9O8j21rJ24j8r8O1P8p1p6R6P1j04n1J06J3j08K7P6
2767E5o3q2Q5P1j18m7J13L8j08oQ9j4j00N9Q0p9p2R3M7j00l5Q6J2r7M0O8o5q2
2795a32Q7P0j03k5Q9K1q9K1Q8o0q1P9P5r0p6Q5M6j01j1Q9k3r4O2Q6o9q6R0P8p1
2824d5m3Q7J6p1MQ2l0j01N0P3p5o0N3J8o5jQ1m5p2O6Q5p2m3O9N5n7pQ3k2p5L6
2855b6R4n7r6P1N7q1l8N7Jq1L9P6l3q7P1Q9l3n2O6M5n9LR2l2p5L5Q1m7r1L6N0
2886G5n4k8O0ro2K6O1l2n4N4N2k9j3L9jn1L8M6k8o9L5N3n0m9M0K0n7J5N4k4o6
2917hM3P5k9n7N0N3n0k1N4Po2J9N2k2p7PN4l4l3L3J6n2J5N1Mo0J3O0ql3L1J8l2
2950G7lL2j4o0J8L7l5o1L2Jj6qL1nl9J1O1j2n1L7M3k4j5K7J0m7LL7l7m1RL6j4
$$ plain form
2740 -42 53 1 -103 -22 68 -41 -98 -9 59 -62 -71 53 35 -63 -2 76 5 -71 25 96 -8 -59 47 60 -48 -21 55
2767 55 -8 -90 -5 66 -52 -99 14 52 -56 -62 27 13 -87 -28 52 -27 -99 -6 41 -59 -94 -8 4 -93 -53 15 -50 -132
2795 -132 -45 25 -78 -103 -14 7 -82 -61 27 -33 -114 -35 40 -50 -126 -41 5 -96 -107 -18 -41 -135 -73 13 -56 -142 -52 26 -45
2824 -45 -88 -1 15 -56 -52 30 0 -101 -51 22 -53 -113 -60 -42 -107 -108 -27 -72 -144 -78 7 -65 -108 -39 16 -41 -48 35 13 -62 -26
2855 -26 68 11 -85 -14 43 -38 -76 -19 -18 -99 -60 16 -17 -104 -33 56 23 -29 37 82 23 26 118 86 11 46 127 80 -11 25 75
2886 75 21 -7 53 44 -18 8 69 37 -17 37 89 60 47 86 85 34 72 118 90 21 56 109 59 10 50 70 13 28 82 58 -8
2917 -8 35 110 81 24 74 127 77 56 110 117 55 74 126 104 27 34 88 54 21 54 70 18 33 84 88 28 41 101 93 60 91 109 77
2950 77 74 106 92 32 50 87 52 -9 23 24 8 0 31 26 -13 -2 59 47 -4 33 76 52 37 64 74 27 30 67 30 -11 -2 34 20
2983B0m1JL7m1%M6Pl7J1M9om8L3L4j7l4L2Rm8pL4k5l2%L4j2m6L7J1j8qN3j9qN
3018FL2j1k9K3Mk2pJ7k4k9ML3ro0L9L2l4k6L8J3k9J5L2Rk7K1K5j3j9nJ9j3k3J1
3052gKk9QJ6rk5kL0mj6K8Pj1J1L3j0l6L3K6j0j5NRl6NK8k1l9J5K9ll8J2J0KJ0
3088HMJ3l8L5K9pk3k2L5Kk3K5j4l6L2N4m2m1K3N0j0l2J9Rk9OM1rn6RM0jl9KRP
3124C0lJ7j7l3K2M1pn0L0K7olJ5ml8J7N3k3n9J3L6j3k8J6pk7LM8j2m9OM9Rl3J
3159B1lJ2RJ5om2J4M3j9k9J7Ml5J2L9l4m7RM8nn0%M3ok4L3pl0J2M2J5n3KL3J1
3194D4k0jJ3l5J5M4l4l8oN9j0m4J9Rk4j2M2Lo0JP6%m1j3N5kk7J3J1l5%M3kl6n
3229BJ8pj6RNl7rN1k1n9K4M6rk4K5L5m1j1O4nn6MP2rm9j1O1l1m5N2J5m7l0N4K9
$$ plain form
2983 20 -21 -20 17 -24 -24 22 29 -8 3 52 46 -2 31 65 48 14 46 55 7 0 34 9 -23 -23 11 -1 -47 -10 1 -17 -25 28 9 1 6
3018 6 38 27 -2 21 25 3 -4 13 -11 -40 -36 -3 -12 -72 -33 -1 -35 -61 -23 -10 -39 -24 8 17 -10 11 36 23 4 -1 18 5 -18 -7
3052 -7 -5 -34 -26 -10 -19 -44 -46 -16 -20 -36 -8 -1 -12 -1 32 22 -14 19 45 35 20 25 34 -2 3 31 10 -29 -14 15 12 -26 -14 -4 -2 8
3088 8 12 25 -13 22 51 44 21 -1 34 36 13 38 24 -12 20 74 32 -9 14 64 54 22 41 50 21 27 68 59 3 12 52 51 12 14 23 30
3124 30 27 44 27 -6 16 57 50 0 30 57 51 48 63 59 21 38 91 68 9 22 58 45 17 33 26 -1 2 50 38 -11 -5 44 53 20 21
3159 21 18 30 39 54 48 6 20 63 44 15 32 36 1 13 52 18 -29 -20 28 23 -27 -27 16 10 -14 19 12 -18 -6 36 51 -2 0 33 44
3194 44 24 23 36 1 16 60 26 -12 -18 41 31 -13 6 15 -9 -21 21 24 -36 -35 41 41 0 -13 42 40 13 26 37 2 2 45 43 7 2
3229 2 20 13 -3 6 11 -26 -35 16 -5 -64 -40 6 -3 -27 -2 33 -8 -19 45 40 -16 -12 60 51 2 -9 52 21 -24 28 43 -4 -34 20 49
3264D9n5kK4J4k9K1J2j4k7N0J1m3jK9j4j3J4Qk8j0O1j5n4LM8j1l8%M0l9l4M7L1
3297C5n3j8M2K7o0%N9j8l6K3K3j9l8M7L5m1rL8Kl7K8L5j3l8L9K3n1j6M4%m8PN8
3330G0l8k8L2L6m0j3M1J9m1kM7om7J4M6l1l5K4K1l3j3K7jm2J5L6k2m9M1M0l7q
3362B3N8j3m1K0N0k0m4L0M1k9l0L5J4k6j0N3nm4J2L2ol7K5K4l7NK5Rm5K1M9l0
3394A09l8M0K6o0mM9Lp5kP2k2p2K1N2l3m4L2K8m0k5M8J2n9mM9Om3J2K3l0lL9j5
3427E2m8QL4Rm3K2Ql6JM8J1n9ON9No9RN1rm7K2K8n1k1M7Qm7j2L7ql7K0J1m4k5
3462f0N5kn7lL5Kl1RL0l1k0M2%m5j5M3nl5OK5rk9K2K2l9j4N0J4l4j7L1J0pJ7K1
3497a9l5j4L8J6m7j1M3ol7K1K7m1j4L8K3n6kK7M5o0mL8j0l8K9L1n1k5L8K2m3k6
$$ plain form
3264 49 -6 -8 16 30 1 22 34 20 -7 43 54 11 10 39 25 12 26 34 6 -4 57 42 -12 -9 39 28 -10 -10 30 -9 -43 4 35
3297 35 -18 -36 6 33 -27 -27 32 14 -22 1 24 5 -33 14 49 8 -1 37 39 2 30 65 52 14 53 76 25 9 53 53 5 12 70
3330 70 32 4 36 72 32 19 60 79 38 36 83 77 30 44 90 59 24 48 69 36 23 50 49 7 22 58 36 -13 28 68 31 23
3362 23 81 68 27 47 97 77 33 63 104 75 45 80 94 68 58 111 106 62 74 106 100 63 88 112 75 80 105 114 69 90 139 109
3394 109 71 111 137 77 73 122 125 50 48 120 98 26 47 99 66 22 54 82 42 17 65 77 18 14 63 69 26 38 61 31 28 67 52
3427 52 4 12 46 55 12 34 42 6 7 55 66 7 13 72 77 8 17 68 59 12 34 62 11 -10 37 45 -2 -14 23 15 -22 -2 9 -35 -60
3462 -60 -5 -7 -64 -67 -32 -30 -61 -52 -22 -53 -73 -31 -31 -76 -91 -48 -53 -88 -82 -57 -66 -95 -73 -51 -90 -104 -54 -40 -74 -91 -60 -50 -57 -40 -19
3497 -19 -54 -68 -30 -14 -61 -72 -29 -35 -72 -51 -24 -65 -79 -41 -18 -74 -76 -49 -4 -64 -68 -30 -40 -78 -49 -18 -69 -94 -56 -34 -77 -103
3529a03J2J6l0J7J6k3j8L2J1j9j3M3NrRJ4j4j8M6J7m5j0L8jj9rK3ok8J5M2l0j8
3562e7M0K3jm3M2Rk2J4J4k1qJ2J6l7lJ5Kk7MJ2j1j7J4L2k4k7L9K1l1mL9j3l0J0
3596a8L0k0k9J1K4j8k9K6OrPJ7Kj0K3K4j0%J7K2l1J1J4qk6J8K1l4k7K0K3l6k2
3629a1L6Kk9J0L2j8j2J8K5%j3J2Qj2m%k0j9J0Kk8j7J4%k4J1Pj4mRK4j4qJ8L4j3
3665A2rJ6Oj0kQjk0PK5j5k6kJ1mJJ4j0nJ1K3k3rQK0j7rOJj8kJ5j3l1J8J8ok0R
3704b3J4j9J1K4k3k2J5L4l3j4J7Jk8J3Oj3k1J6J0j1j1K4K7pnJ7Oj2J0K6Ql7J0
3737A0M0l0j8MJk4J3qok2RJ8j8mJ6MmK0J2k0j2L6K7pk7JK7qj9Rj8k1NJ1j3k1P
3774c0J4j0pJ2lj0K5J8j3rJ8L7j5j4J4rPjPrk3JK9ql4kK7k5jJ1jj4JJ8kj3j0K2
$$ plain form
3529 -103 -91 -75 -105 -88 -72 -95 -113 -81 -70 -89 -102 -59 -54 -63 -54 -40 -54 -72 -26 -9 -54 -64 -26 -27 -46 -55 -32 -38 -66 -51 -9 -39 -57
3562 -57 -17 6 5 -38 4 13 -9 5 19 -2 -10 2 18 -19 -22 -7 -5 -32 -28 -16 -27 -44 -30 2 -22 -49 -10 11 -20 -24 15 2 -28 -18
3596 -18 12 -8 -37 -26 -2 -20 -49 -23 -17 -26 -19 -2 0 -10 13 37 27 27 44 66 35 46 60 52 26 44 65 31 4 24 47 11 -11
3629 -11 25 27 -2 8 40 22 10 28 53 53 40 52 60 48 44 44 24 5 15 17 -11 -28 -14 -14 -38 -27 -20 -34 -38 -29 -5 -19 -27 -9 25 12
3665 12 3 19 25 15 13 21 20 0 7 32 17 -9 -11 0 -4 -3 11 1 -4 7 30 7 -2 6 26 9 0 6 7 -11 -13 2 -11 -42 -24 -6 -12 -32 -23
3704 -23 -9 -28 -17 7 -16 -38 -23 11 -22 -36 -19 -18 -46 -33 -27 -40 -61 -45 -35 -46 -57 -33 -6 -13 -18 -1 5 -7 3 29 37 0 10
3737 10 50 20 2 6 7 -17 -4 -12 -18 -40 -31 -13 -31 -35 -19 -15 -19 1 13 -7 -19 17 44 37 10 11 38 30 11 20 2 -19 -14 -3 -16 -37 -30
3774 -30 -16 -26 -33 -21 -24 -34 -9 9 -4 -13 5 42 27 13 27 18 25 24 31 22 -1 0 29 21 -13 -15 12 -13 -14 -3 -4 -18 -17 1 -1 -14 -24 -2
3812bj4J1Kj2J8LJ1j4k5J4K0j4m%mlLJ5pk9OK4qqkrJ1pJ8j3j5K1J5Lj3mJ8J5j2
3851IJ5j5k1J9J0j4j0j5K9qj5RJ1k8PJ2kk0mK8Nk2PK3j5LK0ppLJ5Jj4%Rj9J9k
3889A6pk6J3J6lj6j3J6j0LjJ6j0qL7jl3ML5j8mLK0k5KJ6Ok8j2K6pj3j2OrqJ3n
3927b1ppK0KorK0mkJ6J2j6mK1rKrJ1kj5JMk6%K2Pj1j0NMnJ6lmmK0Qj2j7K6j2M
3969Fj1PJ0l4J9J0k8j9K0Pj6jRLj0nJ9rjmK1kj7J4Kj0J0J0lj1RK3j7j7J9J6j5
4006DmL1j5k3L0K1j2j1LJ4k0nJ5nk3J4K4k3j5J4Rmj6KJ9k1ML0k3k2J2PqJrPpl
4044hK5j2k2NJ9k1kJ5J6r%J5Rk3J1K4mj4OJ9j3KK2j1k6J8ONk9PJ3Jj0QMlMJ1k1
4083C7klK6j4j3J0j1j2oPJ5l2KJ6pk0J3J3pkORm1J5L5ll6K0J2lk1J9J5k8PK8p
$$ plain form
3812 -2 -16 -5 -3 -15 3 6 17 3 -22 -8 12 -2 -6 -6 -10 -13 -10 5 -2 -31 -25 -1 -9 -17 -19 -28 -17 -24 -6 -19 -34 -13 2 5 -8 -12 6 21 9
3851 9 24 9 -12 7 17 3 -7 -22 7 -1 -16 -7 4 -24 -17 -5 -7 -27 -31 -3 2 -20 -13 10 -5 -2 18 11 4 7 22 23 9 9 18 -1 18 16
3889 16 9 -17 -4 12 9 -7 -20 -4 -14 -11 -12 4 -6 -14 23 22 -11 -7 28 10 6 9 29 4 6 22 28 0 -12 14 7 -6 -18 -12 -21 -29 -16 -21
3927 -21 -28 -35 -15 -13 -19 -28 -8 -12 -14 2 14 -2 -6 15 6 8 -1 10 8 -7 -6 -2 -28 -28 -6 1 -10 -20 -15 -11 -16 0 -3 -7 -11 9 17 5 -12 14 2 6
3969 6 -5 2 12 -22 -3 7 -21 -40 -20 -13 -29 -30 -21 -18 -28 -33 -14 -23 -24 -28 -7 -9 -26 -12 -10 -20 -10 0 -3 -14 -5 18 1 -16 3 19 4
4006 4 0 31 16 -7 23 44 32 21 24 38 18 13 28 23 0 14 38 15 0 14 23 19 3 5 24 3 7 37 14 -8 4 11 3 4 -5 2 -5 -8
4044 -8 17 5 -17 -12 7 -14 -16 -1 15 6 6 21 30 7 18 42 38 24 30 49 36 38 60 49 23 41 47 52 23 30 43 44 34 42 46 43 47 58 37
4083 37 35 32 58 44 31 41 30 18 12 19 34 2 4 20 13 -7 6 19 12 10 16 25 -16 -1 34 31 -5 15 27 24 3 22 37 9 16 44 37
4120C7l0J4L1oj8J2LrMK4jj2kJ5j3j2J1Kj2lJ5nk0NNj9Jlj0Rk2J9Nk7QK7j0l5
4158b2K0Pmj7J4J5k5oJ2Ok0J0OOk3kL4j8JK4jj4j2L7j3NJPj2kJ2j3pJK3rrpRj0
4198DpOqMk0K1Jk2QJ2pk1LJ8j1j3RJk3KJ7ok8OJ9JpOJ3j5mJ7kqKK8lrJ1J7pj1
4240fJ5%j2MK8j9jmJ2j2JkJ3j8MJ5J1j2mJ3nj8J9%pk6J9J8k8qJ6pj9QJj1qK4m
4279a0jj5J4jnoK1koOJ6k2lOQRjJPoJ0Pj2J7NNk0J0J4jj3JMj9nJ6mj1j3J4J1k5
4321AmJ3Kj0OOj0qJ9O%k1RLlj2nrNnJ6j2k4J8kkOJ1l%J8J4j1JlK8j2pJ9%oj1P
4364B8Moj5J6rj8PpJ7k3K5j3JJ0Qk0M%J6j4J2qrmMJ0j4k4K3j%j2nLj1J3jJ0j6
4403a9Qj0J2kpMMjNrMJJ8k1MJ1LqJ0Pkj6J5J7k8oJ4Oj1pKMj7RNmj3ROrpOPnLm
$$ plain form
4120 37 7 21 52 46 28 40 43 34 38 62 61 49 47 62 49 37 48 50 38 35 50 45 25 30 35 16 17 14 4 13 -9 10 15 -12 -4 23 13 -22
4158 -22 -2 5 1 -16 -2 13 -12 -18 -6 0 -20 -10 -4 2 -21 -23 11 -7 -6 18 17 3 -9 28 15 20 21 28 16 14 26 13 6 7 30 21 12 5 14 4
4198 4 -3 3 -5 -1 -21 0 1 -21 -13 -1 -8 -29 -26 -8 -19 -32 -23 -22 -45 -43 -26 -32 -60 -54 -35 -34 -41 -35 -22 -37 -41 -24 -26 -34 -32 -4 -7 -16 -5 12 5 -6
4240 -6 9 9 -3 1 29 10 9 5 17 5 6 4 17 -1 3 18 29 17 13 26 21 3 22 22 15 -11 8 26 -2 -10 6 -1 -20 -12 -11 -22 -30 -6 -10
4279 -10 -11 -26 -12 -13 -18 -24 -3 -5 -11 -5 11 -11 -14 -8 0 9 8 9 16 10 20 27 15 32 37 42 22 32 46 45 32 33 37 18 13 29 25 14 1 15 26 1
4321 1 -3 10 12 2 8 14 4 -4 15 21 21 0 9 12 9 -3 -8 -17 -12 -17 -1 -13 -37 -19 -21 -23 -17 -6 -9 -9 9 23 12 13 10 38 26 19 38 38 32 21 28
4364 28 32 26 11 27 18 0 7 0 17 -6 19 6 7 17 25 5 9 9 25 11 23 15 6 2 6 16 2 -22 1 0 0 -12 -17 -14 -25 -12 -13 -3 -19
4403 -19 -11 -21 -9 -11 -18 -14 -10 -11 -6 -15 -11 -10 8 -13 -9 2 5 -3 7 14 12 -4 11 28 0 -6 8 14 3 -4 -2 2 -15 -6 -1 -5 -18 -9 -3 -12 -19 -13 -6 -11 -8 -12
4449a2NpJ2Knj0NJqPjqj4LJnNNPK2j5lNjJ5M%okPLoJ6j1Nj2J1k2j4J4LmmJ2jO
4495Ej4J1oqJ2M%j3QMknnJ1j0NLNj0mJ7qj5J1J3j5nMkrK1PoOj2J1m%Oj3kJ7lM
4539A4j1Qjllj2PJ1mJ2j6pLlLNmJj6MRQj5nJ9j6JJ0lk%J5ok0J2LjJOJj2NQkqn
4585iQJOj7K7j9k0J7OkKm%joKmKJ1%j2j0QMj1QLoLrJ3jpK2k1kkQLpQRqmJ4pqR
4633cJJ5j9LJ0k0J7j2J8jj3J2NKk4PJ3j0PKprJ7jj3j0J4Jj1kJ0pJpPlmPRj1J0
4674ALlj8J1J1j2j0J4Jj6J3oPmj2K0%oJQnoJ0J1pmMJ6j5JOK%Mj0j3LJ0qj3jLJ
4717hj6LJ5Kj6K0mkkJ4j1j0JK3qj0KJRj7J0Lj6JQJ0j0JJ3qRPMj7QLrjJ0KJj2K0
4760B3j0koJ7j7NPoj3lJ8Kj5QP%JoLj3j0RJ3j8lJPj0J7j1J1jKr%mJ9pj6R%J7%
$$ plain form
4449 -12 -7 -14 -2 0 -5 -15 -10 -9 -17 -10 -11 -19 -33 -30 -29 -34 -29 -24 -17 5 -10 -13 -8 -9 6 10 10 4 2 9 12 6 22 11 16 4 15 -7 -21 -7 -4 -8 -12 0 -1 5
4495 5 -9 2 -4 -12 0 4 4 -9 -1 3 1 -4 -9 2 -8 -3 0 5 -5 -9 8 0 -15 -4 9 -6 -11 -7 -9 -18 3 10 4 10 -2 9 5 5 11 -2 -4 13 10 14
4539 14 3 11 10 7 4 -8 -1 10 6 18 2 -5 -2 -5 -2 3 -1 0 -16 -12 -3 5 -10 -15 4 -12 -11 -1 -4 -6 -6 9 3 -17 -5 -2 -3 -2 4 5 -7 -2 6 4 -4 -9
4585 -9 -1 0 6 -11 16 -3 -23 -6 0 -2 0 -4 -4 -5 -11 -9 -13 -11 0 0 -12 -22 -14 -10 -21 -13 -10 -16 -13 -22 -9 -10 -17 5 -16 -18 -20 -12 -9 -16 -8 1 -7 -11 3 -4 -12 -3
4633 -3 -2 13 -6 -3 7 -13 4 -8 10 9 -4 8 13 15 -9 -2 11 1 8 10 3 -6 11 10 -3 -13 1 2 -9 -11 -1 -8 -7 -14 -7 -10 -14 -7 2 -9 1
4674 1 4 1 -17 -6 5 -7 -17 -3 -2 -18 -5 -11 -4 -8 -20 0 0 -6 -5 3 -2 -8 2 13 6 2 6 22 7 8 14 16 16 20 10 -3 0 10 2 -11 -12 -9 -8
4717 -8 -24 -21 -6 -4 -20 0 -4 -6 -8 6 -5 -15 -14 9 1 -9 -7 -6 3 -14 -4 -1 -17 -16 -8 2 -8 -7 6 -2 7 14 18 1 9 12 3 2 12 14 15 3 23
4760 23 13 11 5 22 5 10 17 11 -2 -5 13 15 0 8 15 15 16 10 13 0 -10 -1 12 -6 -9 -8 -1 -11 6 -5 6 5 7 -2 -2 -6 13 6 -10 -1 -1 16 16
4803A6qLLk1J2QrjJ3lkJ0nKN%J0j1jJ6j3k%nJ5k5J1nk0PJ8jj7%Oo%NRrnKJ1j8
4847eOMpJ0Kl%pRJ0qj0J5ro%J8%j1J4N%j9J1K1k4JJ6j1MJ2oKj9J0J9k7KkRj0K
4889A8MonJ0lnnlQkj4J3j4K0j1Lj0nJ0qOkQlj7K0J2j7lMK0j6RPj0j2J7PqmnJ4
4931B2NrJ2jlml%K%Roj4NOj5J1Mj4Oj7K1Jj9Poj0QLLoqJ2Nj0J2k4ROkJ1k7J1J5
4975HopKKKjJ2llkMNlPJ4j3j1QKjl%J3jrJ0mLk0J6okmMlj3OQ%rLjJ1pPk0J4%J
5024A0lj2J7onmN%qkRMj3J5lNJJ1j5QojP%NoLPj3PK%J0j8Mj0J6%j9J3j3NMm%q
5070apJ1Rj8MmQKj6mJ3npLMj4J9j4%K7j7j6J5%kJ1j2J7j3mJ2Rj0oQ%j0lMLkmJ5
5113EJjkPJ3j6oJ5j2NpRjoJ2j5jkrJ4o%Qm%LLpKj0J7j4Rmj4PRNOj1Mn%%RmnJ0
$$ plain form
4803 16 8 11 14 -7 5 13 4 3 16 13 11 21 16 18 23 23 33 22 21 37 24 22 22 17 32 7 18 13 -7 0 18 17 0 0 6 0 0 5 14 5 0 2 13 -5
4847 -5 1 5 -2 8 10 7 7 0 9 19 11 1 16 7 1 1 19 19 8 22 27 27 8 19 40 16 17 33 22 26 38 32 34 15 25 44 17 19 17 26 16 18
4889 18 22 16 11 21 18 13 8 5 13 11 -3 10 -4 16 5 8 -2 -7 3 -5 1 -1 7 4 -13 7 19 2 -1 3 23 7 16 23 13 1 18 25 17 13 8 22
4931 22 27 18 30 29 26 22 19 19 21 21 30 24 10 15 21 6 17 21 7 13 -4 17 18 -1 6 0 -10 -2 1 4 -2 -10 2 7 -3 9 -15 -6 0 -2 9 -18 -7 8
4975 8 2 -5 -3 -1 1 0 12 9 6 4 8 13 10 17 31 18 7 15 17 16 13 13 26 25 16 26 22 25 5 21 15 13 9 13 10 -3 3 11 11 2 5 4 15 8 15 -5 9 9 10
5024 10 7 -5 12 6 1 -3 2 2 -6 -8 1 5 -8 7 4 9 10 21 6 14 8 7 14 14 19 13 16 23 10 17 19 19 29 11 15 5 21 21 2 15 2 7 11 7 7 -1
5070 -1 -8 3 12 -6 -2 -6 2 4 -12 -16 -3 -8 -15 -12 -8 -22 -3 -17 -17 10 -7 -23 -8 -8 -10 1 -11 6 -7 -11 1 10 0 -6 2 2 -8 -11 -7 -4 -6 -10 5
5113 5 6 5 3 10 23 7 1 16 4 9 2 11 10 4 16 1 0 -2 -11 3 -3 -3 5 1 1 4 7 0 2 -8 9 -5 4 0 -14 -7 2 7 13 2 6 1 1 1 10 6 1 11
5161A1Kn%rKQpRLjQoj1PpRj4J9j2J0mKj4Rj1Oj%LRpj3Mll%J0LmqJ4rLnLJJJKn
5211@JJ0nnKMqPqJ2kk6K2Ok3K3j6J1kJNpJ%Oo%pJ%RNqMj5Qj1NJ6k9J1j3J6jlR
5257@Kk8J0J0lpk%mJ6NorJ0J1j1jJ2j3pJ3opllRKJk%mkKNj3OPkOpPjlmJ4k3jK0
5305dj4Jjk%lL%KoJ0j0rJ6RrKONmk4K3lLPnJqJNpOMrqJ1Lmj%K0k9MJ1n%J4loj
5355hJ8j5mpJ2Nj6J8pkpJ3Jj2KNmJpJ4kpQj0PLj7K5j2MRmqNnJ1mM%oOkjqPoKo
5403gNKQj3kMj2jK0oJ3pjJ0pJ%qKL%qjlNpJ4rrMJ1pmJ0oLNlOLoJ0Kj7OmNpRkO
5454A0j0KLj2kJ3j7qJ7KKj5J5%lqkNjRQqj1MJ4pjKkKrLQj1qJ5nmPj1K0npPj0P
5500bpMmJ7j5J0nJ0nk7K3NjpjQMkoJlJ8j2j5RKklNoJ5qnmJ0nnLj0K3j0pJ5k2P
$$ plain form
5161 11 13 8 8 -1 1 9 2 11 14 13 21 15 4 11 4 13 -1 18 6 16 12 14 0 9 -2 4 3 3 6 15 8 -5 -1 -4 -7 -7 3 6 2 -6 8 -1 2 -3 0 1 2 3 5 0
5211 0 1 11 6 1 3 7 -1 6 -2 10 8 -18 4 10 -13 10 -6 5 3 4 9 2 3 3 9 3 3 -4 -3 -3 6 11 3 7 -8 0 -11 -6 10 -19 -8 -21 -5 -6 -9 0
5257 0 2 -26 -16 -6 -9 -16 -18 -18 -22 -6 -1 -7 -16 -6 5 -6 -7 5 -8 -15 -2 -8 -15 -18 -21 -12 -10 -9 -11 -11 -15 -17 -15 -10 -23 -17 -10 -12 -6 -13 -6 -7 -10 -14 0 -23 -24 -4
5305 -4 -18 -17 -18 -20 -20 -23 -20 -20 -18 -24 -14 -24 -33 -17 -8 -17 -15 -9 -4 -8 -32 -9 -12 -9 -2 -7 -6 -14 -13 -8 -15 -9 -5 -14 -22 -11 -8 -12 -13 -13 7 -22 -18 -7 -12 -12 2 -1 -7 -8
5355 -8 10 -5 -9 -16 -4 1 -15 3 -4 -6 -13 0 1 -11 -9 -4 -8 -7 -14 0 -2 -9 -1 -11 -4 -1 -18 7 -5 -1 8 4 -4 1 -4 7 3 7 7 1 7 5 4 -4 3 -3 -1 -7
5403 -7 -2 0 8 -5 -7 -3 -15 -16 4 -2 11 4 3 13 6 7 7 -1 1 4 4 -4 -5 -8 -3 -10 4 -5 -14 -10 1 -6 -10 0 -6 -3 2 -1 5 8 2 12 14 -3 3 -1 4 -3 6 4 10
5454 10 0 2 5 -7 -9 4 -13 -21 -4 -2 0 -15 0 0 -3 -11 -13 -8 -9 0 8 0 -11 -7 7 0 -1 1 -1 1 -8 -5 3 -8 -16 -1 -6 -10 -3 -14 6 1 -6 1 -9 -2
5500 -2 -9 -5 -9 8 -7 3 -2 8 3 -24 -1 4 3 -4 -5 3 7 5 -1 0 -3 15 3 -12 -3 -1 -3 -6 -1 -7 8 0 -5 -9 1 -4 -9 -6 -16 7 -3 -10 5 -17 -10
5545a0KjkJP%lJpJ2lLj1PPKjlkKj3J4%%Nlj3KJLnONj2Rj6QOj1K0j2lKmLrOjJN
5595enlmJ4rRm%Pj1LOkKLoJMnPLoOLJpnJ2j0J2nlK4qj6J3j0%MrJ8j1MLj2MNMj6
5644@J3mj7J1Rj6%PlJ5j5J0qlj5K0lj5J3lKOJqJ5MpNJLj4J3j0J1mnMlnJ1j8PP
5687A2Pmj4j6K2jNNlNqokJ3j4J0oj1J6onJ1nj2NJ6j9J1J%JqlNlJj7J9Lj3J6j7
5729iOPpJ1nOjmJ0kj0j0J0LnNj9J8pJ4Kj4QnQRj3oRj4J9j4j0J3j6J4j2Rp%NOq
5772fJ4j7JkRjoLnnlJ0K1roKnJ%nRJpQLjJlkPmmOjJK%JnpOkkJ1j2lLknJ4j3J3
5824Djjj0J0qKMoMpjjnPMLoQNorJ1J8j0ojLrOkJ0pjkJ0lj1J0nJ2kn%RpJ8k4J6
5872A8j4J2j0LLnQJ0j4k3K1pNJ1qj8J5oLkQnNPnNj5PmKJ4j5Qj1J7NKj7pJ1lj7
$$ plain form
5545 -10 -8 -9 -11 -10 -3 -3 -6 -5 -12 0 -3 0 -11 -4 3 5 4 1 -1 1 -12 2 2 2 7 4 -9 -7 -6 -3 -8 -2 3 -9 0 -16 -8 -2 -13 7 -5 -8 -6 -10 -7 -16 -10 -11 -10 -5
5595 -5 -10 -13 -17 -3 -12 -3 -7 -7 0 -11 -8 -2 -4 -2 1 -5 -4 0 -5 2 5 -1 5 8 9 2 -3 9 -1 11 6 3 27 19 3 16 6 6 10 1 19 8 12 15 3 7 12 16 0
5644 0 13 9 -8 3 12 -4 -4 3 0 15 0 10 2 -1 -16 4 1 -14 -1 -4 -2 4 5 -3 12 16 9 14 15 18 4 17 7 18 14 9 13 10 5 16 -2 5 12
5687 12 19 15 1 -15 7 6 11 16 13 18 10 4 2 15 1 11 5 -6 10 4 -1 10 5 -7 -2 14 -5 6 7 7 8 0 -3 2 -1 0 -17 2 5 -8 8 -9
5729 -9 -3 4 -3 8 3 9 8 4 14 12 2 -8 2 5 0 5 -14 4 -3 11 13 -1 7 2 10 19 6 0 9 -5 14 0 -10 3 -13 1 -11 -2 -9 -9 -4 2 -6
5772 -6 8 -9 -8 -10 -1 -2 -8 -5 -10 -15 -18 -8 13 4 -2 0 -5 -4 -4 -9 0 1 -6 2 5 4 5 2 0 7 3 -1 5 4 5 7 7 8 3 -4 2 0 -2 9 -3 -6 -3 -5 -10 4 -9 4
5824 4 3 2 -8 2 -6 -4 0 -6 -2 -9 -10 -11 -16 -9 -5 -2 -8 0 5 -1 -10 1 19 9 3 2 5 -4 2 0 10 3 2 0 10 7 -4 6 1 13 11 6 6 15 8 26 2 18
5872 18 4 16 6 9 12 7 15 25 11 -12 9 2 7 18 10 -8 7 1 4 2 10 5 10 17 12 17 2 9 5 7 21 6 14 3 20 25 27 10 3 14 11 -6
5914fK3lNKpJ1j2OJ0j3%PLoj8JJRJKkpNj3NmJOqJjQj1jmJ9k7J7Pk3J6j4K2j1l
5959frJ3%qJQmpJ2mkMmlNMllpK1j7qJ1MJ0omLmNjok%KoKOlj0OnLkj%RkKJj0Jj
6012a5RKlJ3j4JJO%nJ0oj0%J7j1Qj8RjLpNj0J1jNj1K5Nj9olJ1Llj2NjOmjnQnJ3
6058Ej1KpoQPqKj0J1%rJ6llJk%pjJ1JjlKmJJLqQlpOPj2J1mNMllJ6ok1J2KmljQ
6109@JqkOkNOj0Jj2J6j6J2lkJ3j1J2rJ0j6JjjMjKjlOknjK0j6J3Llj8L0pj2JMQ
6154A2qnmOlKj3RRoj4J7nOnJkRr%jj1J0%JKm%NkLoJkrJ2loOJ0nMjPj0OMj1%P%
6205DKlj%n%knJ0Ljqj1J5J0mj1kQj1jQNj7mJ2Oj7PmJ1j1J1jj5J1Pj0NlrJ3oJ0
6249dj5MJ7k6RJJ1pkPJ2%j7J0rRmOnlO%mklMOj0NOomjRqj%nJ1ojOOj0kOknMlL
$$ plain form
5914 -6 17 14 19 21 14 25 13 19 29 16 16 23 26 20 2 3 4 13 14 16 14 7 12 -1 4 0 1 7 -1 0 -1 7 -4 -5 -9 10 -17 0 7 -16 0 -14 8 -3 -6
5959 -6 -15 -2 -2 -10 -9 -1 -5 -12 0 -4 -6 -2 -6 -9 -4 0 -3 -6 -13 8 -9 -17 -6 -2 8 2 -2 1 -3 2 1 -5 -7 -7 -5 -11 -9 -3 -6 -16 -10 -15 -12 -14 -15 -15 -6 -8 -6 -5 -15 -14 -15
6012 -15 -6 -4 -7 6 -8 -7 -6 0 0 -5 5 -1 -11 -11 6 -5 3 -15 -6 -7 -4 -11 -6 -16 -5 -6 -1 -12 13 18 -1 -7 -10 1 4 1 -11 -6 -7 -1 -5 -6 -11 -3 -8 5
6058 5 -6 -4 -11 -17 -9 -2 -10 -8 -18 -7 -7 -16 0 -3 -6 -5 -7 -7 -14 -15 -4 -3 -4 -7 -5 -9 -8 -7 -4 -12 -4 -7 -14 -8 -1 -13 -2 -6 -1 3 0 -3 13 7 -14 -2 0 -4 -7 -8 0
6109 0 1 -7 -9 -3 -5 0 6 -4 -3 -15 1 -15 -3 -6 -8 5 -6 6 -3 7 -9 -8 -9 -10 -6 -7 -5 -6 -9 -3 -5 -10 -11 9 -7 6 9 6 -12 18 11 -1 0 4 12
6154 12 4 -1 -5 1 -2 0 -13 -4 5 -1 -15 2 -3 3 -2 -1 -3 6 -3 -3 -4 -15 -5 -5 -4 -2 -6 -6 -1 -3 0 -6 -5 -7 -16 -4 -7 -13 -7 3 -2 2 1 8 -2 4 8 -3 -3 4 4
6205 4 6 3 2 2 -3 -3 -5 -10 0 3 2 -6 -17 -2 8 4 -7 -9 -1 -12 -13 -5 0 -17 -21 -9 -3 -20 -13 -17 -6 -17 -6 -7 -22 -11 -4 -14 -9 -12 -21 -8 -14 -4
6249 -4 -19 -15 2 -24 -15 -14 -3 -10 -12 -5 7 7 -10 0 -9 0 -4 2 -3 -6 0 0 -4 -6 -9 -5 1 -9 -4 2 -4 -8 -9 0 -8 -9 -9 -14 -3 -9 -10 -4 2 -8 -10 -4 -6 -11 -7 -10 -7
6300gjoJ2qJ3j0mkJ1kJJLo%Rj8J8qmJ1Oj8JPPj6OokJ6k0OKPj0Om%MpKLMl%jKN
6349@lloJ0oNPqKj3LOknOQL%ojJ1qJjJ0rKJknNJLJ1qqlJ2qJ0loRPk0KpJ2lPol
6401AkLjJ0j1nNNrjRnJ0j7PoJ1j7QJ1mj0J9ojj3MJ0moMLP%mNk3MJ1PomJOrOLr
6449cMJJppJ2jllONLk4J5j1Pj4OJ7j3KnQmlJ0Mj4jpJ3%Qj0MoRnJ2nKKNpqQlJ1
6497A1j1ojJ2JrRrmJ0oNQj7MJ2%j8PkMnJ2j1mQj1RKqKMJ0j7qJ6oQj0J1OnkpKJ1
6543Gj6MLJ3rJnPkj4J2Qkj5J8rOLj2J0jKLoLj0LnJ3pNnmQoqOkkJ7mo%Kjj%M%j0
6593dpJ0qJ0Kj0JJ2kOmMkkNrJj2RlLNMpRMmj0J2pnLjOj5KjoNMmJ2qJ5j2Oj2J6
6641A1pMj2MJNorRj5KLOKNjmmJ1%j0JlQpJ0oJ4jrRj5JPQj5K0k6J7plLQrnJ2mk
$$ plain form
6300 -7 -8 -14 -2 -10 3 -7 -11 -13 -2 -4 -3 -2 1 -5 -5 4 -14 4 -4 -8 3 9 -9 -8 -1 6 -10 -4 -10 -12 4 -16 -10 -8 -1 -11 -5 -9 -9 -5 -12 -10 -7 -3 -6 -6 -7 -5 0
6349 0 -3 -6 -12 -2 -8 -3 4 -4 -2 -15 -12 -6 -8 -13 -7 1 4 4 -2 -3 8 0 1 0 10 1 3 4 2 -3 2 3 6 17 9 1 -2 10 2 12 9 3 12 19 -1 1 -6 6 3 10 4 1
6401 1 -1 2 1 11 0 -5 0 5 -4 -5 4 -1 9 -8 -1 -7 4 -13 -5 6 2 -8 11 5 4 -9 -5 5 1 -5 -1 2 9 9 5 10 -13 -9 2 9 3 -1 0 6 -3 3 6 -3
6449 -3 1 2 3 -4 -11 1 0 -3 -6 0 5 8 -16 -1 -12 -5 -19 -13 4 -9 -7 -12 -4 -8 -11 -1 3 -11 -12 -19 -6 -6 2 -8 -4 -10 -1 -6 6 1 3 5 10 3 -5 3 0 11
6497 11 0 -6 -7 5 6 -3 6 -3 -7 3 -3 2 10 -7 -3 9 9 -9 -2 -4 0 -5 7 -4 -8 0 -11 -2 0 -8 -6 -2 8 -9 -17 -1 -7 1 -9 2 8 3 1 -6 -4 7
6543 7 -9 -5 -2 11 2 3 -2 5 3 -11 1 9 7 -8 10 1 7 10 -2 8 7 9 12 6 9 -1 2 -3 10 3 8 3 -1 7 1 -7 -1 -3 -5 12 8 2 2 4 3 2 2 6 6 -4
6593 -4 -11 -1 -9 1 3 -7 -6 6 4 10 6 10 8 6 11 2 3 -9 0 -3 0 5 9 2 11 15 11 1 13 6 1 4 3 9 -6 -4 -5 -11 -6 -2 -6 6 -2 13 1 7 -5 11
6641 11 4 8 -4 0 1 6 0 -9 0 -15 -13 -10 -4 -2 3 2 -2 -6 5 5 -5 -4 -7 1 -6 4 -2 12 11 2 11 -4 -3 4 12 -3 17 -9 8 1 -2 1 9 0 -5 7 3 1
6689ArOJnJ0opPJj2OJ6j3nKNnmJmJ4nPJnQj4LOrQM%qnJ5oj2J6j2ROj0oL%PmJ0
6738GpnkMLlrJ2kkJ%jrJ0%loJ6q%j2J1%KPqlRj0M%NJjM%Rj6N%JkpJ9ojLmJLoM
6791HLlQqmKJ3j4j3K0roOOk1J0J8j5j1J6Nk2NQj7J3jJj2K3qlJ0j2KJ2j2JQj1K
6832bj0K6j6RoJMopJ2lj1J1lNj1%PjQorJ5pLJj1lJ2oOkmMmMmkMjQj3%MMMrJ2l
6881DqQ%j2LlJ0MjkljNnLJj0%J0j1kJ8OomLmlKkn%NlJ6j7Lk%p%oJ1MnloNPoLN
6933aj2QJj0oK1nj3J1j4J2%Rkk0J9lMoKJ5j2j0MK2k6J3%LrPlnJ2j0kj0OPpkRj
6976dOJ1j4jj2Qj1RKJ2j7J5j5LQj8qJ4%j1K6j4Kj2J5QPj4J0j8pJ6KMrNpJ2kpJ0
7017DpPpJ0qjjLlqJ3Qj9J0pj2J5qOKNQk1kQRj0j0J4q%NmJ4rPnq%MRJ%Oj8J4j5
$$ plain form
6689 1 -8 -2 -1 -6 4 -2 -9 -2 -1 -13 -7 9 -4 -9 -7 -2 -7 -11 -10 -14 0 -5 2 3 -2 6 -8 -5 1 -8 0 4 4 -4 -9 6 0 -12 4 -8 1 7 -3 -9 -6 -6 1 -3 7
6738 7 0 -5 -7 -3 0 -3 -12 0 -2 -4 -3 -3 -4 -13 -3 -3 -6 -12 4 -4 -4 -16 -5 -5 -3 4 -4 -7 2 -8 -4 -4 1 2 1 5 5 14 -2 3 3 4 2 -5 14 8 7 10 6 7 10 4 8
6791 8 11 8 16 8 4 6 19 5 -8 12 3 -3 3 9 -12 -2 16 1 -10 6 11 -11 -6 2 -15 -2 -3 -2 -14 9 1 -2 8 -4 -2 10 -2 -1 7 -4 -2
6832 -2 -12 14 -2 7 1 2 6 0 -7 5 2 -9 2 -1 4 -7 -7 0 -1 7 1 -8 7 0 3 4 -7 -10 2 -4 2 0 -4 0 -4 0 -4 -6 -2 -3 5 -8 -8 -4 0 4 -5 7 4
6881 4 -4 4 4 -8 -5 -8 2 6 5 3 0 -1 4 -1 2 3 -7 -7 3 -8 -10 8 14 8 4 7 3 0 2 0 -5 -5 0 -3 13 -4 -1 -3 -3 -10 -10 -16 -5 -1 -6 -9 -15 -10 -3 -9 -6 -1
6933 -1 -13 -5 -4 -14 -20 1 -4 -17 -6 -20 -8 -8 1 -1 -21 -2 -5 -1 -7 -5 10 -2 -12 -8 14 -12 1 1 4 -5 2 -1 -6 6 -4 -6 -16 -10 -3 -10 -12 -3 -4
6976 -4 2 13 -1 -2 -14 -6 -17 -8 -6 6 -11 4 -11 -8 0 -18 -26 -12 -12 -23 3 -11 -9 -21 -6 2 9 -5 5 -13 -20 -4 -2 2 -7 -2 -9 3 1 -6 4
7017 4 -3 4 -3 7 -1 -2 -3 0 -3 -11 2 10 -9 1 -6 -18 -3 -11 -5 -3 2 10 -11 -13 -5 4 -6 -16 -2 -10 -10 -5 -9 5 -4 3 -2 -10 -10 -6 3 4 4 10 -8 6 -9
7064iJ1Qj4JmKRj1J3j0jJJ6j4JMJRj5PJmlOq%%%j0J3rjPmJLj2%MJ1lKmj3jJ4k
7111gJ0j0nJ0oK2j6KnJ0j6RNkkL%Rjk0PlJ8j5RmkqLnLRnpLPqkpJ4j0%PKOLj2m
7159a1NMkm%%QjkkJ0Lj0nJ0j0RmKkJ0j4NpOPjqmkJ0qJ4pLNrjJ1j5J2j1Oj2J2n
7205eJlNLj0jJNNJ0j6JnMKj0JJ6qj2QJ1lj4%K0%rO%LpQrNjO%l%NoJnK1j5kj0J1
7254E%rJ3j2J0qQlmJ7j8PqjlJ2%j2kNLloLKOj1OJ%Nmjlj2J5Nj1J2j5MLJ1j0NM
7300FJ2rj2JqJ2%RJjoMj%Kn%KjmoJ3j6mPlNkKnJ6j0MqQmqJ3joLlrJ7JrqKJ2j2
7350iJ4%ooMlJQKLqJ4j2NrjJ0oOOkJoMj2NoM%j9J2MjKj1R%oPNj7jJMJ2qjklMq
7401a6oJ8KQj4J4k3J5J1rNLj1lnJ3Jjk0J2NMNo%MkLkKp%Rnk7RL1j6%lPpMqOnm
$$ plain form
7064 -9 2 10 -4 -3 -7 -5 4 -7 6 -4 -5 -4 12 -2 -1 3 4 13 -2 5 6 2 -1 5 -3 -3 -3 -3 -13 0 -9 -10 -3 -7 -6 -3 -15 -15 -11 0 -3 -1 -5 -18 -19 -5 -7
7111 -7 3 -7 -12 -2 -8 14 -2 0 -5 5 -11 -2 3 1 -1 2 2 11 10 -10 -3 -6 12 -3 6 2 0 -8 -5 -10 -7 2 -3 -10 -7 0 -8 -10 -17 -3 -13 -13 -6 -4 2 5 -7 -11
7159 -11 -6 -2 -4 -8 -8 -8 0 -1 -3 -5 5 8 -2 -7 3 -7 2 -2 0 -2 8 -6 -1 -8 -2 5 4 -4 -8 -10 0 -8 6 -1 2 7 -2 -3 8 -7 5 -6 0 -12 0 -5
7205 -5 -4 -7 -2 1 -9 -10 -9 -4 1 11 -5 -4 -9 -5 -3 -13 -12 4 -4 -16 -8 3 0 -14 -14 6 6 -3 3 3 6 -1 7 -2 3 2 8 8 5 5 10 4 5 0 21 6 4 -6 5
7254 5 5 -4 9 -3 7 -1 7 4 0 17 -1 6 -2 -3 -6 6 6 -6 -8 -3 0 -3 -9 -6 -4 2 -9 -3 -2 -2 3 -1 -2 -5 -17 -2 3 -8 4 -11 -7 -4 7 -3 2 6
7300 6 18 9 -3 -2 -10 2 2 11 12 11 5 9 8 8 10 5 5 7 6 2 -4 9 -7 -11 -4 -7 -2 -4 -2 -7 9 -1 3 -5 3 -1 -9 4 3 -3 0 -3 -12 5 6 -3 -11 -9 3 -9
7350 -9 5 5 -1 -7 -3 -6 -5 3 5 8 0 14 2 7 -2 -3 7 1 7 13 11 12 6 10 -2 3 -3 1 1 -18 -6 -2 -3 -1 -12 -3 -3 -9 -2 3 -14 -15 -14 -10 2 -6 -7 -9 -12 -8 -16
7401 -16 -22 -4 -2 6 -8 6 -17 -2 9 0 5 8 -3 -6 -11 2 3 2 -18 -6 -1 3 8 2 2 6 4 7 5 7 0 0 9 4 -23 -14 17 1 1 -2 5 -2 2 -6 0 -5 -9
7448iR%%PpqJLMj4%NKOmrMlKQJ1j1qJ0mNqPqLjNRqJ0j6J1pJ3pj4J1NormQLPj2
7498hJJ4j2KLlJ%kPpKKrLnRk4K5pLNpKmoK4j1QrPQj2%LJ2%rpJOPj1J2j3Oj2J5
7546A0lloNMKk%%Qj0kj6OQjJnMj2J1kKplPnMrJ4jj3J6JJj0lNLJ1nNj5OjnJ1pp
7595hnK8j7%P%m%QqQlmkJKjj3Rn%LnPKlrJ1qK1j5%oLJ0pKmrMKnJ4MrJ3j5JMMj
7646BKqj0K1JoJ1j5J2NrLpOKj4J0ojKj3K3r%%Ok1PpJ7pNmqMrJOQp%Nj1PoJ0j1
7693a3NJJ6j1jQq%%kNRj0%KkJpQJ2j9J4noJ8k0K%J%PKnqQLj0MLolMLLqLmQMj9
7743a3PPqPj2NJJ1rnJ9j3LjK%J4j9QJJ4j5LlJ2pqLpJ7mj4J5Qnr%JlKLmjLj0Pj
7790BMrLkQ%j0KKmqJ0nj0QJ3pnJ4j0KlORlrj1LJ5qjJpJ3%JNj1QLrJ1j%j7J2jj1
$$ plain form
7448 -9 0 0 0 7 0 -8 -7 -4 0 -14 -14 -9 -7 -1 -5 -14 -10 -13 -11 -3 8 -3 -11 -1 -5 0 -8 -1 -9 -6 -7 -2 7 -1 9 -7 4 -3 10 3 -11 0 5 -1 -10 -14 -6 -3 4 -8
7498 -8 -7 7 -5 -3 0 -3 -2 -2 -4 3 -4 -2 0 -9 -6 -11 -2 -26 -1 -8 -5 0 -7 -5 -9 -15 9 -2 6 -3 4 12 0 0 3 15 15 6 -1 0 6 13 2 14 1 7 -5 10
7546 10 7 4 -2 3 7 9 7 7 7 15 5 3 -13 -7 1 0 1 -4 0 -12 -1 -3 -1 -8 -11 -4 -9 -5 -14 0 -1 -14 2 3 4 -6 -9 -4 -1 10 5 10 -5 1 0 -5 6 -1 -8
7595 -8 -13 15 -2 -2 5 5 1 1 9 1 9 6 2 0 1 3 2 -11 -2 -7 -7 -4 -9 -2 0 -3 -12 -1 -9 12 -3 -3 -9 -6 4 -3 -1 -5 -14 -10 -8 -13 1 5 -4 9 -6 -5 -1 3 2
7646 2 4 -4 -14 7 8 2 13 -2 10 15 6 9 2 8 10 -4 6 0 -1 1 -12 11 2 2 2 8 -13 -6 -13 4 -3 2 -2 -10 -6 -15 -14 -8 0 -7 -7 -2 -13 -6 -12 -2 -13
7693 -13 -8 -7 9 -2 -3 5 -3 -3 -3 -5 0 9 -1 -1 1 -1 0 -7 1 13 -6 8 3 -3 15 -5 -3 -3 -2 -2 5 7 2 -6 2 5 -5 -1 2 -4 -7 -3 0 3 -5 -2 -6 2 6 -13
7743 -13 -6 1 -7 0 -12 -7 -6 5 -4 -9 10 -3 0 -1 1 1 15 -4 4 5 19 4 7 4 16 9 1 4 -3 14 10 -4 11 19 14 5 5 6 3 5 8 4 3 6 -4 3 2
7790 2 6 -3 0 -2 6 6 -4 -2 0 -4 -12 -2 -7 -17 -9 4 -3 -8 6 -4 -2 -5 1 10 7 -2 -13 -10 5 -3 -4 -3 -10 3 3 4 9 -2 6 9 0 11 10 10 -7 5 4 -7
7838gJ6KrJ1rmKpLlQmj6J4jjNQoJj6Qj%Oj0KJ2qljJNoJ2j4PJ1qJlkkJJ4rmNNr
7888cJ2j1J7j3KkPokj0K1j9J0lnM%O%nmJJJ3j1%j1J1r%JQoJ8j6PmOkj2J8jm%J3
7933A7j4jJ2poQj0J0Jj1MLmlJ7rlPmoOmmJ1oMoJj1kJ0LJ0j4lKmNQk0J5lpJ8qp
7979eQl%jolQQj4NLnJkJ2pj1J1Ooj3J1PJkm%J5j1mO%NpOKpPj0J0j5OMj2PoJ4j2
8027cOnJ1mpknJ%J1qKMlMMm%J0j3mJ7j4O%MmLoMkMj4J6pLOj6O%JJ0j1Rj3mKOr
8076hpNMJmJ0pkjJ3kkj5J9j4Qlj0J0oPqKlJ5j1P%KJMlKLj3RJ4qkJj2mJ0JLklL
8124DrLPpnJ4Jj5JJ2j0QLqmqMJOJnJ0JNj7QJj2OmQqPKk0J5PpPpNJoOjO%oKllR
8176FMpkj5J2jlJ2lOj8MJ1qq
$$ plain form
7838 -7 9 11 2 13 4 0 2 -5 -2 -5 3 -1 -17 -3 -4 -5 0 8 2 3 -13 -5 -6 -6 0 -10 -8 4 -4 -7 -8 -7 -2 -8 4 -10 -3 8 0 1 -2 -4 -6 -5 9 0 -4 1 6 -3
7888 -3 9 -2 15 2 4 2 9 3 1 -9 12 -7 3 0 -5 -1 -1 5 5 0 -4 -3 -2 11 0 0 -11 0 -9 -9 -8 0 -6 12 -4 3 -1 5 3 -9 9 8 4 4 17
7933 17 3 2 14 7 1 9 -1 9 10 -1 3 6 2 -1 16 7 4 11 7 1 7 3 -1 10 4 8 2 3 -8 -10 0 3 13 -1 -4 -2 -6 -1 7 -13 2 -1 -8 10 2 -5
7979 -5 3 0 0 -1 -7 -10 -2 6 -8 -3 0 -5 -4 -6 6 -1 -12 -1 5 -1 -14 -3 4 5 3 -1 -1 14 3 -1 5 5 10 3 9 11 4 11 1 11 -4 2 6 -6 1 -5 9 -3
8027 -3 3 -2 9 5 -2 -4 -9 -8 -8 3 -5 -3 1 -2 2 6 2 2 12 -1 -5 12 -2 4 4 8 4 7 1 5 3 7 -7 9 2 5 11 -5 1 1 2 12 1 10 -3 -7 -5 1 -8
8076 -8 -15 -10 -6 -5 -9 1 -6 -8 -9 4 2 0 -15 4 -10 -2 -5 -15 -5 -11 -4 -12 -10 -13 2 -9 -2 -2 0 1 5 2 4 7 -6 3 17 9 7 8 -4 -8 2 3 6 4 1 4
8124 4 -5 -2 5 -2 -7 7 8 -7 -6 6 -4 4 7 -1 -5 -13 -9 -8 -2 -1 -6 4 5 10 -7 1 2 -10 -4 -8 0 -8 -1 1 -19 -4 3 -4 3 -4 1 2 -4 2 1 7 7 1 3 0 -3 6
8176 6 10 3 1 -14 -2 -3 -6 6 3 9 -9 -5 6 -2 -10
8191a0
##END NTUPLES=NMR FID
##END=
