##TITLE=1H_SA_37.185
 D2O, 8 sc, 
 3.3.2020
##JCAMPDX= 6.0         $$ Bruker NMR JCAMP-DX V2.0
##DATA TYPE= NMR FID
##DATA CLASS= NTUPLES
##ORIGIN= UXNMR, Bruker Analytische Messtechnik GmbH
##OWNER= root
$$ XWIN-NMR		Version 3.5
$$ Tue Mar  3 14:30:55 2020 Russian Standard Time (UT+4h)  she@DPX200
##.OBSERVE FREQUENCY= 200.1315
##.OBSERVE NUCLEUS= ^1H
##.DELAY= (6, 6)
##.ACQUISITION MODE= SIMULTANEOUS
##.ACQUISITION SCHEME= undefined
##.AVERAGES= 8
##.DIGITISER RES= 18
##SPECTROMETER/DATA SYSTEM= spect
##.PULSE SEQUENCE= zg30
##.SOLVENT NAME= D2O
##.SHIFT REFERENCE= (INTERNAL, D2O, 0, 15.7039)
##AUDIT TRAIL= $$ (NUMBER, WHEN, WHO, WHERE, WHAT)
$$ ##TITLE= Audit trail, XWIN-NMR		Version 3.5
$$ ##JCAMPDX= 5.01
$$ ##ORIGIN= Bruker BioSpin GmbH
$$ ##OWNER= she
$$ F:/spectra/data/she/nmr/H-F/1/audita.txt
$$ ##AUDIT TRAIL=  $$ (NUMBER, WHEN, WHO, WHERE, WHAT)
(   1,<2020-03-03 14:29:10.68 +0400>,<she>,<DPX200>,
      <created by zg, POWCHK disabled, PULCHK disabled
       configuration hash MD5:
       00 E9 B6 7A A2 85 ED C7 34 08 36 98 17 FE 4E 26
       data hash MD5: 16K
       D7 F5 CC C1 52 2E D6 36 54 FF 57 1D 51 AC C1 18>)
$$ ##END=
$$ 
$$ hash MD5
$$ 4B C7 54 98 2F 2C 3B A9 7E 7A 39 C5 5A 85 66 73
##$RELAX= 
##$RELAX= 
##$RELAX= 
##$RELAX= 
##$RELAX= 
##$RELAX= 
$$ Bruker specific parameters
$$ --------------------------
##$DU= <F:/spectra>
##$EXPNO= 1
##$NAME= <H-F>
##$PROCNO= 1
##$TYPE= <nmr>
##$USER= <she>
##$AMP= (0..31)
100 100 100 100 100 100 100 100 100 100 100 100 100 100 100 100 100 100 
100 100 100 100 100 100 100 100 100 100 100 100 100 100 
##$AQSEQ= 0
##$AQ_mod= 1
##$AUNM= <au_zg>
##$AUTOPOS= <>
##$BF1= 200.13
##$BF2= 200.13
##$BF3= 200.13
##$BF4= 200.13
##$BF5= 200.13
##$BF6= 200.13
##$BF7= 200.13
##$BF8= 200.13
##$BYTORDA= 1
##$CFDGTYP= 0
##$CFRGTYP= 5
##$CHEMSTR= <none>
##$CNST= (0..31)
1 1 145 1 1 1 1 1 1 1 1 1 1 1 1 1 1 1 1 1 1 1 1 1 1 1 1 1 1 1 1 1 
##$CPDPRG= <>
##$CPDPRG1= <>
##$CPDPRG2= <>
##$CPDPRG3= <>
##$CPDPRG4= <mlev>
##$CPDPRG5= <mlev>
##$CPDPRG6= <mlev>
##$CPDPRG7= <mlev>
##$CPDPRG8= <mlev>
##$CPDPRGB= <>
##$CPDPRGT= <>
##$D= (0..31)
0 1.2 0 0 0 0 0 0 0 0.06 0 0.03 0 0 0 0 0.0002 0 0 0 0 0 0 0 0 0 0 0 0 
0 0 0 
##$DATE= 1583231349
##$DBL= (0..7)
120 120 120 120 120 120 120 120 
##$DBP= (0..7)
150 150 150 150 150 150 150 150 
##$DBP07= 0
##$DBPNAM0= <>
##$DBPNAM1= <>
##$DBPNAM2= <>
##$DBPNAM3= <>
##$DBPNAM4= <>
##$DBPNAM5= <>
##$DBPNAM6= <>
##$DBPNAM7= <>
##$DBPOAL= (0..7)
0.5 0.5 0.5 0.5 0.5 0.5 0.5 0.5 
##$DBPOFFS= (0..7)
0 0 0 0 0 0 0 0 
##$DE= 6
##$DECBNUC= <off>
##$DECIM= 24
##$DECNUC= <off>
##$DECSTAT= 4
##$DIGMOD= 1
##$DIGTYP= 9
##$DL= (0..7)
0 120 120 120 120 120 120 120 
##$DP= (0..7)
150 150 150 150 150 150 150 150 
##$DP07= 0
##$DPNAME0= <>
##$DPNAME1= <>
##$DPNAME2= <>
##$DPNAME3= <>
##$DPNAME4= <>
##$DPNAME5= <>
##$DPNAME6= <>
##$DPNAME7= <>
##$DPOAL= (0..7)
0.5 0.5 0.5 0.5 0.5 0.5 0.5 0.5 
##$DPOFFS= (0..7)
0 0 0 0 0 0 0 0 
##$DQDMODE= 0
##$DR= 18
##$DS= 0
##$DSLIST= <SSSSSSSSSSSSSSS>
##$DSPFIRM= 0
$$ [...]
##$SUBNAM2= <"">
##$SUBNAM3= <"">
##$SUBNAM4= <"">
##$SUBNAM5= <"">
##$SUBNAM6= <"">
##$SUBNAM7= <"">
##$SUBNAM8= <"">
##$SUBNAM9= <"">
##$SW= 24.9337058887773
##$SWIBOX= (0..15)
0 0 2 0 0 0 0 0 0 0 0 0 0 0 0 0 
##$SW_h= 4990.01996007984
##$TD= 16384
##$TD0= 1
##$TE= 0
##$TE2= 300
##$TE3= 300
##$TEG= 300
##$TL= (0..7)
0 120 120 120 120 120 120 120 
##$TP= (0..7)
150 150 150 150 150 150 150 150 
##$TP07= 0
##$TPNAME0= <>
##$TPNAME1= <>
##$TPNAME2= <>
##$TPNAME3= <>
##$TPNAME4= <>
##$TPNAME5= <>
##$TPNAME6= <>
##$TPNAME7= <>
##$TPOAL= (0..7)
0.5 0.5 0.5 0.5 0.5 0.5 0.5 0.5 
##$TPOFFS= (0..7)
0 0 0 0 0 0 0 0 
##$TUNHIN= 0
##$TUNHOUT= 0
##$TUNXOUT= 0
##$USERA1= <user>
##$USERA2= <user>
##$USERA3= <user>
##$USERA4= <user>
##$USERA5= <user>
##$V9= 5
##$VALIST= <valist>
##$VCLIST= <CCCCCCCCCCCCCCC>
##$VD= 0
##$VDLIST= <DDDDDDDDDDDDDDD>
##$VPLIST= <PPPPPPPPPPPPPPP>
##$VTLIST= <TTTTTTTTTTTTTTT>
##$WBST= 1024
##$WBSW= 4
##$XGAIN= (0..3)
0 0 0 0 
##$XL= 0
##$YL= 0
##$YMAX_a= 390315
##$YMIN_a= -260506
##$ZGOPTNS= <>
##$ZL1= 120
##$ZL2= 120
##$ZL3= 120
##$ZL4= 120
##$ABSF1= 10
##$ABSF2= 0
##$ABSG= 5
##$ABSL= 3
##$ALPHA= 0
##$AQORDER= 0
##$ASSFAC= 0
##$ASSFACI= 0
##$ASSFACX= 0
##$ASSWID= 0
##$AUNMP= <proc_1d>
##$AZFE= 0.1
##$AZFW= 0.1
##$BCFW= 1
##$BC_mod= 2
##$BYTORDP= 1
##$COROFFS= 0
##$CY= 11.3945322036743
##$DATMOD= 1
##$DC= 2
##$DFILT= <>
##$DTYPP= 0
##$F1P= 16.9975609425685
##$F2P= -3.02152046262296
##$FCOR= 0.5
##$FTSIZE= 0
##$FT_mod= 4
##$GAMMA= 1
##$GB= 0.15
##$INTBC= 1
##$INTSCL= 1
##$ISEN= 128
##$LB= 0.24
##$LEV0= 0
##$LPBIN= 0
##$MAXI= 10000
##$MC2= 0
##$MEAN= 0
##$ME_mod= 0
##$MI= 1.114404
##$NCOEF= 0
##$NC_proc= 0
##$NLEV= 6
##$NOISF1= 3.799351
##$NOISF2= 2.8
##$NSP= 1
##$NTH_PI= 0
##$NZP= 0
##$OFFSET= 15.70392
##$PC= 1
##$PHC0= -9801.766
##$PHC1= 30.00082
##$PH_mod= 1
##$PKNL= yes
##$PPARMOD= 0
##$PSCAL= 0
##$PSIGN= 0
##$REVERSE= no
##$SF= 200.130013532006
##$SI= 16384
##$SIGF1= 3
##$SIGF2= 2
##$SINO= 400
##$SIOLD= 16384
##$SREGLST= <1H.CDCl3>
##$SSB= 0
##$STSI= 0
##$STSR= 0
##$SW_p= 3612.71676300578
##$SYMM= 0
##$S_DEV= 0
##$TDeff= 0
##$TDoff= 0
##$TI= <>
##$TILT= no
##$TM1= 0
##$TM2= 0
##$TOPLEV= 0
##$USERP1= <user>
##$USERP2= <user>
##$USERP3= <user>
##$USERP4= <user>
##$USERP5= <user>
##$WDW= 1
##$XDIM= 8192
##$YMAX_p= 0
##$YMIN_p= 0
$$ End of Bruker specific parameters
$$ ---------------------------------
##NTUPLES= NMR FID
##VAR_NAME=  TIME,          FID/REAL,        FID/IMAG
##SYMBOL=    X,             R,               I
##VAR_TYPE=  INDEPENDENT,   DEPENDENT,       DEPENDENT
##VAR_FORM=  AFFN,          ASDF,            ASDF
##VAR_DIM=   8192,          8192,            8192
##UNITS=     SECONDS,       ARBITRARY UNITS, ARBITRARY UNITS
##FACTOR=    0.0002004,     1,               1
##FIRST=     0,             0,               0
##LAST=      1.6414764,     0,               0
##MIN=       0,             -260506,         0
##MAX=       1.6414764,     390315,          0
$$ Real data points
##PAGE= N=1
##DATA TABLE= (X++(R..R)), XYDATA
0 0 0 0 0 0 0 0 0 8 -8 8 -8 16 -16 24 -25 32 -40 48 -56 64 -78 89 -104 119 -138 159 -183 207 -233 264
30 264 -298 335 -375 422 -469 525 -583 648 -718 797 -884 977 -1084 1199 -1328 1472 -1636
47 -1636 1819 -2030 2275 -2561 2904 -3319 3839 -4507 5407 -6693 8683 -12225 20465 -82597
61 -82597 28916 75787 -187075 -143853 10127 -75879 -260506 -161735 -29893 -99490 -150409
72 -150409 9617 74455 -85271 -213076 -151051 -83979 -82714 -70004 -29704 -13508 6408 9576
84 9576 -47347 -111184 -95270 -35739 18998 68948 77676 12507 -32473 -8319 -13523 -71974 -56675
97 -56675 26766 56218 59297 103062 63967 -81795 -95356 62840 92979 -36219 -8901 154866
109 154866 110462 -83437 -85100 4946 -101810 -206310 -38656 110923 -47340 -203847 -85961
120 -85961 8196 -136619 -223531 -77539 36788 -5407 -6411 62164 21095 -91543 -88924 -3386
132 -3386 17059 -11618 -3360 26741 32217 -3223 -77637 -131323 -93361 -12608 17172 20497 46743
145 46743 43784 -1777 -4122 26686 867 -22855 59244 142450 97194 21765 16050 -15856 -91835
158 -91835 -69990 16362 -9765 -78852 -9162 71104 -36426 -164074 -101456 -6248 -45192 -54636
170 -54636 59160 84588 -37715 -77314 2548 -15863 -126215 -106550 22478 48122 -26232
181 -26232 -52940 -43436 -77039 -102602 -64238 -17086 1459 25344 56030 57842 29908 -10269
193 -10269 -41076 -19814 46805 73728 39295 24097 37733 1246 -67799 -77851 -51257 -53466
205 -53466 -34230 35883 48937 -29177 -67209 -28822 -28418 -64990 -27484 43458 32932 -2132
217 -2132 20074 6125 -96472 -139450 -61985 -16244 -60910 -62823 -7308 -25039 -101102 -108118
229 -108118 -68163 -75746 -76906 -1247 64789 36771 -12879 -14360 -10479 -28804 -27789 2584 29759
242 29759 45242 48561 23094 -18113 -41842 -45918 -36003 2138 45970 49022 29802 33720 31111
255 31111 -15031 -45271 -7917 34342 36356 43472 61140 26284 -39594 -49629 -24796 -36583
267 -36583 -45326 6167 50176 19860 -20159 -19180 -33033 -68806 -49893 13248 30482 6986 12758
280 12758 22001 -22869 -74001 -66231 -34020 -22472 -4421 28447 28796 -7613 -31074 -29785 -28463
293 -28463 -20158 11832 47295 63060 58772 35783 -300 -22694 -21256 -12134 2167 27927 42810
306 42810 23190 -5504 -18616 -35683 -54422 -34687 16419 42182 37191 40107 38241 1648 -31861
319 -31861 -19782 5266 8623 19637 45656 36490 -13562 -46795 -47787 -53256 -56282 -22917 19361
332 19361 23759 7128 1038 -9493 -32554 -34861 -2754 29538 43150 50229 47483 21225 -15300
345 -15300 -35190 -36370 -24670 -4197 16758 23312 13302 -5936 -28670 -43212 -35643 -11500 14805
358 14805 39662 57025 49221 19127 -5053 -13743 -18586 -14229 10753 34476 30222 9805 -8100
371 -8100 -30479 -56432 -56245 -25008 4032 17342 27926 31788 11210 -17608 -25408 -14632 -2144
384 -2144 16754 41334 47735 25236 -4350 -25434 -40129 -44415 -28959 -1564 17677 22189 14938
397 14938 -3412 -25078 -34785 -25299 -3682 22016 41534 44724 31829 9037 -15633 -33845 -33709
410 -33709 -15381 6550 18901 22175 11650 -12182 -34976 -39956 -30134 -12158 12720 38091 45342
423 45342 29046 6611 -10988 -22999 -23487 -5459 18087 28712 25150 12990 -9442 -35320 -47251
436 -47251 -37047 -15483 6508 25898 32995 21505 173 -16550 -23804 -18704 -267 23282 36519
449 36519 32735 16162 -8156 -32729 -44265 -38192 -21449 -1226 16678 20833 6371 -14767 -28465
462 -28465 -31754 -23693 -1387 24613 38657 37601 25516 3943 -21230 -33536 -24528 -5382 10718
475 10718 22131 22804 6950 -15727 -30255 -33584 -27566 -7239 21840 39638 37043 21177 1953
488 1953 -16530 -24877 -15898 1497 14757 24747 25314 9109 -19152 -39493 -43260 -33101 -12054
501 -12054 12309 24969 20924 9762 -3062 -19289 -29245 -19548 3383 22847 32643 30184 9570
514 9570 -19020 -34351 -33288 -27392 -16835 4842 23789 22477 6703 -10068 -24425 -29047 -13228
527 -13228 16491 35090 37600 34555 26101 4553 -18437 -26432 -19164 -3384 16931 29238 18434
540 18434 -6168 -23317 -31512 -33805 -24552 -4474 15077 27534 31393 18696 -10060 -30115 -25435
553 -25435 -7979 4878 16288 24724 17375 -1014 -16710 -30196 -43560 -36722 -5263 21520 23339
566 23339 13236 2463 -13897 -27076 -22192 -8688 -704 12988 34165 34855 4153 -25101 -31389
579 -31389 -28340 -20443 117 20011 20264 11687 8599 -2025 -24945 -34222 -14189 14523 30631
592 30631 32623 20904 -1325 -18838 -24777 -28726 -28780 -13201 9465 18356 11538 -3099 -25525 -41366
606 -41366 -28555 2125 18151 21489 33495 43385 27592 1596 -9284 -9967 -5136 16528 41840
619 41840 37128 9191 -5502 -9492 -22721 -31617 -16169 6672 20873 35700 42747 19773 -11479
632 -11479 -10032 13116 22846 25327 41492 52018 37551 16065 820 -19153 -34904 -20368 10971
645 10971 21744 9163 -3326 -11748 -22653 -27752 -25255 -18010 2355 32851 45685 28859 6565
658 6565 -4144 -11143 -10289 9157 26961 23239 19809 29114 20087 -17064 -37756 -20537 3053 15384
672 15384 29889 37782 21459 3608 4473 4498 -8141 -2361 29767 50099 44413 32581 16525 -10331
686 -10331 -20185 259 16242 10490 15709 36415 34138 2613 -19401 -19907 -18338 -8038 18794
699 18794 32889 17745 -177 -3876 -12608 -28862 -31525 -17193 1423 20623 28760 10462 -17918
712 -17918 -23196 -12913 -10743 -5711 16407 32638 26545 19921 15427 -8885 -34568 -21992 12920
725 12920 23700 14715 16785 17230 -1460 -16613 -14878 -12309 -6967 19981 48150 42024 17832 6920
739 6920 1537 -7816 -1920 16876 23346 21023 30163 32139 1548 -30858 -27600 -8028 1330 11818
753 11818 27272 25932 9225 2826 1083 -10499 -13816 8273 34305 40885 36127 24333 1444
766 1444 -12838 -5092 3981 1992 12427 37167 40481 18460 2913 -955 -9207 -5394 23311 45587
780 45587 37721 27375 31186 21528 -5516 -15898 -3485 8173 17217 31070 28390 2324 -16611
793 -16611 -14897 -14555 -17440 -2301 21406 27928 23667 21062 6281 -19334 -22515 211 14109 12530
807 12530 16747 20555 4674 -16853 -24906 -27429 -27896 -10559 16198 24277 12594 5163 123 -10101
821 -10101 -9953 6699 20026 26205 39476 46757 25931 -2924 -9527 -4113 -4336 3075 22279 26129
835 26129 10406 1443 -1675 -17303 -29249 -12575 13460 23484 25042 26914 15603 -5763 -12223
848 -12223 -5783 -4385 -118 16908 27069 13361 -5739 -16766 -28170 -34901 -21991 -897 5723
861 5723 5212 9111 3627 -16087 -26421 -18375 -7629 3011 20392 29858 17508 794 -5688 -12175
875 -12175 -19460 -10681 10013 19954 19505 19519 11308 -9492 -20673 -9457 3262 8817 20560 33104
889 33104 25106 4863 -4898 -8717 -15091 -9124 12239 25553 20158 13171 7521 -7249 -20916 -15348
903 -15348 -191 8963 17343 26510 21118 1448 -12374 -15451 -16193 -10896 5340 18217 15814 7285
917 7285 -786 -14237 -25371 -20197 -4399 7087 15902 24115 20011 2483 -9776 -10758 -10098 -5270
931 -5270 10931 23804 19544 8699 -183 -12334 -25686 -23349 -6854 6001 11752 16876 14688
944 14688 -1048 -14843 -13967 -7762 -2409 10144 24972 25294 11681 -1077 -11248 -22079 -22335 -8557
958 -8557 4640 8517 8687 5384 -6681 -20869 -23458 -16164 -4558 9808 22960 24213 13302 1547
972 1547 -6709 -13688 -12829 -2062 9987 14574 14282 7565 -8824 -24559 -26322 -17967 -8055 2686
986 2686 14860 18450 8510 -2093 -7870 -13110 -12203 1939 18746 22863 16885 8979 -2803 -17317
1000 -17317 -23281 -17333 -8243 883 10116 13810 3783 -11131 -18442 -17281 -11322 311 14917 22022
1014 22022 19926 12497 1908 -11131 -17912 -11920 -439 9644 14785 12631 1615 -11280 -18378
1027 -18378 -20147 -16278 -4804 10345 18926 16750 8527 -2601 -13601 -16303 -7243 3781 10364
1040 10364 14739 15676 5868 -10135 -20347 -20761 -15630 -5042 9167 16911 12301 2626 -4879 -11377
1054 -11377 -15230 -10070 3788 16017 20110 17526 8165 -5873 -16140 -16465 -8847 306 9889 15963
1068 15963 14892 5312 -6061 -14265 -15401 -7320 6359 16618 20073 16962 7198 -5285 -14099 -15069
1082 -15069 -10155 -1199 10039 15757 10460 -1480 -11327 -17257 -18823 -10956 2583 12759 15842 13964
1096 13964 7019 -6157 -16407 -15406 -5879 3093 10132 14826 11742 -687 -12362 -17318 -17027 -10727
1110 -10727 1506 14877 19405 14423 5574 -2862 -9849 -9603 -1630 9739 17977 20422 15247 4084
1124 4084 -8773 -16431 -16975 -9633 1439 9742 12252 8840 738 -9848 -16821 -13446 -3297 6891
1138 6891 15446 19737 15103 2091 -8972 -13958 -14898 -10607 215 11022 11133 2724 -5831 -13677
1152 -13677 -19917 -19308 -7765 5316 13021 16732 15350 6251 -5918 -11450 -7200 974 9236 16317
1166 16317 18308 12092 1000 -9390 -15466 -14479 -6391 5051 14561 16243 10022 -203 -8016 -10798
1180 -10798 -9701 -3476 8021 17388 17276 9120 -810 -11531 -19289 -17409 -6049 2815 6005 7782
1194 7782 5861 -4101 -16502 -19507 -13388 -5651 3941 14575 16365 6035 -4830 -9951 -13235 -15075
1208 -15075 -8505 4498 12059 10802 4459 -4593 -13910 -17629 -10919 -185 8645 14784 17084 13413
1222 13413 4112 -6131 -11812 -8280 1867 11126 14622 12624 5487 -5873 -14996 -17276 -14303 -9317
1236 -9317 726 12363 13812 2709 -7544 -11295 -12398 -11325 -1170 10453 13066 9529 6587
1249 6587 -682 -15587 -22885 -15221 -2634 2538 5679 7281 1443 -9802 -14976 -13506 -11188 -4265
1263 -4265 8714 19329 17273 6913 -2240 -8839 -10188 -5548 1928 8279 12711 12760 6650 -4280
1277 -4280 -13402 -16566 -11101 861 11903 13628 9051 5339 -808 -9892 -14627 -8693 -117 5771
1291 5771 12036 13213 1214 -14723 -18165 -12803 -11532 -9083 2895 12384 7871 -851 -5633 -11825
1305 -11825 -18738 -12043 4314 12339 8640 5698 3767 -5423 -16626 -18042 -12012 -4378 4410 11872
1319 11872 9182 -1869 -10175 -12972 -11199 -5922 2035 9411 14099 14970 7566 -5945 -14564 -12837
1333 -12837 -6504 -357 7345 9816 2917 -4836 -8397 -14833 -21564 -15582 3 9104 8374 6904 2367
1348 2367 -9592 -16774 -10441 -2806 -2664 2363 12993 11835 -4431 -15511 -15635 -15850 -14089 -2521
1362 -2521 9339 7709 900 -895 -4311 -13699 -16573 -7127 5265 11892 13534 8990 -767 -8806
1376 -8806 -11752 -11482 -8204 49 7531 9683 7259 812 -9889 -17500 -12127 -1183 4543 7758 12625
1391 12625 10769 143 -8144 -10424 -12003 -10776 1498 13198 9626 -302 -3856 -7396 -15894 -15920
1405 -15920 -4046 4666 6314 11018 14342 3450 -11919 -12455 -4183 -720 2060 10979 13970 5252
1419 5252 -4406 -8558 -13372 -16277 -8698 3987 10503 9251 4750 -1909 -8166 -9639 -7586 -2982 4826
1434 4826 14310 14385 6467 -1448 -8270 -15098 -14462 -3950 4081 3461 3767 4906 -3141 -15497 -17083 -9970
1450 -9970 -4292 1609 11981 14595 3914 -5685 -5667 -7828 -12447 -5762 7369 11078 5958 3176 -1832
1465 -1832 -13503 -18946 -10038 -625 2313 6375 11696 7871 -3693 -9692 -9612 -7784 -2242 7726 13368
1480 13368 9831 3461 -3247 -10480 -13863 -9950 -3659 2360 9241 11307 2985 -6346 -9629 -9420 -8965
1495 -8965 -2103 9669 12977 7733 4572 548 -9740 -16464 -8540 1202 3893 6172 10133 5344
1509 5344 -7728 -12274 -8384 -6033 -3531 7717 16108 11806 2776 -1027 -4985 -11502 -8385 2441
1523 2441 8659 8472 7937 4967 -4993 -12561 -12002 -6644 -743 6702 12694 10621 3733 -1823 -6812 -9453
1539 -9453 -5000 3452 9078 10646 10215 4413 -6216 -12310 -10273 -6808 -2584 6093 12781 8186 7
1554 7 -3049 -5742 -9957 -6688 5479 12431 10455 9215 7016 -2812 -12602 -10603 -2890 251 3645
1569 3645 9736 9525 -420 -8265 -9106 -9411 -7421 1571 11348 12238 7923 3457 -2443 -9103 -9920 -4182
1585 -4182 1657 6426 9634 7669 -1085 -9131 -11796 -11562 -7753 699 8269 9298 6306 3320 -3619
1600 -3619 -10576 -9403 -1585 4319 8012 11504 9132 -90 -8085 -9279 -9246 -8080 -488 9358 10037 4301
1616 4301 -247 -4447 -9914 -10279 -1508 6325 8418 9860 10574 3593 -6915 -10626 -7944 -3864 1192
1631 1192 8475 9976 3991 -2627 -6395 -9935 -10676 -4396 3937 9324 10914 8630 1685 -6438 -8777
1646 -8777 -6021 -2176 3098 8961 10730 5405 -1109 -6266 -10755 -11055 -3470 5546 8843 8413 6710
1661 6710 1941 -5736 -8635 -5293 -1084 3633 10501 12666 5705 -2799 -6634 -9185 -9583 -4442 3975
1676 3975 7952 7014 4882 641 -7421 -11633 -6877 147 5404 9061 10965 6490 -1665 -6970 -8457
1691 -8457 -8352 -4589 3666 8967 7124 2420 -2618 -8476 -11346 -7290 -811 4090 8491 10478 6502
1706 6502 -1304 -7111 -8131 -6723 -1723 5566 9066 6894 2158 -2638 -8623 -12266 -9353 -2322 3685
1721 3685 7235 8559 4617 -3291 -8294 -7562 -5511 -1550 5046 10303 8224 2299 -3099 -8302 -12084
1736 -12084 -8996 -1454 4202 5657 6164 3226 -3191 -9050 -9040 -5126 -247 6183 11016 9584 3234
1751 3234 -2666 -6522 -8819 -6874 -293 5489 7264 6519 2823 -4390 -10005 -9657 -5377 -177 5554
1766 5554 10147 9137 3366 -1873 -5852 -8281 -5930 1328 7514 8321 6373 2698 -3992 -10162 -10114 -5315
1782 -5315 -571 4386 9215 8926 2012 -4008 -6207 -6647 -4839 2025 8622 10402 7090 3443 -2653
1797 -2653 -8574 -9402 -4844 693 5534 8199 7251 1257 -4685 -7551 -7646 -4562 2076 8207 9964 7312
1813 7312 2706 -2846 -8274 -8347 -3759 996 4897 7833 6650 20 -6689 -8913 -8339 -5784 830 7638
1829 7638 8966 5625 2026 -2909 -8178 -8882 -3570 2855 6392 7444 6202 623 -6508 -9355 -7909
1844 -7909 -4639 490 7229 9405 6286 999 -3477 -7040 -6871 -1774 4011 7295 8446 7195 1142
1859 1142 -6084 -8541 -7747 -4689 1072 6691 7807 3742 -981 -4436 -7572 -8348 -2492 4171 8079
1874 8079 8933 7183 1594 -5694 -8061 -5780 -2778 904 5889 8181 4231 -1709 -5743 -8525 -8316
1889 -8316 -2897 4446 8513 8049 6524 2399 -3349 -6182 -4469 -457 4791 9379 10429 5375 -742
1904 -742 -4671 -7046 -6914 -2156 4529 7514 7521 6290 1596 -5761 -7847 -3927 603 4609 8478 10001
1920 10001 5584 -693 -4556 -6361 -7008 -2955 4685 8569 6641 3387 -663 -5484 -8153 -4858 626
1935 626 4477 7533 9779 6925 -519 -5871 -6712 -4678 -627 4942 8342 6886 3563 -193 -5559
1950 -5559 -8329 -5440 -41 4691 8958 9944 4637 -1809 -4794 -4635 -4484 -1680 5126 9124 6466 1992
1966 1992 -1539 -6717 -10481 -6836 65 3758 4517 5964 4284 -2049 -7081 -6133 -3719 -781 5475
1981 5475 10065 7665 1696 -2095 -4875 -7343 -6271 -409 4480 6295 6622 3397 -2717 -7223 -6804
1996 -6804 -2987 1265 6167 9399 8307 3913 403 -3667 -7166 -4177 2698 6646 7314 6979 3710
2011 3710 -3423 -7658 -5978 -3139 -1132 3854 9646 7940 1265 -2701 -4303 -6191 -4810 1704 7483
2026 7483 6816 4867 3360 -1774 -7966 -8301 -2955 1304 4179 7765 7327 1525 -2965 -4466 -4376 -3311
2042 -3311 2195 8131 9109 6784 3670 -1777 -6333 -6219 -1638 1931 5144 7953 7053 1616 -2999 -4741
2058 -4741 -5729 -3361 2932 8655 8532 5525 2945 -1291 -7290 -7068 -1896 1975 3242 6475 6226 -568
2074 -568 -7407 -7641 -5776 -4987 -605 6157 7742 3598 192 -2082 -6310 -7400 -2347 3801 5722 5837
2090 5837 5310 818 -5277 -7812 -5806 -3529 287 5911 7738 4325 172 -2896 -6068 -5817 -1200
2105 -1200 4018 6566 7395 6752 1301 -4824 -6457 -4934 -3188 803 6157 7519 2116 -1569 -3779
2120 -3779 -6861 -7854 -2735 4031 5645 5125 5123 1495 -5582 -8077 -4566 -1621 679 4849 7245 3238
2136 3238 -3068 -5246 -5903 -6546 -3489 3684 7214 6084 4268 1595 -3504 -6352 -3981 381 3912
2151 3912 6734 8204 4925 -664 -4003 -5421 -5304 -1612 4303 6674 5563 4057 722 -4263 -6301
2166 -6301 -2932 990 3352 6933 8867 5256 -1850 -4574 -4530 -4872 -2964 3440 6763 4339 1242 -762
2182 -762 -5235 -8928 -5650 220 3709 4740 6166 4676 -1796 -5802 -4654 -3500 -1969 3211 7619
2197 7619 6141 1290 -1644 -4571 -7135 -5620 25 4016 5463 5856 4204 -1046 -5187 -5374 -3040
2212 -3040 -220 4428 7243 5703 1713 -1013 -4581 -7349 -5417 296 4020 4534 5107 3288 -2876
2227 -2876 -6968 -5733 -2737 -912 2742 7184 6216 872 -2755 -4598 -6779 -5989 -103 4468 4651 3556
2243 3556 2065 -2281 -6743 -7067 -3026 336 3699 6879 6700 1788 -2833 -4226 -4338 -3537 378 5270
2259 5270 6155 4804 2295 -1660 -6093 -6296 -2380 1799 4876 7023 6238 2208 -1716 -3401 -4490 -2919
2275 -2919 1851 6212 6977 4469 2076 -2063 -6295 -6214 -2196 1080 2983 5575 5903 1503 -3997 -5252
2291 -5252 -3942 -2836 1312 6156 7204 4172 1352 -1316 -5184 -6489 -2777 1927 4232 5172 5105 1099
2307 1099 -4098 -5747 -4002 -1870 1210 5639 8130 5670 1927 -960 -3607 -4319 -1020 3687 5792
2322 5792 5712 4652 1017 -3665 -5742 -4918 -2566 886 5284 6529 3686 405 -2317 -4253 -4990 -1847
2338 -1847 3034 5104 5217 4589 840 -4541 -7019 -4941 -2199 240 3639 5248 3179 -1290 -4025
2353 -4025 -5312 -5953 -2795 2726 5993 5646 3697 1226 -3078 -5695 -3864 -811 1924 4729 6077
2368 6077 4281 -749 -4117 -4789 -4465 -1610 3267 6092 5952 4170 1232 -2570 -5426 -3593 -66 3145
2384 3145 5381 6320 3803 -1036 -4274 -4915 -4757 -2461 2116 5747 4686 2496 -160 -3700 -6222 -4611
2400 -4611 -64 2801 4537 5153 3514 -740 -4609 -5147 -3963 -1614 2307 5556 5495 2310 -739 -3246
2416 -3246 -4887 -3675 159 3969 5671 6124 4278 -84 -3772 -4438 -2603 -230 3627 6221 6150 2855
2432 2855 -149 -2921 -5083 -3612 701 4521 5641 5459 3462 -712 -4639 -5053 -3343 -1013 2378
2447 2378 4631 4361 933 -2846 -4880 -5896 -5013 -1102 2877 4585 3557 2026 -1430 -5049 -5568 -2849
2463 -2849 -264 2756 4678 4379 866 -3000 -5262 -5776 -5003 -1351 2836 4345 3494 1541 -1463 -4756
2479 -4756 -4751 -2168 1109 4088 6206 6262 2660 -1244 -3579 -4104 -3125 -1 3980 4632 3328 762 -2293
2496 -2293 -5664 -6424 -3900 -294 3188 4522 4403 1486 -2388 -4236 -4596 -2672 73 3972 4976 3517
2512 3517 800 -2829 -5703 -6173 -3334 73 2169 3773 3514 437 -3481 -5003 -4579 -3008 571 4274
2528 4274 5580 3626 1064 -1743 -4208 -4898 -2268 1690 4219 4500 3933 919 -3104 -4801 -4036 -2074
2544 -2074 180 3831 5148 3124 -131 -2741 -5082 -5088 -2620 1007 3530 3569 2814 122 -3578 -5496
2560 -5496 -4679 -2405 643 3694 5194 2839 -111 -2587 -4878 -4477 -2153 1205 3489 3797 3032 -189
2576 -189 -4058 -5734 -4347 -2178 589 3526 4788 3125 -340 -2603 -3881 -4306 -1985 2199 4800
2591 4800 4355 2645 -186 -3313 -5378 -4502 -2049 377 2633 3697 1934 -1834 -4663 -5699 -5011 -2632
2607 -2632 578 3413 3332 1463 -945 -4082 -5868 -5196 -2085 982 3353 3341 1645 -1919 -4460 -5093
2623 -5093 -4613 -2043 1522 3913 4071 2378 -465 -3706 -5122 -3772 -392 2156 3702 4250 3241 -1016
2639 -1016 -3925 -3960 -3092 -1033 2921 5474 4532 2284 -124 -2232 -3821 -3285 -108 2800 4275 4258 2621
2656 2621 -1398 -4469 -5233 -3794 -1760 1084 3424 3253 711 -1511 -3903 -5170 -3843 -314 2373
2671 2373 3905 4001 2161 -1061 -4081 -4470 -3011 -1268 1551 4076 3679 449 -2062 -3986 -5098 -3731
2687 -3731 -284 2690 3809 3908 2708 -536 -3803 -3749 -1575 422 3047 5199 4634 1519 -1758 -3167
2703 -3167 -4244 -3469 -522 3048 3876 2562 1043 -2220 -4764 -4886 -3048 -78 1886 3693 3222 568
2719 568 -2017 -4187 -4842 -3590 -557 2488 3248 2274 497 -2559 -5117 -4719 -2724 -403 1854 3897
2735 3897 3565 424 -2437 -3683 -3818 -2963 -215 3234 4346 2582 769 -1299 -4112 -4517 -2196 1023
2751 1023 2486 3934 3890 1192 -2104 -3979 -3053 -2185 216 3295 4360 2773 -133 -2370 -4644 -4963
2767 -4963 -2713 202 2557 3173 2949 469 -2869 -4336 -3668 -2224 771 3444 4278 2589 576 -2105
2783 -2105 -3972 -4426 -1983 1401 3130 3644 3355 1046 -2402 -3959 -2827 -1250 1223 4253 5182 3570
2799 3570 415 -1215 -2457 -3380 -1341 2301 4085 3546 2655 1066 -2217 -4484 -3352 -903 821 2929
2815 2929 4092 2797 -244 -3019 -3612 -3602 -2067 1004 3121 3043 1741 -335 -3378 -4850 -3713 -1832
2831 -1832 138 2458 3389 1736 -772 -3011 -3843 -3691 -1438 1970 3880 3781 2378 463 -2488 -4280
2847 -4280 -3266 -257 1434 3102 3953 2636 -610 -2856 -3323 -2692 -1370 2017 3968 3662 1585 -249
2863 -249 -2236 -4320 -3752 -661 1397 2385 2710 1628 -1596 -4128 -4514 -3988 -1793 781 2866 2716 800
2880 800 -1101 -3119 -4666 -3897 -1099 1584 2583 3000 1549 -1251 -3970 -3656 -2936 -1101 1659 3655
2896 3655 3670 1625 -964 -2099 -3566 -2574 664 2935 3615 3521 2497 -521 -3142 -3529 -1934 -157 1553
2913 1553 3710 3560 717 -1833 -2793 -3559 -3033 -346 2228 3150 2406 1406 -1220 -3656 -4409 -2627 -558
2930 -558 1151 2631 2609 625 -2304 -3944 -4513 -3602 -1148 1994 3059 1860 1134 -1086 -3082 -3456 -1611
2947 -1611 568 2362 3739 3587 1140 -1556 -2992 -2909 -2324 191 3133 3574 2642 1238 -484 -3025
2963 -3025 -3659 -1592 992 2772 3326 3436 802 -1872 -3033 -3025 -2270 -381 2011 3060 1762 -573 -2236
2980 -2236 -3998 -4389 -2727 -79 1420 2585 2401 245 -2392 -3969 -3282 -2265 -8 2423 3473 2077
2996 2077 -95 -1823 -3201 -3539 -1965 837 2506 3163 3111 1324 -1897 -3209 -2262 -993 770 3047
3012 3047 3961 2990 113 -1244 -2851 -3055 -1915 1329 2899 2420 1955 218 -2503 -3722 -3260 -1367
3028 -1367 -110 1934 3289 1769 -721 -2838 -3866 -3611 -2363 429 2033 1787 1485 -386 -2560 -3876
3044 -3876 -3019 -1338 430 2291 3219 2184 -663 -2056 -3050 -2657 -1101 1259 2831 2759 1657 92
3060 92 -1742 -3404 -2584 -218 1512 2977 3918 2838 281 -1877 -2230 -1725 -940 1446 3313 2745 1271
3077 1271 -45 -2493 -4029 -3683 -1232 876 2104 2402 1537 -596 -2951 -3419 -2653 -885 1140 3011
3093 3011 3214 1553 -341 -2139 -3141 -2700 -659 1530 2516 2482 1419 -853 -2704 -2952 -2116 -587 1061
3110 1061 3375 3218 1805 -64 -1565 -2614 -2123 247 2603 3050 2877 2097 -291 -2108 -2950 -1871
3126 -1871 -342 1309 3041 2888 1150 -1129 -2274 -2883 -2763 -488 1959 2559 2590 1541 -527 -2604
3142 -2604 -3124 -2025 -37 1497 2970 3015 1253 -883 -1930 -2626 -2134 238 2562 3234 2505 1533 -435
3159 -435 -2400 -2773 -1117 372 1962 3295 3152 1380 -990 -1967 -2469 -1835 176 2476 3284 2643 1175
3176 1175 -240 -2243 -2782 -1549 449 1611 2545 2539 928 -2235 -3204 -2878 -2135 -609 1412 2248 1553
3193 1553 524 -1221 -2665 -3260 -1259 45 1806 2861 2578 929 -1286 -2442 -2322 -1580 143 2155
3209 2155 3184 2222 761 -990 -2093 -2736 -1217 911 2288 2831 2797 1118 -1279 -2157 -1953 -1079 705
3226 705 2259 3419 2723 805 -1152 -1864 -2549 -1194 1057 2288 2532 1944 652 -1835 -2810 -2663 -1498
3243 -1498 253 1668 2725 1665 -413 -2202 -2440 -2895 -1428 540 2405 2264 1773 817 -1383 -2409
3259 -2409 -2111 -720 715 2634 3016 1972 -75 -1687 -2444 -2623 -1166 718 2024 2221 1955 694
3275 694 -1361 -2541 -1814 -55 1576 2597 3487 2479 707 -1141 -1750 -1754 -745 1246 2598 3052 1599
3292 1599 -201 -1472 -2643 -2151 -659 1018 2312 2506 1996 143 -1538 -1988 -1550 -576 1241 2647
3308 2647 2827 1681 196 -1474 -2776 -2246 -277 931 2023 2175 1373 -455 -2147 -2557 -1758 -674
3324 -674 1093 2319 2977 1324 -80 -1600 -2464 -1932 -372 1586 2225 2209 1615 -107 -2283 -2128 -1635
3341 -1635 -282 1274 2425 2393 988 -622 -1611 -2457 -1968 -427 1336 1989 2122 1199 -581 -2324 -2529
3358 -2529 -1616 -706 1151 2229 2321 1261 -667 -2028 -2522 -2067 -366 1404 1984 1990 1121 -626 -2287 -2242
3376 -2242 -1375 -38 1186 2172 2560 932 -955 -1808 -2039 -1220 -360 1765 2770 2116 1002 -409 -2042
3393 -2042 -2557 -1464 -61 1449 2140 2255 924 -1016 -1727 -2199 -1527 5 1823 2628 1686 579 -763
3410 -763 -2184 -2697 -1434 20 968 2004 1966 637 -1377 -2005 -1866 -1249 -17 1801 2746 1997 614
3427 614 -665 -1536 -2109 -990 835 1638 2317 2354 826 -876 -1658 -1836 -854 278 1944 2931 2141 640
3445 640 -562 -1409 -1644 -840 1150 2020 2158 2190 491 -1181 -1821 -1730 -1169 -7 1568 2372 1455 -61
3463 -61 -1297 -1964 -2119 -1372 437 1492 1739 1534 326 -1145 -2567 -2269 -841 148 1336 2280 1549 -120
3481 -120 -1219 -2041 -2163 -1442 773 1638 1931 1199 383 -952 -1976 -1701 -701 767 1544 2393 1623 9
3499 9 -1088 -1946 -1953 -980 701 1814 1782 1401 278 -1134 -1943 -1531 -540 506 1604 2095 1043 -544 -1480
3518 -1480 -2063 -1960 -1054 530 1789 1483 631 -323 -1343 -2269 -2122 -578 669 1520 1618 1510 -167 -1618
3536 -1618 -1858 -1473 -636 733 2080 2224 1135 94 -939 -1879 -1605 -410 729 2192 2092 1206 305
3553 305 -1493 -1987 -1272 -66 1020 2107 2162 1006 -474 -1292 -2192 -1665 -239 988 1734 1452 741 -527
3571 -527 -1722 -2073 -1708 -521 677 1789 1619 1066 -627 -1156 -1934 -1536 -319 1229 1864 1607 1302 -214
3589 -214 -1416 -1860 -816 338 1015 2111 2108 638 -502 -1157 -1429 -913 46 1481 1858 1915 888 -287
3607 -287 -1258 -1808 -995 178 818 1757 1550 749 -947 -1145 -1573 -1375 -109 1036 1594 1228 466 -599
3625 -599 -1610 -2257 -1105 229 768 1751 1716 306 -958 -1614 -1654 -906 -298 1492 2037 1199 271 -245 -1589
3644 -1589 -1777 -875 300 1373 1661 1566 797 -648 -1527 -1511 -773 238 1578 2017 1704 164 -661 -1466
3662 -1466 -1721 -716 251 1158 1456 986 89 -1095 -1741 -1779 -980 -358 1123 1727 1027 -203 -1134 -1654 -2028
3681 -2028 -1100 471 1155 1309 1184 269 -1257 -2123 -1615 -813 -11 923 1924 849 36 -715 -1310 -1535
3699 -1535 -685 448 1738 1343 1320 307 -770 -1467 -1502 -558 400 851 1583 1107 -304 -1097 -1345 -1559 -947
3718 -947 636 1173 1535 840 239 -886 -1884 -1580 -573 450 1252 1527 1272 82 -1148 -1530 -1457 -624
3736 -624 430 1635 1567 1107 634 -640 -1698 -1310 -263 584 1473 1340 1328 101 -950 -1059 -817 -685
3754 -685 708 1845 1832 1200 82 -773 -1420 -1420 -188 999 1318 1573 1227 40 -863 -1330 -1052 -660 373
3773 373 1133 1467 666 -747 -1146 -1643 -1620 -358 722 1072 1237 644 -356 -1392 -1360 -1156 -513 531 1739
3792 1739 1352 775 -395 -1044 -1482 -1277 -491 878 1034 1198 730 -342 -1397 -1388 -937 -22 772 1509 1212
3811 1212 758 -597 -1210 -1641 -1314 -257 930 1246 845 558 -341 -1411 -1491 -1067 -216 374 1287 1263 139
3830 139 -755 -1300 -1479 -1240 -257 846 1259 1225 545 -303 -1392 -1642 -701 -49 882 1421 1236 749 -505
3849 -505 -1146 -1335 -1028 11 581 1438 1122 504 -615 -1262 -1422 -863 489 1208 1441 1267 568 -288 -997
3868 -997 -1092 -312 280 1053 1696 1080 67 -606 -1321 -1546 -914 4 838 1206 1160 488 -589 -1459 -1061 -277
3888 -277 399 1035 1463 1075 360 -702 -1446 -1268 -945 149 1018 1252 1035 36 -872 -1585 -1249 -722 14
3907 14 1115 1036 846 114 -545 -1035 -1327 -431 390 1318 1072 1094 378 -555 -1349 -1065 -691 338 959 1347
3927 1347 780 136 -760 -1229 -1336 -732 239 1117 1195 946 201 -687 -1187 -1051 -370 321 912 1641 710 80
3947 80 -912 -1474 -938 -901 379 1195 1065 541 75 -624 -1101 -1173 -227 184 1033 1177 971 -269 -605 -1392
3967 -1392 -1175 -473 499 1200 1113 449 -156 -770 -1030 -1179 -259 377 1171 1114 800 -17 -1204 -1166 -858 -471
3987 -471 447 1314 897 598 -117 -860 -1416 -992 -104 399 879 795 592 -452 -965 -1117 -863 -140 552 1103
4007 1103 902 354 -223 -919 -1141 -480 -334 537 620 951 365 -211 -798 -982 -860 3 413 1257 1370 432
4027 432 -496 -1056 -1146 -836 -8 827 1010 926 492 46 -1060 -971 -439 96 519 1197 1304 219 -163 -1044
4047 -1044 -978 -1023 -355 863 1033 553 202 -162 -849 -1119 -485 51 525 1151 835 440 -548 -1060 -1101 -651
4067 -651 -48 634 1128 737 233 -239 -1097 -1142 -745 241 766 941 948 349 -321 -695 -676 -531 101 999 1164
4088 1164 1257 224 -370 -805 -940 -430 322 745 876 949 367 -511 -1001 -925 -581 92 534 1154 477 -206
4108 -206 -541 -1082 -1204 -653 -16 907 907 710 -266 -481 -971 -747 -274 -133 583 922 785 302 -816 -816 -777
4129 -777 -534 211 573 1100 683 189 -532 -1004 -795 -224 294 518 1142 587 124 -392 -766 -920 -600 525
4149 525 860 1090 480 120 -712 -867 -711 -79 204 657 1017 630 -302 -659 -963 -1112 -374 451 629 779
4169 779 525 -107 -727 -984 -754 -335 476 782 1090 449 -76 -775 -1025 -843 -645 712 877 779 533 -109
4189 -109 -349 -717 -626 11 501 959 835 589 12 -815 -442 -373 -12 676 1070 957 398 71 -401 -981 -815
4210 -815 -102 373 1052 785 345 -291 -562 -714 -599 13 457 697 899 622 -404 -725 -879 -596 -147 400
4230 400 605 1084 395 -357 -1090 -767 -368 -290 738 1149 1078 582 -282 -405 -585 -495 103 534 778 975 178
4251 178 -89 -549 -676 -209 -256 331 677 822 306 -366 -534 -734 -453 -218 603 712 788 8 -527 -625 -678
4272 -678 -600 -122 514 847 773 189 -343 -688 -735 -472 -37 534 698 676 204 -347 -916 -890 -293 208 565 778
4294 778 741 287 -224 -534 -444 -553 62 915 1209 490 235 -556 -793 -719 -217 67 750 723 863 235 -544
4315 -544 -425 -536 -387 -16 564 793 468 49 -489 -891 -882 -295 213 977 611 684 226 -617 -853 -522 -93
4336 -93 139 603 918 551 112 -454 -738 -830 -218 488 529 695 588 260 -599 -650 -323 -167 300 763 900
4357 900 365 -143 -607 -483 -771 -359 249 665 460 469 -54 -714 -827 -403 -9 689 577 889 749 -249 -316
4378 -316 -717 -656 -130 342 742 810 419 -149 -463 -881 -525 31 325 834 602 271 -369 -573 -453 -468 -295
4399 -295 289 720 836 481 -33 -783 -744 -547 -12 255 863 552 503 -305 -601 -583 -392 -84 452 816 604
4420 604 164 -280 -397 -847 -259 -300 512 716 366 290 -352 -675 -673 -573 -36 558 602 571 191 -89 -741 -488
4442 -488 -338 22 573 609 637 -17 -198 -458 -731 -242 -51 557 762 444 75 -277 -319 -813 -439 302 539
4463 539 303 466 139 -511 -687 -847 -356 104 520 392 760 17 -210 -867 -656 -324 -13 274 525 477
4483 477 127 -674 -779 -766 -274 92 375 457 486 185 -420 -818 -720 -203 -58 582 665 460 197 -240 -541 -503
4505 -503 -226 445 124 513 742 199 -428 -250 -355 -190 147 772 469 208 0 -338 -508 -514 -215 283 354
4526 354 761 468 -223 -348 -517 -404 -239 178 699 546 221 -152 -517 -363 -623 -100 215 486 524 315
4546 315 198 -391 -714 -514 -50 46 609 652 77 -148 -64 -766 -623 6 195 805 557 504 -230 -526 -647
4567 -647 -153 -28 357 663 499 204 -42 -199 -761 -382 8 273 721 336 373 41 -772 -629 -180 203
4587 203 309 625 529 110 -254 -786 -675 -315 271 281 575 438 268 -140 -516 -312 -453 -139 317 772 570
4608 570 14 -342 -296 -466 -286 154 635 675 513 240 -339 -389 -324 -156 56 320 529 400 322 -295 -566 -322
4630 -322 -172 -256 372 516 420 -1 -449 -417 -430 -14 127 368 497 159 36 -486 -637 -479 -521 -1 392 685
4652 685 297 270 -418 -468 -543 -131 150 659 656 187 295 -311 -586 -547 -198 359 322 484 139 -51 -595 -163
4674 -163 -614 -122 -30 365 344 319 -17 -332 -357 -308 7 458 393 454 370 11 -451 -570 -403 -220 378 478 614
4697 614 3 -138 -430 -554 -427 -146 -69 523 320 110 -423 -305 -336 -309 -77 274 455 410 484 -234 -233 -612
4719 -612 -303 46 284 279 543 -146 -259 -321 -329 -106 -51 404 365 87 135 -259 -335 -424 -386 67 403 286 92 88
4743 88 8 -560 -275 -323 -6 452 212 215 328 -143 -287 -433 -343 -73 425 443 75 253 -22 -423 -585 -204
4765 -204 44 260 389 454 -62 -29 -315 -770 -329 281 293 476 101 60 -268 -470 -387 -363 381 400 655 366
4787 366 267 44 -513 -485 -338 102 354 438 413 279 -410 -364 -480 -103 83 203 421 392 -167 -373 -541 -358
4809 -358 -334 21 183 344 209 20 -270 -459 -246 -231 328 433 384 53 28 -697 -373 -495 -156 375 505
4830 505 388 142 89 -143 -276 -178 233 125 538 437 208 -153 -457 -266 -577 92 -130 534 188 168 -109
4851 -109 -263 -349 -812 -143 201 520 390 322 5 -387 -319 -192 198 157 522 405 38 -189 -555 -569 -339 103
4873 103 175 508 491 179 -117 -505 -281 -354 165 66 399 460 43 55 -339 -491 -499 -44 461 573 308 69 -70
4896 -70 -648 -462 -259 -10 197 321 347 -72 -131 -354 -507 -304 39 337 236 177 152 -315 -349 -314 -498 304
4918 304 495 546 322 37 -413 -164 -115 -325 38 348 354 499 226 -485 -560 -528 -178 -15 121 30 453 -113
4940 -113 -94 -491 -341 -175 241 358 548 513 -196 -269 -409 -574 -279 -138 474 486 540 -51 -184 -361 -563 -14
4962 -14 364 496 304 279 65 -503 -436 -227 -184 188 239 251 233 220 -343 -503 -405 -89 -53 606 590 173 -48 -310
4986 -310 -517 -195 -167 427 170 504 0 -91 -136 -502 -238 -75 217 363 395 182 -177 -385 -515 -600 -55 317
5008 317 489 417 93 -245 -412 -543 -435 157 330 375 325 356 7 -354 -515 -92 -114 132 404 272 28 -84
5030 -84 -348 -653 -101 305 486 581 421 232 -76 -465 -368 -309 274 193 553 344 51 -139 -599 -515 -181 -272
5052 -272 173 488 232 -57 -443 -392 -409 -146 -172 58 416 252 220 -135 -556 -546 -100 -3 261 214 582 3
5074 3 -213 -408 -361 -175 110 585 520 376 9 -96 -483 -241 -6 172 318 294 39 276 -299 -552 -352 -202
5096 -202 191 341 274 382 -232 -262 -315 -405 -218 229 388 560 204 37 -220 -471 -168 -148 26 463 409 519
5118 519 68 -4 -219 -280 -209 177 387 618 547 109 -191 -769 -259 -78 376 402 518 233 -56 -181 -467 -626
5140 -626 -185 373 443 463 38 62 -276 -699 -398 -81 284 730 484 529 -34 -363 -493 -251 30 92 635 351
5162 351 -44 -40 -496 -328 -353 -39 244 402 196 260 -43 -213 -567 -224 -207 197 388 701 411 -307 -182 -524
5184 -524 -144 166 526 261 466 98 -314 -247 -418 -318 57 368 355 465 205 42 -387 -941 -402 95 413
5205 413 471 285 360 -195 -665 -483 -452 57 402 631 564 25 -192 44 -507 -154 143 351 651 493 -58
5226 -58 -303 -206 -655 -91 -86 450 384 387 185 -67 -781 -439 -414 125 554 576 520 250 -316 -263 -412 -239 34 394
5250 394 432 433 -164 -194 -581 -148 -47 23 435 702 535 91 155 -483 -208 -308 123 318 678 265 -129 -263
5272 -263 -475 -646 -259 -34 277 500 279 -52 -297 -234 -500 -32 471 393 411 480 66 -281 -594 -297 -42
5293 -42 168 673 679 311 29 -629 -542 -466 324 338 301 665 358 -123 -674 -606 -470 11 370 298 295 364 -47 -485
5317 -485 -515 -530 -104 137 519 279 219 196 -614 -429 -110 -13 28 181 396 261 -195 -33 -346 -506 -395 390
5339 390 732 344 101 -91 -457 -704 -242 -60 80 374 477 174 7 -367 -486 -354 -194 417 515 560 -24
5360 -24 -434 -493 -604 -313 -212 467 586 552 333 -160 -595 -675 -537 -259 163 556 486 231 -190 -360 -459 -498
5382 -498 10 245 706 217 -11 -19 -312 -408 -446 -49 285 570 360 144 -112 -314 -711 -569 145 262 498
5403 498 257 281 -367 -549 -798 -340 239 625 566 422 186 -324 -634 -987 -507 -78 398 486 104 -58 -265
5424 -265 -404 -444 -465 -28 173 348 351 73 -516 -444 -496 -274 140 566 617 664 153 -383 -504 -672 -221 290 583
5447 583 615 561 -78 -307 -527 -422 -290 151 521 565 360 -115 -128 -743 -476 154 299 480 192 349 348 -369
5469 -369 -552 -684 -139 -81 541 643 308 64 -94 -716 -374 -86 30 503 508 260 7 -296 -546 -428 -194
5490 -194 368 533 610 434 -24 -336 -705 -397 -43 54 488 455 265 19 -633 -632 -478 -286 224 485 581 373
5512 373 -293 -382 -442 -695 33 408 597 219 242 -68 -307 -442 -437 -24 204 718 248 105 -95 -593 -473 -304
5534 -304 -68 416 618 484 308 -134 -551 -642 -220 117 276 639 545 542 -159 -456 -157 -602 -238 616 733
5555 733 366 87 -286 -474 -709 -354 97 71 239 690 123 -112 -676 -611 -483 183 165 406 128 77 -203
5576 -203 -718 -555 -201 196 473 299 515 144 -282 -171 -689 -465 121 439 437 388 124 -42 -380 -634 -638 308
5598 308 419 446 812 154 3 -668 -470 187 -182 455 526 43 122 -169 -767 -436 -361 88 568 639 234 15
5620 15 -568 -675 -582 -172 94 458 804 538 46 -583 -420 -411 -270 234 325 520 636 172 -113 -466 -424 -164
5642 -164 -166 81 671 386 47 -325 -662 -538 -240 85 551 244 552 192 -604 -855 -680 -194 98 384 515
5663 515 722 77 -166 -575 -433 -360 -151 299 476 432 -109 -198 -216 -460 -176 334 553 296 311 131 -532 -648
5685 -648 -424 -355 171 662 638 416 -237 -397 -344 -819 -315 423 486 495 303 -23 -557 -370 -452 -266 15 567
5707 567 558 676 -189 -461 -418 -560 -623 289 727 807 378 -171 -428 -499 -492 -132 341 405 946 1 -68 -491 -619
5730 -619 -519 -47 259 788 548 249 -5 -773 -649 -436 -189 420 428 675 154 -316 -686 -822 -473 59 421
5751 421 360 848 308 -15 -628 -736 -522 -32 315 467 680 -34 -239 -817 -900 -547 -28 265 656 580 -22
5772 -22 -110 -311 -603 -523 -3 386 481 324 24 -509 -621 -393 -482 109 715 608 605 269 -92 -101 -519 -406 -180
5795 -180 403 668 422 342 -418 -670 -603 -569 -28 659 812 778 167 -408 -402 -428 -527 146 579 635 338 245 -126
5818 -126 -863 -693 -565 67 224 459 422 90 -191 -666 -653 -480 130 366 580 489 337 -543 -749 -730 -202
5839 -202 88 715 257 413 194 -136 -650 -436 -361 -167 499 517 780 193 -204 -715 -685 -411 -110 266 663
5860 663 452 -159 -380 -259 -796 -250 46 283 552 161 166 -215 -560 -332 -439 103 875 375 607 323 -355
5881 -355 -635 -778 -285 -135 397 543 381 -34 -275 -616 -346 -296 88 659 498 594 261 -547 -569 -522 -392
5902 -392 315 379 459 185 111 -394 -594 -545 -222 328 423 595 24 -8 -435 -756 -271 -153 249 568 945 320
5924 320 -16 -261 -962 -276 -160 294 609 708 277 -415 -341 -672 -567 -375 175 780 730 139 -50 -602 -631
5945 -631 -362 -367 322 440 440 575 49 -478 -596 -453 53 446 689 532 309 -7 -93 -401 -285 -6 158 743
5967 743 609 246 41 -239 -645 -410 -182 324 988 870 516 -266 -402 -855 -472 -179 509 840 759 129
5987 129 -405 -294 -871 -353 73 380 715 709 422 -45 -755 -604 -198 -346 409 623 749 258 -55 -210 -783
6008 -783 -120 -128 390 591 828 125 -114 -646 -521 -546 -296 136 752 578 148 222 -522 -791 -554 102 300
6029 300 754 485 148 -23 -422 -780 -60 291 614 831 488 110 -9 -426 -766 -394 -52 211 718 713 334
6050 334 -245 -570 -694 -390 78 370 576 405 146 -562 -560 -784 -504 -45 167 905 235 -10 -404 -888 -552
6071 -552 -325 133 312 443 333 281 -426 -535 -611 -645 264 675 487 175 344 -282 -485 -573 -131 211 772
6092 772 650 710 64 -195 -733 -700 -65 32 669 481 662 276 -379 -765 -271 -415 121 578 682 260 -31
6113 -31 -275 -664 -507 18 94 586 731 9 -91 -380 -675 -484 -360 251 776 535 253 602 -761 -819 -694
6134 -694 -555 554 531 218 268 -148 -352 -596 -616 -100 54 552 920 314 58 -422 -654 -552 -134 521 743
6155 743 617 313 -146 -295 -847 -642 -261 506 516 545 307 -45 -614 -696 -460 -37 159 535 671 716 87
6176 87 -255 -661 -456 -111 468 717 780 367 -253 -495 -644 -400 -263 504 305 469 251 -268 -411 -367 -660
6197 -660 233 785 651 901 279 -145 -552 -426 -476 -55 219 823 638 381 -361 -518 -500 -651 56 525 397
6218 397 601 269 -238 -577 -608 -691 92 336 559 439 88 -108 -386 -755 -415 -70 292 680 602 221 -384
6239 -384 -756 -525 -520 8 264 682 596 -68 -191 -196 -615 -46 -63 445 780 550 -8 -200 -330 -623 -235 153
6261 153 265 632 458 116 -273 -598 -481 -361 32 408 862 310 65 -198 -584 -549 -453 -9 254 760 687
6282 687 244 -284 -578 -458 -50 268 641 866 606 13 -103 -527 -510 -75 149 655 506 538 306 -267 -935
6303 -935 -816 17 136 227 468 624 295 -460 -433 -491 40 80 431 743 556 293 -428 -640 -691 -330 151 435
6325 435 777 357 -67 -656 -553 -994 -208 446 764 882 373 136 -223 -657 -641 -85 328 809 531 562 267
6346 267 -435 -452 -821 -194 124 622 524 202 -220 -499 -416 -792 -82 134 665 623 419 -116 -305 -696 -651 -290
6368 -290 330 452 535 548 -302 -564 -619 -509 -270 78 755 566 237 -16 -595 -597 -478 -230 457 518 757 230
6390 230 222 -278 -465 -263 -162 310 463 522 347 19 -767 -662 -563 -13 344 540 585 336 -166 -304 -788 -706
6412 -706 10 304 631 306 622 -175 -320 -858 -441 -239 204 952 598 293 -165 -416 -492 -549 -98 574 606
6433 606 516 484 56 -460 -792 -360 -51 419 336 628 357 -139 -584 -538 -491 -178 398 656 393 121 -396 -494
6455 -494 -487 -376 -233 266 403 666 263 -9 -460 -680 -262 -160 102 548 663 187 -145 -744 -468 -367 171
6476 171 360 445 582 179 175 -703 -585 -168 197 145 768 621 258 -177 -508 -743 -465 -68 457 793 703 546
6498 546 -77 -516 -564 -335 -196 261 788 774 114 -640 -401 -874 -132 230 371 572 526 0 -129 -655 -488
6519 -488 -236 315 350 504 459 97 -528 -623 -568 -348 96 495 673 588 305 -448 -800 -662 -284 107 629 577
6541 577 779 2 -276 -454 -618 -379 15 523 529 397 -1 -510 -562 -517 -309 94 369 577 363 -27 -323
6562 -323 -506 -621 -544 162 586 624 392 127 -370 -437 -419 -435 217 401 823 579 39 -535 -665 -753 -289 40
6584 40 726 479 389 19 -155 -428 -674 -346 454 707 626 761 -12 -369 -787 -709 -244 252 418 590 377
6605 377 -75 -366 -741 -953 -376 242 532 548 431 -77 -655 -486 -598 -468 192 516 441 164 50 -606 -690
6626 -690 -528 -241 425 559 808 279 136 -436 -808 -515 -158 246 693 608 466 -5 -868 -733 -471 -38
6646 -38 322 648 621 760 27 -475 -520 -472 -284 95 228 616 308 -161 -441 -755 -504 -242 490 399 293 274
6668 274 -195 -303 -878 -793 -348 209 585 235 342 -167 -495 -578 -503 75 279 468 404 155 -83 -435 -651
6689 -651 -286 183 178 838 706 526 -272 -688 -673 -509 -229 190 597 566 117 -106 -480 -979 -474 -107 323
6710 323 525 529 76 -295 -354 -727 -525 -223 335 341 464 236 -294 -482 -901 -340 42 123 703 697 105 1 -250
6733 -250 -603 -535 594 218 776 375 81 -200 -726 -297 -495 191 720 781 169 165 -437 -268 -673 -423 25
6754 25 453 541 549 135 -356 -542 -752 -205 -178 431 705 304 46 -362 -570 -762 -157 230 372 772 508 292
6776 292 -461 -590 -622 -262 17 803 459 468 308 -508 -790 -713 -291 250 544 636 462 139 -350 -699 -182 -463
6798 -463 233 627 734 772 -195 -114 -413 -383 -11 185 478 358 479 143 53 -867 -398 -51 160 691 789 123
6820 123 -19 -308 -675 -502 -280 112 380 667 305 -259 -417 -462 -692 -404 129 793 525 376 -224 -586
6840 -586 -507 -471 -489 25 432 556 497 -146 -578 -873 -641 -196 126 175 557 26 -123 -629 -520 -814 -317 74
6862 74 627 583 276 58 -575 -507 -373 -99 130 358 661 416 -27 -510 -560 -657 144 453 631 504 497 -398
6884 -398 -625 -644 -233 -105 308 495 476 119 25 -303 -540 -492 -170 300 426 460 175 -328 -333 -1032 -66 -308
6906 -308 212 787 530 390 17 -434 -338 -450 -69 196 702 342 64 166 -252 -766 -440 -277 621 309
6926 309 703 352 -417 -373 -659 -397 -33 12 616 385 -114 -92 -493 -604 -609 -219 548 551 420 -26 -83 -523 -714
6949 -714 -389 -300 18 347 371 224 -309 -686 -579 -375 -194 298 763 599 126 -181 -688 -385 -392 -118 554
6970 554 477 777 117 33 -804 -429 -428 -10 326 729 493 182 -206 -617 -627 -88 -4 572 592 317 159 -382
6992 -382 -471 -654 -340 -5 643 777 436 -1 -185 -593 -706 -432 -77 323 551 560 42 -735 -740 -538 -546 -24
7014 -24 587 396 385 123 -131 -293 -682 -14 -90 563 707 338 -63 -285 -327 -772 -304 137 458 459 531 108
7036 108 -424 -476 -623 -431 292 338 516 498 32 -542 -646 -494 -312 12 425 611 473 -40 -604 -604 -742 -164
7058 -164 -36 658 901 296 -182 -419 -536 -858 -419 262 564 768 380 77 -562 -533 -503 2 560 659 611
7079 611 377 -214 -523 -487 -636 32 254 539 589 559 -30 -126 -567 -275 -281 103 655 653 449 13 -423 -474 -649
7102 -649 -486 243 385 519 347 -104 -208 -619 -587 -33 450 548 178 235 28 -548 -611 -263 111 617 541 336
7124 336 256 -72 -214 -811 -512 345 -79 858 274 218 -138 -575 -380 -536 102 324 923 614 174 100 -443
7145 -443 -436 -590 107 555 587 160 448 -212 -634 -737 -389 -299 278 514 369 317 -359 -446 -184 -396 62 341
7167 341 554 444 31 -162 -703 -589 -276 -164 437 325 769 404 -172 -266 -371 -402 81 218 588 275 393
7188 393 68 -830 -312 -327 68 336 572 384 274 -214 -500 -476 -437 -113 445 731 516 174 -259 -437 -511
7209 -511 -364 124 630 526 518 284 -420 -342 -642 -144 66 423 517 672 162 -17 -722 -432 -163 169 504
7230 504 652 401 561 -477 -434 -308 -297 82 461 580 399 82 -118 -566 -448 -372 171 458 567 417 143
7251 143 -186 -588 -547 -113 190 399 653 392 -37 -197 -432 -459 -22 115 653 564 550 187 -288 -672 -409
7272 -409 -231 183 697 832 310 -130 -361 -452 -405 -134 150 401 497 492 102 -48 -273 -495 -143 69 280 409
7294 409 656 377 -274 -601 -352 -126 291 374 644 416 -249 -193 -481 -539 -243 -3 611 301 193 -78 -536
7315 -536 -784 -487 -20 82 507 663 349 -148 -174 -752 -388 1 320 346 527 297 74 -201 -643 -125 -10
7336 -10 403 470 126 -79 -176 -422 -665 -266 -188 294 414 168 503 -186 -659 -510 -777 -107 101 391 703
7357 703 845 -34 -333 -628 -407 -40 361 271 595 165 -236 -443 -671 -123 86 479 271 276 248 -82 -452
7378 -452 -437 -516 -296 249 665 530 118 -224 -509 -222 -221 -227 459 548 457 413 -146 -559 -663 -439 7 22 616
7401 616 616 513 -195 -788 -539 -399 -25 142 614 415 238 -202 -469 -677 -165 -125 359 658 300 487 -367
7422 -367 -379 -560 -448 301 180 452 682 69 -272 -467 -701 -133 464 297 385 443 177 -202 -413 -425 -480 262
7444 262 429 758 85 -60 -192 -547 -643 -710 27 705 685 439 -174 -253 -275 -291 -297 282 421 544 223 -46 -184
7467 -184 -717 -56 -380 118 503 769 487 -214 -70 -694 -443 -158 80 323 556 468 -234 -21 -647 -607 -187
7488 -187 -81 313 455 310 -41 -70 35 -685 -243 -74 463 658 658 -37 -327 -346 -647 -142 -264 457 312
7509 312 206 86 -42 -678 -384 -277 460 590 633 210 403 -268 -480 -267 -434 263 426 628 600 -5 -530
7530 -530 -503 -503 -165 238 208 676 238 -106 -373 -646 -615 -104 -92 501 542 466 -144 -649 -501 -426 183 311 335
7553 335 478 277 14 -265 -365 -382 -258 535 500 256 341 99 -320 -73 -481 -154 545 403 341 155 -126
7574 -126 -357 -343 -466 -88 295 414 632 170 -98 -279 -405 -407 -148 186 463 460 319 70 -393 -676 -601 -251
7596 -251 323 327 468 269 -411 -440 -595 -368 -91 133 430 349 -64 18 -455 -132 -451 336 91 141 344 706
7618 706 46 -349 -390 -491 -144 501 597 718 8 -213 -496 -347 -542 -78 333 462 637 337 88 -563 -535
7639 -535 -708 -204 448 132 78 244 -215 -470 -533 -388 199 484 479 488 -70 -30 -423 -643 -259 -5 435 577
7661 577 251 245 -550 -496 -439 11 -26 246 617 238 -181 -12 -297 -522 -279 32 318 618 409 362 -221 -521
7683 -521 -686 -423 119 498 404 552 116 -212 -627 -672 -544 -107 773 270 392 5 -183 -321 -543 -222 -190
7704 -190 318 551 206 233 -33 -456 -504 -117 -75 499 537 239 53 -491 -433 -686 -152 307 510 502 124 -138
7726 -138 -407 -396 -387 -232 192 629 607 617 -11 -359 -544 -426 -452 342 364 349 24 -50 -220 -530 -365 -153 144
7749 144 264 692 343 -276 -369 -387 -480 -76 451 509 356 486 -271 -392 -434 -415 -403 265 384 736 438 19
7771 19 -425 -490 -460 113 261 371 431 430 -152 -413 -576 -377 -37 370 378 556 192 -187 -270 -803 -821 -265 34
7794 34 566 338 106 -60 -339 -517 -441 -127 235 579 249 97 -101 -191 -359 -442 58 45 629 750 718 -76
7816 -76 -370 -671 -445 -61 356 730 241 110 -136 -522 -763 -300 -296 395 589 478 -249 -125 -424 -277 -161
7837 -161 246 -113 671 576 137 -216 -573 -305 -183 -198 287 171 509 66 34 -453 -448 -189 -198 556 600 322 20
7860 20 -338 -294 -540 -281 21 568 501 197 146 -286 -708 -682 -166 2 404 456 325 157 -66 -425 -459 -363 -143
7883 -143 311 563 102 267 -150 -707 -724 -154 -85 228 473 211 -15 -167 -156 -516 -325 -400 395 340 459 -217
7905 -217 -153 -401 -320 -114 -282 353 493 363 163 -29 -635 -478 -183 -7 512 421 623 -54 -148 -178 -460 -333
7927 -333 317 257 319 205 -60 -268 -573 -679 -420 131 51 899 258 200 -224 -590 -368 14 -315 209 583
7948 583 364 86 -372 -526 -519 -282 -4 554 402 255 -22 -298 -566 -277 -186 -257 451 439 98 12 -325 -76
7970 -76 -298 -122 370 184 735 427 72 -509 -459 -408 -106 188 435 564 651 23 -64 -900 -139 -183 262 336
7992 336 483 349 45 -308 -550 -235 -69 427 215 652 202 -51 -86 -718 -361 -403 585 947 490 377 -255
8013 -255 -328 -585 -428 -298 280 376 489 102 -16 -344 -219 -545 -174 430 314 388 438 -282 -445 -537 -474 -237
8035 -237 411 522 212 404 -122 -406 -452 -467 -114 385 608 235 34 241 -402 -634 -364 54 235 453 242
8056 242 -123 -32 -528 -467 -498 159 113 248 607 322 -523 -303 -153 -331 82 459 710 285 193 43 -344 -578
8078 -578 -419 74 122 372 274 155 109 -336 -741 -177 7 353 576 309 348 -185 -443 -713 -169 -157 211 334
8100 334 282 359 -313 -370 -525 -289 206 371 387 512 143 -137 -876 -301 -224 -32 148 346 330 50 -127 -608
8122 -608 -525 -388 -132 419 544 300 -133 -200 -358 -718 -215 175 188 517 539 113 -340 -608 -619 -390 162 290
8144 290 304 39 283 -225 -396 -495 -253 -99 66 379 404 112 -440 -345 -415 -261 29 445 573 392 -162 -416
8166 -416 -764 -135 -410 -114 47 414 174 46 -724 -668 -158 -292 -23 597 692 440 100 -357 -139 -683 -106
8187 -106 -20 219 625 74
8191G4
$$ Imaginary data points
##PAGE= N=2
##DATA TABLE= (X++(I..I)), XYDATA
0 0 0 0 0 0 8 0 8 -8 16 -16 16 -24 32 -40 45 -56 65 -79 89 -108 125 -145 169 -197 224 -255 293 -334 375
29 375 -425 479 -539 604 -675 751 -839 932 -1037 1149 -1274 1410 -1561 1729 -1914 2120
45 2120 -2354 2615 -2914 3258 -3659 4133 -4701 5405 -6293 7459 -9068 11435 -15283 22600
59 22600 -41526 194164 390315 28982 38578 179971 106891 -102965 -10190 125112 42129
70 42129 -69578 35837 61923 -113556 -223018 -96088 19420 19412 9697 43714 43424 31223
82 31223 13827 -31416 -70668 -25431 44395 66966 49861 5798 -79365 -127221 -93146 -69283
94 -69283 -99527 -69786 23267 48557 16257 25427 7676 -75216 -39846 142298 190154 61920
106 61920 63702 204419 153886 -45025 -40023 94492 43243 -50006 87643 204663 21243
117 21243 -153123 -29338 90238 -38648 -119311 40385 152046 59977 -5498 32824 -3413
128 -3413 -101007 -75444 32242 47377 -8155 -19373 -1230 -18000 -63822 -110349 -114445 -42153
140 -42153 45366 54996 18301 12181 2968 -36680 -34550 12247 14395 1869 67393 123779 51547
153 51547 -41798 -32518 -11231 -37769 2762 98640 83881 7249 50711 116539 18259 -90160
165 -90160 -387 122919 82691 32386 100749 102253 -35346 -83348 8623 16356 -75307 -48710
177 -48710 75262 74455 -39015 -78859 -45996 -49372 -57550 -7056 41788 39508 29595 29231 7191
190 7191 -31944 -55436 -50588 -7768 54166 63706 11261 -17351 -675 -14932 -54474 -31801 31212
203 31212 51160 58090 96100 85607 -548 -35285 21261 44934 14508 38429 92984 63265
215 63265 -2204 -750 -2562 -69104 -79308 22354 77347 20372 -6856 34076 14493 -60879
227 -60879 -59987 -654 4530 -11707 29057 52853 -16529 -92329 -91845 -69801 -74211 -66457 -30502
240 -30502 -10239 -14634 -27829 -51453 -74063 -65238 -30634 4412 41483 67012 48950 9212
252 9212 -959 -1834 -31625 -43850 3370 45714 28663 5267 2697 -28052 -74589 -58433 -1154
265 -1154 14146 12463 54573 83627 38376 -11233 -1725 10640 -3625 18400 70578 65528 9308
278 9308 -13755 -15020 -53954 -90599 -62291 -13081 -2679 -4761 5022 -9366 -49270 -61183 -36194
291 -36194 -11962 5712 32074 50934 39214 10133 -20956 -45727 -47808 -24785 -1806 9646
303 9646 19271 15159 -15776 -45226 -44706 -34478 -26196 6256 54018 63436 34684 16654 10255 -14356
317 -14356 -30456 -551 36035 36278 28058 31588 9695 -40372 -59395 -35215 -15256 -6251 21397
330 21397 47413 29843 -6466 -19419 -20374 -27349 -15819 20894 44235 35123 16288 -2471 -30403
343 -30403 -53151 -48963 -24980 5 18689 26501 16547 -6131 -24918 -33632 -27351 -2952 26795
356 26795 42993 44535 35252 9001 -24826 -38759 -26985 -11540 2820 23608 34149 15244
368 15244 -14645 -28022 -31268 -31441 -10674 28120 50151 42245 28153 14272 -10951 -32802 -26150
381 -26150 -1862 14598 23078 27849 14735 -18280 -43582 -45298 -33994 -16557 9492 34207 38749
394 38749 24737 4475 -13566 -23250 -16187 5694 27649 39258 35121 16005 -11401 -34068 -44576
407 -44576 -40727 -21248 5861 23344 22695 9843 -7200 -25213 -31679 -17033 8481 29293 41524
420 41524 44749 28941 -2142 -26501 -32408 -26731 -12874 8670 23913 19739 543 -18276 -32458
433 -32458 -39885 -28528 -208 27057 39897 39624 27324 4307 -17432 -23295 -14100 2156 20477
446 20477 31821 25841 4749 -19472 -37418 -42959 -32534 -8671 14923 28398 29417 17034 -5573
459 -5573 -23209 -24162 -12224 5377 24158 35489 26987 5083 -17980 -36199 -46435 -38587 -14101
472 -14101 9210 18070 14594 2845 -15901 -30580 -28577 -12622 7310 27798 43750 40312 17473
485 17473 -8803 -24960 -29230 -22229 -3138 14713 19512 12867 761 -19497 -38781 -39964 -21091
498 -21091 3774 25228 37424 32559 12662 -6643 -16278 -20822 -16963 850 21834 28083 16416
511 16416 -3544 -28137 -47279 -45830 -25798 -7376 4586 17089 20929 5244 -17946 -29439
523 -29439 -27720 -16372 6947 30472 33094 15798 -2040 -15538 -30568 -38811 -27976 -5289 13616
536 13616 24417 20903 423 -23011 -28725 -18454 -4414 11761 29436 36939 29469 14003 -7624
549 -7624 -31067 -37738 -17830 6636 14351 11704 5334 -9630 -29544 -36454 -31590 -23768 -4427 26512
563 26512 40462 23756 -1312 -13843 -21458 -23177 -9348 8114 12401 11232 12321 -2845 -38391
576 -38391 -59136 -46165 -24011 -8290 7227 16965 6505 -10749 -15687 -17293 -24602 -16907 12584
589 12584 38165 37103 17921 -4891 -26277 -35266 -29107 -20402 -14167 -2021 8759 916 -21222
602 -21222 -40576 -51515 -49462 -24530 7137 15279 3538 -281 -1378 -20283 -40669 -37080 -18846
615 -18846 -3708 11964 22654 4290 -29726 -41231 -32543 -30040 -28114 -7056 13460 14479 7660
628 7660 -1542 -26390 -47572 -31949 2611 14976 9996 14726 16638 -2634 -22515 -24640 -21312
641 -21312 -14984 10594 39528 37396 10384 -8967 -14127 -17411 -16009 -7612 1687 12190 21643 11589
655 11589 -21376 -46928 -46515 -36826 -24567 -3739 10249 793 -10636 -6777 -12475 -36150 -38269
668 -38269 -3608 26185 27705 22344 13417 -10111 -30434 -25368 -17168 -20929 -13320 12558 19794 -2202
682 -2202 -23438 -31712 -37502 -27296 6539 29559 23169 21101 33387 25743 -5048 -16717 -169
695 -169 15463 25472 37788 34707 5012 -20251 -22418 -21803 -28215 -21633 -514 13859 17059 8170
709 8170 -15586 -37638 -30281 -6071 4385 7388 20387 25143 5465 -13497 -19741 -32163 -42257
722 -42257 -19328 15688 16528 -7526 -16384 -17273 -30700 -38028 -23508 -7191 1818 19961 32084
735 32084 11099 -20248 -26989 -18129 -14099 -4015 14781 16424 3284 125 -3930 -28842 -47422
748 -47422 -26404 6380 15836 14605 17114 6638 -14013 -19773 -13155 -13612 -9724 11813 27780 16882
762 16882 -5018 -21771 -36182 -38037 -19053 -1661 -1560 2773 16395 10366 -16274 -27695 -16759
775 -16759 -7263 4364 29776 42586 22553 1953 2624 -708 -17129 -15772 9021 24126 24009
788 24009 22832 11470 -14314 -25839 -10765 3318 6700 19756 35619 30554 12629 2710 -6377
801 -6377 -18310 -9054 19902 32156 19877 11073 7737 -8892 -26624 -24108 -11586 -4013 10066
814 10066 25481 17960 -7234 -20603 -20205 -20630 -14183 4875 16443 13524 12362 8875 -11932 -32505
828 -32505 -23638 -651 9505 15915 28514 25126 4036 -6552 -2637 -5349 -6492 14136 37176
841 37176 34270 18007 8121 -4680 -19125 -16744 1117 10222 13643 23405 25105 5521 -12955
854 -12955 -13041 -7908 -1055 16580 33948 30460 15130 7067 -2693 -19953 -24221 -9409 4061 6902
868 6902 9534 5308 -15048 -32938 -31290 -23494 -17553 -3037 17383 21397 10260 2171 -4929 -16941
882 -16941 -16934 3451 19226 19253 17651 16225 -400 -22269 -26335 -17962 -12317 -2017 16662 22247 7698
897 7698 -5094 -7467 -10952 -11746 4134 24492 30534 27910 24043 11161 -8984 -17278 -9348 -713
911 -713 6180 16151 18403 5275 -10359 -17555 -21676 -20215 -5412 14448 22095 20164 17040 6472
925 6472 -10273 -15537 -5788 4237 11326 20906 23252 8717 -9441 -16570 -18924 -20506 -8654 11690
939 11690 20492 15467 9465 2533 -11128 -17070 -5999 8659 16081 22152 26674 16255 -3340 -15270
953 -15270 -15786 -13592 -5297 10778 19666 13621 3495 -4534 -13974 -20324 -13391 2467 14652 21190
967 21190 21324 12234 -4961 -15246 -15223 -10577 -2030 10450 18411 14403 4303 -6192 -17446 -22928
981 -22928 -12993 3868 13759 17529 18246 11020 -4388 -14919 -13942 -9382 -1826 11859 21840 15628
995 15628 663 -10149 -16388 -19921 -14486 824 13062 16690 16203 10136 -4324 -16678 -16087 -6246
1009 -6246 4667 13335 18782 14384 1803 -10137 -18068 -21527 -16665 -2790 11052 16215 12173 3322
1023 3322 -7851 -15580 -13042 -4136 5596 15554 23307 19781 6539 -7317 -16023 -18197 -12153 566
1037 566 11244 11149 6282 -5 -10501 -21175 -20772 -8910 4158 14089 20857 18172 5106 -8301
1051 -8301 -12410 -11580 -8457 594 11936 15424 8324 -3418 -15324 -23726 -23778 -12827 1366 10373
1065 10373 13958 12426 4651 -6119 -12396 -11096 -2530 10122 20455 22320 14253 2797 -8832
1078 -8832 -16649 -17287 -9067 1392 9493 14310 11183 -333 -12491 -15729 -11610 -2921 8590 19644
1092 19644 22293 15008 4698 -5108 -13857 -16267 -7376 5675 11445 10237 5247 -4516 -16861 -22968
1106 -22968 -18600 -8760 2144 11975 17130 12477 541 -9002 -12381 -10129 -2496 8224 16524 17239
1120 17239 10171 -888 -11888 -17754 -15271 -6079 5543 14696 16271 10346 1141 -6976 -12264 -9951
1134 -9951 552 13177 19136 18585 12847 1727 -10743 -15977 -11919 -3811 3761 12131 15648 7473
1148 7473 -5363 -13815 -14378 -12261 -4406 8505 17102 15048 7858 -688 -10673 -18562 -15880 -4021
1162 -4021 6046 10571 10125 4905 -4754 -13858 -16471 -11657 -1545 10547 19102 20678 13412 2575
1176 2575 -6109 -8244 -3453 3680 11436 18072 18638 9711 -3358 -11654 -14863 -11795 -1934 11177 17278
1191 17278 13768 8143 2605 -6016 -12219 -7037 5559 14049 17358 17876 9637 -5357 -15669 -14780
1205 -14780 -10211 -5743 1713 10875 10789 1281 -9207 -15272 -16981 -11415 1122 12502 16186 13310
1219 13310 8090 87 -8380 -12593 -8998 1121 12552 16989 12870 4185 -4840 -11755 -12799 -6216
1233 -6216 3588 10797 16367 19186 12573 -2591 -11486 -8316 -2105 3587 11730 17743 12426 1302
1247 1302 -5172 -9621 -16640 -15315 -62 13271 13908 8266 3909 -4111 -12685 -12424 -4477 2279 7821
1262 7821 14320 14792 3644 -10642 -17046 -15734 -9401 -826 7173 9851 7831 2886 -4422 -11420 -12095
1277 -12095 -4709 6842 18084 22857 16706 6146 -660 -3801 -7599 -5189 4703 13514 14024 11140
1291 11140 4884 -7695 -18674 -13467 45 6179 7946 15037 17699 6984 -5005 -7593 -6106
1304 -6106 -5424 4026 17962 18584 5805 -3508 -6277 -11766 -16498 -10748 663 8197 10576 9419 1491
1319 1491 -10058 -14243 -9290 -899 6653 12646 14608 11496 5275 -3967 -13355 -13812 -3767 6328
1333 6328 11432 12896 9263 -723 -8539 -8190 -6980 -5522 3999 17561 19755 9823 1255 -3916 -11494
1348 -11494 -13083 -1742 8062 6914 5398 9247 2833 -13706 -20731 -11998 -3097 1493 10301 15707
1362 15707 7947 -3924 -7250 -6972 -10006 -7891 4082 13281 12177 4172 -5135 -14014 -17541 -12988
1376 -12988 -6131 568 7146 9927 5874 -1212 -7689 -12795 -11806 -923 12390 14409 10389 8112
1390 8112 1986 -9187 -14238 -9514 -4027 -31 8573 13970 3795 -10496 -12921 -10191 -10991 -6160
1404 -6160 7130 14263 9446 5687 4083 -6564 -17547 -10786 3442 7686 6982 9140 6858 -4787
1418 -4787 -13757 -12262 -9203 -5543 3912 14010 13648 4534 -2930 -8020 -9918 -5993 1180 6991 11576
1433 11576 13427 7136 -4746 -11355 -11604 -9665 -3243 8254 13709 7943 2436 306 -5896 -13648
1447 -13648 -8949 3279 9692 10251 11838 7795 -6595 -15015 -10873 -6432 -6218 782 11313 9752
1461 9752 -1451 -6930 -8863 -13647 -12117 1555 12109 10552 7613 6714 -389 -11127 -13264 -6934
1475 -6934 -351 4448 9985 8345 -435 -9079 -12884 -13171 -9792 -875 6663 9702 10208 6228 -4146
1490 -4146 -11526 -9267 -3222 688 6588 12964 10086 -1761 -8206 -9850 -14159 -14050 -2345 8546
1504 8546 7486 3135 1830 -3930 -13959 -13113 -2425 3621 5532 11527 13270 2599 -9198 -11254
1518 -11254 -9103 -8697 -2684 7783 10014 3649 -2063 -5781 -11933 -14164 -6267 3597 8487 10946 10492
1533 10492 3604 -5665 -9542 -8174 -5237 1694 9427 10086 5687 -166 -6433 -13815 -13741 -4974 2498
1548 2498 6027 9845 10289 1696 -7978 -8750 -5347 -4036 1439 11625 14405 5817 -1128 -4082 -10074
1563 -10074 -13785 -6109 5047 8016 6781 7042 3074 -6906 -11777 -6869 -542 3351 10353 14679 9314
1578 9314 -202 -5907 -7924 -9054 -4962 3424 8638 8414 5780 -157 -8318 -12282 -8910 -2512 3552
1593 3552 9979 12325 7322 -489 -5152 -8359 -9812 -4312 5702 9275 7379 4837 -973 -10015 -14118
1608 -14118 -8721 -2335 1223 7345 12322 7384 -2366 -7053 -6968 -7348 -3323 6718 12007 8411 3467
1623 3467 16 -6890 -13643 -11200 -2315 3718 6869 8539 5872 -2898 -8796 -8416 -5820 -1891 5227
1638 5227 11574 11443 5739 -728 -7157 -11342 -8749 -1520 3709 6057 7025 4118 -3831 -9996 -10352 -7698
1654 -7698 -2795 5734 12167 10433 4167 -440 -4850 -8636 -6829 749 6315 8516 8975 5317 -3678
1669 -3678 -11403 -10206 -6142 -1751 4074 10356 10268 3685 -973 -4480 -8090 -6655 1769 9428 10781
1684 10781 8711 4940 -2033 -9387 -10224 -6369 -1439 3486 8824 9258 2666 -4158 -7663 -8253 -5673
1699 -5673 1551 8091 10069 8738 5623 -726 -8184 -9806 -5386 568 5303 8987 8006 1095 -5119
1714 -5119 -7898 -8897 -6815 104 7859 11039 8722 4404 -1555 -7884 -8700 -3276 1700 5468 8153
1729 8153 8536 2032 -6388 -9913 -9908 -7651 -1711 6706 9292 5321 1042 -2885 -8009 -9398 -4486 2030
1745 2030 6760 8834 7810 1978 -6562 -10212 -9290 -6242 -1209 5096 7951 5280 571 -4781 -9092
1760 -9092 -9460 -4124 2887 7620 9391 7810 2475 -5072 -8738 -8099 -5073 -35 6564 9186 4832
1775 4832 -1116 -5772 -9442 -10081 -4770 2741 6864 8411 7554 2449 -4691 -9072 -6908 -3019 1010
1790 1010 6591 9181 5431 -1679 -6706 -9328 -9907 -5702 1977 7146 7767 5658 1430 -4580 -7938
1805 -7938 -6160 -1626 3442 8358 10454 6614 66 -5183 -8392 -8616 -4553 2405 6653 6699 4769 661
1821 661 -6180 -9969 -6650 -1177 3590 7972 10287 6759 -220 -5261 -7014 -7739 -4764 2633 7164
1836 7164 6489 2656 -1735 -6980 -10972 -8856 -2767 2508 6132 8502 6050 -650 -6504 -7882 -6361
1851 -6361 -2444 3833 8322 7108 3391 -1256 -6495 -10679 -8794 -2599 2439 6407 7815 4347 -2427
1866 -2427 -6685 -6924 -6181 -2812 4177 8843 8070 3390 -1284 -6698 -10557 -8351 -1659 3008 4763 5758
1882 5758 3436 -2825 -8615 -9214 -6410 -2611 3307 8678 7652 2337 -2399 -6256 -8843 -7700 -2443
1897 -2443 3058 5839 6195 2847 -3939 -9051 -9119 -5655 -1809 4052 8435 8217 3656 -750 -4706 -8113
1913 -8113 -6452 842 6643 7123 5987 3334 -2753 -8404 -8632 -5418 -2027 2869 8305 8453 2275 -3295
1929 -3295 -5452 -6721 -4732 974 6936 8243 6355 4291 -1295 -7826 -9408 -5381 -237 3879 6778
1944 6778 5925 978 -4106 -6264 -7344 -5289 337 6709 8769 7632 4596 -1846 -7196 -6416 -1938
1959 -1938 1276 3929 7840 7837 1735 -4430 -6457 -7266 -6137 456 7683 8288 4529 2228 -1003 -6389
1975 -6389 -8111 -3794 1660 4693 6983 6673 854 -6144 -8478 -7114 -5350 -1358 4744 6919 4391
1990 4391 897 -3023 -7729 -8489 -3534 2700 5800 6864 5805 1288 -4427 -6886 -7025 -5400 74
2005 74 6136 7366 4022 605 -2910 -7136 -7201 -1590 4199 6011 7435 8418 3747 -4557 -7244 -4643
2021 -4643 -2274 444 5873 8145 3504 -1804 -3901 -6627 -9318 -5016 2531 6409 6255 4909 1646
2036 1646 -4305 -7368 -5193 -1702 1465 5532 8209 5016 -812 -4857 -7599 -7758 -3927 2814 5944
2051 5944 5931 4670 1674 -3952 -6689 -4066 -753 3398 8109 10514 5770 -68 -2480 -4233 -5513
2066 -5513 -2205 4872 7756 5947 4691 2311 -4295 -8468 -4651 1126 2887 6018 8635 6493 -846
2081 -846 -4685 -4622 -5278 -3403 2866 7562 6008 2170 -904 -4664 -8361 -6993 -1162 2715 5266 6925
2097 6925 5070 -645 -5010 -5779 -4884 -1669 4032 7808 6416 3264 30 -4813 -8210 -5723 -252
2112 -252 2725 5461 7425 4770 -1823 -5754 -4443 -3109 -1519 4484 9545 7592 2490 -129 -3282
2127 -3282 -7687 -6683 -10 3961 4195 4401 3688 -2148 -8146 -7558 -4170 -1924 1618 6778 6909 1577
2143 1577 -3049 -4831 -6621 -6127 -1210 3895 5171 3959 2426 -2268 -7124 -7582 -4564 -1064 3222
2158 3222 7358 6483 2089 -1672 -3581 -5592 -4672 1152 6084 6296 5566 4100 -1026 -6940 -6561 -2526
2174 -2526 297 3045 7158 7692 1943 -2626 -3761 -4386 -4438 564 6871 7584 4758 2681 -881 -6400
2190 -6400 -7780 -3502 655 2358 4923 6161 1564 -4482 -6317 -5289 -3905 -470 5420 7687 5029
2205 5029 2087 -1242 -5181 -6663 -3255 1431 4158 6173 5454 1247 -4107 -5490 -5508 -4172 50 5659
2221 5659 7152 4773 2017 -980 -4933 -6349 -1623 3231 4759 5709 6223 1977 -4386 -6852 -5517
2236 -5517 -3938 -1052 3912 6400 3221 -1117 -2979 -5538 -6833 -3550 2215 4898 4932 4853 1649 -4323
2252 -4323 -7268 -5929 -2916 -240 3151 5595 3026 -980 -4478 -6377 -6966 -3929 1893 5324 5558
2267 5558 4326 1626 -3330 -5790 -4210 -1548 1355 5399 6978 4473 -1138 -3685 -5610 -6138 -3141
2282 -3141 2388 5246 4704 3713 1953 -3082 -6780 -4847 -990 2083 4887 6774 4403 -873 -4353
2297 -4353 -4987 -5474 -3633 1124 5638 5070 2522 -229 -3861 -7316 -5545 -901 2337 4133 5556 4847
2313 4847 -183 -4689 -5283 -4489 -2236 2241 6110 5643 2441 -16 -3462 -5361 -4398 -380 3034 5724
2329 5724 7056 4857 22 -3963 -4119 -2998 -1281 2738 6296 5625 2616 -34 -3341 -6313 -5249
2344 -5249 -171 3675 5123 5195 4135 -297 -4687 -5209 -3104 -1167 2218 5611 5798 1909 -2183 -4402
2360 -4402 -6464 -5790 -1429 2850 3905 3864 2618 -939 -5066 -5866 -3573 -196 3397 5949 6003 2563
2376 2563 -1067 -3461 -5041 -4566 -712 3443 5439 4497 2321 -1091 -4919 -5449 -2555 285 3135 6269
2392 6269 6655 2989 -943 -3462 -4360 -3722 144 4352 5679 3864 1643 -1151 -5542 -6869 -4015 -236
2408 -236 2875 4782 5087 2248 -2383 -4449 -4097 -2822 308 4387 6302 4650 1886 -1769 -5053 -6100
2424 -6100 -3627 87 2827 4556 4962 1589 -2146 -4459 -3999 -2574 930 5492 7571 6313 3255
2439 3255 323 -2825 -3993 -1362 2336 4617 6001 5586 2398 -2252 -4800 -3969 -2551 517 4544
2454 4544 6190 4883 1573 -1028 -3743 -4795 -2416 2035 4836 5289 4379 1552 -2722 -5420 -5062 -2982
2470 -2982 123 3346 5072 3262 -479 -3187 -5051 -5578 -3022 1514 4121 5006 3848 1940 -2617
2485 -2617 -5065 -4165 -1463 1544 4271 6225 4650 1037 -2068 -3203 -4073 -2065 2401 5357 5522 4058
2501 4058 1237 -2412 -5019 -4424 -1858 1106 3927 5117 3763 73 -2933 -4196 -4242 -1513 2239 5464
2517 5464 5543 3668 1201 -2458 -5099 -4152 -1656 861 3874 4857 2645 -1362 -4104 -5129 -4993 -3023
2533 -3023 1409 4969 4849 3111 697 -2178 -4411 -3710 13 3651 5174 5877 4612 658 -3196 -4516
2549 -4516 -3663 -1407 1629 4720 4765 2139 -540 -3038 -4932 -4253 -680 2397 4710 5264 3782 56
2565 56 -3498 -4317 -3436 -1436 2187 4691 4626 2066 -531 -3470 -5382 -4531 -557 2566 4127 4454 2981
2582 2981 -675 -3203 -4048 -2896 -631 2147 5354 5124 2503 -1186 -2749 -4301 -3789 -247 3462 4702
2598 4702 4441 3499 353 -2680 -4505 -2262 502 2821 5139 4760 2065 -1235 -3827 -5055 -4400 -1175
2614 -1175 2063 3512 3154 1146 -2025 -5145 -5235 -3435 -832 1749 4295 4233 1178 -2329 -4273 -5339
2630 -5339 -4462 -988 2335 3185 2059 748 -2010 -5232 -6285 -3562 -990 1484 3522 4304 1442 -2176
2646 -2176 -3634 -3470 -2183 -24 3835 5159 4255 1627 -595 -3634 -4633 -2569 688 3164 4164 3852
2662 3852 1399 -1545 -4212 -4239 -3080 -173 3400 4509 3493 922 -1876 -4382 -4930 -2914 330 2405
2678 2405 3963 3606 850 -2908 -4448 -4438 -2884 -204 2991 4466 2674 183 -2059 -4337 -5264 -2944
2694 -2944 824 2746 3739 3296 1405 -2535 -4493 -3195 -1786 909 3729 5636 4187 1078 -1189
2709 -1189 -3055 -3543 -1833 1664 4079 4054 2968 910 -2236 -4589 -4195 -2497 125 3076 4348 2858
2725 2858 -92 -2085 -3904 -4085 -1982 1246 3709 3326 3002 381 -3250 -5274 -3999 -2319 -467 2434
2741 2434 3536 2120 -1185 -3567 -4114 -4095 -2673 996 3965 3946 2356 652 -2151 -4296 -3550 -1094
2757 -1094 1360 2864 4083 2983 -649 -3247 -4160 -3555 -1961 1085 3545 3384 1806 -202 -2662 -4636
2773 -4636 -3569 -1271 1118 2894 3311 2375 -1095 -3696 -4553 -4209 -2707 635 2935 3163 1133 -851
2789 -851 -2888 -5261 -4126 -671 1687 2789 3187 2941 -539 -3600 -3822 -2817 -1564 1293 4145 3899
2805 3899 1719 -576 -2454 -3799 -3008 -91 2700 3907 3840 3470 213 -2425 -3398 -2173 -367 2344
2821 2344 3996 4132 1593 -788 -2807 -3940 -3669 -1030 1973 3446 3724 2048 -730 -3869 -4123 -2328
2837 -2328 -949 1328 3382 3403 1029 -1969 -3194 -4180 -3808 -856 2238 3361 2482 1659 -594 -3416
2853 -3416 -4099 -2098 303 1989 3968 4662 1861 -1191 -2869 -3022 -2418 115 2849 4187 3101 1497
2869 1497 -236 -3172 -3918 -1955 327 2469 3602 3712 1525 -1354 -3088 -3394 -2635 -729 2311 3222
2885 3222 2356 78 -2212 -4314 -4937 -3009 -565 1430 2577 2831 449 -2389 -3878 -3626 -2539 -371
2901 -371 2586 3843 2744 412 -1102 -3055 -4138 -2357 894 2801 2970 3234 1377 -1716 -3736 -2574
2917 -2574 -1534 576 2947 4248 3350 1084 -1163 -2918 -3563 -2016 828 2923 3149 2432 706 -2445
2933 -2445 -3980 -3456 -2014 -293 2114 3102 2547 -567 -2416 -3620 -3887 -2692 -163 2181 2437 1541
2949 1541 388 -2646 -4595 -3580 -1703 307 2291 3664 2427 32 -1743 -2615 -2610 -1738 1357 3657
2965 3657 3282 2485 828 -1593 -3013 -3102 -536 1014 2302 3700 2920 447 -2142 -2743 -2688 -1356 1412
2982 1412 3281 3123 1942 113 -2301 -4048 -3649 -1434 772 2185 2468 1805 -1377 -3231 -3857 -3273
2998 -3273 -2220 463 2750 2559 1533 -582 -1943 -4064 -3270 -655 1438 2327 2794 2319 -524 -2960
3014 -2960 -3370 -2449 -1155 1182 3188 3755 1616 57 -1427 -2671 -2516 -239 2471 3432 3600 2468
3030 2468 -138 -2564 -3580 -2604 -1033 665 2541 2660 885 -1301 -2836 -3642 -3263 -1014 1267 2507
3046 2507 2150 1409 -890 -3046 -3726 -2504 -1042 495 2473 2641 391 -1823 -3040 -3901 -3560 -1056
3062 -1056 1914 2385 2205 1458 -332 -2652 -3347 -2007 -139 1677 3370 3312 1869 -745 -2286 -2366 -2333
3079 -2333 -688 2006 3129 2186 1167 -874 -2872 -3666 -2528 -477 1165 2575 2474 616 -1648 -3190
3095 -3190 -3364 -2772 -957 1440 2523 1879 594 -1451 -2849 -3838 -2784 -148 1221 2485 2510 565
3111 565 -1943 -3471 -3270 -2308 -849 1728 2957 2164 695 -1070 -2555 -2895 -2015 809 2213 3000 3239
3128 3239 1303 -847 -2609 -2528 -1629 142 1600 2988 2180 414 -1431 -2979 -3336 -2181 -221 2066
3144 2066 2313 2009 655 -1648 -2805 -2889 -1738 6 1558 2845 2205 221 -1488 -2687 -3238 -1866
3160 -1866 131 1786 2041 2168 453 -1179 -2981 -2778 -1179 360 2446 3120 2982 400 -1324 -1849
3176 -1849 -2099 -1521 775 2492 3011 2161 789 -1056 -2818 -2614 -947 684 2114 2987 2447 262 -2038
3193 -2038 -2862 -2735 -1679 149 1999 2158 1425 -476 -1997 -3527 -3189 -1372 207 1619 2426 1807 -208
3210 -208 -1925 -2747 -2316 -1455 517 2469 2563 1396 -27 -1465 -3207 -2810 -1015 546 1943 2291 2013
3227 2013 205 -1975 -2335 -1674 -691 1138 3087 3241 2165 516 -1107 -2272 -2083 -574 1405 2591
3243 2591 2760 1810 -136 -2200 -2857 -2179 -1109 422 2159 2515 1198 -300 -1960 -2653 -2375 -922 1386
3260 1386 2118 2300 1532 -397 -2210 -2763 -2047 -1207 646 1959 2280 842 -713 -1968 -2488 -2229 -940
3277 -940 1066 2374 1800 1043 -294 -2178 -2656 -1709 -238 1396 2668 2798 1586 -130 -1549 -2111 -1714
3294 -1714 -80 1593 2777 2367 1361 -152 -1923 -2174 -1629 -214 1069 2469 2304 943 -705 -2079
3310 -2079 -2081 -1794 -345 2035 2979 2655 1332 -268 -1604 -2446 -1258 491 1333 2545 2521 1512 -1055
3327 -1055 -2013 -2115 -1610 -510 1332 2651 1987 1043 -613 -1477 -2336 -1466 237 2086 3013 2503 1191
3344 1191 -615 -1830 -2110 -1267 -84 1564 2378 1950 672 -497 -1903 -2313 -1420 436 1530 2444 2229
3361 2229 967 -982 -2202 -1472 -962 -13 1613 2718 2049 395 -1134 -1773 -2367 -1605 527 1962 1940
3378 1940 1746 740 -1169 -2203 -2090 -1070 201 1803 2434 2150 305 -1157 -2062 -2180 -1522 234 1746
3395 1746 2441 1616 640 -1275 -2124 -1907 -727 443 2039 2903 1941 407 -1085 -1916 -1654 -1213 575
3412 575 2094 1987 1417 664 -1189 -2428 -2156 -880 461 1465 2228 1808 -64 -1685 -2174 -1717 -1328
3429 -1328 171 2020 2075 1310 119 -954 -2486 -2111 -959 950 1897 2066 1767 358 -1142 -1756 -1426
3446 -1426 -866 1002 2583 2614 1903 896 -956 -1884 -1741 -280 1560 2226 2369 2124 330 -1034 -1383
3463 -1383 -949 -435 1108 2184 2414 1795 190 -1143 -1884 -1759 -599 1242 1820 1835 1579 22 -1785
3480 -1785 -2291 -1552 -574 523 1813 2390 1091 -100 -1305 -1753 -1465 -394 1118 1803 1748 846 -605
3497 -605 -1609 -2114 -1244 -284 1079 2216 2263 1489 -30 -1294 -1542 -1347 -14 1547 2184 2148 1664 175
3515 175 -1495 -1959 -1219 -66 1146 1894 2181 987 -566 -1354 -1714 -1765 -271 1403 2114 1393 574 -560
3533 -560 -1728 -2159 -1715 -182 829 1659 1817 606 -857 -1915 -2172 -1253 -315 1516 2197 1835 886 -19
3551 -19 -1393 -1667 -1057 259 1600 2062 2149 780 -649 -1140 -1402 -1009 -20 1472 2305 1706 916 -116
3569 -116 -1457 -1432 -1022 383 1189 1563 2046 517 -836 -1709 -1663 -1145 -298 971 1853 1390 123 -639 -1644
3588 -1644 -2026 -1468 342 1250 1648 1570 773 -908 -1889 -1554 -1023 -17 1424 2133 1582 269 -628 -1385
3606 -1385 -1604 -1249 506 1771 2198 1446 658 -617 -1241 -1169 -753 676 1456 1925 1497 263 -654 -1563
3624 -1563 -1396 -751 394 1735 1580 1213 428 -805 -1536 -1353 -435 100 1223 2001 1208 343 -1163 -1860
3642 -1860 -1348 -1001 394 1755 1915 1138 174 -864 -1806 -1644 -245 758 1549 2050 1680 646 -861
3659 -861 -1038 -1259 -438 627 1722 2254 1261 250 -767 -1308 -1235 -277 910 1643 1854 1467 28 -807
3677 -807 -1396 -1260 -614 481 1733 1526 606 -264 -1203 -1859 -2085 -627 618 1271 1313 950 12 -1462 -1644
3696 -1644 -1262 -642 639 1519 1714 943 66 -1067 -1745 -1461 -595 768 1587 1560 1395 -99 -1106 -1447
3714 -1447 -1081 -145 450 1626 1611 1210 -96 -1029 -1375 -1210 -593 669 1261 1413 615 -500 -1112 -1641 -1169
3733 -1169 -242 664 1365 1155 890 -300 -1321 -1454 -1201 -327 1143 1606 1391 693 -275 -1173 -1786 -905 -27
3752 -27 861 1639 1484 795 -284 -1349 -1005 -1328 59 1121 1915 1976 872 -174 -1296 -1169 -650 325
3770 325 1021 1744 1473 975 -379 -947 -1079 -788 -341 769 1599 1280 581 -321 -1026 -1441 -1104 275 723
3789 723 1411 1213 819 -706 -1232 -1307 -760 -25 1207 1386 1295 618 -365 -1033 -1658 -742 183 923 1542 967
3809 967 853 -732 -1321 -1438 -828 42 1341 1602 1198 386 -542 -1006 -1483 -647 499 1393 1673 1536 575
3828 575 -595 -1529 -1199 -646 112 877 1365 941 -9 -988 -1252 -1302 -916 708 874 1040 1588 288 -693
3847 -693 -1220 -1130 -495 157 967 1148 741 43 -1135 -1005 -1373 -975 55 1135 1493 608 68 -835 -1723
3866 -1723 -1399 -415 8 1209 1645 1048 66 -781 -895 -803 -941 402 1161 1386 1129 48 -852 -1479 -1220
3885 -1220 -697 488 1392 1527 915 188 -1092 -1225 -1219 -382 376 1258 1170 731 195 -711 -1432 -1313 -312 569
3905 569 920 1543 1037 -281 -1050 -1543 -1248 -759 287 1256 1142 565 -289 -934 -1261 -1351 -231 499 710
3924 710 893 1015 -64 -955 -1395 -811 -330 501 1198 1271 673 -64 -883 -1278 -1069 -328 743 1334 1042 811
3944 811 -336 -794 -1097 -558 -107 663 1080 1313 798 -271 -873 -1188 -829 -401 804 1117 1066 750 -318
3963 -318 -1013 -1385 -725 -68 518 1194 1144 626 -385 -834 -1004 -874 7 823 1167 1298 245 -357 -815 -1172
3983 -1172 -827 254 797 1101 1150 220 -657 -1100 -1189 -632 -174 663 1255 838 480 -247 -764 -1373 -949 -159
4003 -159 801 993 1174 105 -446 -1214 -860 -592 -26 593 1050 1022 210 -664 -1336 -1281 -772 -113 684 777 774
4024 774 496 -668 -1059 -1196 -631 34 658 1022 787 -30 -791 -1142 -913 -871 10 897 1043 797 175 -268
4044 -268 -950 -885 -449 202 520 954 928 263 -804 -807 -871 -581 25 782 689 769 59 -404 -1178 -923 -375 208
4066 208 950 894 770 -332 -879 -958 -1120 -511 337 838 1067 670 54 -877 -1123 -1124 -577 340 849 1103 535
4087 535 -201 -582 -1114 -645 -501 97 939 1545 774 -86 -529 -835 -796 -100 303 896 1223 1028 309 -691
4107 -691 -994 -851 -252 46 824 968 603 101 -599 -897 -890 -386 205 821 567 611 81 -819 -1121 -864 -381
4128 -381 -66 888 566 428 -151 -675 -1226 -1037 -316 362 619 583 435 -582 -765 -1428 -1163 -472 472 920
4148 920 781 591 -268 -924 -977 -796 -106 437 928 712 404 -86 -1006 -1323 -652 -165 313 1083 653 26
4168 26 -357 -929 -986 -884 -534 398 882 412 468 -278 -850 -1178 -540 -177 146 997 917 -4 -251 -900 -1049
4189 -1049 -659 -190 898 703 639 412 -79 -779 -862 -497 96 795 788 738 292 -472 -947 -723 -652 49 502
4210 502 837 711 445 -452 -784 -781 -510 -84 432 893 630 245 -403 -1043 -1000 -341 -125 346 819 567 -60
4231 -60 -341 -558 -725 -568 157 148 589 621 131 -141 -979 -854 -341 222 538 856 511 18 -190 -618 -872
4252 -872 -493 16 614 520 478 306 -339 -788 -487 -334 222 876 829 541 111 -406 -694 -790 -353 365 594
4273 594 742 541 -183 -832 -594 -870 -286 -51 578 846 422 -40 -888 -846 -703 -628 -124 880 575 631 8
4294 8 -194 -695 -577 27 -178 808 864 263 0 -408 -787 -642 -370 653 714 881 443 75 -410 -593 -1071
4315 -1071 -79 480 648 941 536 -65 -621 -907 -544 -95 350 704 537 292 -117 -413 -722 -659 -289 425
4335 425 509 564 421 -210 -709 -670 -782 -569 424 906 742 523 -308 -418 -929 -899 126 529 741 644 307
4356 307 -194 -745 -708 -473 -236 464 764 723 520 -357 -135 -636 -358 -14 584 715 675 490 -278 -643 -597
4377 -597 -356 -258 535 624 716 122 -137 -835 -738 -546 243 430 554 458 243 -158 -812 -429 -614 -172 353 693
4399 693 600 330 -248 -473 -614 -586 -50 672 482 668 122 -208 -394 -497 -103 -5 787 778 514 200 -548 -673
4421 -673 -465 -469 10 490 828 790 -265 -133 -650 -729 -99 -90 891 418 637 367 -395 -717 -726 -142 370 647
4443 647 644 334 -67 -437 -629 -473 -252 75 846 604 649 297 -424 -417 -621 -247 451 632 786 581 14 -318
4465 -318 -782 -890 -470 267 600 491 162 -62 -497 -521 -447 -630 195 598 720 504 214 -328 -708 -655 122
4486 122 277 764 559 308 168 -489 -622 -480 80 81 609 571 236 -109 -308 -440 -491 -165 218 643 464
4507 464 409 -275 -478 -472 -256 14 480 581 541 252 72 -687 -701 -707 -45 35 563 660 37 -32 -667 -688 -458 58
4531 58 221 442 628 440 -360 -420 -416 -235 27 430 566 195 97 -262 -637 -345 -368 -51 572 643 553 -109 -414
4554 -414 -206 -515 -555 100 394 593 531 -57 -47 -628 -829 -220 -45 508 482 45 424 -446 -613 -239 -568
4575 -568 -36 350 648 438 286 -437 -484 -409 -188 169 420 426 97 266 -168 -297 -567 -69 550 580 684 459
4597 459 120 -347 -519 -756 -359 262 266 734 314 274 -342 -661 -621 -135 148 452 741 383 -21 -247 -687
4618 -687 -405 -95 349 672 382 285 92 -347 -527 -659 -295 253 567 563 593 122 -91 -616 -562 -174 119 432
4640 432 391 262 -26 -339 -570 -440 -67 263 352 783 352 -172 -116 -367 -691 -103 258 237 618 38 -40 -523
4662 -523 -731 -238 71 416 561 671 393 -163 -345 -623 -235 -97 -26 485 323 249 32 -464 -593 -382 98
4683 98 401 445 298 233 -73 -436 -560 -368 -5 327 576 502 52 -151 -353 -541 -172 2 474 538 397 260
4705 260 -306 -388 -449 -444 197 123 621 245 192 -82 -415 -407 -330 143 509 381 586 237 -321 -349 -468 -346 67
4728 67 528 516 222 155 -28 -221 -714 -234 245 346 447 371 226 -407 -323 -294 -46 -174 395 477 614 341
4750 341 7 -695 -350 -266 -118 554 587 457 125 -178 -268 -379 8 230 319 355 361 -228 -338 -467 -301 -176
4772 -176 47 298 365 6 -2 -424 -459 -248 -530 167 377 280 359 -494 -148 -556 -212 -498 127 652 414 309
4794 309 -204 -319 -248 -83 -12 144 302 738 601 75 -594 -497 -334 -64 0 479 326 -31 -98 -329 -599 -657
4816 -657 -51 -46 217 325 425 77 -416 -354 -462 -212 609 295 312 359 -141 -371 -83 -371 -106 280 591 143
4838 143 66 228 -323 -501 -414 384 189 450 420 189 -162 -313 -360 -347 -124 386 602 341 215 -28 -297 -490
4860 -490 -451 92 473 746 370 173 -154 -321 -571 -242 155 430 615 481 36 -129 -280 -556 -309 100
4880 100 414 599 229 136 -82 -343 -593 -285 -79 215 460 225 333 123 -230 -563 -146 3 113 510
4900 510 270 229 -228 -463 -641 -383 1 402 453 378 229 -230 -493 -545 27 25 656 424 238 25 -409 -554
4922 -554 -217 -281 -304 353 490 295 -152 -323 -328 -203 -344 65 542 473 343 -13 -329 -714 -655 58 198 234
4944 234 386 124 1 -175 -559 -145 -244 196 508 255 395 62 -165 -476 -88 49 244 460 138 89 -80
4965 -80 -164 -285 -291 -280 -38 305 727 451 -142 -435 -364 -241 26 355 782 392 31 -8 -736 -613 -349 128
4987 128 309 353 398 -11 -374 -531 -629 -336 156 265 732 415 348 -88 -366 -774 -240 130 463 640 409
5008 409 120 -332 -491 -473 -268 13 255 563 231 342 -243 -592 -447 -41 251 386 288 258 319 -564 -347
5029 -347 -645 -194 -129 456 359 341 -101 -113 -282 -64 -230 197 417 260 335 36 -186 -196 -397 -199 170 575
5051 575 700 29 261 -347 -478 -224 -139 197 243 504 397 195 -499 -408 -394 -614 137 511 792 345 -87
5072 -87 -223 -407 -547 -245 246 575 525 340 108 -353 -550 -572 -339 -7 278 590 444 203 -262 -611 -429
5093 -429 -219 75 403 413 439 -88 -495 -427 -271 15 49 258 390 580 47 -260 -561 -274 -180 270 148 123
5115 123 -36 -146 -273 -307 -140 -89 469 326 453 370 131 -231 -374 -388 -78 262 446 475 95 -281 -382 -295
5137 -295 -279 -140 479 405 478 313 -37 -471 -549 -342 -82 50 498 362 165 234 -532 -493 -492 75 -111 530 502
5160 502 49 -94 -286 -289 -580 360 274 203 168 -29 -197 -539 -445 -265 55 316 401 418 217 -144 -692 -510 -354
5183 -354 152 497 465 101 -61 -422 -479 -566 -265 76 417 556 458 258 -229 -430 -55 -302 145 288 572
5204 572 526 -125 -313 -336 -484 -57 29 144 339 459 -105 -303 -502 -310 -278 179 267 363 414 441 -89 -605 -391
5227 -391 -326 98 537 339 146 78 -167 -355 -427 -104 144 231 698 489 -141 -121 -349 -362 -278 170 263 455 381
5250 381 21 -259 -373 -446 -51 519 523 681 180 -196 -389 -529 -789 162 -53 437 644 241 -138 -335 -519
5271 -519 -291 -7 366 472 392 268 -336 -233 -556 -327 1 295 366 451 242 -179 -316 -522 -863 8 222
5292 222 447 517 -36 80 -200 -300 -210 149 282 384 611 248 -250 -478 -442 -144 66 215 775 283 -184
5313 -184 -233 -344 -335 -517 -8 326 565 373 1 22 -276 -669 -299 -50 56 562 358 235 -341 -497 -376
5334 -376 -73 151 467 496 355 317 -512 -556 -435 -426 -185 234 315 15 107 -135 -408 -846 -346 -43 296 668
5356 668 380 83 -153 -718 -558 -271 195 155 628 625 92 -259 -490 -646 -283 211 306 367 383 -49 -319 -559
5378 -559 -789 -79 -55 338 563 328 -128 -359 -647 -810 -169 75 572 860 281 -61 -249 -417 -362 -376 367
5399 367 730 200 339 -305 -589 -562 -408 -83 -15 373 621 483 260 -502 -647 -487 -524 -126 332 430 99
5420 99 -349 -121 -319 -519 -9 116 545 176 179 162 -426 -633 -618 -254 206 280 632 252 -88 -371 -606 -439
5442 -439 -139 195 662 362 -193 -187 -548 -378 -391 -318 348 430 693 -6 23 -447 -491 -346 -240 -15 599 313
5464 313 54 -41 -497 -557 -375 81 -152 215 751 496 88 -250 -540 -555 -57 303 613 559 148 -101 -272
5485 -272 -705 -295 130 364 455 387 195 -167 -526 -263 -283 -43 109 390 196 423 23 -489 -681 -647 -111
5506 -111 639 534 705 490 -272 -501 -425 -85 194 230 543 462 342 91 -179 -632 -602 123 95 350 302 313
5528 313 -160 -566 -434 -294 71 349 644 384 51 -434 -712 -508 -404 -234 495 315 660 119 -201 -846
5548 -846 -545 -31 -109 253 617 583 23 -322 -532 -643 -415 7 463 697 708 291 -42 -403 -736 -76 161
5569 161 790 307 701 -42 -171 -867 -711 -112 215 671 468 365 382 -123 -395 -414 -219 90 478 706 676
5590 676 147 -357 -256 -262 -294 262 165 493 349 74 -162 -707 -803 -347 -14 439 585 361 -22 -450 -284 -599
5612 -599 -364 372 308 507 252 107 -172 -922 -598 -289 424 673 698 437 293 -200 -526 -481 -261 116 612
5633 612 683 265 104 -398 -500 -631 74 386 511 792 240 87 -435 -718 -325 112 286 427 523 456 132
5654 132 -478 -684 -741 -335 417 560 530 261 -143 -403 -638 -590 143 378 492 431 376 -260 -349 -302 -394 -109 434
5677 434 498 691 446 16 -417 -606 -652 -13 351 556 372 252 45 -141 -630 -619 -47 74 692 722 225
5698 225 -65 -521 -737 -620 39 450 629 568 120 -74 -430 -529 -581 -124 324 482 354 405 -329 -639 -650 -376
5720 -376 77 292 475 521 417 -339 -290 -372 -216 -126 257 503 456 -114 -99 -107 -649 -510 112 482 722 620 29
5743 29 -71 -854 -418 -362 -340 209 381 495 214 -143 -818 -681 -84 -142 224 488 540 204 -363 -512 -500 -326
5765 -326 -138 558 903 259 213 -301 -369 -539 -374 106 85 597 321 404 -534 -613 -429 -139 260 561 551 440
5787 440 -148 -450 -757 -527 -172 167 666 633 55 144 -45 -611 -888 -490 162 429 669 245 -172 -698 -666
5808 -666 -464 -253 152 591 819 467 155 209 -347 -372 -248 357 498 864 412 284 -503 -580 -229 -338 236
5829 236 484 665 161 -92 -365 -644 -630 -268 83 752 721 245 12 -508 -443 -658 -390 67 417 843 440
5850 440 127 -164 -722 -463 -150 240 642 687 770 -306 -149 -507 -313 -87 325 540 513 495 170 -481 -598
5871 -598 -572 -92 196 461 945 524 121 -288 -591 -511 -218 227 462 403 275 13 -337 -940 -730 -165 324
5892 324 522 655 487 -269 -690 -552 -655 171 283 779 799 199 -11 -887 -735 -268 -195 500 501 335 383 -168
5914 -168 -350 -853 -312 221 104 640 609 406 -205 -558 -558 -505 -334 375 641 836 348 -55 -471 -663 -342
5935 -342 -36 50 589 618 317 -112 -508 -755 -260 -14 334 727 509 356 -40 -505 -783 -561 253 333 583
5956 583 508 125 -414 -479 -520 -550 -136 607 704 733 422 127 -392 -653 -461 -307 339 589 583 144 -295 -401 -623
5979 -623 -254 9 382 703 541 42 -230 -443 -619 -522 456 310 441 509 -135 -77 -464 -978 -281 -293 222
6000 222 859 478 270 -175 -540 -675 -233 262 549 716 407 -7 -325 -689 -623 -425 17 686 635 660 106
6021 106 -362 -864 -328 -393 219 405 692 313 247 -47 -933 -393 -182 94 333 539 454 364 -360 -358 -551 -201
6043 -201 -8 644 495 585 199 -165 -465 -429 -339 291 458 693 507 -57 -375 -575 -403 -371 4 543 938
6064 938 117 96 -275 -349 -463 -331 14 732 572 559 188 -469 -553 -563 -48 228 499 583 558 0 -153 -628
6086 -628 -700 -52 198 433 607 546 14 -245 -639 -504 -340 340 462 754 105 114 -830 -729 -371 -172 319
6107 319 461 688 403 -89 -524 -844 -229 -24 190 339 915 164 -142 -410 -620 -394 -363 243 536 402
6127 402 394 -87 -401 -522 -246 -128 319 691 471 531 -129 -509 -702 -191 -184 325 425 679 107 -39 -323 -850
6149 -850 -211 9 255 476 906 310 52 -582 -708 -623 -21 359 567 780 319 -222 -432 -729 -642 -363 335
6170 335 835 630 193 -243 -563 -702 -533 -184 338 778 658 386 -56 -532 -646 -705 -35 203 305 599
6190 599 224 -240 -646 -446 -340 -70 403 309 267 248 -383 -976 -299 -488 -12 491 659 465 203 -208 -462
6211 -462 -568 -549 -235 247 675 514 34 -378 -651 -528 -625 110 508 602 560 -21 -387 -707 -869 -134 191
6232 191 339 688 517 396 -328 -156 -643 -751 133 550 515 391 229 -246 -839 -676 -307 -16 373 524
6252 524 153 337 -177 -339 -586 -134 -20 729 571 532 -213 -609 -535 -407 -277 59 664 554 710 -17 -225
6273 -225 -557 -730 -522 -59 457 593 303 209 -465 -733 -475 -269 -108 587 734 495 -11 -518 -380 -766
6293 -766 -69 158 554 581 581 105 -674 -732 -419 -406 352 928 563 352 -178 -261 -751 -566 -158 444 573 847
6315 847 50 -85 -382 -819 -857 -341 425 628 435 539 -148 -568 -660 -501 -205 268 689 752 430 0 -478
6336 -478 -484 -566 -41 399 447 522 276 -44 -620 -626 -862 -16 519 743 594 400 348 -632 -431 -494 -102 423 887
6359 887 628 358 -331 -556 -713 -187 19 338 624 605 520 -311 -608 -566 -655 -120 102 539 650 379 -154
6380 -154 -623 -517 -383 -314 315 784 499 409 -376 -465 -596 -515 51 387 514 807 388 -379 -454 -804 -330 276
6402 276 647 557 215 292 -243 -594 -666 -329 -17 710 727 493 40 -150 -549 -610 -394 -160 366 698 598 431
6424 431 -233 -487 -870 -305 -207 661 650 184 -63 -132 -556 -896 -408 -282 548 574 550 -133 -36 -571 -780 -516
6446 -516 216 476 446 761 288 60 -546 -725 -592 -56 481 751 521 147 -303 -768 -541 -514 130 541 961
6467 961 547 154 -617 -532 -587 -350 295 132 622 243 308 -82 -850 -333 -361 -27 328 679 697 366 -387 -641
6489 -641 -466 -340 233 691 747 459 -67 -309 -711 -462 -233 241 670 315 446 328 -363 -583 -373 -227
6509 -227 40 612 825 709 383 -572 -885 -735 -207 48 348 1021 596 132 -124 -450 -514 50 69 374 523
6530 523 382 -171 -264 -777 -575 -303 251 442 734 479 48 -325 -570 -819 -352 440 772 550 419 147
6550 147 -459 -606 -500 177 384 838 765 319 86 -326 -620 -249 -222 139 394 691 118 -210 -528 -673 -528
6571 -528 -228 364 448 242 159 -50 -422 -899 -736 -436 329 391 633 652 -141 -280 -744 -640 -44 439 770
6592 770 667 364 -129 -568 -641 -689 134 370 806 795 246 -485 -576 -95 -415 134 481 625 747 207 -228
6613 -228 -460 -567 -301 22 400 613 530 184 -269 -700 -534 -381 -198 385 569 556 274 -24 -769 -592 -388
6634 -388 -7 294 509 526 423 -397 -428 -609 -276 67 216 742 602 83 -109 -606 -498 -283 -54 290 358
6655 358 823 397 -126 -466 -459 -305 -8 646 586 734 113 -179 -460 -409 -488 32 41 794 536 251 -272 -229 -668
6678 -668 -681 73 586 518 489 101 -402 -785 -817 -504 -77 550 975 492 351 -428 -479 -666 -110 314 733 772
6700 772 525 112 -446 -701 -462 -384 -47 532 518 442 245 -187 -473 -901 -330 185 225 614 473 21 -583
6721 -583 -589 -695 -477 -16 338 838 519 -103 -354 -420 -468 -304 27 604 421 449 208 -460 -488 -615 -214 337
6743 337 672 889 218 -1 -335 -743 -529 -211 189 365 554 262 -472 -601 -719 -504 -360 154 522 841
6763 841 168 165 -382 -773 -690 -12 214 802 674 495 -185 -497 -582 -954 -49 450 781 647 164 14 -364
6784 -364 -450 -692 -51 200 858 754 351 -26 -303 -830 -603 -57 689 604 516 195 63 -460 -549 -446 -179
6805 -179 57 579 947 485 31 -448 -545 -499 -101 262 475 253 165 39 -303 -627 -448 -89 196 516 1019
6826 1019 259 -190 -377 -537 -493 -59 228 641 661 470 -389 -444 -825 -526 -199 539 656 414 113 -163 -402
6847 -402 -891 -426 33 428 633 665 198 -47 -737 -703 -737 -123 387 445 581 10 -194 -613 -597 -455 52 287
6869 287 566 440 115 113 -411 -254 -523 52 421 656 510 135 -139 -448 -698 -251 -89 425 863 479 200
6890 200 -197 -475 -685 -214 226 314 617 602 165 -48 -419 -249 -526 -240 166 626 595 283 -173 -778 -454
6911 -454 -269 261 338 657 494 295 50 -797 -1059 -402 220 415 690 481 225 -133 -485 -572 -420 -160 374
6932 374 614 552 178 -58 -499 -518 -440 -107 794 473 610 500 -520 -675 -453 -426 79 224 346 841 452
6953 452 -553 -433 -593 -380 371 361 783 410 110 -60 -490 -737 -363 347 482 642 329 -73 -129 -311
6973 -311 -544 -579 92 413 763 526 -72 -335 -432 -309 -180 136 594 382 639 81 -392 -319 -578 -167 324
6994 324 566 779 582 234 -168 -563 -637 -340 295 256 697 335 65 -378 -487 -611 -242 -53 399 336 307
7015 307 261 -293 -636 -742 -248 286 394 612 591 167 -779 -650 -604 -25 387 459 598 269 -165 -588 -825
7036 -825 -276 -71 3 625 530 304 -178 -565 -651 -89 -238 7 417 521 209 186 -122 -800 -545 -136 210
7057 210 451 320 157 -453 -345 -577 -492 -51 115 332 511 214 2 -277 -665 -539 -136 123 410 361 449
7078 449 -14 -201 -660 -730 -178 445 410 699 113 122 -599 -351 -661 57 286 576 684 -34 -348 -701 -720 -579
7100 -579 -100 339 481 323 270 -51 -545 -403 -118 -144 198 546 461 29 -452 -645 -572 -385 -154 144 565
7121 565 511 371 139 -329 -661 -364 163 239 186 507 34 -370 -654 -288 -451 225 464 487 584 416 -169 -536
7143 -536 -447 -186 -145 334 451 355 98 -95 -364 -626 -473 78 -1 863 581 -38 -277 -522 -707 -338 45
7164 45 625 687 775 169 -329 -415 -655 -495 -94 145 562 406 123 -226 -537 -758 -527 200 408 598 617 -19
7186 -19 -501 -384 -228 -210 206 284 485 521 115 -47 -536 -662 -268 215 588 580 325 -165 -456 -604 -498 -109
7208 -109 14 480 537 270 -271 -124 -723 -526 -84 169 252 617 216 -218 -188 -734 -571 -266 -42 539 684
7229 684 602 -161 -444 -182 -244 -346 214 609 233 305 149 -221 -575 -554 -281 560 607 991 439 -80 -212 -621
7251 -621 -478 -174 117 678 655 444 -126 -570 -569 -550 -218 124 633 557 510 134 -423 -846 -558 -317 153 525
7273 525 203 163 -154 -261 -252 -521 -34 283 364 362 360 105 -469 -558 -200 -155 337 522 465 349 -122 -227 -644 -395
7297 -395 -87 -2 617 444 415 69 -371 -500 -140 -78 382 487 529 297 -232 -436 -693 -705 -12 83 584 353
7319 353 -10 -179 -494 -662 -442 -138 384 626 545 359 -350 -116 -526 -332 80 373 495 591 305 -187 -631
7340 -631 -598 -339 488 483 623 78 201 -282 -462 -615 -416 -136 120 683 589 379 -462 -609 -802 -356 68
7361 68 512 256 354 58 22 -400 -477 -503 -96 48 626 629 323 -294 -312 -732 -472 -189 236 758 627 129 -305
7384 -305 -483 -498 -395 366 604 477 121 -201 -306 -631 -505 -162 -60 330 501 598 -48 -224 -566 -439 -331
7405 -331 -42 293 480 461 -97 -38 -736 -287 -285 228 53 581 500 105 -413 -583 -477 -361 208 407 548 249
7427 249 46 27 -632 -374 -195 217 486 504 480 -36 -315 -739 -186 -341 311 816 621 465 -253 -258 -636 -609
7449 -609 -115 121 504 427 418 240 -285 -427 -308 -159 312 378 670 231 -223 -249 -554 -413 -145 203 449 492
7471 492 260 -37 -425 -301 -463 -260 545 190 831 600 -290 -424 -431 -360 -388 53 636 432 233 -276 -474
7492 -474 -456 -473 23 236 182 745 207 50 -120 -497 -1013 -236 241 473 585 243 -11 -342 -537 -328 -127
7513 -127 215 244 261 116 -4 -591 -502 -361 18 331 450 573 234 -8 -241 -708 -691 95 314 510 561 5
7535 5 93 -405 -552 -345 110 351 566 381 255 -34 -620 -615 -346 123 241 529 671 238 40 -242 -400 -329
7557 -329 155 258 515 534 394 318 -465 -382 -634 179 203 571 609 244 25 -394 -426 -362 -194 -80 258 851
7579 851 410 -362 -452 -610 -363 45 529 359 390 155 -85 -644 -379 -306 189 340 256 470 98 -313 -400 -626
7601 -626 -337 202 -156 602 460 144 -288 -514 -706 -256 -239 397 238 668 385 -345 -483 -379 -142 139
7621 139 494 526 533 121 -232 -544 -479 -300 369 407 558 374 183 -195 -379 -376 -531 68 431 906 376 153
7643 153 -125 -574 -540 -202 12 461 666 473 -116 -176 -627 -396 -485 278 275 662 367 48 -536 -473 -727 -501
7665 -501 164 185 791 421 111 -255 -354 -409 -263 119 392 613 594 -146 -295 -363 -304 33 321 742 610 498
7687 498 364 -463 -681 -529 -228 274 503 564 123 174 -383 -378 -681 -150 287 658 130 332 246 -81 19 -175
7709 -175 -166 332 378 612 157 76 -473 -679 -335 -255 565 589 508 55 85 -241 -596 -627 48 173 709 570 380
7732 380 111 82 -302 -266 -64 199 450 684 293 85 -204 -118 -462 191 365 224 286 27 42 -388 -539 -250
7754 -250 93 39 355 523 278 -253 -261 -349 -246 -170 163 659 514 113 -260 -643 -437 -429 -50 330 389 570 408
7777 408 -143 -675 -568 -235 -48 367 -35 282 51 14 -553 -664 -159 130 87 551 554 205 -515 -415 -177
7798 -177 -291 -130 35 214 333 124 -259 -233 -468 -180 117 287 531 214 233 30 -255 -334 -540 -37 240
7819 240 432 373 431 -338 -699 -596 -349 -95 334 366 742 351 -342 -289 -532 20 -9 450 777 654 279 -84
7841 -84 -590 -699 -389 -43 566 438 350 217 -159 -619 -696 -158 149 391 412 319 -2 -219 -586 -394 -10 90
7863 90 280 222 414 -2 -244 -524 -476 -509 250 319 444 299 154 -179 -355 -637 -422 187 366 534 434 104
7885 104 -531 -606 -549 -139 132 400 644 420 268 -591 -238 -416 -19 100 152 615 97 81 -556 -323 -419 -194
7907 -194 -83 350 376 338 -119 -380 -651 -383 -287 287 561 307 222 -149 -392 -622 -212 -59 219 299 438 252
7929 252 -15 -506 -182 -3 34 171 525 358 370 -128 -324 -462 -382 -256 -218 707 389 305 -152 -191 -69 -408
7951 -408 125 504 704 625 173 296 -461 -284 -358 64 311 477 598 158 157 -304 -444 -712 -244 110 498
7972 498 493 249 -130 -480 -573 -634 15 318 534 277 212 -19 -706 -613 -369 162 278 439 476 315 -278 -382
7994 -382 -441 -327 34 154 610 429 289 -251 -199 -290 -108 313 308 586 303 101 -348 -417 -316 -337 45 167
8016 167 532 441 257 -308 -258 -470 -683 -83 406 608 500 506 -79 -248 -220 -186 -158 164 359 212 44 -378
8038 -378 -471 -410 -519 87 330 640 514 272 -491 -312 -329 -225 224 93 609 407 126 -114 -392 -338 -370 -86
8060 -86 264 619 558 -7 -221 -404 -380 -471 89 108 525 531 -122 -328 -561 -328 12 165 547 447 706 24
8082 24 -256 -502 -530 -199 -146 298 557 314 116 -74 -355 -367 -234 337 137 400 398 -34 -593 -508 -249 -153 -63
8105 -63 282 513 521 82 -12 -527 -633 -24 209 583 489 354 -127 -209 -455 -277 -418 117 476 441 243 -162
8127 -162 -1 -285 -474 -109 76 717 321 440 127 -505 -285 -434 -121 394 269 600 315 81 -342 -767
8147 -767 -265 -172 150 344 612 64 326 -91 -325 -407 -316 112 732 713 333 -161 -494 -506 -285 -158 35 336
8169 336 505 411 163 -478 -511 -409 -232 -50 493 485 216 -76 -159 -212 -304 -127 45 479 471 -5 51 -61
8191f1
##END NTUPLES=NMR FID
##END=
