##TITLE=1H_SA_37.139
 D2O, 8 sc, 
 18.11.2019
##JCAMPDX= 6.0         $$ Bruker NMR JCAMP-DX V2.0
##DATA TYPE= NMR FID
##DATA CLASS= NTUPLES
##ORIGIN= UXNMR, Bruker Analytische Messtechnik GmbH
##OWNER= root
$$ XWIN-NMR		Version 3.5
$$ Mon Nov 18 16:13:31 2019 Russian Standard Time (UT+4h)  she@DPX200
##.OBSERVE FREQUENCY= 200.1315
##.OBSERVE NUCLEUS= ^1H
##.DELAY= (6, 6)
##.ACQUISITION MODE= SIMULTANEOUS
##.ACQUISITION SCHEME= undefined
##.AVERAGES= 8
##.DIGITISER RES= 18
##SPECTROMETER/DATA SYSTEM= spect
##.PULSE SEQUENCE= zg30
##.SOLVENT NAME= D2O
##.SHIFT REFERENCE= (INTERNAL, D2O, 0, 15.7039)
##AUDIT TRAIL= $$ (NUMBER, WHEN, WHO, WHERE, WHAT)
$$ ##TITLE= Audit trail, XWIN-NMR		Version 3.5
$$ ##JCAMPDX= 5.01
$$ ##ORIGIN= Bruker BioSpin GmbH
$$ ##OWNER= she
$$ F:/spectra/data/she/nmr/H-F/1/audita.txt
$$ ##AUDIT TRAIL=  $$ (NUMBER, WHEN, WHO, WHERE, WHAT)
(   1,<2019-11-18 16:10:25.92 +0400>,<she>,<DPX200>,
      <created by zg, POWCHK disabled, PULCHK disabled
       configuration hash MD5:
       00 E9 B6 7A A2 85 ED C7 34 08 36 98 17 FE 4E 26
       data hash MD5: 16K
       38 CC C1 49 AF 8E D1 C7 64 75 DD 42 92 76 5D 32>)
$$ ##END=
$$ 
$$ hash MD5
$$ 6D EF 4A 59 13 4E CD 8C EC 1E E9 F4 CD A1 42 4E
##$RELAX= 
##$RELAX= 
##$RELAX= 
##$RELAX= 
##$RELAX= 
##$RELAX= 
$$ Bruker specific parameters
$$ --------------------------
##$DU= <F:/spectra>
##$EXPNO= 1
##$NAME= <H-F>
##$PROCNO= 1
##$TYPE= <nmr>
##$USER= <she>
##$AMP= (0..31)
100 100 100 100 100 100 100 100 100 100 100 100 100 100 100 100 100 100 
100 100 100 100 100 100 100 100 100 100 100 100 100 100 
##$AQSEQ= 0
##$AQ_mod= 1
##$AUNM= <au_zg>
##$AUTOPOS= <>
##$BF1= 200.13
##$BF2= 200.13
##$BF3= 200.13
##$BF4= 200.13
##$BF5= 200.13
##$BF6= 200.13
##$BF7= 200.13
##$BF8= 200.13
##$BYTORDA= 1
##$CFDGTYP= 0
##$CFRGTYP= 5
##$CHEMSTR= <none>
##$CNST= (0..31)
1 1 145 1 1 1 1 1 1 1 1 1 1 1 1 1 1 1 1 1 1 1 1 1 1 1 1 1 1 1 1 1 
##$CPDPRG= <>
##$CPDPRG1= <>
##$CPDPRG2= <>
##$CPDPRG3= <>
##$CPDPRG4= <mlev>
##$CPDPRG5= <mlev>
##$CPDPRG6= <mlev>
##$CPDPRG7= <mlev>
##$CPDPRG8= <mlev>
##$CPDPRGB= <>
##$CPDPRGT= <>
##$D= (0..31)
0 1.2 0 0 0 0 0 0 0 0.06 0 0.03 0 0 0 0 0.0002 0 0 0 0 0 0 0 0 0 0 0 0 
0 0 0 
##$DATE= 1574079025
##$DBL= (0..7)
120 120 120 120 120 120 120 120 
##$DBP= (0..7)
150 150 150 150 150 150 150 150 
##$DBP07= 0
##$DBPNAM0= <>
##$DBPNAM1= <>
##$DBPNAM2= <>
##$DBPNAM3= <>
##$DBPNAM4= <>
##$DBPNAM5= <>
##$DBPNAM6= <>
##$DBPNAM7= <>
##$DBPOAL= (0..7)
0.5 0.5 0.5 0.5 0.5 0.5 0.5 0.5 
##$DBPOFFS= (0..7)
0 0 0 0 0 0 0 0 
##$DE= 6
##$DECBNUC= <off>
##$DECIM= 24
##$DECNUC= <off>
##$DECSTAT= 4
##$DIGMOD= 1
##$DIGTYP= 9
##$DL= (0..7)
0 120 120 120 120 120 120 120 
##$DP= (0..7)
150 150 150 150 150 150 150 150 
##$DP07= 0
##$DPNAME0= <>
##$DPNAME1= <>
##$DPNAME2= <>
##$DPNAME3= <>
##$DPNAME4= <>
##$DPNAME5= <>
##$DPNAME6= <>
##$DPNAME7= <>
##$DPOAL= (0..7)
0.5 0.5 0.5 0.5 0.5 0.5 0.5 0.5 
##$DPOFFS= (0..7)
0 0 0 0 0 0 0 0 
##$DQDMODE= 0
##$DR= 18
##$DS= 0
##$DSLIST= <SSSSSSSSSSSSSSS>
##$DSPFIRM= 0
$$ [...]
##$SUBNAM2= <"">
##$SUBNAM3= <"">
##$SUBNAM4= <"">
##$SUBNAM5= <"">
##$SUBNAM6= <"">
##$SUBNAM7= <"">
##$SUBNAM8= <"">
##$SUBNAM9= <"">
##$SW= 24.9337058887773
##$SWIBOX= (0..15)
0 0 2 0 0 0 0 0 0 0 0 0 0 0 0 0 
##$SW_h= 4990.01996007984
##$TD= 16384
##$TD0= 1
##$TE= 0
##$TE2= 300
##$TE3= 300
##$TEG= 300
##$TL= (0..7)
0 120 120 120 120 120 120 120 
##$TP= (0..7)
150 150 150 150 150 150 150 150 
##$TP07= 0
##$TPNAME0= <>
##$TPNAME1= <>
##$TPNAME2= <>
##$TPNAME3= <>
##$TPNAME4= <>
##$TPNAME5= <>
##$TPNAME6= <>
##$TPNAME7= <>
##$TPOAL= (0..7)
0.5 0.5 0.5 0.5 0.5 0.5 0.5 0.5 
##$TPOFFS= (0..7)
0 0 0 0 0 0 0 0 
##$TUNHIN= 0
##$TUNHOUT= 0
##$TUNXOUT= 0
##$USERA1= <user>
##$USERA2= <user>
##$USERA3= <user>
##$USERA4= <user>
##$USERA5= <user>
##$V9= 5
##$VALIST= <valist>
##$VCLIST= <CCCCCCCCCCCCCCC>
##$VD= 0
##$VDLIST= <DDDDDDDDDDDDDDD>
##$VPLIST= <PPPPPPPPPPPPPPP>
##$VTLIST= <TTTTTTTTTTTTTTT>
##$WBST= 1024
##$WBSW= 4
##$XGAIN= (0..3)
0 0 0 0 
##$XL= 0
##$YL= 0
##$YMAX_a= 305166
##$YMIN_a= -254075
##$ZGOPTNS= <>
##$ZL1= 120
##$ZL2= 120
##$ZL3= 120
##$ZL4= 120
##$ABSF1= 10
##$ABSF2= 0
##$ABSG= 5
##$ABSL= 3
##$ALPHA= 0
##$AQORDER= 0
##$ASSFAC= 0
##$ASSFACI= 0
##$ASSFACX= 0
##$ASSWID= 0
##$AUNMP= <proc_1d>
##$AZFE= 0.1
##$AZFW= 0.1
##$BCFW= 1
##$BC_mod= 2
##$BYTORDP= 1
##$COROFFS= 0
##$CY= 11.3945322036743
##$DATMOD= 1
##$DC= 2
##$DFILT= <>
##$DTYPP= 0
##$F1P= 16.9975609425685
##$F2P= -3.02152046262296
##$FCOR= 0.5
##$FTSIZE= 0
##$FT_mod= 4
##$GAMMA= 1
##$GB= 0.15
##$INTBC= 1
##$INTSCL= 1
##$ISEN= 128
##$LB= 0.24
##$LEV0= 0
##$LPBIN= 0
##$MAXI= 10000
##$MC2= 0
##$MEAN= 0
##$ME_mod= 0
##$MI= 1.114404
##$NCOEF= 0
##$NC_proc= 0
##$NLEV= 6
##$NOISF1= 3.799351
##$NOISF2= 2.8
##$NSP= 1
##$NTH_PI= 0
##$NZP= 0
##$OFFSET= 15.70392
##$PC= 1
##$PHC0= -9789.518
##$PHC1= 11.80087
##$PH_mod= 1
##$PKNL= yes
##$PPARMOD= 0
##$PSCAL= 0
##$PSIGN= 0
##$REVERSE= no
##$SF= 200.130013532006
##$SI= 16384
##$SIGF1= 3
##$SIGF2= 2
##$SINO= 400
##$SIOLD= 16384
##$SREGLST= <1H.CDCl3>
##$SSB= 0
##$STSI= 0
##$STSR= 0
##$SW_p= 3612.71676300578
##$SYMM= 0
##$S_DEV= 0
##$TDeff= 0
##$TDoff= 0
##$TI= <>
##$TILT= no
##$TM1= 0
##$TM2= 0
##$TOPLEV= 0
##$USERP1= <user>
##$USERP2= <user>
##$USERP3= <user>
##$USERP4= <user>
##$USERP5= <user>
##$WDW= 1
##$XDIM= 8192
##$YMAX_p= 0
##$YMIN_p= 0
$$ End of Bruker specific parameters
$$ ---------------------------------
##NTUPLES= NMR FID
##VAR_NAME=  TIME,          FID/REAL,        FID/IMAG
##SYMBOL=    X,             R,               I
##VAR_TYPE=  INDEPENDENT,   DEPENDENT,       DEPENDENT
##VAR_FORM=  AFFN,          ASDF,            ASDF
##VAR_DIM=   8192,          8192,            8192
##UNITS=     SECONDS,       ARBITRARY UNITS, ARBITRARY UNITS
##FACTOR=    0.0002004,     1,               1
##FIRST=     0,             0,               0
##LAST=      1.6414764,     0,               0
##MIN=       0,             -254075,         0
##MAX=       1.6414764,     305166,          0
$$ Real data points
##PAGE= N=1
##DATA TABLE= (X++(R..R)), XYDATA
$$ plain form
0 0 0 0 0 0 0 0 0 1 -8 8 -8 8 -16 16 -17 24 -25 33 -39 45 -53 62 -72 84 -94 110 -125 143 -161 183 -208 233
32 233 -260 293 -325 363 -403 448 -499 552 -611 678 -749 830 -920 1021 -1133 1259 -1409
49 -1409 1577 -1775 2013 -2300 2661 -3124 3749 -4643 6026 -8495 14249 -58826 36065 122144
63 122144 -5287 -6875 10541 -105110 -254075 -200254 -81562 -45947 -13314 101474 121122
74 121122 -17420 -155022 -164052 -123196 -75786 -3157 75928 101928 80614 17058 -82101 -162849
86 -162849 -156658 -80799 16467 101065 127821 68747 -14540 -63149 -97314 -118758 -64356 49119
98 49119 121711 137887 133232 57299 -90832 -154110 -66201 10902 2426 47236 150123 115224
110 115224 -52084 -129861 -103768 -132411 -153314 -12737 144199 97249 -35861 -50957 -39796
$$ packed form
0@%%%%%%%JrJ6j6J6k4L2l3M1m9N8p2Q4r8J15j34J56j78K04k35K68l04L44l91M41
32B33m93N53o18O88p66Q51r47J051j163J289j427J579j750J941k154K392k668
49a409K986l352L788m313M961n785O873q392J0669j4521K2744p3075R4891Q6079
63A22144j27431j588J7416j15651j48965N3821J18692L5615L2633J14788J9648
74A21122j38542j37602r030M0856M7410P2629P9085K6000k1314o3556r9159q0748
86a62849O191P5859R7266Q4598K6756n9074q3287m8609l4165k1444N4402J13475
98D9119P2592J6176m655p5933j48131o3278Q7909P7103q476M4810J02887l4899
110A15224j67308p7777K6093k8643k0903J40577J56936m6950j33110j5096J1161
$$ plain form
121 -39796 -133120 -190336 -82377 53925 85969 80720 81160 11667 -110105 -155033 -97511 -23873
133 -23873 27998 74524 99900 78395 12478 -78013 -142778 -120761 -26427 58196 101210 116737
145 116737 82174 -6297 -76057 -86118 -78737 -54522 34051 132529 130888 52071 -13542 -71780
157 -71780 -136789 -124379 -20024 49449 43523 60250 85109 -1122 -143088 -166441 -87047 -40811
169 -40811 -8941 78037 121462 31724 -74300 -88549 -86156 -118340 -87059 34987 118864 94244
181 94244 31529 -22733 -83113 -122004 -92327 -17869 50185 93986 104135 67441 -219 -68232
193 -68232 -111174 -95202 -10677 78461 103732 82600 53734 -3896 -87336 -122592 -85062 -30500
205 -30500 19789 83995 109263 38221 -62801 -102647 -103123 -100499 -52230 41997 90058 62020
$$ packed form
121c9796r3324n7216J07959J36302L2044n249M40o9493j21772m4928N7522P3638
133b3873N1871M6526K5376k1505o5917r0491o4765K2017R4334Q4623M3014J5527
145A16737l4563q8471o9760j0061P381K4215Q8573R8478j641p8817o5613n8238
157g1780o5009J2410J04355O9473n926J6727K4859q6231j41966k3353P9394M6236
169d0811L1870Q6978M3425q9738j06024j4249K393l2184L1281J22046Q3877k4620
181I4244o2715n4262o0380l8891K9677P4458O8054M3801J0149l6694o7660o8013
193f8232m2942J5972Q4525Q9138K5271k1132k8866n7630q3440l5256L7530N4562
205c0500N0289O4206K5268p1042j01022l9846m76K624M8269R4227M8061k8038
$$ plain form
217 62020 24862 -12609 -92572 -154824 -109118 -8162 41724 53484 70539 46582 -42695 -114674
229 -114674 -111164 -77645 -39685 30923 105110 107406 39159 -31244 -70673 -83986 -60434 1636
241 1636 68685 110264 112318 66811 -9179 -68693 -84799 -62521 -4219 71871 111313 86209
253 86209 33303 -14622 -67741 -107076 -79378 475 63374 86583 89890 53516 -30173 -95458
265 -95458 -89555 -49715 -11722 43142 100611 95532 25394 -40648 -78410 -101851 -86958 -12440
277 -12440 65544 83952 60936 28411 -24473 -87667 -106101 -60839 5336 59834 96564 95522
289 95522 42803 -28712 -73945 -78426 -48463 8523 68456 99483 87537 38902 -30093 -83914
301 -83914 -90378 -53120 1554 57070 94242 81753 23232 -37811 -73813 -86390 -63385 3399
$$ packed form
217F2020l7158l7471p9963o2252M5706J00956M9886J1760J7055k3957q9277p1979
229a14674L510L3519L7960P0608P4187K296o8247p0403l9429j3313K3552O2070
241A636O7049M1579K054m5507p5990n9514j6106K2278N8302P6090L9442k5104
253H6209n2906m7925n3119l9335K7698P9853O2899K3209L307l6374q3689o5285
265i5458N903L9840L7993N4864N7469n079p0138o6042l7762k3441J4893P4518
277a2440P7984J8408k3016l2525n2884o3194j8434M5262O6175N4498L6730j042
289I5522n2719p1515m5233m481K9963N6986N9933L1027j1946m8635o8995n3821
301h3914o464L7258N4674N5516L7172j2489n8521o1043l6002j2577K3005O6784
$$ plain form
313 3399 73225 94622 70504 28822 -26946 -84129 -97118 -50815 10509 53674 80403 77890
325 77890 25440 -48787 -89610 -84281 -54039 -2475 60824 94875 73321 18942 -33734 -73135
337 -73135 -84596 -49692 15448 70876 90420 74071 26731 -35553 -80029 -83263 -47290 11060
349 11060 64556 87250 67934 18266 -39520 -81455 -85115 -45040 14304 63083 85585 72147
361 72147 20079 -44414 -81465 -77392 -43552 8501 63996 88140 63223 9300 -42878 -79459
373 -79459 -86729 -49955 14761 65589 79075 59905 15344 -42669 -83444 -79534 -37903 16300
385 16300 63500 86562 67198 12786 -45182 -77688 -75240 -39334 17005 66113 82815 60314
397 60314 10648 -44620 -80122 -77056 -37804 18590 66306 82821 59416 8719 -43761 -76356
$$ packed form
313C399O9826K1397k4118m1682n5768n7183j2989M6303O1324M3165K6729k513
325G7890n2450p4227m0823N329L0242N1564O3299L4051k1554n4379n2676l9401
337g3135j1461L4904O5140N5428J9544j6349m7340o2284m4476l234L5973N8350
349A1060N3496K2694j9316m9668n7786m1935l660M0075N9344M8779K2502j3438
361G2147n2068o4493l7051M073L3840N2053N5495K4144k4917n3923n2178l6581
373g9459p270L6774O4716N0828J3486j9170m4561n8013m0775L910M1631N4203
385A6300M7200K3062j9364n4412n7968l2506K448L5906N6339M9108J6702k2501
397F0314m9666n5268l5502L066L9252N6394M7716J6515k3405n0697n2480l2595
$$ plain form
409 -76356 -74490 -36093 21847 68293 80958 57801 8767 -46222 -80618 -73252 -32240 20324
421 20324 63220 79558 56812 3492 -50344 -78144 -72271 -35081 20807 67001 77933 51724
433 51724 3103 -47254 -78414 -72502 -30031 24684 66186 77781 53818 2818 -48890 -76042
445 -76042 -67241 -27374 26362 69617 79325 51830 2317 -47508 -74984 -65566 -23754 28699 68289
458 68289 78088 52771 1391 -49608 -74542 -63156 -23506 29307 70280 76987 47953 -77
470 -77 -46878 -73701 -65031 -21935 31540 68510 74483 46686 -4100 -53778 -75256 -61832 -22794
483 -22794 26663 65730 73316 43042 -6908 -52825 -75331 -62762 -17987 34742 68383 71302
495 71302 45342 -1368 -48959 -70308 -55665 -13868 36306 74246 77461 43771 -7087 -48217
$$ packed form
409g6356J866L8397N7940M6446J2665k3157m9034n4989l4396P366M1012N2564
421B0324M2896J6338k2746n3320n3836k7800N873L7190N5888M6194J0932k6209
433E1724m8621n0357l1160N912M2471N4715M1502J1595k3963n1000n1708k7152
445g6042Q801L9867N3736M3255R708k7495m9513m9825k7476R418M1812N2453L9590
458F8289R799k5317n1380n0999k4934J1386L9650N2813M0973O707k9034m8030
470g7m6801k6823Q670M3096N3475L6970N973k7797n0786m9678k1478J3424L9038
483b2794M9457L9067P586l0274m9950m5917k2506J2569M4775N2729L3641K919
495G1302k5960m6710m7591k1349J4643M1797N0174L7940L215l3690n0858m1130
$$ plain form
507 -48217 -66280 -54715 -14190 36686 70436 72182 43861 -5300 -54250 -73927 -52844 -8173
519 -8173 36061 66303 69764 39457 -10373 -52460 -69944 -57843 -16556 36663 70867 66326 30738
532 30738 -15353 -55102 -71440 -54894 -13564 32092 64673 69123 37017 -15296 -57367 -69012
544 -69012 -49150 -5991 42613 70293 65847 37211 -3339 -45302 -66796 -47484 1340 49042
556 49042 75342 73474 39330 -11650 -48408 -55749 -40122 -6342 40057 74150 69995 31743 -15969
569 -15969 -55555 -71178 -49630 -613 40922 57995 55378 31523 -15071 -59994 -72009 -47241
581 -47241 -4931 40137 70193 63116 22135 -23060 -51727 -59946 -45763 -6930 39333 67919
593 67919 64642 30059 -21173 -59284 -62590 -34469 5898 45992 71924 67024 34261 -5554 -37757
$$ packed form
507d8217j8063J1565M0525N0876L3750J746k8321m9161m8950j9677K1083M4671
519h173M4234L0242L461l0307m9830m2087j7484J2101M1287N3219L4204m541l5588
532C0738m6091l9749j6338J6546M1330M5656L2581M450l2106n2313m2071j1645
544f9012J9862M3159M8604K7680m446k8636m0550m1963k1494J9312M8824M7702
556D9042K6300j868l4144n0980l6758p341J5627L3780M6399L4093m155l8252m7712
569a5969l9586j5623K1548M9017M1535J7073k617k3855m6594m4923j2015K4768
581d7241M2310M5068L0056p077m0981m5195k8667q219J4183L8833M6263K8586
593F7919l277l4583n1232l8111l306K8121M0367M0094K5932m900l2763l9815l2203
$$ plain form
606 -37757 -54051 -36342 15469 66137 81234 64985 33715 -8061 -45877 -54903 -32451 1867
618 1867 37713 66636 63815 18850 -34993 -64464 -65806 -45368 -4053 39555 55047 42290 17569
631 17569 -18516 -61114 -76794 -45570 5698 41954 56817 48120 11629 -35162 -63172 -63593 -46104
644 -46104 -12132 31695 58862 48499 9290 -36229 -66425 -64828 -32287 9069 40282 59562
656 59562 59248 26849 -20493 -51022 -52883 -31745 9647 56780 72597 45615 5256 -25898 -51741
669 -51741 -65673 -46301 -2003 35239 50879 43222 6482 -44996 -73718 -62864 -33527 -583
681 -583 34944 56573 43663 7797 -27359 -56160 -68281 -41991 13565 51136 51765 33055 6304
694 6304 -31587 -62926 -62051 -34705 807 38092 62594 50577 6692 -35587 -54795 -49392 -20856
$$ packed form
606c7757j6294J7709N1811N0668J5097j6249l1270m1776l7816r026K2452L4318
618A867L5846K8923k821m4965n3843k9471j342K0438M1315M3608J5492j2757k4721
631A7569l6085m2598j5680L1224N1268L6256J4863q697l6491m6791k8010m21J7489
644d6104L3972M3827K7167j0363l9209m5519l0196J597L2541M1356L1213J9280
656E9562l14l2399m7342l0529j861K1138M1392M7133J5817k6982m0359l1154k5843
669e1741j3932J9372M4298L7242J5640p657l6740n1478k8722J0854K9337L2944
681e83L5527K1629j2910l5866l5156k8801j2121K6290N5556L7571O29j8710k6751
694F304l7891l1339Q75K7346L5512L7285K4502j2017m3885m2279j9208N403K8536
$$ plain form
707 -20856 20798 51144 59170 50753 23993 -22612 -59891 -55286 -20848 14644 43485 57684 39264
720 39264 -5877 -42875 -56638 -59086 -45097 -3059 41967 53244 30055 -5946 -43723 -68452
732 -68452 -60238 -25847 8635 32558 48006 40169 1298 -42004 -62589 -58750 -34384 10707 50515
745 50515 53453 25603 -3269 -28886 -54289 -57560 -25654 18495 48350 59364 45940 5557
757 5557 -38021 -53302 -40924 -16892 16015 48342 56550 35997 3420 -32435 -62598 -62763 -23643
770 -23643 20752 40085 39902 27006 -5728 -48009 -66553 -55542 -33168 -1919 34801 49291
782 49291 22537 -21889 -52303 -65991 -61590 -32539 7236 32887 36811 25028 -6361 -48231
794 -48231 -68742 -53089 -19913 14756 44482 53296 29118 -7485 -33067 -46842 -47417 -21362 23844
$$ packed form
707b0856M1654L0346Q026q417k6760m6605l7279M605L4438L5492K8841J4199j8420
720C9264m5141l6998j3763k448J3989M2038M5026J1277k3189l6001l7777k4729
732f8452Q214L4391L4482K3923J5448p837l8871m3302k0585L839K4366M5091L9808
745E0515K938k7850k8872k5617k5403l271L1906M4149K9855J1014j3424m0383
757E557m3578j5281J2378K4032L2907L2327Q208k0553l2577l5855l0163j65L9120
770b3643M4395J9333j83j2896l2734m2281j8544J1011K2374L1249L6720J4490
782D9291k6754m4426l0414j3688M401K9051L9775K5651L924j1783l1389m1870
794d8231k0511J5653L3176L4669K9726Q814k4178l6603k5582j3775n75K6055M5206
$$ plain form
807 23844 54975 54020 32443 -1072 -37744 -54893 -39662 -8873 19974 45330 56318 36354
819 36354 -3826 -36089 -49448 -43888 -15097 28912 54409 46611 24382 -2029 -35461 -59230
831 -59230 -49256 -13977 18382 39507 46584 26144 -16701 -49885 -55291 -42520 -18379 17451 47408
844 47408 48720 25475 -5325 -35699 -53786 -41466 -3926 31386 48981 49763 30730 -6694 -39888
857 -39888 -49078 -37519 -12524 22821 51211 49255 20867 -11868 -38460 -51986 -40235 -5639
869 -5639 28322 46278 47993 29654 -8351 -43176 -50503 -34077 -7644 23998 48495 45795 16038
882 16038 -16460 -40477 -54349 -46606 -11969 26299 43149 39003 20272 -11978 -44691 -52496 -32033
895 -32033 -2061 26995 49772 51400 24749 -12147 -36725 -44371 -33477 -2905 32951 50032
$$ packed form
807B3844L1131r55k1577l3515l6672j7149J5231L0789K8847K5356J0988j9964
819C6354m0180l2263j3359N560K8791M4009K5497p798k2229k6411l3432k3769
831e9230R974L5279L2359K1125P077k0440m2845l3184n406J2771K4141L5830K9957
844D7408J312k3245l0800l0374j8087J2320L7540L5312J7595P82j9033l7424l3194
857c9888r190J1559K4995L5345K8390j956k8388l2735k6592j3526J1751L4596
869e639L3961J7956J715j8339l8005l4825p327J6426K6433L1642K4497k700k9757
882A6038l2498k4017j3872P743L4637L8268J6850m146j8731l2250l2713p805K0463
895c2033K9972K9056K2777J628k6651l6896k4578p646J0894L0572L5856J7081
$$ plain form
907 50032 42594 20027 -11375 -41542 -50990 -32873 -1507 28246 47737 46013 19149 -16252 -39492
920 -39492 -44571 -31907 -1032 33546 49545 40623 16691 -13946 -43101 -52056 -32663 -963 26423
933 26423 42686 40856 14156 -22560 -45377 -46488 -31077 -2699 31603 49628 40671 15162 -13402
946 -13402 -37912 -46368 -28026 6653 35025 47202 42402 18020 -16815 -41800 -43623 -26053 1671
959 1671 32193 49789 41486 13792 -17131 -38744 -43208 -25377 7010 35658 47642 41568 17309
972 17309 -16667 -41572 -43377 -24980 3703 32684 47198 36999 8677 -20998 -40943 -45937
984 -45937 -29074 4033 33815 45110 36149 12097 -19814 -43058 -42509 -20725 7610 32934 46689
997 46689 38589 10304 -21629 -41739 -43069 -24927 6353 35008 44329 32182 7062 -21984 -42465
$$ packed form
907E0032p438k2567l1402l0167r448J8117L1366K9753J9491j724k6864l5401k3240
920c9492n079J2664L0875L4578J5999q922k3932l0637k9155q955J9393L1700K7386
933B6423J6263j830k6700l6716k2817j111J5411K8378L4302J8025q957k5509k8564
946a3402k4510q456J8342L4679K8372J2177m800k4382l4835k4985j823J7570K7724
959A671L0522J7596q303k7694l0923k1613m464J7831L2387K8648J1984o074k4259
972A7309l3976k4905j805J8397K8683K8981J4514j0199k8322k9675j9945m994
984d5937J6863L3107K9782J1295q961k4052l1911k3244N49K1784K8335K5324J3755
997D6689q100k8285l1933k0110j330J8142L1280K8655R321j2147k5120k9046k0481
$$ plain form
1010 -42465 -43432 -22914 7406 34722 46461 36245 7602 -23175 -41027 -39564 -20293 8946
1022 8946 35170 44042 32329 6848 -23133 -44364 -43964 -21363 9394 33462 42348 31653 4455
1035 4455 -24849 -41462 -39188 -20484 8976 37122 46636 32010 3757 -23511 -41062 -39572 -18516
1048 -18516 11603 34394 40867 30340 4210 -26664 -44660 -40710 -18232 10850 34458 42009
1060 42009 29243 2145 -25035 -41052 -38261 -17450 12812 36655 43080 29485 1648 -26929
1072 -26929 -42010 -36982 -16350 11811 35105 42032 27977 392 -26392 -41476 -37676 -14735
1084 -14735 15959 37852 41359 27786 2855 -25697 -41178 -35214 -12566 14699 35798 42042
1096 42042 27067 -2285 -28932 -40710 -35362 -15142 13573 36545 40303 24929 -1958 -27516
$$ packed form
1010d2465r67K0518L0320K7316J1739j0216k8643l0777j7852J463J9271K9239
1022H946K6224Q872j1713k5481k9981k1231M00K2601L0757K4068Q886j0695k7198
1035D455k9304j6613K274J8704K9460K8146R514j4626k8253k7268j7551J490K1056
1048a8516L0119K2791O473j0527k6130l0874j7996L950K2478K9082K3608P551
1060D2009j2766k7098k7180j6017K791K0811L0262K3843O425j3595k7837k8577
1072b6929j5081N028K0632K8161K3294O927j4055k7585k6784j5084L800K2941
1084a4735L0694K1893L507j3573k4931k8552j5481N964K2648K7265K1099O244
1096D2042j4975k9352k6647j1778N348K0220K8715K2972L758j5374k6887k5558
$$ plain form
1108 -27516 -41037 -35375 -12223 16722 36500 39898 24882 -1662 -27639 -41050 -34886 -12059
1120 -12059 16681 36574 38645 23257 -3072 -28657 -41328 -33389 -9756 17145 36679 40973
1132 40973 24929 -3118 -28051 -37763 -30334 -8666 18950 39604 40490 22869 -3009 -27052 -39696
1145 -39696 -33122 -8051 19442 35998 36579 21926 -4419 -29748 -40743 -30746 -7734 18457 37437
1158 37437 39203 21886 -5914 -28693 -37348 -28924 -7093 19296 37768 38505 21084 -6431 -30093
1171 -30093 -38592 -29656 -6982 19848 37452 35946 18665 -5909 -27912 -38583 -29667 -4549 23242
1184 23242 38074 36728 20738 -5594 -29515 -36822 -25533 -4395 19304 37222 38656 18817
1196 18817 -9947 -31183 -37221 -28521 -5675 20951 36805 32936 16076 -7400 -29581 -39002 -28588
$$ packed form
1108b7516j3521N662K3152K8945J9778L398j5016k6544k5977j3411O164K2827
1120a2059K8740J9893K071j5388k6329k5585j2671P939K3633K6901J9534M294
1132D0973j6044k8047k4933r712P429K1668K7616K0654Q86j7621k5878k4043j2644
1145c9696O574K5071K7493J6556N81j4653k6345k5329j0995R997K3012K6191J8980
1158C7437J766j7317k7800k2779q655Q424K1831K6389J8472P37j7421k7515k3662
1171c0093q499Q936K2674K6830J7604j506j7281k4574k2003j0671Q916K5118K7791
1184B3242J4832j346j5990k6332k3921p307J1289K1138K3699J7918J434j9839
1196A8817k8764k1236o038Q700K2846K6626J5854l869j6860k3476k2181r421J0414
$$ plain form
1209 -28588 -2660 23161 37500 35043 16948 -8478 -28990 -35373 -25284 -2860 21957 37172
1221 37172 35870 17675 -9917 -32527 -37523 -23901 -1703 20255 35105 33967 15101 -10704
1233 -10704 -30148 -36335 -27580 -2913 24879 38435 31092 12024 -9494 -29184 -37419 -25781 -756
1246 -756 21328 33745 32702 15040 -13848 -35629 -36831 -23033 -2163 19573 34228 31176 12475
1259 12475 -12078 -31127 -37248 -24984 418 25729 37310 31167 12061 -11617 -28362 -32436
1271 -32436 -22440 -376 24161 37815 32177 11364 -12963 -32591 -36453 -21663 2976 22417
1283 22417 31043 29781 13384 -14009 -34515 -35508 -20766 572 23464 37469 29688 6052 -15324
1296 -15324 -28054 -33241 -25252 -450 25851 35041 26793 8193 -15309 -35027 -36847 -19367 3621
$$ packed form
1209b8588K5928K5821J4339k457j8095k5426k0512o383J0089K2424K4817J5215
1221C7172j302j8195k7592k2610m996J3622K2198K1958J4850j138j8866k5805
1233a0704j9444o187Q755K4667K7792J3556p343j9068k1518j9690q235J1638K5025
1246g56K2084J2417j043j7662k8888k1781j202J3798K0870K1736J4655l052j8701
1259A2475k4553j9049o121J2264K5402K5311J1581o143j9106k3678j6745m074
1271c2436R996K2064K4537J3654n638k0813k4327j9628l862J4790K4639J9441
1283B2417Q626j262j6397k7393k0506r93J4742K1338K2892J4005p781k3636k1376
1296a5324j2730n187P989K4802K6301R190q248j8600k3502j9718j820J7480K2988
$$ plain form
1309 3621 21725 31099 28158 10164 -14580 -32863 -34704 -19369 5551 26954 34759 27601 8735
1322 8735 -14669 -30872 -31869 -18093 1885 23561 36492 29059 4138 -19997 -32403 -32686 -20803
1335 -20803 2481 23991 30312 22447 7048 -15235 -36545 -38554 -17958 6399 21909 29605 25074
1348 25074 3645 -21352 -33541 -30751 -20771 -1568 23400 35307 22881 -401 -20277 -32697
1360 -32697 -33378 -18995 4988 24023 29994 23543 5726 -17635 -34132 -33066 -16474 7952 27816
1373 27816 32065 21426 3638 -16034 -31621 -32943 -16113 7378 24431 31660 25104 3430 -23338
1386 -23338 -34355 -27858 -14243 3480 24017 33005 21673 266 -18510 -31721 -34312 -17169
1398 -17169 11063 27950 27341 19608 4390 -18179 -34445 -29777 -12312 7238 24308 34150 24980
$$ packed form
1309C621J8104R374k941j7994k4744j8283j841J5335K4920K1403P805p158j8866
1322H735k3404j6203r97J3776J9978K1676J2931p433k4921k4135j2406k83J1883
1335b0803K3284K1510O321p865j5399k2283k1310k009K0596K4357J5510P696m531
1348B5074k1429k4997j2189K790R980J9203K4968J1907j2426k3282j9876j2420
1360c2697o81J4383K3983J9035N971o451j7817k3361j6497J066J6592K4426J9864
1373B7816M249j0639j7788j9672j5587j322J6830K3491J7053P229o556k1674k6768
1386b3338j1017O497J3615J7723K0537Q988j1332k1407j8776j3211k591J7143
1398a7169K8232J6887o09p733j5218k2569j6266M668J7465J9550J7070R842r170
$$ plain form
1411 24980 -490 -22734 -29939 -26173 -13122 7784 26797 31861 21406 2310 -18913 -32541
1423 -32541 -29098 -11665 10456 27560 31880 20094 -635 -19069 -28753 -29157 -14876 10834 29170
1436 29170 29388 18120 118 -21261 -34796 -28945 -9479 8642 21894 29443 21917 -2376 -24829
1449 -24829 -31652 -26765 -13219 9701 29725 30399 15282 -1721 -17651 -30968 -29495 -9872 13556
1462 13556 26648 28733 20117 -1161 -23060 -31725 -24054 -8908 10179 26698 30866 18369 -2910
1475 -2910 -21504 -31327 -26144 -7691 13825 26600 28997 18117 -2729 -22573 -30247 -24109 -9961
1488 -9961 10588 28984 30310 13989 -5885 -21462 -30823 -27661 -8350 15184 26159 25848 17087
1501 17087 -1544 -23577 -32236 -22174 -4623 12582 27298 31329 16883 -5477 -21401 -27350
$$ packed form
1411B4980k5470k2244p205L766J3051K0906J9013N064j0455j9096k1223j3628
1423c2541L443J7433K2121J7104M320j1786k0729j8434r684m04J4281K5710J8336
1436B9170K18j1268j8002k1379j3535N851J9466J8121J3252P549p526k4293k2453
1449b4829o823M887J3546K2920K0024O74j5117j7003j5930j3317J473J9623K3428
1462A3556J3092K085q616k1278k1899q665P671J5146J9087J6519M168j2497k1279
1475b910j8594r823N183J8453K1516J2775K397j0880k0846j9844p674O138J4148
1488i961K0549J8396J326j6321j9874j5577r361L162J9311K3534J0975l11q761
1501A7087j8631k2033q659J0062J7551J7205J4716M031j4446k2360j5924n949
$$ plain form
1513 -27350 -23575 -7154 16200 30245 28185 14861 -3307 -21905 -30215 -22076 -3490 15179 28065
1526 28065 29933 16470 -5129 -21729 -27725 -22080 -4677 17122 29856 26979 14432 -4040 -22917
1539 -22917 -30807 -21300 -2298 14675 26446 28667 14759 -8219 -24148 -26936 -20898 -5521 16543
1552 16543 30879 26694 11450 -5497 -21189 -30005 -21801 -526 18004 26371 25886 14055 -7221
1565 -7221 -25609 -28301 -18854 -2667 15305 28487 26944 11059 -8242 -23389 -29135 -20467 -1269
1578 -1269 17982 27348 25045 11456 -8764 -24995 -28339 -19060 -2654 16533 28824 24978 8458
1591 8458 -9886 -23552 -29280 -20436 22 18774 26296 23410 11779 -8754 -26168 -28424 -16336
1604 -16336 473 16911 28423 25729 8305 -11033 -23005 -26110 -19095 -901 20188 29020 22475
$$ packed form
1513b7350L775J6421K3354J4045k060j3324j8168j8598q310Q139J8586J8669J2886
1526B8065J868j3463k1599j6600n996N645J7403K1799J2734k877j2547j8472j8877
1539b2917p890R507J9002J6973J1771K221j3908k2978j5929k788O038J5377K2064
1552A6543J4336m185j5244j6947j5692q816Q204K1275J8530Q367m85j1831k1276
1565g221j8388k692R447J6187J7972J3182j543j5885j9301j5147n746Q668J9198
1578a269J9251R366k303j3589k0220j6231l344R279J6406J9187J2291l846j6520
1591H458j8344j3666n728Q844K0458J8752P522k886j1631k0533j7414k256J2088
1604a6336J6809J6438J1512k694j7424j9338j1972l105P015J8194K1089Q832o545
$$ plain form
1617 22475 8513 -9384 -24925 -28737 -15961 2592 17910 26787 24566 9172 -11310 -25072
1629 -25072 -26467 -16296 1470 19718 27791 21943 7341 -10571 -24968 -27488 -15719 2509 18775
1642 18775 27433 23848 7017 -13093 -25000 -24527 -15538 1882 20488 28496 22086 6856 -10591
1655 -10591 -24567 -27527 -14354 5055 19785 25844 22199 6601 -13306 -25869 -24853 -14451 2292
1668 2292 19962 28765 21213 3903 -13231 -24277 -25913 -14673 4959 20353 25630 20638 5904
1681 5904 -13732 -26642 -26112 -12888 4360 19927 26595 19636 3165 -14084 -24836 -25516 -14284
1694 -14284 5198 21061 26352 19764 3821 -14588 -26187 -24413 -12057 4754 19916 26761 19766
1707 19766 2526 -15362 -25356 -25160 -12937 6413 21699 25229 17620 3089 -14185 -26161 -24800
$$ packed form
1617B2475j3962j7897j5541l812J2776J8553J5318Q877k221j5394k0482j3762
1629b5072j395J0171J7766J8248Q073n848j4602j7912j4397k520J1769J8228J6266
1642A8775Q658l585j6831k0110j1907M73Q989J7420J8606Q008o410j5230j7447
1655a0591j3976k960J3173J9409J4730O059l645j5598j9907j2563J016J0402J6743
1668B292J7670Q803p552j7310j7134j1046j636J1240J9632J5394N277m992j4734
1681E904j9636j2910N30J3224J7248J5567O668o959j6471j7249j0752o80J1232
1694a4284J9482J5863N291o588j5943j8409j1599J774J2356J6811J5162O845o995
1707A9766j7240j7888r994J96J2223J9350J5286L530p609j4531j7274j1976J361
$$ plain form
1720 -24800 -11202 6227 20301 26388 19695 1294 -16121 -24471 -22472 -11510 6289 22202 26392
1733 26392 17641 2141 -14388 -25745 -23972 -9543 8520 21319 25423 18081 1812 -15455 -24624
1746 -24624 -22282 -9511 8148 22853 26222 17139 1001 -14872 -24609 -22467 -8759 8961 21778
1759 21778 25416 17940 975 -16979 -25175 -21116 -8464 8722 23131 26163 16069 -380 -15019
1772 -15019 -24691 -22639 -7944 10990 22834 24843 16640 508 -16516 -25118 -20341 -6705 9472
1785 9472 22558 25911 15940 -1562 -16796 -24102 -20724 -7024 10557 22829 24023 14897 -1016
1798 -1016 -17359 -25315 -20500 -6635 10049 22463 24317 13880 -3072 -17346 -24634 -21290 -7084
1811 -7084 10938 22738 23324 13514 -2453 -17876 -25590 -19847 -4785 10630 21930 24498 14318
$$ packed form
1720b4800J3598J7429J4074O087o693j8401j7415q350J999J0962J7799J5913M190
1733B6392q751j5500j6529j1357J773J4429J8063J2799M104p342j6269j7267r169
1746b4624K342J2771J7659J4705L369r083j6138j5873r737K142J3708J7720J2817
1759B1778L638p476j6965j7954q196M059J2652J7186J4409L032j0094j6449j4639
1772a5019r672K052J4695J8934J1844K009q203j6132j7024q602M777J3636J6177
1785I472J3086L353r971j7502j5234p306L378J3700J7581J2272J194r126j5913
1798a016j6343p956M815J3865J6684J2414J854j0437j6952j4274p288L344J4206
1811g084J8022J1800N86r810j5967j5423p714N743J5062J5415J1300K568j0180
$$ plain form
1824 14318 -3910 -18446 -23572 -19272 -5559 12320 24224 23491 12691 -2236 -17212 -24626 -18881
1837 -18881 -3474 12379 23287 23978 12959 -3597 -18307 -23387 -17770 -4492 12479 23573 22821
1850 22821 11430 -4243 -19150 -25013 -18339 -3031 12401 22093 22197 12116 -5406 -19757 -23695
1863 -23695 -17649 -4040 13118 24143 22407 9967 -5324 -17371 -23592 -17457 -1862 14138 23071
1876 23071 22340 12148 -4933 -20056 -23295 -15558 -1332 13990 23838 22566 10830 -5247 -18256
1889 -18256 -23287 -16478 -428 15298 23585 21439 10386 -6495 -19970 -22992 -15668 -2378 13065
1902 13065 23644 21260 7335 -8805 -20155 -24005 -17420 -1565 14538 21295 18786 8369 -7309
1915 -7309 -21479 -25181 -15174 317 14386 22516 20359 7095 -8883 -19986 -22352 -15696 -963
$$ packed form
1824A4318j8228j4536n126M300J3713J7879J1904p33j0800j4927j4976p414N745
1837a8881J5407J5853J0908O91j1019j6556j4710n080N617J3278J6971J1094p52
1850B2821j1391j5673j4907n863O674J5308J5432R692J04j0081j7522j4351l938
1863b3695O046J3609J7158J1025j736j2440j5291j2047o221O135J5595J6000Q933
1876B3071p31j0192j7081j5123l239P737J4226J5322R848j272j1736j6077j3009
1889a8256n031O809J6050J5726Q287k146j1053j6881j3475l022P324J3290J5443
1902A3065J0579k384j3925j6140j1350l850O585J5855J6103O757k509j0417j5678
1915g309j4170l702J0007J5491J4069Q130k157j3264j5978j1103k366O656J4733
$$ plain form
1928 -963 15586 23294 19166 6752 -9148 -21130 -23663 -13934 805 14415 22086 19662 7235
1941 7235 -9342 -20836 -22948 -14998 1145 16544 22136 16982 5385 -9114 -21813 -24238 -14205
1954 -14205 593 13552 21265 18814 4802 -13088 -22549 -21741 -14092 137 15365 22906 17523
1967 17523 4488 -9228 -20776 -23360 -12522 4033 17276 22127 18230 6032 -10473 -20521
1979 -20521 -20740 -11739 2407 16971 24009 17904 3790 -10936 -20821 -21408 -11453 4053 16700 21562
1993 21562 18095 5070 -11656 -22230 -21041 -11378 3134 17153 22588 15595 1685 -11210 -20609
2006 -20609 -23008 -13561 4061 16911 19949 15271 3242 -13263 -23967 -21037 -9524 3646 15409
2019 15409 22063 17292 2253 -12569 -21102 -20259 -10945 5601 18955 21800 15312 2984 -11981
$$ packed form
1928i63J6549P708m128j2414j5900j1982k533R729J4739J3610P671k424j2427
1941G235j6577j1494k112P950J6143J5399N592n154j1597j4499j2699k425J0033
1954a4205J4798J2959P713k451j4012j7890r461Q08P649J4229J5228P541n383
1967A7523j3035j3716j1548k584J0838J6555J3243M851l897j2198j6505j0048
1979b0521k19R001J4146J4564P038o105j4114j4726r885n87R955J5506J2647M862
1993B1562l467j3025j6726j0574J189R663J4512J4019N435o993j3910j2895r399
2006b0609k399R447J7622J2850L038m678j2029j6505j0704K930J1513J3170J1763
2019A5409O654m771j5039j4822q533Q43R314J6546J3354K845o488j2328j4965
$$ plain form
2032 -11981 -21563 -20291 -9377 4608 16994 22392 15745 528 -14100 -20945 -20178 -10825 5028
2045 5028 17753 20504 14049 1945 -13258 -23224 -21154 -8214 5698 16159 20608 14505 -811
2058 -811 -15306 -21216 -19716 -11281 4351 18762 21234 11956 -478 -12936 -22150 -20935 -7546 7975
2072 7975 17918 20911 15490 1441 -14072 -21043 -17419 -6582 7603 19543 22326 13818 282
2085 282 -12921 -20820 -18976 -6700 8273 18217 20981 14193 -467 -15410 -21410 -17328 -6996 6661
2099 6661 19513 21786 12034 -1723 -12939 -21409 -19579 -6924 9696 18257 18868 13115 -247 -15948
2113 -15948 -22080 -16655 -5221 7021 18649 22155 12210 -3211 -14483 -18712 -17330 -5902 10221
2126 10221 20713 20090 12248 98 -13996 -21312 -16659 -3707 9559 19021 21098 12279 -2950
$$ packed form
2032a1981r582J272J0914J3985J2386N398o647j5217j4628o845P67R353J5853
2045E028J2725K751o455j2104j5203r966K070J2940J3912J0461M449o103j5316
2058h11j4495n910J500Q435J5632J4411K472r278j2434j2458r214J215J3389J5521
2072G975R943K993n421j4049j5513o971L624J0837J4185J1940K783q508j3536
2085B82j3203p899J844J2276J4973R944K764o788j4660j4943o000M082J0332J3657
2099F661J2852K273r752j3757j1216q470J830J2655J6620Q561O11n753j3362j5701
2113a5948o132N425J1434J2242J1628L506r945j5421j1272m229J382J1428J6123
2126A0221J0492o23p842j2150j4094p316M653J2952J3266R462K077q819j5229
$$ plain form
2139 -2950 -15319 -20275 -16864 -5392 9719 19238 18814 10714 -2564 -15773 -22041 -16456 -4075 8723
2153 8723 18016 19961 10115 -5599 -16382 -19949 -16954 -6196 9875 20025 17690 8323 -3144
2166 -3144 -15411 -22353 -16908 -2041 10729 17648 19003 11622 -4068 -17671 -20057 -14178 -3755
2179 -3755 10253 20599 19498 8293 -4636 -14625 -20478 -15840 -2407 11916 19269 18236 9884
2192 9884 -4451 -16808 -20798 -14142 -2298 10591 19842 18891 8307 -5226 -16617 -21264 -15488
2205 -15488 -1723 11770 17979 17300 8887 -5733 -17702 -19991 -13159 -2279 11029 20877 19649
2218 19649 7156 -6365 -14953 -18578 -14006 -543 14134 20021 17165 8526 -4348 -17028 -20492
2231 -20492 -12214 724 11958 19487 18985 7573 -6870 -16209 -18374 -13075 -816 13935 20716
$$ packed form
2139b950j2369m956L411J1472J5111R519m24q100j3278j3209o268N585J2381J2798
2153H723R293J945r846j5714j0783l567K995J0758J6071J0150k335r367j1467
2166c144j2267o942N445J4867J2770O919J355p381j5690j3603k386N879J0423
2179c755J4008J0346j101j1205j2929r989n853M638J3433J4323P353j033q352
2192I884j4335j2357l990O656J1844J2889R251r51j0584j3533j1391m647N776
2205a5488J3765J3493O209o79q413j4620j1969k289O832J0880J3308R848j228
2218A9649j2493j3521q588l625M572J3463J4677N887k856q639j2874j2680l464
2231b0492Q278J2938J1234P529n02j1412j4443r339k165N299J2259J4751O781
$$ plain form
2244 20716 16652 6280 -6407 -17190 -20164 -12650 199 11632 18123 16255 5801 -8558 -18982
2257 -18982 -20360 -13826 -625 12813 18594 14981 4553 -7476 -18026 -20572 -12435 1113 12298
2270 12298 18754 17315 5793 -9140 -18429 -17859 -11297 -255 13381 20356 15898 4031 -7884
2283 -7884 -17195 -19653 -11404 3259 14687 18518 15747 5632 -8192 -18028 -18253 -10245 1210 13677
2297 13677 20109 15308 2874 -9923 -17802 -19216 -11986 2128 13998 17751 14026 4013 -9924
2310 -9924 -19412 -18620 -9517 2898 13791 19313 14879 2614 -9510 -17580 -18618 -10471 3770 15503
2324 15503 19089 13924 3479 -9549 -18470 -17315 -7410 4232 14417 20186 15822 3365 -9952
2337 -9952 -16568 -15762 -7816 5604 17504 19988 13839 2835 -8844 -18029 -17844 -7687 5176 15267
$$ packed form
2244B0716m064j0372j2687j0783k974P514J2849J1433O491j868j0454j4359j0424
2257a8982j378O534J3201J3438N781l613j0428j2029j0550k546Q137J3548J1185
2270A2298O456j439j1522j4933r289N70O562J1042J3636O975m458j1867j1915
2283g884r311k458Q249J4663J1428L831k771j0115j3824r836k25Q008J1455J2467
2297A3677O432m801j2434j2797p879j414P230J4114J1870L753l725j0013j3937
2310i924r488P92R103J2415J0893N522m434j2265j2124q070j038Q147J4241J1733
2324A5503L586n165j0445j3028q921J155R905J1642J0185N769m364j2457j3317
2337i952o616Q06P946J3420J1900K484o149j1004j1679r185J85J0157J2863J0091
$$ plain form
2351 15267 18643 13474 831 -12440 -18202 -16874 -8429 4289 15668 19007 12680 1118 -10800
2364 -10800 -18489 -17389 -7021 6220 15182 17622 12506 378 -12470 -18616 -16337 -7457 4757
2377 4757 16513 19004 11819 -107 -11078 -17429 -15877 -5371 7853 16840 19362 13605 1560
2390 1560 -11659 -17807 -14125 -4571 6802 16852 19143 11679 -552 -11776 -17728 -15892 -5999 7260
2404 7260 16689 17550 11035 -684 -12839 -18606 -14855 -5119 6739 16224 18144 10784 -1849 -12996
2418 -12996 -18045 -15214 -5419 7829 16594 16816 10151 -1444 -12917 -18877 -14393 -3629 8210 16961
2432 16961 18853 10927 -1944 -12412 -16561 -13399 -3138 9903 18572 18277 10501 -895 -12171
2445 -12171 -17411 -13190 -1836 10014 17373 18135 10815 -2255 -13303 -17084 -13059 -2836 9333
$$ packed form
2351A5267L376n169j2643j3271n762J328Q445J2718J1379L339o327j1562j1918
2364a0800p689J100J0368J3241Q962K440n116j2128j2848o146K279Q880J2214
2377D757J1756K491p185j1926j0971o351J552J0506J3224Q987K522n757j2045
2390A560j3219o148L682R554J1373J0050K291p464j2231j1224n952J836R893J3259
2404G260R429Q61o515j1719j2155n767L751R736J1858R485J920p360j2633j1147
2418a2996n049K831R795J3248Q765K22o665j1595j1473n960M484J0764J1839Q751
2432A6961J892p926j2871j0468m149L162J0261J3041Q669k95p776j1396j1276
2445a2171n240M221J1354J1850P359P62p320j3070j1048l781M025J0223J2169
$$ plain form
2458 9333 18064 17085 8750 -3012 -13658 -18228 -13970 -2430 9332 16330 16745 8741 -4460 -14807
2472 -14807 -17712 -12415 -2265 9783 18158 17049 8570 -3484 -13277 -17344 -12640 -999 11089
2485 11089 17596 16649 8617 -3840 -14212 -17526 -11909 -1230 10295 18008 16788 7476 -4648 -13748
2499 -13748 -16915 -11848 -800 11183 17300 16308 7410 -5086 -15451 -18027 -12411 -1675 9103
2512 9103 16241 14502 4881 -7239 -16015 -18744 -13898 -1799 10166 16248 14035 5720 -5562 -15482
2526 -15482 -17534 -10686 362 11388 17742 16651 6547 -5929 -14855 -16434 -10948 80 11795
2539 11795 17604 15116 6021 -5685 -14783 -16906 -10372 1360 12489 18101 15957 6408 -5445 -14049
2553 -14049 -15544 -9878 1555 12486 17814 14904 5187 -6950 -16695 -18510 -10882 141 10109 14858
$$ packed form
2458I333Q731r79q335j1762j0646m570M258J1540J1762O998M15q004j3201j0347
2472a4807k905N297J0150J2048Q375j109q479j2054r793m067M704J1641J2088
2485A1089O507r47q032j2457j0372l314N617J0679J1525P713j220r312j2124r100
2499a3748l167N067J1048J1983O117r92q898j2496j0365k576N616J0736J0778
2512I103P138j739r621j2120q776k729M846J2099J1965O082k213q315j1282r920
2526a5482k052O848J1048J1026O354j091j0104j2476q926j579N486J1028J1715
2539A1795N809k488r095j1706r098k123O534J1732J1129N612k144r549j1853q604
2553a4049j495N666J1433J0931N328k910r717j2137r745j815P628J1023R968M749
$$ plain form
2567 14858 13070 3335 -9224 -17311 -17713 -11266 97 11644 16852 13290 3400 -7429 -15316 -17168
2581 -17168 -10005 2353 12499 16585 13558 4064 -8345 -16824 -16448 -9217 1551 11862 16686 13358
2595 13358 3282 -7762 -15778 -16317 -8778 3259 13557 17536 13791 3918 -7811 -15409 -15238 -8567
2609 -8567 2131 12745 16795 11965 1365 -9724 -16890 -17544 -9935 1917 11576 14538 11145 1632
2623 1632 -10246 -18005 -16977 -8422 2762 12113 16505 11871 993 -9756 -15763 -15960 -8846 3162
2637 3162 13706 16131 11069 1191 -9718 -17026 -15983 -7750 3537 12593 15929 11710 1477 -9959
2651 -9959 -15904 -15243 -7077 4315 13758 16416 11097 1484 -9754 -16647 -15076 -6792 4009 12829
2665 12829 15982 10862 -235 -11346 -16491 -15202 -7708 4226 13734 15710 9715 -9 -10353 -16981
$$ packed form
2567A4858j788r735j2559q087m02O447J1363J1547N208l562r890j0829p887j852
2581a7168P163J2358J0146M086l027r494j2409q479L76P231J0768J0311M824l328
2595A3358j0076j1044q016n39P539J2037J0298L979l745r873j1729p598J71O671
2609h567J0698J0614M050m830j0600j1089p166o54P609J1852R659K962l393r513
2623A632j1878p759J028Q555J1184R351M392m634j0878j0749o007j97P114J2008
2637C162J0544K425n062r878j0909p308J043Q233J1287R056L336m219j0233j1436
2651i959n945O61Q166J1392R443K658n319r613j1238o893J571Q284J0801Q820
2665A2829L153n120j1097j1111n145J289P494J1934R508J976n995r724j0344o628
$$ plain form
2679 -16981 -15351 -5395 5861 13925 15950 11567 909 -10553 -15773 -13291 -5171 6054 15271 17481
2693 17481 10797 33 -10046 -15342 -13592 -4799 6749 14812 16292 10687 207 -10882 -16422
2706 -16422 -13740 -4871 5947 14519 15940 9192 -1066 -11069 -16488 -14602 -5110 6243 13501 14708
2720 14708 9069 -1826 -12994 -17789 -13927 -4901 4846 13336 15257 7981 -3217 -11957 -16238 -14693
2734 -14693 -5115 7157 14760 14827 8790 -1161 -11735 -16342 -12512 -2768 7321 14570 16023 9319
2748 9319 -2157 -11884 -15272 -12583 -3740 7358 15240 15190 8219 -2209 -12089 -16444 -12745 -2822 7558
2763 7558 14300 15008 7875 -3257 -12727 -15975 -12991 -3872 7617 15008 14030 6804 -3396 -12793 -16867
2778 -16867 -12952 -2354 7560 14031 14381 7545 -3904 -13104 -15417 -10885 -2469 8411 16367 15540
$$ packed form
2679a6981J630R956J1256Q064K025m383j0658j1462n220K482Q120J1225R217K210
2693A7481o684j0764j0079n296J750Q793J1548Q063J480n605j0480j1089n540
2706a6422K682Q869J0818Q572J421o748j0258j0003n419J886R492J1353P258J207
2720A4708n639j0895j1168m795L862R026R747Q490J921p276j1198q740m281J545
2734a4693R578J2272P603O7o037r951j0574m607L830R744J0089P249J453o704
2748I319j1476r727l388K689Q843J1098P882n0o971j0428r880m355L699R923J0380
2763G558O742P08p133j1132r470l248K984R119J1489P391r78p226j0200r397m074
2778a6867L915J0598R914O471L50o836j1449r200k313M532Q416J0880P956q27
$$ plain form
2792 15540 6980 -2921 -10998 -14770 -11158 -521 10144 15661 15110 8405 -2836 -12308 -14777 -9918
2806 -9918 -696 9238 15691 14946 6248 -3866 -12216 -15258 -11261 -1151 9450 14911 13868 6305
2820 6305 -4714 -13918 -16031 -10453 -1339 8014 14917 13860 5176 -5290 -12790 -15310 -11169 -876
2834 -876 9790 15146 12933 5707 -4326 -13760 -15913 -9592 -130 9577 15370 14468 5581 -5581 -12839
2849 -12839 -14020 -9356 299 10809 15836 13590 5343 -4390 -13151 -15259 -9193 995 9837 14897
2863 14897 13055 4502 -6441 -13942 -15256 -10250 -646 9666 14821 11304 3196 -6343 -14570 -16364
2877 -16364 -9948 744 9450 13673 12525 4005 -7326 -14685 -14659 -8666 671 10614 15161 12372 3151
2892 3151 -5951 -13031 -14640 -8401 2623 11674 15454 12784 4688 -6413 -13720 -13658 -7186 2386 11139
$$ packed form
2792A5540q560r901q077l772L612J0637J0665N517n51o705j1241r472k469M859
2806i918R222R934O453p45q698j0114q350l042L997J0110J0601N461j043p563
2820F305j1019r204k113N578R114R353O903j057q684j0466p500k520M141J0293
2834h76J0666N356k213p226j0033r434k153O321R462R707N793r02q887j1162p258
2849a2839j181M664R655J0510N027k246q247r733q761k108O066J0188Q842N060
2863A4897j842q553j0943p501j314N006R604J0312N155l517q108r539q227j794
2877a6364O416J0692Q706M223j148q520j1331p359K6N993R337R943M547k789r221
2892C151r102p080j609O239J1024R051L780k670q096j1101p307O2O472R572Q753
$$ plain form
2907 11139 15853 12440 3026 -6583 -13051 -14487 -8096 2277 11276 14414 11462 3247 -7888 -14792
2921 -14792 -14338 -8056 1483 10398 14962 11107 1173 -8177 -14028 -14523 -8278 2382 11687 14411 10698
2936 10698 3052 -7255 -14589 -13519 -5929 3671 11640 15292 12040 2607 -7298 -12598 -12221 -6349 4201
2951 4201 13483 15774 11106 2297 -6517 -13641 -13404 -5653 3946 11812 15126 11213 2084 -8416 -14237
2966 -14237 -13117 -6236 3815 12078 14513 9577 1030 -8317 -14565 -13897 -6328 3635 11554 13828 9809
2981 9809 102 -9592 -14518 -12677 -5645 3562 12853 15100 9851 530 -7835 -13533 -12471 -4347 6377
2996 6377 12876 14640 11150 1937 -8367 -13590 -11066 -4120 5282 13358 15878 9744 69 -8396 -13291
3011 -13291 -11969 -4880 5840 13168 13741 8986 -6 -9821 -14483 -12289 -4646 4786 12241 13926 8538
$$ packed form
2907A1139M714l413r414r609o468j436O391J0373Q999L138k952q215j1135o904
2921a4792M54O282R539Q915M564l855r934r350n851m95O245J0660R305K724l713
2936A0698p646j0307p334J070P590R600P969L652l252r433r905n300L77N872J0550
2951D201R282K291m668q809q814p124K37P751R599P866L314l913r129j0500n821
2966a4237J120O881J0051Q263K435m936q547r347o248O68P569R963P919K274m019
2981I809r707r694m926J841P032R207R291K247n249r321q365n698J062Q124J0724
2996F377O499J764l490r213j0304n223K524O946R402Q076K520o134r675q465m895
3011a3291J322P089J0720P328N73m755q992r815m662K194P643R432P455J685n388
$$ plain form
3026 8538 -1338 -9987 -14388 -12622 -5112 5399 12739 13000 8110 -675 -10068 -14361 -11612 -3181 5895
3041 5895 13307 15136 9158 -658 -9317 -12598 -10645 -2945 7388 14381 14614 8537 84 -8808 -13685
3056 -13685 -10458 -1917 7575 13180 14455 8949 -1228 -10045 -13042 -10385 -3151 6282 13593 13462 7169
3071 7169 -2200 -10357 -14706 -11482 -2897 6722 12600 12844 7083 -2740 -11280 -13947 -10259 -2822 7300
3086 7300 13676 13723 6918 -1976 -9865 -13346 -10252 -1022 8245 13908 13362 7904 -1887 -10437 -13139 -8888
3102 -8888 -700 8209 14744 14112 7318 -2037 -9236 -12502 -8831 -48 9313 14483 13144 6973 -2533
3117 -2533 -10912 -13835 -9502 -1061 7417 12896 12531 5414 -4622 -11868 -14236 -10127 -1651 8097 13358
3132 13358 11635 5534 -3649 -11609 -13710 -8594 -239 8033 13349 12633 5288 -4495 -11487 -13411 -9323
$$ packed form
3026H538r876q649m401J766P510J0511P340K61m890q785r393m293K749Q431R076
3041E895P412J829n978r816q659l281J953P700J0333O993K33o077q453q892m877
3056a3685L227Q541R492N605J275n506j0177q817k997K657P234R433P311j31o293
3071G169r369q157m349L224Q585R619N878K44n761r823q540k667L688P437J0122
3086G300O376M7o805q894p889l481L094R230R267N663n46n458r791q550k702M251
3102h888Q188Q909O535o32o794r355p199l266L671Q783R361N170j339o171r506
3117b533q379k923M333Q441Q478N479l65p117j0036p246k368M109Q476R748N261
3132A3358j723o101r183p960k101N116Q355Q272N316p16p345r783o992j924M088
$$ plain form
3147 -9323 -815 8693 13272 11239 4310 -4579 -11633 -13735 -8340 648 8794 13554 12559 5326 -4410
3162 -4410 -11407 -12318 -7843 8 8925 13603 11353 3759 -4865 -12313 -14154 -9350 161 8072 12224
3177 12224 10749 3852 -5826 -12380 -12900 -7904 468 9086 13900 11567 3843 -4794 -11041 -12806 -7641
3192 -7641 1629 9514 12899 11052 3814 -5880 -12439 -12723 -7526 960 9205 13275 10784 2783 -5925
3207 -5925 -11716 -12423 -7283 2140 10466 13243 10522 3415 -5945 -12704 -12478 -6613 1683 8889 12477
3222 12477 10152 1764 -7488 -12980 -13275 -7688 1214 9490 12435 9135 1601 -6798 -12698 -12455 -6585
3237 -6585 2268 9932 13206 10100 1822 -6732 -12033 -11689 -6416 2451 10583 12936 9419 2126 -6459
3252 -6459 -12560 -12369 -5496 3401 10402 12943 10063 1832 -7200 -12177 -11261 -5938 3096 11116 13519
$$ packed form
3147i323Q508R508M579k033o929q889p054k102N395Q988Q146M760r95p233r736
3162d410o997r11M475P851Q917M678k250p594q624p448j841M804R511P911M152
3177A2224j475o897r678o554n20M996Q372Q618M814k333p724q637o247j765N165
3192g641R270P885L385j847p238r694o559k84N197Q486Q245M070k491q001q708
3207e925n791p07N140R423Q326K777k721p107r360o759K26N865Q296P206L588
3222A2477k325q388r252n492k95N587Q902Q276K945l300p534q399n900K43N870
3237f585Q853P664L274l106q278q554n301L44N273Q867Q132K353l517p293q585
3252f459o101J91O873Q897P001K541k880q231r032m977R16N323R034Q020K403
$$ plain form
3267 13519 9548 1368 -6651 -12364 -11997 -5376 3396 10427 12142 8836 767 -8318 -13290 -12338 -6084
3282 -6084 2965 9956 11863 7770 -1 -8232 -13382 -12508 -5745 3266 9959 12095 8083 37 -8701
3297 -8701 -13017 -11237 -5065 3522 10676 12555 7914 -397 -7952 -12738 -11884 -4704 4358 10691 11960
3312 11960 7785 -168 -8403 -12911 -11027 -3881 4182 11180 13036 8139 -457 -8443 -12093 -10537 -3916
3327 -3916 4779 11521 11992 7470 -637 -8855 -12925 -10836 -3569 4257 10671 11715 6927 -1674 -9222
3342 -9222 -12843 -10707 -4017 5222 11306 11667 6695 -901 -9179 -12914 -10176 -2691 5306 11115 12360
3357 12360 7174 -1408 -9594 -12775 -9732 -3260 5307 11768 11693 6509 -1330 -8621 -12130 -9732 -2108
3372 -2108 6511 11946 12190 7234 -1362 -9083 -11774 -8905 -2413 6452 12191 12128 5843 -1996 -9249 -12329
$$ packed form
3267A3519l971q180q019n713L67O621Q772P031J715l306q069r085m972R52O254
3282f084R049O991J907m093p771q231n150Q74O763R011O693K136m012q046q738
3297h701m316J780O172Q587P154J879m641q311p555m786Q54P180R062O333J269
3312A1960m175p953q235m508J884P146Q063O998J856m897q596p986l650J556O621
3327c916Q695O742M71m522q107q218m070K089P267P826O414J044m788q601p548
3342i222l621K136O690R239O084L61m972p596q278l735K738P485P997N809J245
3357A2360n186q582q186l181L043O472Q567O461p5n184p839p291l509K398P624
3372b108Q619N435K44m956q596p721k691K869O492Q865N739o3o285p839p253l080
$$ plain form
3388 -12329 -9470 -1777 6477 11044 11466 6297 -2384 -9802 -12262 -8665 -1788 6202 12236 11490 5645
3403 5645 -2713 -9096 -11805 -8989 -954 7263 11943 11034 5714 -2151 -9880 -12209 -8177 -1076 6862
3418 6862 11976 11520 5529 -3071 -9706 -11721 -8415 -839 6989 11475 10956 5067 -3287 -10188 -12608
3433 -12608 -8345 -1195 6214 11242 10465 3968 -4033 -10448 -12427 -9232 -1196 6965 11284 9826 3986
3448 3986 -3543 -10711 -12322 -7978 -437 7071 11290 10653 4849 -4528 -10196 -11317 -7800 -10 7892
3463 7892 12400 10720 3921 -3243 -9585 -11555 -7074 1035 8274 12013 10703 4253 -3815 -10063 -11281
3478 -11281 -7102 638 8159 12089 10200 3561 -4496 -10512 -11604 -7008 691 7654 11539 9938 3730
3493 3730 -4943 -10576 -11134 -6738 79 8400 12169 9161 2432 -4731 -10505 -11737 -6774 1667 8757
$$ packed form
3388a2329K859P693Q254M567M22n169q681p418k460L597O877P990O034p46n845
3403E645q358o383k709K816Q035Q217M680r09n320p865p729k329M032P101P938
3418F862N114m56n991q600o635k015L306P576P828M486n19n889q354o901k420
3433a2608M263P150P409N028p77o497q001o415j979L195Q036Q161M319j458n840
3448C986p529p168j611M344P541P508M219o37n804r377n668j121L517P790P902
3463G892M508j680o799p164o342j970M481Q109P239L739j310o450q068o248j218
3478a1281M179P740P521L930j889o639q057o016j092M596P699O963L885j601o208
3493C730q673n633n58M396O817Q321L769l008o729p163n774j232M963Q441P090
$$ plain form
3508 8757 11523 9895 3399 -4589 -10442 -10446 -5321 2013 8732 12895 10340 3147 -4796 -9601 -10363 -5981
3524 -5981 2385 9553 12245 9259 2908 -4841 -10630 -10876 -5363 2004 8718 11798 9257 2057 -5804
3539 -5804 -10869 -10922 -5905 1671 9012 11484 8302 1879 -6173 -11272 -10962 -5288 1763 8610 11333 8698
3555 8698 1544 -6210 -10296 -10251 -5621 2582 9644 11747 8117 2028 -5258 -10809 -10444 -4211 3686 9330
3571 9330 11844 9069 1909 -6347 -10677 -9118 -4566 2831 9524 12062 7872 1051 -6188 -10996 -10761
3586 -10761 -4976 3349 8928 10850 7674 610 -7264 -11430 -10317 -4933 2523 9122 11135 7602 376
3601 376 -6793 -10888 -10591 -4568 3899 9543 11256 7930 822 -7277 -10856 -8949 -3517 3695 9820
3616 9820 11719 8043 378 -6262 -10239 -9689 -3389 4657 10239 11187 7810 555 -7054 -11008 -9084
$$ packed form
3508H757K766j628o496p988n853mN125P334O719M163k555p193p943m805p62M382
3524e981Q366P168K692k986o351p749n789k46N513P367O714L080k541p200p861
3539e804n065n3N017P576P341K472l182o423q052n099L10N674P051O847K723k635
3555H698p154p754m086M5M630Q203P062K103l630o089p286n551L65O233P897N644
3571I330K514k775p160q256m330J559M552P397O693K538m190o821p239m808K35
3586a0761N785Q325N579J922l176p064p874m166J113N384P456O599K013l533p226
3601C76p169m095K97O023Q467N644J713l326p108q099l579J907N432P212O125
3616I820J899l676p665o640l977N50O300Q046N582R48l377p255p609l954J924
$$ plain form
3631 -9084 -3256 3918 9604 11395 7195 -633 -7699 -10591 -9499 -3637 4235 9697 10599 6676 -357
3646 -357 -7384 -11399 -9398 -2622 4414 10134 11107 6974 -960 -7632 -10491 -8653 -2428 5261 10903
3661 10903 11083 6655 -43 -6868 -10348 -8278 -1483 5979 10589 11278 6934 -655 -7556 -10339 -7568
3676 -7568 -1806 5644 11003 11000 6124 -956 -7380 -10353 -8444 -1822 5668 10100 10335 5937 -1587 -8437
3692 -8437 -10712 -8170 -2269 5356 10492 9831 4968 -1984 -8281 -11539 -8511 -1645 5657 9946 9853 5442
3708 5442 -2089 -8917 -10706 -7384 -1353 5667 10735 10421 4963 -2154 -8291 -10401 -7685 -836 6207
3723 6207 10512 9630 5265 -2165 -8658 -11080 -7888 -792 5708 9903 9681 4411 -3397 -9233 -10615
3738 -10615 -8011 -1012 6447 9943 9155 4139 -3023 -9000 -10977 -7332 -811 5672 10218 9451 3984
$$ packed form
3631i084N828P174N686J791m200p828p066k892J092N862P872N462R02l923p033
3646c57p027m015K001O776P036N720R73m133p934o672k859J838O225P689N642
3661A0903J80m428o698o825l480K070O795P462M610O89m344p589o901k783K771
3676g568N762P450N359lm876p080o424k973J909O622P490M432K35m398p524o850
3692h437k275K542N901P625N136o61m863o952o297l258L028O866P302M289r3m411
3708E442p531o828j789L322O031P020N068l14n458p117o137k110K716O849P043
3723F207M305q82m365p430o493k422L192P096O500M195k22n270p808n836j382
3738a0615K604O999P459L496p88n016p162n977j977L645O521O483M546p67n467
$$ plain form
3753 3984 -3436 -8822 -10285 -7480 -537 6718 10304 8989 4170 -2800 -8734 -10452 -6273 874 7205
3768 7205 10729 10196 4465 -3360 -8610 -9370 -6112 378 7674 10876 8984 3635 -3229 -8850 -10436
3783 -10436 -6469 664 6850 9934 8907 3638 -3789 -9162 -10207 -6144 412 7387 10644 9128 2898
3798 2898 -3747 -9038 -9962 -6248 923 7235 10212 8775 2863 -4188 -9250 -10006 -5738 943 7364
3813 7364 10853 8587 2901 -4150 -8710 -9428 -5465 1715 8301 10477 8725 3022 -4005 -9219 -9438
3828 -9438 -4863 1170 7343 10293 8113 1906 -5134 -9451 -10021 -5661 1539 7724 9889 7501 1987
3843 1987 -4916 -9876 -9646 -4906 1624 7417 10001 7922 1461 -5223 -9421 -9303 -5435 1765 7769
3858 7769 9760 7256 1181 -5418 -9770 -9777 -5303 1335 7261 9742 7399 1139 -5627 -9526 -8860 -4576
$$ packed form
3753C984p420n386j463K805O943P255L586j315m819o970n934j718M179P147O331
3768G205L524n33n731p825n250p60L258O490P296L202j892n349o864n621j586
3783a0436L967P133O186L084j027n269p427n373j045M063O556O975L257j516o230
3798B898o645n291r24L714P171O312K977j437n912p051n062p56M268O681O421
3813G364L489k266n686p051m560p18L963P180O586K176j752n703p027n214k19
3828i438M575O033O173K950k180o207p040m317n70M360P200O185K165k388n514
3843A987o903m960K30M740O530N793K584k079o461o684m198J18L868P200O004
3858G769J991k504o075o599m352pM474O638N926K481k343o260o766l899O66M284
$$ plain form
3874 -4576 2079 8400 10215 7320 902 -5443 -9591 -9325 -4498 2558 8157 9571 7332 1338 -5835
3889 -5835 -9847 -8725 -4283 2314 8011 9806 6673 475 -5479 -9479 -9166 -3950 3282 8113 9709
3904 9709 7175 850 -6116 -9939 -8432 -3686 2897 8399 10199 6444 -226 -6187 -9523 -8889 -3652
3919 -3652 3235 7992 9472 6569 508 -6419 -9574 -8171 -2993 3390 8261 10061 6348 -265 -6219
3934 -6219 -9355 -8133 -3419 3632 8676 9475 5935 -156 -6585 -9954 -8271 -2802 3401 8532 9728
3949 9728 5965 -867 -7042 -9641 -8083 -2903 4473 9101 9264 5473 -591 -6812 -10096 -7975 -2243
3964 -2243 4218 8721 9442 5747 -1093 -6891 -9772 -7909 -2468 4059 9034 9202 5137 -1029 -7193
3979 -7193 -9711 -8117 -1870 4618 8994 9195 5335 -961 -7032 -9453 -7216 -1793 4287 8838 8947
$$ packed form
3874d576O655O321J815k895o418o345m148K66M827P056N599J414k239n994p173
3889e835m012J122M442O597N697J795l133o198n954m000L13N216P232M831J596
3904I709k534o325o966l823J507M746O583N502J800l755o670n961l336O34N237
3919c652O887M757J480k903o061o927l155J403N178O383M871J800l713o613n954
3934f219l136J222M714P051N044P99l540o091o429l369J683N469O203N131J196
3949I728l763o832o175k599J558N180P376M628J63l791o064o221l284K121N732
3964b243O461M503P21l695o840n798k881J863N441O527M975J68m065o166o164
3979g193k518J594O247O488M376K01l860o296o071k421K237N423O080M551J09
$$ plain form
3994 8947 4418 -1778 -7222 -9622 -7723 -2273 4482 8512 8545 4362 -2043 -7651 -9691 -7274 -2026
4009 -2026 4652 8931 8740 4156 -2583 -7770 -9761 -7492 -1584 5207 8618 7963 4268 -2327 -8049
4024 -8049 -9660 -6725 -1239 5039 9065 8567 4260 -2106 -7386 -9112 -6850 -606 5958 9476 8139
4039 8139 4190 -2272 -7556 -9193 -6408 -242 5633 9432 9026 3716 -2507 -7373 -8951 -6230 -569
4054 -569 5637 9478 8088 3198 -2489 -7942 -9397 -6396 -347 5605 8973 8422 3285 -3141 -7713
4069 -7713 -8982 -5881 -249 6315 9152 8219 3072 -2702 -7520 -8790 -5426 718 6407 9291 8573
4084 8573 3325 -3118 -7804 -8147 -5421 300 6595 9799 7887 2907 -3043 -7443 -8532 -5236 893
4099 893 6741 9281 7378 3085 -3442 -8091 -8654 -4957 817 6151 9170 7495 2314 -3988 -8490
$$ packed form
3994H947m529o196n444k400J899N450O755M030L3m183o405n608k040K417N248
4009b026O678M279j91m584o739n187j991K269N908O791L411o55l695o595n722
4024h049j611K935N486O278M026m98m307o366n280j726K262O244O564L518j337
4039H139l949o462n284j637K785O166N875L799m06n310o223m866j578K721N661
4054e69O206L841j390m890n687n453j455L001O049N952L368n51n137o426m572
4069g713j269L101N632O564K837r33n147n774m818j270L364O144N689K884p18
4084H573n248o443m686l43K726N721O295L204j912m980n950m400j089L296O129
4099H93N848K540j903m293o527m649n63L697N774N334L019j675n181o302m502
$$ plain form
4114 -8490 -9203 -5455 749 6458 8827 6957 2144 -4043 -8380 -8305 -4882 1150 6630 9188 7621 1921
4130 1921 -4006 -7835 -8192 -4718 1905 7286 8933 7086 2233 -3962 -8464 -8228 -4051 1766 6953
4145 6953 9147 7063 1272 -4622 -7890 -8142 -4643 1623 6768 9160 6533 1374 -4499 -8675 -8376
4160 -8376 -4331 1561 6613 8995 6693 698 -4911 -8466 -7961 -4149 1991 7570 9039 6160 1103
4175 1103 -4130 -8366 -7862 -3573 2958 7430 9429 6999 1190 -4584 -7657 -7223 -3246 2788 7551
4190 7551 9177 6562 1052 -4894 -7942 -7400 -3161 2806 7511 8918 6390 883 -4999 -8350 -7319
4205 -7319 -3178 2685 7520 8770 5870 33 -5159 -8078 -7914 -3366 2860 7359 8525 5438 162
4220 162 -5636 -8661 -7371 -2698 2537 7445 9128 5564 -156 -5314 -8049 -7247 -2559 3442 8096
$$ packed form
4114h490p13L748O204N709K369j870m813o187m337P5L423O032N480K558j567n700
4130A921n927l829l57L474O623N381J647j847m853o195m502K36M177N817N187
4145F953K194k084n791n894l268k52L499O266N145K392k627n159n873m176K99
4160h376M045N892N052K382k302n995n609l555N05L812O140N579J469k879n057
4175A103n233m236N04M289O531M472J999k430n809n774l073M34L977O034M763
4190G551J626k615n510n946l048N42M239N967M705J407k528n507n882l351J031
4205g319M141N863M835J250k900n837n192k919J64M548O226M499J166l087n276
4220A62n798l025J290M673N235M908J683l564n720n158k735Q02M688O001M654
$$ plain form
4235 8096 8572 5645 68 -5442 -8126 -6978 -2160 3390 7771 8861 5666 -365 -5808 -8331 -6881
4250 -6881 -2532 3432 7793 8054 4684 -864 -6203 -8539 -7153 -2249 3177 7331 8244 4906 -1181
4265 -1181 -6372 -8507 -7102 -2699 3824 7650 7936 4326 -774 -6139 -8965 -7101 -1598 3904 7304
4280 7304 8266 5045 -752 -6106 -7947 -6372 -1913 3911 8095 8400 4550 -1319 -5876 -8481 -6733
4295 -6733 -1639 4584 7611 8101 4727 -1276 -6448 -8432 -6758 -1619 3698 7735 7657 3660 -1740 -6950
4311 -6950 -8593 -6666 -1447 4076 7444 7330 3815 -1810 -6786 -8424 -6126 -1455 3925 8121 7773
4326 7773 3656 -1678 -6454 -8211 -6093 -771 4918 8024 7599 3763 -1481 -6691 -8363 -5586 -571
4341 -571 4404 8074 7902 3799 -1948 -6591 -7970 -5809 -816 4985 8163 7290 3568 -2055 -6859 -8505
$$ packed form
4235H096M76k927n577n510k684J148M818N550M381J090l195o031n443k523J450
4250f881M349N964M361K61l370n548n339k336J386M904N426M154R13l338o087
4265a181n191k135J405M403O523L826K86l610n100n365k826J864N503N502L400
4280G304R62l221n797n354j841J575M459N824M184L05l850n869m557k605J748
4295f733N094O223L027M90l374o003n172j984J674N139N317M037p8l997n400n210
4311f950j643J927N219N523L368j14l515n625m976j638K298M671N380M196l48
4326G773m117n334m776j757K118N322N689L106m25l836n244n210j672K777N015
4341e71M975L670j72m103n747m643j379K161M993N801L178q73l722n623m804j646
$$ plain form
4357 -8505 -5854 -405 4766 7903 7159 3123 -2356 -6965 -7989 -5622 -635 4821 7959 7154 2898
4372 2898 -2559 -6927 -8251 -5297 395 5144 8205 7473 3292 -2622 -6694 -7569 -4910 -232 5550
4387 5550 8302 6970 2835 -2315 -6647 -8051 -5184 229 5375 7643 7022 2715 -3115 -7183 -7690
4402 -7690 -5042 238 5268 8083 6671 2048 -3212 -7050 -7910 -5216 632 5461 7900 6330 2044
4417 2044 -3451 -7567 -7776 -4333 813 5436 7922 6369 1831 -3495 -6966 -7960 -4617 1075 5811
4432 5811 7788 6380 2018 -3764 -7129 -7532 -4246 1065 5822 7823 6415 1387 -3588 -7156 -7603
4447 -7603 -4393 1328 5856 7676 6009 1693 -3657 -7291 -7453 -3611 1284 5999 7919 5965 1044
4462 1044 -3960 -7096 -7737 -3787 1552 6280 7781 5706 1187 -4040 -7504 -7231 -3543 1802 6226
$$ packed form
4357h505K651N449N171L137p44m036n479m609j024K367M987N456L138q05m256
4372B898n457m368j324K954N692M749L061p32m181n914m072q75K659M678N782
4387E550K752j332m135n150m332j404K867N413N146K268o21m307n830m068n07
4402g690K648N280N030K815j412m623n260l838q60K694N848M829K439j570m286
4417B044n495m116k09L443N146M623K486j553m538n326l471r94L343N692M736
4432E811J977j408m362n782l365m03L286N311M757K001j408n028m975l568m47
4447g603L210N721M528J820j667m316n350l634j62L842M895M715J920j954m921
4462A044n004l136o41L950N339M728J501k075m519n227l464K73L688N345M424
$$ plain form
4477 6226 7967 5926 838 -4097 -7111 -6999 -3382 2100 6693 7847 5589 836 -4031 -7350 -6933
4492 -6933 -2781 2219 6172 7851 5557 1036 -4440 -7225 -6557 -3003 1799 6544 7883 5396 427
4507 427 -4490 -7225 -7108 -2773 2415 6455 7918 5242 399 -4676 -7406 -6549 -2778 2224 6445 7664
4523 7664 4970 -84 -4526 -7404 -6481 -2952 2448 6376 7300 4634 -58 -4799 -7759 -6469 -2180
4538 -2180 2604 6752 7573 4746 -280 -5028 -7047 -6488 -2219 3065 6914 7088 4436 -299 -5221 -7441
4554 -7441 -6074 -2098 3021 6647 7403 4611 -563 -5204 -7576 -6019 -2087 3083 6864 6985 4017
4569 4017 -777 -5405 -7687 -6125 -1769 3031 6820 6890 4377 -1182 -5800 -7367 -6036 -2024 3152
4584 3152 6531 6860 3751 -1017 -5433 -7524 -5920 -1588 3421 6836 6801 4235 -1023 -5489 -6932 -5299
$$ packed form
4477F226J741k041n088m935l014J12L617N482M593J154k258m753m867l319M17
4492f933M152N000L953J679k294m521n476k785O68L554M802M745J339k487m969
4507D27m917k735J17M335N188M040J463k676m843n075k730Q57L771N002M221J219
4523G664k694n054m442k878R23L529N400L928R24k666m692m741k960J290M289
4538b180M784M148Q21k827n026m748k019N59M269N284L849J74k652m735m922k220
4554g441J367L976N119L626P56k792n174m641k372J557L932N170L781J21k968
4569D017m794m628k282J562M356M800L789P0k513n559m618j567J331M012N176
4584C152L379L29l109m768m416k091J604M332N009L415l5k566n258m466j443J633
$$ plain form
4600 -5299 -1373 3394 6956 6928 3800 -1089 -5500 -7137 -5879 -1208 3927 6902 6763 3660 -948 -5708
4616 -5708 -6978 -5341 -946 3510 6948 7000 3389 -1540 -5490 -7492 -5668 -1038 3658 6762 6406 3083
4632 3083 -1745 -5826 -7210 -4904 -978 3700 7212 6851 3371 -1904 -5659 -7274 -5045 -753 4478
4647 4478 7249 6595 3243 -1468 -5720 -6963 -4633 -416 4341 7157 6499 3206 -1731 -5702 -7036
4662 -7036 -4968 -251 4402 6890 6553 3203 -2042 -5793 -7007 -4570 -321 4255 6803 6132 2772
4677 2772 -2424 -6073 -7023 -4718 -473 4572 7045 6093 2781 -2103 -5968 -7270 -4732 -5 4599
4692 4599 6787 5949 2511 -2372 -6214 -6745 -4223 223 4666 7094 6036 2239 -2313 -5879 -6542 -3999
4708 -3999 340 4577 6807 6025 2482 -2718 -6540 -6914 -4031 348 5011 7044 5673 1827 -2846
$$ packed form
4600e299L926M767L562k8l128m889m411j637J258M671N135K975j39l103m608m760
4616e708j270J637M395M456L438N2l611m929l950k002J824M630M696L104l56l323
4632C083m828m081j384K306L926M678L512l61l480n275l755j615K229M292N231
4647D478K771o54l352m711m252j243K330M217M757K816o58l293m937l971j334
4662g036K068M717M653K488l37l350n245l751j214K437M249M576K548o71l360
4677B772n196l649r50K305M245N045K473r52l312m884l865j302K538M727M604
4692D599K188q38l438m883l842n31K522M446M443K428j058l797m552l566o63K543
4708c999M339M237K230p82l543n200l822l74K883M379M663K033j371l846m673
$$ plain form
4723 -2846 -6251 -6674 -4214 531 4944 6591 5465 1686 -2960 -6290 -6883 -3691 668 4775 6916
4738 6916 5777 1590 -3020 -6353 -6453 -3795 1064 5217 6869 5577 1654 -3016 -6280 -6247 -2940 1351
4754 1351 5108 7323 5815 1669 -3030 -6010 -6281 -3296 1182 5322 7208 5090 1482 -3037 -6421
4769 -6421 -6187 -3313 1334 5275 6789 5393 1144 -3830 -6214 -6373 -3367 1320 5550 6637 5318
4784 5318 1456 -3356 -6338 -6385 -2825 1607 5305 6976 5146 1046 -3770 -6330 -5848 -2790 1697 5867
4800 5867 6911 5153 551 -3349 -6195 -6159 -2378 2253 5683 6476 4671 567 -3769 -6660 -5883 -2355
4816 -2355 1862 5637 6362 4622 255 -3971 -6449 -6143 -2680 2217 5701 6446 4355 60 -4499 -6484
4832 -6484 -5789 -2304 1884 5484 6620 4236 -224 -4223 -6467 -5751 -2532 2447 5801 6097 4361 -44
$$ packed form
4723b846l405m23K460M745M413J647j126l779m646l330n93L192M359M107K141
4738F916j139m187m610l333j00K658M859M153J652j292l923m670l264L3L307M291
4754A351L757K215j508m146m699k980k71K985M478M140J886k118l608m519l384
4769f421K34K874M647L941J514j396m249m974k384j59L006M687M230J087j319
4784E318l862m812k982m7L560M432L698J671j830m100m816k560M82L058M487M170
4800E867J044j758m602l900k846L6L781M631L430P93j805m104m336k891P77L528
4816b355M217L775P25j740m367m226k478L06L463M897L484P45k091m295m559j985
4832f484O95L485M188L600J136k384m460l999k244P16L219M979L354K96j736m405
$$ plain form
4848 -44 -3775 -6751 -5496 -1625 2342 5657 6656 4447 -34 -4407 -6323 -5413 -1671 2857 6072 6324
4864 6324 4037 -233 -4377 -6502 -5151 -1711 2481 5780 6111 4084 -437 -4859 -6676 -5297 -1902
4879 -1902 2748 6224 6481 3623 -463 -4686 -6490 -4947 -1603 2848 5770 6427 3703 -547 -4364
4894 -4364 -6670 -5214 -1382 2962 6302 6120 3511 -411 -4503 -6317 -4912 -1047 3302 5650 5905
4909 5905 3585 -848 -4959 -6474 -4766 -1287 2943 6189 6387 2944 -1139 -4780 -6423 -5261 -1090
4924 -1090 3166 5707 5829 2957 -1235 -4868 -6525 -4798 -1020 3134 5932 6091 3088 -1668 -4979
4939 -4979 -6361 -4915 -858 3448 6198 5653 3176 -1126 -5200 -6221 -4437 -362 3712 5999 5859
4954 5859 2725 -1555 -5058 -6110 -4735 -540 3572 6167 5660 2606 -1616 -5187 -6446 -4335 -665
$$ packed form
4848d4l731k976J255L871L967L315R99k209m481m373j916R10L742M528L215K52
4864F324k287m270m144k125J351L440M192L299L31k027m521m422j817J379L395
4879a902M650L476K57k858m086m223j804J543L344M451K922O57k724m250l817
4894d364k306J456L832M344L340j82k609l922m092j814J405L865M349K348K55
4909E905k320m433m111j515J708L479M230L246J98l443m083l641j643J162M171
4924a090M256K541J22k872m192l633j657J727L778M154K798J59l003m756l311
4939d979j382J446M057M306K750n45k477m302m074j021J784M075M074K287j40
4954E859l134m280l503j052J375M195M112K595n07l054m222l571j259K111L670
$$ plain form
4969 -665 3567 5886 5609 2621 -1627 -5093 -6149 -4068 -540 3973 6041 5398 2179 -1505 -5271 -6338
4985 -6338 -4179 -340 3708 5896 5708 2513 -1932 -4985 -5684 -3878 -58 3961 6445 5527 2283 -1609
5001 -1609 -5131 -6246 -4078 217 4129 5815 5372 2198 -2509 -5381 -6000 -3800 -226 3879 6193
5016 6193 5077 1710 -2054 -5529 -6282 -3680 130 3969 5765 5105 1988 -2422 -5520 -5958 -3542 381
5032 381 3997 6107 4909 1925 -2580 -5466 -6274 -3696 838 4523 5936 4716 1964 -2830 -5500
5047 -5500 -5839 -3607 365 4155 5935 4949 1624 -2564 -5491 -5716 -3245 749 4493 5922 5025 1358
5063 1358 -2620 -5857 -5808 -3358 907 4332 6195 4610 1165 -2565 -5463 -5428 -3159 756 4412 6003
5079 6003 4935 1262 -2769 -5778 -5337 -2776 977 4505 6053 4634 1247 -3022 -5704 -5151 -3094
$$ packed form
4969f65M232K319k77k988m248l466j056K081L528M513K068o43l219l684l766j067
4985f338K159L839M048K188j88l195m445l053o99J806L820M019K484r18l244l892
5001a609l522j115K168M295L912J686m43l174m707k872o19K200L574M105K314
5016F193j116l367l764l475p53K602L810L839J796o60l117m410l098m38K416L923
5032C81L616K110j198k984m505k886q08K578M534L685J413j220k752m794k670
5047e500l39K232L972L790J780r86l325m188k927k25K471L994L744J429q97l667
5063A358l978l237M9K450M265L425J863j585l445l730k898L5K269L915L656J591
5079F003j068l673m031l009M41K561L753L528J548j419l387m269k682N53K057
$$ plain form
5094 -3094 830 5074 5817 4331 1025 -2947 -5687 -5715 -2580 1724 4697 5791 4495 708 -3468 -5445
5110 -5445 -5504 -2571 1284 4709 6166 4490 672 -3650 -5384 -5522 -2646 1508 4740 5959 4426 805
5126 805 -3125 -5756 -5311 -2404 1727 4717 6040 4167 559 -3421 -5648 -5162 -2493 1808 5153 5762
5142 5762 3624 319 -3448 -5804 -5111 -2041 1637 5120 5774 3963 -4 -3581 -5606 -5098 -1952 2158
5158 2158 5229 5723 3650 17 -3626 -5787 -4779 -1786 2036 5062 5773 3975 79 -3576 -5549
5173 -5549 -4696 -1944 2399 5097 5820 3635 17 -3309 -5578 -4763 -1664 2078 4917 5480 3555 -186
5189 -186 -4028 -5425 -4786 -1451 2168 5508 5639 3124 -366 -3960 -5674 -4923 -1355 2511 5112 5296
5205 5296 3300 -417 -4074 -5419 -4257 -1460 2421 5062 5526 3169 -644 -4041 -5368 -4428 -1004
$$ packed form
5094c094L924M244P43j486l306l972k740k8L135M304K973J094j296l787m176j977
5110e445n9K933L855L425J457j676l818m322j734j38K876M154L232J219j533l621
5126H05l930k631M45K907M131K990J323j873l608l980k227M86K669M301L345O09
5142E762k138l305l767k356O93L070L678L483O54j811l967l577k025N08L146M110
5158B158L071M94k073l633l643k161J008K993L822L026P11j798l896l655j973
5173e549Q53K752M343K698P23k185l618l326k269Q15L099L742K839N63j925l741
5189a86l842j397O39L335L619L340J31k515l490l594j714P51L568L866K601J84
5205E296j996l717l657j345J162K797L881K641M64k357l813l397j327R40L424
$$ plain form
5220 -1004 2434 4955 5204 3338 -860 -4170 -5664 -4370 -1088 2547 5302 5404 2762 -661 -4108
5235 -4108 -5555 -4501 -1077 2820 5196 5281 2884 -948 -4398 -5506 -3995 -751 2926 5302 5427 2654
5251 2654 -1335 -4562 -5549 -4241 -912 3217 4902 5067 2623 -1060 -4535 -5628 -3826 -676 3134
5266 3134 5198 5335 2658 -1260 -4447 -5409 -3919 -457 3183 5366 4918 2241 -1190 -4003 -5587 -3624
5282 -3624 -411 3085 5319 4878 2558 -1562 -4299 -5524 -3548 -429 3335 5406 4800 2358 -1533
5297 -1533 -4203 -5363 -3904 -180 3210 5494 4853 2096 -1594 -4550 -5330 -3526 -86 3364 5366
5312 5366 4824 1987 -1431 -4517 -5293 -3578 189 3635 5477 4931 2128 -1793 -4559 -4838 -3314 122
5328 122 3414 5669 4718 1920 -1912 -4403 -5094 -3210 278 3455 5380 4715 1850 -2193 -4775 -5337
$$ packed form
5220a004L438K521K49j866m198l310j494J294L282L635K755J02k642l423l447
5235d108j447J054L424L897K376Q5k397l832l450j108J511L244L677K376J25k773
5251B654l989l227r87J308L329M129J685J65k444l683l475j093J802L150L810
5266C134K064J37k677l918l187r62J490L462L640K183m48k677l431k813j584J963
5282c624L213L496K234m41k320m120k737j225J976L119L764K071o06k442l891
5297a533k670j160J459L724L390K284o41k757l690k956p80J804L440L450K002
5312E366n42k837l418l086p76J715L767L446J842n46k803l921k766k79J524L436
5328A22L292K255r51k798l832k491o91J884L488L177J925o65k865m043k582n62
$$ plain form
5344 -5337 -3290 320 3452 5341 4760 1769 -2255 -4950 -4886 -3018 355 3834 5298 4546 1680 -1983
5360 -1983 -4733 -4945 -2904 622 3453 5273 4673 1755 -2245 -4888 -5314 -3103 758 4153 5434 4287
5376 4287 1131 -2319 -4899 -5133 -2666 809 3908 5232 4215 1204 -2360 -4672 -4719 -2455 919 3843
5392 3843 5180 3986 1021 -2491 -4915 -5000 -2393 835 3917 5065 4227 911 -2728 -4782 -4604 -2522
5408 -2522 1155 4082 5090 4259 1020 -2617 -4807 -4775 -2066 1242 4387 5148 3783 854 -2579 -5098
5424 -5098 -4567 -1950 955 4297 5279 3824 323 -3038 -4756 -4892 -1944 1462 4378 5136 3919 412
5440 412 -2884 -4960 -4486 -2051 1525 4214 5066 3275 162 -2968 -5179 -4665 -1912 1450 4408 4797
5456 4797 3239 135 -2944 -4992 -4294 -1848 1616 4377 5033 3466 262 -3091 -4863 -4207 -2007 1713
$$ packed form
5344e337K047L610L132J889n81k991m024k695O4J868L373L479J464p52k866l663
5360a983k750k12K041L526K831J820o00k918m000k643m26K211L861L395J281j147
5376D287l156l450k580k34K467L475L099J324j017l011l564k312m7K264L374K924
5392C843J337j194k965l512k424q5K607L228L082J148q38l316l639k054J78K082
5408b522L677K927J008q31l239l637k190L2K709L308L145P61j365k929l433k519
5424e098N31K617K905L342R82j455l501l361j718j36K948L406K916P58j217l507
5440D12l296k076M74K435L576K689Q52j791l113l130k211N14K753L362K958L89
5456D797j558l104l079k048O98K446L464K761O56j567l204l353j772O56K200L720
$$ plain form
5472 1713 4403 5029 3026 -42 -3265 -5011 -4445 -1594 1809 4192 4821 3540 136 -3633 -4997 -4164
5488 -4164 -1759 1826 4722 4834 3072 -244 -3400 -5180 -4107 -1361 2079 4091 5049 2902 -184
5503 -184 -3469 -5002 -4065 -1320 2023 4853 5015 2842 -445 -3480 -4793 -4032 -1086 2422 4609 4746
5519 4746 3047 -353 -3702 -4979 -3918 -794 1916 4529 4776 2567 -852 -3600 -4639 -3903 -888
5534 -888 2364 4635 4936 2647 -577 -3536 -5249 -3663 -945 2242 4648 4807 2341 -996 -3780 -4898
5550 -4898 -3806 -955 2364 4709 4505 2228 -614 -3576 -5162 -3438 -739 2606 4872 4300 2341
5565 2341 -1109 -3683 -4625 -3686 -739 2695 4878 4425 1818 -1088 -3809 -4843 -3557 -490 2799 4699
5581 4699 4747 2043 -1429 -3941 -4639 -3446 -397 2526 4683 4029 1844 -1122 -3817 -4602 -3486 -256
$$ packed form
5472A713K690O26k003l068l223j746N66K851L403K383O29j281l404l769j364Q33
5488d164K405L585K896J12j762l316l156j780J073K746L440K012R58k147l086
5503a84l285j533R37K745L343K830J62k173l287l035j313P61K946L508K187J37
5519D746j699l400l349j277J061L124K710K613K47k209l419k748j039P36L015
5534h88L252K271L01k289l224k959j713J586K718L187K406J59k466l337k784j118
5550d898J092K851L319K345k04k277k842k962j586J724K699L345K266n72j959
5565B341l450k574r42R39K947L434K183m53k607k906k721j034J286L067L289J900
5581D699M8k704l472k512o98J193L049K923K157o54k185k966k695p85J116L230
$$ plain form
5597 -256 2832 4757 4312 1596 -1367 -4123 -4475 -2891 -346 2941 4591 4127 1765 -1272 -4051 -4477
5613 -4477 -3256 74 3003 4433 4349 1855 -1581 -4013 -4610 -3120 -71 3129 4647 4177 1845 -1481
5629 -1481 -3816 -4529 -2690 126 3454 4520 4271 1290 -1594 -4069 -4589 -2677 -149 3387 4575 4334
5645 4334 1756 -1869 -4075 -4578 -2792 218 3601 4866 3923 1529 -1851 -4113 -4485 -2719 424 3370
5661 3370 4499 4006 1169 -2093 -4180 -4510 -2653 295 3571 4772 3723 1358 -1792 -4544 -4323 -2210
5677 -2210 375 3255 4732 4183 1035 -2333 -4238 -4289 -2629 318 3701 4873 3576 922 -1923 -4310
5693 -4310 -4405 -2351 1025 3605 4586 3657 882 -2586 -4505 -4187 -2258 716 3493 4698 3593 714
5709 714 -2358 -4151 -4124 -2266 1150 3486 4095 3330 831 -2516 -4379 -3948 -2061 1239 3856 4740 3318
$$ packed form
5597b56L088J925m45k716k963k756l52J584K545L287J650m64k362l037k779m26
5613d477J221L330K929J430q4k494l436k432n97J490L049L200J518m70k332l326
5629a481k335p13J839K816L328J066k49k981k884k475n20J912K528L536J188k41
5645D334k578l625k206n03J786L010L383J265r43k394l380k262l72J766L143K946
5661C370J129m93k837l262k087l30J857K948L276J201j049k365l150k752K21K113
5677b210K585K880J477n49l148l368j905n1J660K947L383J172j297k654k845k387
5693d310r5K054L376K580R81r29k775l468j919L18J929K974K777J205j105k879
5709G14l072j793K7J858L416K336O09p65k499l347j863M31J887L300K617Q84j422
$$ plain form
5726 3318 452 -2456 -4354 -3882 -1841 1176 3964 4225 3383 738 -2489 -4225 -4248 -1845 1053 3746
5742 3746 4783 3174 552 -2489 -4210 -3741 -1815 1450 4074 4513 3017 279 -2582 -4302 -3962 -1643
5758 -1643 1202 3439 4438 2969 25 -2734 -4525 -3951 -1657 1463 4144 4498 2882 69 -2823 -4001
5774 -4001 -3769 -1306 1613 3740 4499 2746 -235 -2961 -4398 -3718 -1118 1484 4115 4567 2589 -386
5790 -386 -3034 -4607 -4229 -1242 1681 3866 4321 2462 15 -3174 -4294 -3414 -1120 1642 3815 4309
5806 4309 2575 -60 -2862 -4254 -3483 -1131 2092 4122 3995 2386 -473 -3097 -4066 -3604 -1330 2019
5822 2019 4055 3915 2518 -349 -3238 -4204 -3469 -928 1930 4098 4450 2397 -542 -3295 -4364 -3550
5838 -3550 -965 1999 4027 4052 2348 -639 -3159 -4018 -3483 -647 2214 4065 4032 2312 -547 -3223
$$ packed form
5726C318k866k908j898M72K041L017K788K61q42k645l227j736k3K403K898K693
5742C746J037j609k622l041j721M69J926L265K624M39j496k738k861j720L40K319
5758a643K845K237R99j469k944k759j791N74K294L120K681L54j616k813k892j178
5774d001K32K463K919K127P59j753k981k726j437O80K600K602K631M52j978k975
5790c86k648j573L78K987K923K185M55j859k447l189j120Q80K294K762K173M94
5806D309j734k635k802j392P71K352L223K030j27j609k859k624r69M62K274L349
5822B019K036j40j397k867k889r66P35K541K858K168L52k053k939k753j069Q14
5838c550K585K964K028K5j704k987k520q59N35K836K861J851l3j720k859k676
$$ plain form
5854 -3223 -4338 -3459 -720 2391 4273 4135 2263 -866 -3340 -4122 -3007 -583 2370 4278 4052 1723
5870 1723 -931 -3326 -4212 -2949 -358 2596 4188 3819 1891 -1107 -3457 -3929 -2964 -473 2213 3814
5886 3814 3854 1645 -904 -3170 -4429 -2857 -314 2583 4105 3827 1678 -855 -3636 -4132 -2792 24
5902 24 2655 4050 3854 1265 -1084 -3629 -4176 -3205 -144 2860 4300 3656 1614 -1351 -3187 -3773 -2644
5919 -2644 103 2661 3817 3725 1428 -1079 -3587 -3999 -2928 58 2555 3919 3678 1666 -1512 -3914
5935 -3914 -3865 -2751 -130 2895 4065 3469 1204 -1722 -3370 -4252 -2617 241 2899 4403 3490 1364
5951 1364 -1458 -3640 -4291 -2331 108 3067 4050 3776 1222 -1829 -3434 -4136 -2548 233 3018 4348
5967 4348 3344 1381 -1708 -3526 -3830 -2184 602 2929 3844 3542 732 -2006 -3546 -3829 -2257 474
$$ packed form
5854c223j115Q79K739L111J882j38j872l129k474p82J115K424K953J908k26k329
5870A723k654k395q86J263K591K954J592l69j928k998k350m72R65K491K686J601
5886C814M0k209k549k266j259J572K543K897J522k78k149k533k781m96J340K816
5902B4K631J395j96k589k349k545n47R71L061L004J440o44k042k965j836n86J129
5919b644K747K558J156r2k297k507k508m12J071K986K497J364k41k012l178k402
5935c914M9J114K621L025J170n96k265k926j648q82J635K858K658J504r13k126
5951A364k822k182o51J960K439K959R83k74k554l051j605p02J588K781K785J330
5967D348j004j963l089j818l04J646K786K327R15l02k810k738j540k83J572K731
$$ plain form
5983 474 2945 4095 3215 973 -2006 -3772 -3931 -2397 398 2738 4151 3267 935 -1951 -3658 -3657 -1833
6000 -1833 777 3204 4186 3306 997 -1921 -3668 -3707 -2187 881 3305 3698 3084 883 -2144 -3686
6016 -3686 -3741 -1898 726 3293 4054 3104 318 -2112 -3809 -3840 -1652 927 3129 4109 2764 488 -2246
6033 -2246 -4115 -3570 -1661 851 3039 3924 2897 -137 -2249 -3516 -3778 -1646 951 3245 4047 3064
6049 3064 458 -2255 -3869 -3537 -2046 1233 3150 3737 2764 -14 -2391 -3921 -3448 -1467 936 3052
6065 3052 3990 2476 357 -2601 -4034 -3491 -1459 1395 3558 3773 2754 255 -2525 -4005 -3521 -1758
6081 -1758 1195 3522 3879 2050 44 -2570 -4067 -3311 -1349 1103 3359 3803 2653 9 -2645 -3759
6097 -3759 -3437 -1137 1251 3633 3903 2504 43 -2502 -4132 -3320 -1185 1829 3634 3895 2599 -88
$$ packed form
5983D74K471J150q80k242k979j766j59J534K795K340J413q84k332k886j707JJ824
6000a833K610K427R82q80k309k918j747l9J520L068K424L93o14k201l027j542
6016c686n5J843K624K567P61r50k786k430j697l1K188K579K202R80j345k276k734
6033b246j869N45J909K512K188Q85j027l034k112j267k62K132K597K294Q02r83
6049C064k606k713j614L32J491L279J917N87r73k778k377j530M73J981K403K116
6065C052R38j514k119k958j433N43K032K854K163K15j019k499k780j480M84J763
6081a758K953K327L57j829k006k614j497P56J962K452K256M44j150k644k654j114
6097c759L22K300K388K382K70j399k461k545j630Q12K135L014J805K61j296k687
$$ plain form
6113 -88 -2480 -4200 -3399 -1041 1424 3692 3544 2132 -307 -2751 -3711 -3258 -1037 1473 3416 3836 2179
6130 2179 -298 -2696 -4191 -3176 -834 1835 3770 3806 2369 -441 -2882 -3640 -2942 -985 1758 3687
6146 3687 3624 1993 -419 -2726 -4085 -3146 -733 1711 3613 3730 2094 -736 -3026 -3715 -3101 -763
6162 -763 2011 3377 3609 1971 -539 -3073 -3590 -2838 -550 1785 3508 3540 1876 -774 -3117 -3719 -3075
6179 -3075 -660 2136 3770 3279 1939 -686 -2622 -3670 -2630 -204 2322 3830 3651 1763 -884
6194 -884 -2919 -3941 -2705 -656 2336 3689 3452 1324 -869 -2945 -3818 -2771 -550 2168 3555 3381
6210 3381 1719 -897 -3266 -3467 -2758 78 2337 4081 3387 1229 -1293 -3034 -3747 -2761 -368 2398
6226 2398 3477 3035 1891 -895 -2965 -3512 -2476 -88 2453 3866 3226 1489 -1226 -3062 -3668 -2233
$$ packed form
6113h8k392j720Q01K358K465K268j48j412k439k444r60M53K221K510J943M20j657
6130B179k477k398j495J015K342K669J935L6j437k810k441p58O98J957K743J929
6146C687o3j631k412k307j359R39K413K444J902J17j636k830k290o89O14K338
6162g63K774J366K32j638k510k534n17P52K288K335J723L2j664k650k343o02O44
6179c075K415K796J634m91j340k625j936j048J040K426K526J508j79j888k647
6194h84k035j022J236K049K992J353k37k128k193k076q73J047K221K718J387j74
6210C381j662k616k369k01P09K836K259J744o94k158k522j741p13R86K393K766
6226B398J079m42j144k786k070n47J036K388K541J413o40j737k715j836o06J435
$$ plain form
6242 -2233 189 2490 3661 3169 1411 -1279 -3421 -3657 -1988 169 2888 3804 3294 1291 -1326 -3257
6258 -3257 -3757 -2325 44 2833 3768 3200 1017 -1339 -3270 -3875 -2285 250 2643 3479 2922 1229
6274 1229 -1577 -3402 -3410 -2349 181 2702 3554 3205 1220 -1456 -3547 -3385 -1592 531 2491 3836
6290 3836 2901 738 -1584 -3395 -3428 -1949 359 2323 3663 2848 1052 -1577 -3282 -3495 -1701 638
6306 638 2664 3756 3157 852 -1671 -3317 -3335 -1706 456 2765 3546 2558 773 -1806 -3521 -3557 -1670
6323 -1670 901 2665 3344 2960 962 -1614 -3287 -3013 -1361 892 3028 3759 2888 697 -1816 -3164
6339 -3164 -3137 -1702 877 2839 3724 2684 693 -1648 -3013 -3213 -1660 897 2661 3586 2513 86
6355 86 -1952 -3482 -2961 -1216 825 2880 3476 2087 222 -2252 -3599 -3261 -1417 874 2952 3447
$$ packed form
6242b233K422K301J171m92j758k690k142k36J669K157K719R16n10k003k617j931
6258c257n00J432K369K789R35n68k183k356j931o05J590K535K393Q36n57j693
6274A229k806j825qJ061K530K521Q52l49j985k676k091J62J793K123J960J345
6290C836r35k163k322j811l3J479K308J964J340q15j796k629j705k13J794K339
6306F38K026J092n99k305k523j646j8J629K162K309P81r88j785k579j715l6J887
6323a670K571J764O79l84j998k576j673K74J652K253K136P31q71k191k513j348
6339c164K7J435K579J962Q85j040j991k341j365k00J553K557J764R25j073k427
6355H6k038j530N21J745K041K055N96j389j865k474j347L38J844K291K078M95
$$ plain form
6371 3447 2282 -140 -2284 -3229 -3072 -1494 1034 3042 3506 2090 448 -2123 -3229 -3037 -1283 1444
6387 1444 3022 3173 2045 136 -2564 -3395 -3090 -1552 1043 3028 3127 2378 -260 -2408 -3629 -3141 -768
6404 -768 1512 2783 3088 1991 -410 -2416 -3316 -2964 -1038 1473 2953 2927 2301 -477 -2809 -3178 -2976
6421 -2976 -968 1172 3121 3284 1986 -231 -2261 -3285 -2823 -901 1607 3334 3247 1992 -340 -2443
6437 -2443 -3353 -2769 -1120 1600 2763 3482 1932 -499 -2178 -3656 -2456 -645 1281 3128 3030 1937
6453 1937 -734 -2651 -3371 -2666 -884 1462 3036 3154 2005 -731 -2765 -3518 -2740 -716 1642 2962
6469 2962 3000 1942 -563 -2725 -3479 -2593 -521 1666 3216 3258 1801 -754 -2569 -3232 -2437 -540 1396
6486 1396 3568 3201 1480 -657 -2807 -3318 -2256 -754 2172 3198 3206 1548 -786 -2450 -3219 -2502 -522
$$ packed form
6371C447j165k422k144r45J57J578K528K008M64j416j642k571j106J92J754K727
6387A444J578J51j128j909k700q31L05J538K595J985R9p49k638k148j221M88K373
6404g68K280J271L05j097k401k006r00L52J926K511J480k6o26k778k332l69K02
6421b976K008K140J949J63j298k217k030j024M62J922K508J727q7j255k332k103
6437b443r10N84J649K720J163P19j550k431j679j478J200J811J926J847r8j093
6453A937k671j917p20P05J782K346J574J18j149k736k034p53P78K024K358J320
6469B962L8j058k505k162p54Q86K072K187J550M2j457k555j815o63P95J897J936
6486A396K172l67j721k137k150n11J062J502K926J026Qj658k334j664p69P17J980
$$ plain form
6503 -522 1820 2999 2969 1436 -779 -2921 -3418 -2274 -558 1968 3092 2905 1352 -1017 -2562 -3162
6519 -3162 -2151 -208 1871 3078 2920 1630 -747 -2693 -3653 -2236 -53 2059 3309 3138 1226 -1202
6535 -1202 -2533 -3155 -2187 -33 1917 3228 3248 1192 -1103 -2684 -3250 -2373 -59 2387 3242 2843 1406
6552 1406 -1296 -2887 -3301 -2318 -50 2167 3195 2724 800 -1360 -3004 -3551 -2076 10 2219 2964
6568 2964 2990 707 -1017 -2786 -2906 -1644 285 2421 3278 2546 1023 -1134 -2712 -3216 -1758 639
6584 639 2074 3460 2643 804 -1310 -2915 -3120 -1884 470 2181 3199 2967 623 -1559 -2875 -3165
6600 -3165 -2000 163 2260 3151 2386 529 -1384 -2964 -2988 -1738 416 2485 3173 2268 760 -1393
6616 -1393 -3036 -2955 -1840 505 2413 3157 2888 784 -1346 -2999 -2667 -1225 532 2237 3258 2780
$$ packed form
6503e22K342J179l0j533k215k142m97J144J716K526J124j87j553k369j545o00
6519c162J011J943K079J207j58j290k377j946r60J417K183K112J250j71j912k428
6535a202j331o22R68K154J950J311K0k056k295j581n66Q77K314K446Q55l99j437
6552A406k702j591m14R83K268K217J028m71j924k160j644n47J475K086K209P45
6568B964K6k283j724j769j20J262J929K136Q57p32j523k157j578n04J458K397
6584F39J435J386q17j839k114j605k05J236K354J711J018k32k344k182j316k90
6600c165J165K163K097Q91p65j857j913j580k4J250K154K069O88r05j508k153
6616a393j643Q1J115K345J908P44k69k104k130j653L32J442J757J705J021m78
$$ plain form
6632 2780 399 -1379 -2679 -2798 -1420 976 2769 3355 2630 748 -1735 -2810 -2864 -1682 577 2373
6648 2373 3226 2200 298 -2070 -3018 -3092 -1250 767 2388 3045 2422 311 -1594 -2854 -2695 -1475 1002
6665 1002 2465 2926 1970 144 -1971 -3039 -2801 -1438 763 2105 3040 2228 134 -1767 -3013 -2788
6681 -2788 -1012 930 2520 3212 2238 254 -1978 -3101 -2824 -1083 943 2632 2839 1970 294 -1771
6697 -1771 -3286 -2774 -923 898 2841 3133 2095 15 -2263 -2869 -2742 -1158 1257 2770 3158 1900
6713 1900 56 -2157 -3110 -2690 -896 970 2729 2711 2001 66 -2252 -2746 -2586 -555 1272 2842 2994
6730 2994 1855 -261 -2120 -3015 -2684 -881 1545 2578 2900 1798 -225 -2145 -3041 -2478 -736 1302
6746 1302 2788 2821 1729 -288 -2038 -2909 -2491 -907 1436 2781 2864 1768 -53 -2374 -3189 -2297 -591
$$ packed form
6632B780k381j778j300j19J378K396J793N86p25j882k483j075n4J182K259J796
6648B373Q53j026j902k368r48p4J842K017J621O57o23k111j905j260J59J220K477
6665A002J463M61r56j826k115j068K38J363K201J342R35q12k094j901j246K25
6681b788J776J942J590O92r74j984k232j123K77J741K026J689K07q69j676k065
6697a771j515N12J851J821J943K92j038k080k278o06J27J584K415J513L88j258
6713A900j844k213r53M20J794J866J759j8p10j935k318m94J60K031J827J570J52
6730B994j139k116j859q95L31J803K426J033L22j102k023j920q96N63J742K038
6746A302J486L3j092k017j750q71M18J584K343J345Q3j096j821k321q15Q92J706
$$ plain form
6763 -591 1243 2686 2910 1425 -428 -2383 -2898 -2494 -502 1501 2768 2842 1501 -530 -2185 -3005 -2401
6780 -2401 -558 1078 2747 2683 1854 -444 -2504 -2906 -2128 -649 1513 2831 2900 1237 -243 -2359 -2974
6797 -2974 -2401 -497 1356 3011 2907 1332 -671 -2282 -3087 -2125 -550 1552 2627 2609 880 -615
6813 -615 -2026 -2962 -1975 -380 1908 2815 2741 1491 -798 -2385 -2908 -1872 -232 1694 2707 2650 1251
6830 1251 -776 -2341 -3068 -2002 -105 1883 2908 2621 1169 -650 -2322 -2918 -2065 -211 1770 3063
6846 3063 2615 1157 -821 -2292 -3006 -1875 -51 1743 2857 2709 1431 -664 -2278 -2747 -1925 155
6862 155 1933 3073 2414 891 -1177 -2023 -2590 -1792 155 1994 3218 2281 701 -1015 -2374 -2806 -1950
6879 -1950 77 1941 2516 2557 890 -1014 -2461 -2785 -1493 150 1896 2985 2320 911 -1019 -2246
$$ packed form
6763e91J834J443K24j485j853j955n15M04J992K003J267P4j341k031j655q20O04
6780b401J843J636J669o4q29k298k060m02P78J479K162J318O9j663j480k116o15
6797b974N73J904J853J655j04j575k003j611q05R62J575K102J075j8j729j495
6813f15j411r36R87J595K288R07p4j250k289j587n23J036J640J926J013n7j399
6830A251k027j565p27J066J897J988J025k87j452j819j672n96Q53J854J981J293
6846C063m48j458j978j471p14J131J824J794J114j48j278k095j614m69Q22K080
6862A55J778J140o59j523k068q46n67P98J947J839J224r37j580j716j359m32Q56
6879a950K027J864N75M1j667j904j447l24J292J643J746J089o65j409j930j227
$$ plain form
6895 -2246 -2708 -1611 144 1899 3038 2578 502 -1131 -2661 -2732 -1508 120 2097 2909 2450 452
6911 452 -965 -2249 -2610 -1606 431 2013 2982 2225 709 -1406 -2833 -2475 -1830 508 1951 2665 1911
6928 1911 698 -1461 -2469 -2698 -1471 514 1917 2823 2138 642 -1383 -2496 -2526 -1239 650 2177
6944 2177 2795 2015 585 -1622 -2531 -2320 -1211 755 2282 2752 2131 353 -1312 -2177 -2262 -1209 388
6961 388 2006 2925 2108 550 -1242 -2830 -2528 -1428 671 2150 2808 1614 278 -1453 -3015 -2585
6977 -2585 -1113 612 1901 2423 1749 -79 -1797 -2681 -2400 -1269 447 2310 2746 1821 324 -1804
6993 -1804 -2650 -2225 -940 987 2361 2706 1818 209 -1781 -2486 -2088 -871 766 2349 2738 1779 -28
7010 -28 -1581 -2776 -2436 -776 600 2365 2384 1604 -44 -1781 -2634 -2510 -742 618 2226 2652 1324
$$ packed form
6895b246m62J097J755J755J139m60k076j633j530p1J224J628J977Q12m59j998
6911D52j417j284l61J004K037J582R69p57j516k115j427L58O45K338J443P14p54
6928A911j213k159j008k29J227J985J403R06o85j496k025j113l0J287J889J527
6944B177O18p80j430k207r09K11J109J966J527M70o21j778j665q65q5J053J597
6961C88J618R19q17j558j792j588L02J100K099J479O58j194j336j731j562M30
6977b585J472J725J289N22o74j828j718q84K81J131J716J863M36r25j497k128
6993a804q46M25J285J927J374L45q88j609j990p05L98J217J637J583L89r59j807
7010b8j553j195L40J660J376J765J9p80j648j737q53J24J768J360J608M26j328
$$ plain form
7027 1324 -36 -1856 -3036 -2407 -1075 1032 2034 2299 1528 -182 -2092 -3039 -1843 -692 974 2012
7043 2012 2989 1856 -168 -2111 -2613 -2018 -691 1122 2527 2798 1379 32 -1809 -2587 -2182 -590
7059 -590 1228 2485 2439 1463 -338 -1641 -2625 -2150 -662 1644 2078 2387 1150 -614 -2113 -2835 -2238
7076 -2238 -1083 998 2163 2201 1423 -284 -2297 -2353 -2429 -415 1034 2543 2537 1437 -417 -2244 -2552 -1974
7094 -1974 -413 1103 2218 2312 1005 -691 -1785 -2492 -1817 -13 1492 2318 2462 1221 -399 -2001
7110 -2001 -2429 -1845 -301 1543 2432 2185 1056 -566 -2383 -2912 -2034 -286 1345 2367 2092 905 -632
7127 -632 -2031 -2566 -2055 -107 1409 2406 2217 1013 -727 -2285 -2729 -1562 -92 1641 2353 2315 964
7144 964 -811 -2066 -2649 -1635 126 1819 2605 1987 926 -662 -2268 -2234 -1778 6 1800 2793 2447
$$ packed form
7027A324j360j820j180O29J332K107J002K65p71j710j910r47J196J151J666J038
7043B012R77j133k024j943n02N95J327J813J405K71j419j347j841p78M05J592
7059e90J818J257m6r76j801j303r84M75J488K306M34L09j237j764j499p22N97
7076b238J155K081J165L8p78j707k013n6p6K014J449J509oj100j854j827l08N78
7094a974J561J516J115R4j307j696j094p07O75J804J505Q26J44j241j620j602
7110b001m28N84J544J844Q89k47j129j622j817n29Q78J748J631J022k75j187j537
7127f32j399n35N11J948J516R97j89j204j740j558m44J167J470J733P12l8j351
7144I64j775j255n83J014J761J693P86o18j061j588j606L4M56J784J794R93l46
$$ plain form
7161 2447 676 -1074 -2545 -2538 -1524 7 1719 2505 2065 715 -835 -2482 -2803 -1562 86 1692
7177 1692 2714 1893 694 -759 -2520 -2469 -1745 98 1655 2662 2423 747 -1369 -2180 -2654 -1291 594
7194 594 1641 2445 2112 672 -1049 -2106 -2440 -1187 270 1937 2871 2282 588 -1165 -2018 -2602 -1271
7211 -1271 420 2018 2468 2017 589 -1242 -2254 -2408 -1492 105 1841 2540 1958 478 -1353 -2210 -2711
7228 -2711 -1539 222 1752 2714 1750 460 -1173 -2450 -2499 -1068 589 1651 2541 1748 438 -1031
7244 -1031 -2464 -2458 -1118 346 2174 2501 2253 318 -1340 -2560 -2473 -1296 463 2055 2537 1987 519
7261 519 -1486 -2561 -2461 -1275 448 1801 2522 1986 646 -1417 -2354 -2111 -837 904 1774 2466 1631
7278 1631 176 -1425 -2233 -2209 -1253 596 2185 2341 1736 133 -1456 -2396 -2244 -976 796 2132 2351
$$ packed form
7161B447j771j750j471PJ014J531J712P86m40j350j550j647l21J241J648J606
7177A692J022q21j199j453j761N1P24J843J557J007k39j676k116q11m74J363J885
7194E94J047Q04l33j440j721j057l34J253J457J667R34n89j694j753q53n84J331
7211a271J691J598M50m51j428j831j012j54R16J597J736O99n82j480j831q57n01
7228b711J172J761J530R62r64j290j633j277m9J431J657J062Q90p93j310j469
7244a031j433OJ340J464J828L27k48j935j658j220Q7J177J759J592M82n50j468
7261E19k005j075J00J186J723J353P21n36j340k063r37K43J274J741Q70O92q35
7278A631j455j601q08K4R56J849J589J56o05j603j589r40J52J268J772J336K19
$$ plain form
7295 2351 1819 445 -1189 -2036 -2130 -727 988 2024 2624 1757 -141 -1377 -2276 -2031 -685 769 2132
7312 2132 2448 1864 44 -1638 -2310 -2197 -808 925 2550 2470 1486 -8 -1406 -2499 -2199 -758 666
7329 666 2137 2158 1690 -108 -1710 -2575 -2095 -777 912 2054 2400 1749 -169 -1842 -2245 -1878 -919 1279
7347 1279 2303 2301 1517 -174 -1301 -2126 -1716 -538 1356 2309 2366 1231 -317 -1575 -2340 -1716 -642 1278
7365 1278 1963 2153 1460 -439 -1986 -2268 -1882 -432 1076 2548 2337 1538 -424 -1746 -2426 -1892 -502
7382 -502 1283 2478 1884 1045 -197 -1814 -2466 -2092 -369 969 2287 2293 1248 -384 -1722 -2289 -1624
7399 -1624 -322 1131 2442 1785 919 -556 -1948 -2354 -1709 -197 1312 2183 2135 1220 -754 -1646 -2225
7416 -2225 -1642 -7 1423 2302 2463 1136 -541 -1853 -2361 -2115 -207 1291 2165 2180 1048 -598 -2029
$$ packed form
7295B351n32j374j634q47r4J403J715J036O00q67j898j236q99K45J346J454J363
7312B132L16n84j820j682o72J13J389J733J625q0r84j494j398j093L00J441J424
7329F66J471K1m68j798j602q65M80J318J689J142L46o51j918j673m03L67R59K198
7347A279J024kp84j691j127q25M10J178J894R53N7j135j548j258p65O24J074J920
7365A278O85J90o93j899j547k82L86J450J508J472k11p99j962j322o80N34J390
7382e02J785J195n94q39j242j617o52L74J723J338J318Oj045j632j338n67O65
7399a624J302J453J311o57q66j475j392m06O45J512J509Q71m8r15j974q92n79
7416b225N83J635J430Q79J61j327j677j312n08K46J908J498Q74J5j132j646j431
$$ plain form
7433 -2029 -2343 -1549 11 1145 2332 2077 867 -790 -1913 -2437 -1712 -20 1664 2374 1965 1014 -616
7450 -616 -1991 -2501 -1533 -121 1278 2235 2111 1043 -859 -2092 -2289 -1245 -196 1594 2150 2086 898
7467 898 -910 -1840 -2165 -1648 179 2026 2544 2024 565 -664 -1862 -2256 -1539 -98 1661 2075 1779
7484 1779 804 -1104 -2055 -2479 -1317 -61 1311 2197 1835 649 -850 -1862 -2393 -1424 400 1640 2114
7501 2114 1734 395 -974 -2025 -2188 -1407 -57 1602 2213 1994 664 -997 -2205 -1759 -1322 382 1393
7518 1393 2158 2151 716 -1153 -1836 -2149 -1372 614 1821 2374 1755 575 -1120 -1909 -2279 -1194 113 1764
7536 1764 2235 1944 513 -1035 -2107 -2240 -710 356 1596 2235 1836 167 -1003 -2176 -1835 -1046 465
7553 465 1904 2108 1610 550 -1074 -1680 -1544 -1102 477 1944 2271 1931 241 -1037 -2201 -2112 -1049
$$ packed form
7433b029l14P94J560J134J187k55j210j657j123n24P25J692J684P10m09r51j630
7450f16j375n10R68J412J399R57j24j068j902j233j97J044J049J790N56o4j188
7467H98j808r30l25N17J827J847N18n20j459j229j198l94P17J441J759M14k96
7484A779r75j908r51m24J162J256J372Q86l62j186j499j012n31R69J824J240M74
7501B114l80j339j369j051j63P81J350J659O11k19j330j661j208M46M37J704J011
7518A393P65pj435j869o83l13P77J986J207N53o19j180j695p89l70J085J307J651
7536A764M71k91j431j548j072j33J530J066J240O39l99j669j170j173L41P89J511
7553D65J439K04m98j060j624o06J36M42J579J467L27l40j690j278j164Q9J063
$$ plain form
7570 -1049 667 1625 2399 1633 40 -1127 -2256 -2047 -1121 462 1950 2409 1644 211 -1358 -1999 -1995 -969
7588 -969 564 2119 1874 1477 127 -1242 -2154 -2367 -1193 418 1845 2092 1732 171 -1329 -2162 -1853
7605 -1853 -878 615 2014 2017 1475 -101 -1175 -2217 -1613 -593 582 1872 2237 1440 206 -1307 -2471
7622 -2471 -1937 -665 997 2098 2243 1389 -169 -1429 -2140 -1656 -833 655 2024 1965 1442 -159 -1553
7639 -1553 -2196 -2022 -927 866 1558 1828 848 15 -1854 -2038 -1984 -912 822 1813 1983 1061 -39 -1551
7657 -1551 -2216 -1758 -559 965 1848 2148 1308 -281 -1343 -2262 -1508 -438 1093 1953 2205 1300 -258
7674 -258 -1959 -2171 -1741 -560 962 2239 1885 992 -323 -1748 -1959 -2172 -552 1025 1907 1885 1246 -486
7692 -486 -1534 -1939 -1693 -404 835 1603 1813 967 -286 -1827 -2135 -1698 -360 1024 1789 2028 1014
$$ packed form
7570a049J716R58P74p66j593j167j129K09R26J583J488M59p65j433j569o41MJ026
7588i69J533J555k45l97j350j369r12k13J174J611J427K47l60j561j500q33L09
7605a853R75J493J399Ln42j576j074j042O04J020J175J290L65p97j234j513j164
7622b471N34J272J662J101J45q54j558j260p11M84Q23J488J369n9n23j601j394
7639a553o43J74J095J793O92K70r80q33j869j84N4J072J734R91J70r22j100j512
7657a551o65M58J199J524Q83L00q40j589j062r19P54J070J531Q60K52r05j558
7674b58j701k12M30J181J522J277l54q93j315j425k11k13J620J577Q82k2o39j732
7692d86j048m05K46J289J239P68K10q46j253j541l08M37J338J384P65K39j014
$$ plain form
7709 1014 -398 -1869 -2035 -1672 -89 1293 1996 2119 787 -430 -1635 -2228 -1599 -37 1350 2013 1716
7726 1716 876 -534 -1726 -2152 -1311 -277 1233 2123 1817 660 -713 -1879 -2141 -1607 -137 1165 1817
7743 1817 1727 948 -589 -1930 -2322 -1543 -88 1405 2000 1426 848 -511 -1610 -2099 -1288 116 1344
7760 1344 2191 1909 939 -597 -1649 -1864 -1179 36 1554 2021 1702 748 -775 -1456 -1957 -1226 139 1059
7778 1059 2098 1673 680 -802 -1875 -2356 -1415 -2 1498 2081 1707 497 -822 -2163 -2349 -1441 -185
7795 -185 1399 1929 1691 470 -948 -1762 -2129 -1422 130 1270 1970 1829 691 -1182 -2096 -1852 -1208 194
7813 194 1710 2279 1636 350 -903 -1835 -1868 -1206 297 1571 2246 1795 223 -1039 -1665 -1751 -978 114
7831 114 1302 2089 1613 496 -1133 -1786 -1877 -1021 391 1478 1855 1614 258 -1092 -1737 -1529 -1219 564
$$ packed form
7709A014j412j471j66L63J583J382P03J23j332j217j205n93O29J562J387O63k97
7726A716q40j410j192m26Q41J034J510Q90l06j157j373j166k62N34J470J302O52
7743A817r0p79j537j341l92P79J455J493N95n74n78j359j099m89Q11J404J228
7760A344Q47k82r70j536j052k15O85J215J518M67l19r54j523o81n01P31J365R20
7778A059J039m25r93j482j073m81R41J413J500N83l74j210j319j341j86R08J256
7795a85J584N30k38j221j418q14l67P07J552J140P00j41j138j873r14K44O44J402
7813A94J516N69o43j286j253r32l3O62J503J274O75m51j572j262o26q6P73J092
7831A14J188P87m76j117j629o53r1Q56J412J087L77k41j356j350o45K08L10J783
$$ plain form
7849 564 1625 1902 1630 371 -1093 -1701 -1637 -1068 733 1622 2123 1438 333 -828 -1846 -1661 -720 523
7867 523 1565 2226 1784 378 -983 -2264 -1788 -1069 373 1645 2138 1748 145 -957 -2226 -1920 -845
7884 -845 288 1718 2184 1609 385 -1252 -1954 -1977 -739 451 1882 2028 1418 59 -1218 -2127 -1961
7901 -1961 -627 654 1765 1900 1457 -150 -1234 -1942 -1647 -836 518 1856 1531 1494 -28 -1006 -1939
7918 -1939 -1953 -345 951 1573 1933 1561 1 -1311 -2010 -1662 -750 561 1550 2001 1102 -149 -1140 -1866
7936 -1866 -1673 -839 602 1650 1854 1174 -74 -1415 -1905 -1645 -632 468 1631 1838 1227 -254 -1310
7953 -1310 -1939 -1520 -432 684 1660 1677 1069 -154 -1656 -1990 -1554 -469 782 1650 2172 886 -199
7970 -199 -1511 -1828 -1781 -308 1079 1746 1862 915 -100 -1440 -2131 -1759 -538 964 1705 1974 1031 -342
$$ packed form
7849E64J061K77k72j259j464o08O4N69J801Q89N01o85j105j161j018J85R41J243
7867E23J042O61m42j406j361j281M76P19J442J272M93l90j603j102j269L06J075
7884h45J133J430M66n75j224j637p02k3J238J190J431J46o10j359j277r09J66
7901a961J334J281J111J35m43j607j084p08K95Q11J354J338l25l7j522r78r33
7918a939j4J608J296O22L60l72j560j312o99L48R12J311R89M51q99j251r91p26
7936a866J93Q34J441J048K04o80j248j341m90K60J013J100J163K07o11j481j056
7953a310o29M19J088J116R76J7o08j223j502l34M36J085J251Q68N22j286j085
7970a99j312l17M7J473J387O67J16r47j015j340o91L72J221J502P41K69r43j373
$$ plain form
7988 -342 -1340 -1876 -1413 -472 1020 1658 1680 1059 -415 -1626 -1938 -1816 -129 1036 1767 1777 908 -287 -1647
8007 -1647 -1766 -1341 76 1108 1962 1865 812 -387 -1618 -2026 -1432 -57 1051 1886 1965 876 -246
8024 -246 -1639 -1813 -1369 -325 1116 2073 1955 763 -385 -1475 -1797 -1196 -105 985 1822 2037 883
8041 883 -195 -1840 -1819 -1335 181 1101 1810 1867 877 -444 -2114 -1864 -1322 -156 1116 2182 1873 708
8059 708 -700 -1652 -1500 -1251 8 931 1879 1649 534 -677 -1830 -1917 -851 -324 1163 1810 1643 442
8077 442 -529 -1843 -1825 -1203 142 1042 1754 1644 417 -850 -1625 -2031 -1211 54 1221 2116 1715 591
8095 591 -664 -1912 -1887 -1015 59 1176 1920 1481 577 -885 -1846 -1856 -972 -56 1106 2006 1758 403
8113 403 -782 -1761 -2001 -1218 35 1480 1808 1573 69 -919 -1646 -1426 -898 258 1225 2040 1521 282
$$ packed form
7988c42r98n36M63R41J492O38K2o21j474j211l12J22J687J165P31J0q69j195j360
8007a647j19M25J417J032Q54r7j053j199j231m08N94J375J108Q35P9j089j122
8024b46j393j74M44J044J441R57j18j192j148j090l22O01J091J090Q37K15j154
8041H83j078j645K1M84J516R20P09N7r90j321j670K50N42J166J272J066l09j165
8059G08j408r52J52K49J259R23R48k30j115j211j153q7J066N27J487O47j67j201
8077D42r71j314J8O22J345R00P12j10j227j267p75m06Q20J265J167Q95m01j124
8095E91j255j248K5Q72J074J117P44m39r04j462r61j0Q84R16J162R00k48j355
8113D03j185r79k40P83J253J445L28k35j504r88p27K20N28J156R67Q15n19j239
$$ plain form
8131 282 -733 -1772 -1769 -794 430 1395 1914 1600 416 -699 -1865 -1533 -937 363 1344 1919 1305 20
8149 20 -962 -1729 -1686 -908 198 1365 1502 1355 614 -956 -1801 -1687 -814 319 1769 1828 1453 140 -845
8168 -845 -1389 -1598 -859 298 1398 1810 1584 305 -743 -1460 -1797 -712 665 1466 1844 1403 189 -1095
8186 -1095 -2019 -1945 -1200 334 1591
8191 1591
$$ packed form
8131B82j015j039LR75J224R65N19l14j184j115j166L32N96J300R81N75o14j285
8149B0r82p67M3P78J106J167J37j47p41j570q45J14Q73J133J450N9l75j313r85
8168h45n44k09P39J157J100M12k26j279j048p17l37J085J377Q01L78m41j214j284
8186a095r24P4P45J534J257
8191A591
$$ Imaginary data points
##PAGE= N=2
##DATA TABLE= (X++(I..I)), XYDATA
$$ plain form
0 0 0 0 0 0 0 0 8 -8 8 -9 16 -17 24 -25 33 -40 49 -57 67 -81 92 -108 125 -144 166 -190 218 -245 277 -316
30 -316 354 -396 446 -497 556 -620 690 -766 848 -942 1043 -1154 1279 -1416 1570 -1741 1934
47 1934 -2156 2410 -2707 3059 -3477 3997 -4655 5514 -6703 8451 -11290 16696 -30730 146327
61 146327 305166 60643 9929 17448 -49632 -151519 -41425 105817 122115 72724 98023
72 98023 50930 -106653 -207445 -131095 -17197 49489 89352 113807 73298 -1954 -77662 -131459
84 -131459 -137341 -58137 50969 119985 123503 67769 -39015 -124369 -133741 -100693 -62744 14659
96 14659 108623 127202 66487 2695 -66554 -144939 -122653 29760 136945 113305 101950 142321
108 142321 74810 -88526 -125346 -23623 21984 24263 125329 208937 89289 -92607 -107959
$$ packed form
0@%%%%%%Qj6J6j7K5l3M1m9N8p3Q9j06J24j48J73k00K33k69L10l56M08m63N22n93
30c16O70p50Q42r43J053j176J310j456J614j790J985k197K433k695K986l311L675
47A934m090M566n117N766o536P474q652J0169j2217J5154j9741K7986m7426J77057
61A46327J58839k44523n0714P519o7080j01887J10094J47242J6298m9391K5299
72I8023m7093j57583j00792P6350J13898O6686L9863K4455m0509p5252p5708n3797
84a31459n882P9204J09106O9016L518n5734j06784q5354r372L3048L7949P7403
96A4659R3964J8579o0715o3792o9249p8385K2286J52413J07185k3640j1355M0371
108A42321o7511j63336l6820J01723M5607K279J01066Q3608j19648j81896j5352
$$ plain form
119 -107959 -50277 -84241 -96869 30780 146996 110034 21480 -23672 -82130 -153132 -127931
130 -127931 -10094 78412 93723 80477 48925 -13462 -84410 -129884 -121318 -39653 70198 120614
142 120614 94012 40060 -25493 -98609 -122102 -69497 -3490 44689 106680 147117 86069 -29409
154 -29409 -84349 -80395 -67416 -6026 105168 148070 89212 42299 28876 -48851 -144373 -104350
166 -104350 29602 89342 79697 94682 78161 -39150 -137447 -107138 -42519 -29158 10246 102904
178 102904 126149 31999 -69631 -108361 -113799 -93372 -23125 59294 93073 75219 29105 -36004
190 -36004 -94370 -113542 -86521 -16960 75884 130133 98720 25190 -25890 -62166 -93141 -69707
202 -69707 14849 84199 104017 103843 69802 -26222 -112078 -102476 -40534 3570 49615 107416 101934
$$ packed form
119a07959N7682l3964j2628J27649J16216l6962q8554m5152n8458p1002K5201
130a27931J17837Q8506J5311j3246l1552o2387p0948m5474Q566Q1665J09851N0416
142A20614k6602n3952o5553p3116k3493N2605O6007M8179O1991M0437o1048j15478
154b9409n4940L954J2979O1390J11194M2902n8858m6913j3423p7727r5522M0023
166a04350J33952N9740r645J4985j6521j17311r8297L0309O4619J3361L9404R2658
178A02904K3245r4150j01630l8730n438K0427P0247Q2419L3779j7854m6114o5109
190c6004n8366j9172K7021O9561R2844N4249l1413p3530n1080l6276l0975K3434
202f9707Q4556O9350J9818j74l4041r6024q5856R602O1942M4104M6045N7801n482
$$ plain form
215 101934 20159 -48170 -72889 -99938 -100364 -13863 91249 104342 51989 13459 -31308 -105991
227 -105991 -136173 -79102 -5823 32301 60992 72405 17177 -79892 -134599 -122384 -78317 -20777
239 -20777 42481 78144 65748 18020 -45997 -99804 -106750 -60544 7151 68691 107968 92599
251 92599 21606 -48713 -77781 -80642 -63447 -1283 79043 106159 70966 20573 -33327 -93425
263 -93425 -108534 -48023 28384 66361 84444 88552 39244 -48108 -94994 -80114 -45574 2030
$$ packed form
215A01934q1775o8329k4719k7049m26Q6501J05112J3093n2353l8530m4767p4683
227a05991l0182N7071P3279L8124K8691J1413n5228r7069n4707J2215M4067N7540
239b0777O3258L5663j2396m7728o4017n3807o946M6206O7695O1540L9277j5369
251I2599p0993p0319k9068k861J7195O2164Q0326K7116l5193n0393n3900o0098
263i3425j5109O0511P6407L7977J8083M108m9308q7352m6886J4880L4540M7604
$$ [...]
8191I80
##END NTUPLES=NMR FID
##END=
