##TITLE=1H_SA_36.138
 CDCl3, 24 sc, 
 23.9.2019
##JCAMPDX= 6.0         $$ Bruker NMR JCAMP-DX V2.0
##DATA TYPE= NMR FID
##DATA CLASS= NTUPLES
##ORIGIN= UXNMR, Bruker Analytische Messtechnik GmbH
##OWNER= root
$$ XWIN-NMR		Version 3.5
$$ Mon Sep 23 14:28:51 2019 Russian Standard Time (UT+4h)  she@DPX200
##.OBSERVE FREQUENCY= 200.1315
##.OBSERVE NUCLEUS= ^1H
##.DELAY= (6, 6)
##.ACQUISITION MODE= SIMULTANEOUS
##.ACQUISITION SCHEME= undefined
##.AVERAGES= 24
##.DIGITISER RES= 18
##SPECTROMETER/DATA SYSTEM= spect
##.PULSE SEQUENCE= zg30
##.SOLVENT NAME= CDCl3
##.SHIFT REFERENCE= (INTERNAL, CDCl3, 0, 15.7039)
##AUDIT TRAIL= $$ (NUMBER, WHEN, WHO, WHERE, WHAT)
$$ ##TITLE= Audit trail, XWIN-NMR		Version 3.5
$$ ##JCAMPDX= 5.01
$$ ##ORIGIN= Bruker BioSpin GmbH
$$ ##OWNER= she
$$ F:/spectra/data/she/nmr/H-F/1/audita.txt
$$ ##AUDIT TRAIL=  $$ (NUMBER, WHEN, WHO, WHERE, WHAT)
(   1,<2019-09-23 14:27:58.95 +0400>,<she>,<DPX200>,
      <continue with go, POWCHK disabled, PULCHK disabled
       configuration hash MD5:
       00 E9 B6 7A A2 85 ED C7 34 08 36 98 17 FE 4E 26
       data hash MD5: 16K
       8B 1D 36 EC 57 D9 6D F7 AD FE 5B 13 E8 AD 08 5B>)
$$ ##END=
$$ 
$$ hash MD5
$$ 6B 40 FE 78 3E 3E 08 FB 32 BB 6E F7 A0 6C D4 53
##$RELAX= 
##$RELAX= 
##$RELAX= 
##$RELAX= 
##$RELAX= 
##$RELAX= 
$$ Bruker specific parameters
$$ --------------------------
##$DU= <F:/spectra>
##$EXPNO= 1
##$NAME= <H-F>
##$PROCNO= 1
##$TYPE= <nmr>
##$USER= <she>
##$AMP= (0..31)
100 100 100 100 100 100 100 100 100 100 100 100 100 100 100 100 100 100 
100 100 100 100 100 100 100 100 100 100 100 100 100 100 
##$AQSEQ= 0
##$AQ_mod= 1
##$AUNM= <au_zg>
##$AUTOPOS= <>
##$BF1= 200.13
##$BF2= 200.13
##$BF3= 200.13
##$BF4= 200.13
##$BF5= 200.13
##$BF6= 200.13
##$BF7= 200.13
##$BF8= 200.13
##$BYTORDA= 1
##$CFDGTYP= 0
##$CFRGTYP= 5
##$CHEMSTR= <none>
##$CNST= (0..31)
1 1 145 1 1 1 1 1 1 1 1 1 1 1 1 1 1 1 1 1 1 1 1 1 1 1 1 1 1 1 1 1 
##$CPDPRG= <>
##$CPDPRG1= <>
##$CPDPRG2= <>
##$CPDPRG3= <>
##$CPDPRG4= <mlev>
##$CPDPRG5= <mlev>
##$CPDPRG6= <mlev>
##$CPDPRG7= <mlev>
##$CPDPRG8= <mlev>
##$CPDPRGB= <>
##$CPDPRGT= <>
##$D= (0..31)
0 1.2 0 0 0 0 0 0 0 0.06 0 0.03 0 0 0 0 0.0002 0 0 0 0 0 0 0 0 0 0 0 0 
0 0 0 
##$DATE= 1569234376
##$DBL= (0..7)
120 120 120 120 120 120 120 120 
##$DBP= (0..7)
150 150 150 150 150 150 150 150 
##$DBP07= 0
##$DBPNAM0= <>
##$DBPNAM1= <>
##$DBPNAM2= <>
##$DBPNAM3= <>
##$DBPNAM4= <>
##$DBPNAM5= <>
##$DBPNAM6= <>
##$DBPNAM7= <>
##$DBPOAL= (0..7)
0.5 0.5 0.5 0.5 0.5 0.5 0.5 0.5 
##$DBPOFFS= (0..7)
0 0 0 0 0 0 0 0 
##$DE= 6
##$DECBNUC= <off>
##$DECIM= 24
##$DECNUC= <off>
##$DECSTAT= 4
##$DIGMOD= 1
##$DIGTYP= 9
##$DL= (0..7)
0 120 120 120 120 120 120 120 
##$DP= (0..7)
150 150 150 150 150 150 150 150 
##$DP07= 0
##$DPNAME0= <>
##$DPNAME1= <>
##$DPNAME2= <>
##$DPNAME3= <>
##$DPNAME4= <>
##$DPNAME5= <>
##$DPNAME6= <>
##$DPNAME7= <>
##$DPOAL= (0..7)
0.5 0.5 0.5 0.5 0.5 0.5 0.5 0.5 
##$DPOFFS= (0..7)
0 0 0 0 0 0 0 0 
##$DQDMODE= 0
##$DR= 18
##$DS= 0
##$DSLIST= <SSSSSSSSSSSSSSS>
$$ [...]
##$SUBNAM2= <"">
##$SUBNAM3= <"">
##$SUBNAM4= <"">
##$SUBNAM5= <"">
##$SUBNAM6= <"">
##$SUBNAM7= <"">
##$SUBNAM8= <"">
##$SUBNAM9= <"">
##$SW= 24.0689530833862
##$SWIBOX= (0..15)
0 0 2 0 0 0 0 0 0 0 0 0 0 0 0 0 
##$SW_h= 4816.95568400771
##$TD= 16384
##$TD0= 1
##$TE= 0
##$TE2= 300
##$TE3= 300
##$TEG= 300
##$TL= (0..7)
0 120 120 120 120 120 120 120 
##$TP= (0..7)
150 150 150 150 150 150 150 150 
##$TP07= 0
##$TPNAME0= <>
##$TPNAME1= <>
##$TPNAME2= <>
##$TPNAME3= <>
##$TPNAME4= <>
##$TPNAME5= <>
##$TPNAME6= <>
##$TPNAME7= <>
##$TPOAL= (0..7)
0.5 0.5 0.5 0.5 0.5 0.5 0.5 0.5 
##$TPOFFS= (0..7)
0 0 0 0 0 0 0 0 
##$TUNHIN= 0
##$TUNHOUT= 0
##$TUNXOUT= 0
##$USERA1= <user>
##$USERA2= <user>
##$USERA3= <user>
##$USERA4= <user>
##$USERA5= <user>
##$V9= 5
##$VALIST= <valist>
##$VCLIST= <CCCCCCCCCCCCCCC>
##$VD= 0
##$VDLIST= <DDDDDDDDDDDDDDD>
##$VPLIST= <PPPPPPPPPPPPPPP>
##$VTLIST= <TTTTTTTTTTTTTTT>
##$WBST= 1024
##$WBSW= 4
##$XGAIN= (0..3)
0 0 0 0 
##$XL= 0
##$YL= 0
##$YMAX_a= 185533
##$YMIN_a= -173861
##$ZGOPTNS= <>
##$ZL1= 120
##$ZL2= 120
##$ZL3= 120
##$ZL4= 120
##$ABSF1= 10
##$ABSF2= 0
##$ABSG= 5
##$ABSL= 3
##$ALPHA= 0
##$AQORDER= 0
##$ASSFAC= 0
##$ASSFACI= 0
##$ASSFACX= 0
##$ASSWID= 0
##$AUNMP= <proc_1d>
##$AZFE= 0.1
##$AZFW= 0.1
##$BCFW= 1
##$BC_mod= 2
##$BYTORDP= 1
##$COROFFS= 0
##$CY= 11.3945322036743
##$DATMOD= 1
##$DC= 2
##$DFILT= <>
##$DTYPP= 0
##$F1P= 20.1720416913024
##$F2P= 0.152960286110954
##$FCOR= 0.5
##$FTSIZE= 0
##$FT_mod= 4
##$GAMMA= 1
##$GB= 0.15
##$INTBC= 1
##$INTSCL= 1
##$ISEN= 128
##$LB= 0.24
##$LEV0= 0
##$LPBIN= 0
##$MAXI= 10000
##$MC2= 0
##$MEAN= 0
##$ME_mod= 0
##$MI= 1.114404
##$NCOEF= 0
##$NC_proc= 0
##$NLEV= 6
##$NOISF1= 3.799351
##$NOISF2= 2.8
##$NSP= 1
##$NTH_PI= 0
##$NZP= 0
##$OFFSET= 15.70392
##$PC= 1
##$PHC0= -9578.753
##$PHC1= 34.40096
##$PH_mod= 1
##$PKNL= yes
##$PPARMOD= 0
##$PSCAL= 0
##$PSIGN= 0
##$REVERSE= no
##$SF= 200.130013532006
##$SI= 16384
##$SIGF1= 3
##$SIGF2= 2
##$SINO= 400
##$SIOLD= 16384
##$SREGLST= <1H.CDCl3>
##$SSB= 0
##$STSI= 0
##$STSR= 0
##$SW_p= 3612.71676300578
##$SYMM= 0
##$S_DEV= 0
##$TDeff= 0
##$TDoff= 0
##$TI= <>
##$TILT= no
##$TM1= 0
##$TM2= 0
##$TOPLEV= 0
##$USERP1= <user>
##$USERP2= <user>
##$USERP3= <user>
##$USERP4= <user>
##$USERP5= <user>
##$WDW= 1
##$XDIM= 8192
##$YMAX_p= 0
##$YMIN_p= 0
$$ End of Bruker specific parameters
$$ ---------------------------------
##NTUPLES= NMR FID
##VAR_NAME=  TIME,          FID/REAL,        FID/IMAG
##SYMBOL=    X,             R,               I
##VAR_TYPE=  INDEPENDENT,   DEPENDENT,       DEPENDENT
##VAR_FORM=  AFFN,          ASDF,            ASDF
##VAR_DIM=   8192,          8192,            8192
##UNITS=     SECONDS,       ARBITRARY UNITS, ARBITRARY UNITS
##FACTOR=    0.0002076,     1,               1
##FIRST=     0,             0,               0
##LAST=      1.7004516,     0,               0
##MIN=       0,             -173861,         0
##MAX=       1.7004516,     185533,          0
$$ Real data points
##PAGE= N=1
##DATA TABLE= (X++(R..R)), XYDATA
0@%%%%%%%%%%K4m8M8m8M8p1R5r6J20j44J68j99K23k64L08l51L99m53N18n85O61
31C53p47Q35r36J047j165J294j440J602j776J969k180K413k671K958l280L640
47A916m051M518n057N687o438P354q488R944j1890J4647j8889K6328m3212J50869
61A23238J1003j79733J43424Q7601o9691q7229P1540J1814p0829j0651P9622k9411
73H0698r4286N315R0380j5956q9616j5377O6391J8275l6902l0108M661J2351K2863
86A8689J0323j9609l0719M910L7482K8133j8283m2735j0082M3476L5676k4806
98C2455m5143m850K5182J7109m787k4160l1046L559M0617O354n5746k9891M6493
111b3854L5023l8051l5222J9893J4188j1021K0028K3523m8340m4962O5374P7382
$$ y = [0, 0, 0, 0, 0, 0, 0, 0, 0, 0, 0, 24, -24, 24, -24, 24, -47, 48, -48, 72, -72, 96, -103, 120, -144, 164, -187, 212, -241, 277, -308, 353, -394, 441, -495, 552, -613, 681, -759, 843, -933, 1036, -1144, 1269, -1402, 1556, -1724, 1916, -2135, 2383, -2674, 3013, -3425, 3929, -4559, 5385, -6505, 8142, -10747, 15581, -27631, 123238, 134241, -45492, 97932, 185533, 115842, 28613, 100153, 111967, 41138, 30487, 110109, 80698, -13588, -8273, 82107, 66151, -23465, -38842, 27549, 45824, 8922, -21186, -16525, -4174, 18689, 29012, 9403, -21316, -16406, 21076, 49209, 30926, -11809, -21891, 21585, 57261, 32455, -12688, -17538, 7644, 24753, 19966, -4194, -35240, -31681, 8936, 15290, -40456, -70347, -23854, 11169, -26882, -62104, -42211, -28023, -39044, -19016, 4507, -43833, -88795, -23421, 53961]
123E3961n1043q5453L5387Q1091j1208m9425J3676K4889k2586q43M4805l967o0690
136c1406O56P1057J4234o9488k9566N0724L6768k4326l1919j862J1176J3011J0627
149A9686r774k9305r999K8542K9178j3499m2765j4645L3473L2385j6131l8898
161c1752r364K5216K0996n762k1775j7030R392K9036J1809k8440k7715J9620L7913
174A2144R38k9040r912J2986J5195J4284K569k9508k4274L6431M8477k1458n7441
187b8609M168N0118Q628l1166j0543Q375m022N152K3876q308m5126n156N3827
200B1214K1675m8378l3395L3379L8641j0205k4573k038P631J0954J7820L628k6519
213I834j9168K7005L8455r618m3115j1147L4692K4091j5783k9697q412J1966J6392
$$ y = [53961, 2918, -82535, -47148, 33943, 22735, -26690, -13014, 11875, -10711, -11554, 33251, 29284, -31406, -30750, 40307, 54541, -14947, -44513, 6211, 42979, 18653, -13266, -15128, -3952, 9059, 19686, 9912, -19393, -29392, -850, 28328, 14829, -27936, -42581, -9108, 23277, 7146, -31752, -41116, -15900, 5096, -666, -22441, -39471, -30079, -1043, 10766, -17674, -45389, -25769, 12144, 13082, -15958, -25870, -12884, 2311, 16595, 19164, -10344, -34618, 1813, 50290, 28832, -28609, -24441, 25677, 34305, 3139, -7404, 971, -3051, 2101, 25977, 17669, -27457, -32613, 21214, 42889, -5489, -38884, -5505, 33136, 22931, -1642, -3680, 3951, 14905, 32725, 36353, 9834, -9334, 17671, 56126, 46508, 3393, -7754, 26938, 51029, 35246, 5549, -2863, 9103, 25495]
226B5495K855j9967k6081L12K7246J1703k6209l1486P305L0534N912k2315j8202
239c2898K932J4686J5751O52k4283j8270K2484L7305q386m1471q875L4840K1452
252A5919j5409k0508l705M747J1625J4491q838l4135p935L8553K3425l3471l6076
265e1317J6240L3645k09k0705q209L452P761J5501O237k0280j9566J9544L7912
278B0006n51l5543j3756K9855K7481o955k1784q657R653J9279J1810j3835k5657
291h654j505K8809J8002j9102k9991K261K6392J2244j6393j9591j694J3957J5663
304B0398r50k2064j7607J7346L0231k833l0913j3354K1668K2272m335j8454j0880
317i475L715J7174J5703q858k9355q028L0292K2734k1337l1410N876K6622P372
$$ y = [25495, 28350, 8383, -17698, -17386, 9860, 21563, -4646, -36132, -28827, 1707, 7619, -14696, -32898, -29966, -15280, 471, 1123, -23160, -41430, -18946, 18359, 9973, -31498, -40373, -5533, 15919, 510, -19998, -23703, -18956, -7331, 7160, -1678, -35813, -43748, -5195, 18230, -15241, -51317, -35077, -1432, -1641, -22346, -30555, -27103, -19342, -3841, 2396, -17884, -37450, -17906, 20006, 19455, -16088, -29844, 11, 27492, 20537, -1247, -9904, -251, 19028, 30838, 17003, -8654, -10159, 18650, 36652, 17550, -12441, -10180, 16212, 28456, 12063, -7528, -9222, 4735, 20398, 19448, -2616, -20223, -2877, 27354, 24521, -6392, -19746, 1922, 24194, 19859, 1405, -9475, -5760, 11414, 27117, 18259, -11096, -19124, 11168, 33902, 12565, -18845, -12969, 13653, 21025]
330B1025j5267j4600l618Q150J6160M836k1991k1130J3387L1079J88l1494j6561
343b9836K0476K3282l004j8370j2346L061J6680J5890q866k6638n410K6587K0036
356B1542j4444k7216j2K2373J4964q714j8115p575J1288J9746L300k1260j9504
369b3627J3713K8952Q65k7083j6060J4648K1303K233j5584j4372R9J5616J5710
382A6413p205k6142p982K5732K2087j4925k7915N41K1759J1047p682j3062p244
395a4578N293J8017Q982j7425k2877R132L0139O527k6320j7924J5117K0353J489
408A5925j2990j2146j293J4027J6045m429k5387j0177K2210K2543j1036k6659
420a3367l929J8757J3529n740j5520r206N397J7575Q182j7424k2164O278K7740
$$ y = [21025, 5758, -8842, -12460, -4310, 11850, 16686, -5305, -26435, -13048, 18031, 18219, -13275, -29836, -9360, 13922, 10918, -7452, -19798, -16737, -57, 15833, 6967, -19671, -25081, 1506, 21542, 7098, -20118, -20130, 2243, 17207, 8493, -9622, -17197, -5909, 13837, 17137, -4123, -23627, -9914, 19038, 19903, -7180, -23240, -8592, 12711, 14944, -640, -15012, -14913, 703, 16413, 9208, -16934, -24916, 816, 22903, 7978, -19937, -19396, 2363, 13410, 5728, -7334, -14578, -9285, 8732, 17714, 289, -22588, -13456, 16683, 23210, -3110, -21034, -5917, 14436, 15925, 2935, -9211, -10504, 3523, 19568, 15139, -10248, -20425, 1785, 24328, 13292, -13367, -17296, 1461, 14990, 9250, -6270, -15476, -10079, 7496, 15678, -1746, -23910, -17632, 10108]
433A0108O952k1512j7575J0219J9481O110j0834j3223k883J4325J8834j872k3912
446e782j1548K2237K4670j0044k6241l323J8666J2749m805j2535j1339J901J6395
459A1001J1196j4987k4405K581K6212R032k2840j8396R578J7618L551q178j1079
472i116n153J0079J9405K035k2794j2259K0199K3991n694k4216o674J6754J5143
485B1700j457j3036j2246J08J6415J1563j4002k4302r2K3398Q431j9321j9688
498b2529L287J5458N895r091j3794n444R118J6906J552k0573j4114J6482K6325
511I478j962k3578p171J6317J5690N93r370r800M30J5087J4942q615k4974k593
525a5526K5289J3608j8302k0573N162J6631L908p479r095p828N370J8585M871
$$ y = [10108, 17060, -4452, -22027, -11808, 7673, 13783, 2949, -10274, -13157, 1168, 20002, 18130, -5782, -17330, 4907, 29577, 19533, -6708, -10031, 8635, 21384, 16579, 4044, -7295, -5394, 11001, 22197, 7210, -17195, -14614, 11598, 20630, -2210, -20606, -11028, 6590, 10141, 1963, -9116, -14269, -4190, 15215, 17250, -5544, -17803, 2396, 26387, 20693, -3523, -10197, 6557, 21700, 20243, 7207, -5039, -4931, 11484, 23047, 9045, -15257, -15349, 8049, 16480, -2841, -22529, -19242, -3784, 2111, -6980, -20774, -26218, -17100, -194, 1358, -19215, -33329, -16847, 9478, 7516, -16062, -23233, -6916, 8774, 9367, -3, -9803, -9373, 5714, 20656, 12041, -12933, -15526, 9763, 23371, 5069, -15504, -10342, 6289, 10197, 2718, -6377, -14205, -8835, 9750, 14621]
538A4621k0203j7237J5208K5571k520k1404p010J3081J4125J953p220j1070k003
551d108J5083J6457p730k3571l519K2323J3184j3998j8925J070J3675P863n545
564A2259j3621q459O696J6043L717j8008j7117R865K3163P93k2478j0846J0861
577g132J5228J518j1057j0656k862J0884J4175m638k1609q200K0537J6767j3107
590a52k2354J463J6569P436n287r125o947J794J6548J0529j6002j9171J0627K6395
604A2323L393k0727r898J2181J4334K860n672q771m385J0260J6995l516k2594
617c217p506J9949J5314j1052j8073k136J1080R420j452j0913r504L109J6151
630A1170Q115j5233j7688P141K2099N730j5549j3649O298J5526N358p524j2202
$$ y = [14621, -5582, -22819, -7611, 17960, 15440, -5964, -12974, 107, 14232, 16185, 8965, -2105, -4108, 10975, 27432, 19702, -3869, -7388, 14935, 28119, 14121, -4804, -3734, 9941, 17804, 12259, -1362, -9821, -3125, 12918, 16635, -1373, -18490, -8625, 14538, 15331, -7147, -17993, -7132, 8096, 9614, -1443, -12099, -14961, -4077, 10098, 5460, -16149, -24349, -3812, 12955, -152, -22506, -21043, -4474, 2962, -2325, -11450, -18397, -16603, -55, 10474, -5528, -24699, -14072, 12323, 15716, -5011, -14909, -2728, 11606, 14466, 8794, 23, -4362, 5898, 22893, 19377, -3217, -10723, 9226, 24540, 13488, -4585, -6721, 4359, 13779, 12327, 1414, -8090, -4981, 11170, 19285, 4052, -13636, -6495, 15604, 21334, 5785, -7864, -1566, 13960, 19318, 11794, -408]
643d08k169J1263J3044l996j8600j0055J4940J6642p810k1517n097J3176R274
656H687m846j0859q084O83J2824R945j1352j9780K619K2450Q778j6931j3807P647
670a2026J5068K987n375q249n510P218J6917J311k0710j1500J6482J7841p215
683G239j8643m293J1809Q434K0p994j1123r2J4519J1743j0943j8362L705K0782
697F801P523j2334j2090L787J3148Q550m448j0855o546P982J5003o36j7782j1357
711a3254J0852J5864l570j8980r547R084J0874j296j0933r990j122J1132R419
724a467q267j8399l40J8884J1430j2001j5306M546J4579O534l477o280n427M935
738a0056J5615N180j6517j2934J1442J9337k636j9172p318R048Q503j3p507j0334
$$ y = [-408, -2577, 8686, 21730, 17734, -866, -10921, 4019, 20661, 12851, -8666, -13763, -587, 8687, 3841, -7018, -15102, -14419, -1595, 8350, -3002, -22782, -20163, 2287, 11065, -5866, -19673, -12026, 3042, 6029, 654, -7595, -13105, -5887, 11030, 12341, -8369, -19869, -3387, 14454, 7239, -11404, -15697, -3888, 4546, 4566, -3428, -14551, -14643, -124, 11619, 676, -17686, -13981, 6801, 14324, 1990, -10100, -6313, 6835, 15385, 10937, 82, -6464, 1518, 16521, 15885, -1897, -13254, -2402, 13462, 9892, -9088, -18635, -9551, 1323, 27, -10906, -20896, -22018, -10886, -1467, -9734, -28133, -28473, -9589, 1841, -10160, -25466, -20920, -6341, 193, -3284, -9564, -14991, -10056, 5559, 10739, -5778, -18712, -7270, 12067, 9431, -9741, -17059, -8011, 492, 479, -7028, -17362]
752a7362l828J1433J2243p328j9778k014J9005J0639j0922j2115K821J1723Q038
765B555k66p775n792P306J6454M975j2964j1415J0408J7847J615j3210q398P315
779H655J1026K708q148j0776k636J0496J0256o170j7338n628J4397J1724q234
792A0332j7015j492J2140Q040m335r966n929M286J2589N320j2255j3720O052J8619
806A2666K910j5161r851Q488J1672J546n892q093l746Q919J2320k029j7988o521
820a0760J5058J3349q309j5654j829J0585P666j228q817q478K215J3315N766j2945
834f6j4419N991J6521K318j2976j0146M174J0442M649m673j0717l207J0114J1527
848I532k610j4501m628J1584J3931l377j3133m402R051J0589l16q335p807K501
$$ y = [-17362, -21190, -9757, 2486, -4842, -24620, -26634, -7629, 3010, -7912, -20027, -17206, -5483, 2555, 2289, -5486, -11278, -3972, 12482, 17457, 4493, -6922, 3486, 21333, 22948, 9738, 1340, 8655, 19681, 22389, 14241, 3465, 829, 11325, 21581, 15411, -1927, -7555, 6842, 18566, 10332, -6683, -8175, 3965, 12005, 7670, -2296, -8225, -3939, 8650, 13970, 1715, -12005, -5953, 12666, 15576, 415, -9436, -948, 10724, 12270, 6378, -1715, -5461, 3458, 15778, 13749, -4239, -10760, 4298, 17647, 9338, -6316, -8145, 2440, 10106, 8878, 61, -8417, -6202, 7113, 12879, -66, -14485, -8494, 8027, 10345, -2631, -12777, -8603, 1839, 6488, 1815, -8902, -12109, -1995, 9532, 6922, -7579, -12207, -623, 13308, 9931, -3202, -7604, 1447, 12036, 11720, 3385, -4422, -1921]
862a921J1831N778j0187j3945J725J5485N327j3103j2922L390J0532L756p142
875a396r394m337O456J1173q96j5621p638J1572J3951l688j3556k356Q173R013
889A456Q20m771q342R27J2896Q830q434j5003K948J6199N460j1189r045J632Q558
904B942N844l411j1068o117P996J2414j589j5026p495R809J2436j803j1916n418
918a2402O517R762L193p057q051K266J0805Q284o268j1609N29J3867P980p152
932A0664j1993J588J0460N857l834q793n513N231J1560J659j3949j0440Q522J3828
946A4847j474j4963o399O131Q904J429n826q567k245J0291Q985n800j4448K5J4758
961E648P173q329j0412J137Q089O566p78q766o834N373J2818J818j3649r750O953
$$ y = [-1921, 9910, 15688, 5501, -8444, -6719, 8766, 14093, 990, -11932, -8542, 1990, 5746, -1396, -10790, -15127, -8671, 2502, 1606, -14015, -21653, -10081, 3870, 182, -13374, -15730, -7557, 1456, 2276, -2495, -10837, -9910, 2986, 11816, 3382, -11621, -8673, 7526, 12986, 1797, -7248, -5616, 2942, 8786, 5375, -5693, -11810, -3814, 8600, 7011, -8015, -15510, -5701, 6735, 4932, -6984, -12402, -5885, 3877, 7070, 13, -8038, -5772, 5033, 13317, 7049, -4560, -4031, 9836, 17816, 10664, -1329, 259, 10719, 16576, 12742, 3949, -1564, 3667, 15227, 16886, 2937, -7503, 1019, 14847, 13373, -1590, -7989, -1858, 7046, 8475, 2649, -5918, -8163, 2128, 11113, 5313, -9135, -9110, 5648, 12821, 4492, -5920, -4783, 3306, 9872, 9094, 328, -6506, -1133, 11685, 13503, -146, -9896, -2943]
976b943J3034O63j1410q311L252Q636L956o619j0054j300R810P699n737j2746
990a2070j681J0717Q781n889j1232j125R476O990j906q388n134N102J1379L567
1004H587j1049r621M890J4354K239j0879q443M194R400L545n272q976l134Q715
1018a450R600l597j3875m152J2072Q738o066j0664j558P125P607J35p853p317
1032a1255L559J2721L487j0421r656O079J2103L163r041p797K998Q235O364m882
1046E657r355k989Q662R346l765j1935l186Q931Q912l394j0866l851O908Q009
1060G084K27p726p086K733J0727M191r295r834K965J2589M248r349q286J537R243
1075C968M533k853q422l853P323R714j453j2216n896J0297R559k601j0188l667
$$ y = [-2943, 10091, 10754, -656, -8967, -5715, 2921, 6877, 258, -9796, -11096, -1286, 6413, 676, -12070, -13751, -3034, 5747, -142, -11374, -12499, -3023, 3967, 2061, -6327, -11461, -6359, 5020, 8587, -2462, -12083, -7193, 7161, 9400, -1479, -9922, -5728, 3672, 7217, 1945, -7031, -10165, -1450, 8150, 4553, -9322, -13474, -1402, 7336, 1270, -9394, -10952, -3827, 3780, 3915, -3938, -11255, -7696, 5025, 8512, -1909, -11565, -5486, 6617, 9780, 739, -7058, -4060, 4175, 10539, 5657, -3698, -6687, 1975, 11321, 7556, -4379, -7565, 1366, 10278, 6884, -3982, -7833, -925, 7084, 7311, -415, -7501, -4768, 5959, 10150, 855, -8979, -6014, 6575, 10823, 1474, -6812, -5275, 3968, 8501, 5648, -2774, -6627, 696, 10410, 8957, -3259, -9155, 1142, 10701, 8100, -2088, -5755]
1089e755O175P247J328o959p995J908J0742M885q757j1208K537J1865L777p913
1103A877q610P39P378N807k805j0506m064P331J0429k251j1779n239Q555Q200
1117E062j433q254m705M952Q305K354o506q141J393J1121N733p598j0973Q95J1529
1132C734N181p370r110o36P370N910k924r441o180N766R728k8j1811o849P358
1147i302R536j444q756m361M049P705L564m448p365K71J0796P424o162r781J534
1162f740J1846N958o151p917l43O346P068q13r064o803N188J0583oj1805o769
1177i422O167R401m61q696o191L213P711L532m519q493M16R863O155m109r554
1192d987J95J0969P394m423p761j343O923P025k33p397o317M145J0034J744j0793
$$ y = [-5755, 420, 7667, 8995, 2036, -5959, -4051, 6691, 11576, 2819, -8389, -5852, 6013, 9790, 1877, -6733, -5994, 1384, 7191, 4386, -6120, -10184, -2853, 7576, 5325, -6454, -11693, -3138, 5062, 3629, -4625, -9330, -4378, 3927, 6281, -225, -8366, -6973, 4148, 9881, 2283, -8690, -7795, 3734, 8915, 1545, -7565, -8201, -831, 5079, 2155, -7286, -13466, -7700, 2028, 2000, -9811, -16660, -9302, 234, -1210, -9966, -14327, -10278, -2573, 991, -3457, -10822, -10551, 245, 7669, 1507, -8274, -6740, 5106, 11064, 4913, -3004, -3347, 2999, 10067, 9254, 190, -6613, -1425, 9158, 9152, -2653, -9422, -3255, 6146, 5685, -3011, -9202, -5989, 1722, 5254, 735, -7758, -7342, 2521, 8676, 4567, -4987, -4792, 6177, 13571, 9148, 1387, 44, 6967, 13992, 13759, 6362, 45, 4190, 14224, 15968, 5175]
1207E175q453M883R635L94r267p034K261O450K662m664q479k327Q715O779m814
1222A916j1395j133J0047P005n405o917j766N200O651J562p234p199M151J1097
1236F580K523r609p228M607Q660J934o847o681J346P058M256l723r677k027Q226
1251f02P718m814r911k460Q265P264m240q495l847N901P083j20p026p098K907
1266i475R244L010p664q455L459J0077L326o766o696J842P317M986k314o779l429
1281h317P248R455j864j0541l630R313Q318m028o797l234L174O628J893o298q945
1296g625R72J0415L145r523q766L030Q572K331o530o100M61N369N969q44q109
1311g233l027P852R644k002r009k413P715Q605l00o536m032M320P583K899o304
$$ y = [5175, -3278, 1605, 11240, 11634, 2367, -4667, -2406, 4044, 6706, 2042, -6437, -8764, -49, 6730, 1916, -9479, -10612, -565, 6440, 1035, -5882, -7648, -2448, 4203, 5765, -1469, -8668, -4517, 6580, 9103, -506, -7734, -3127, 5533, 7467, 620, -6061, -4715, 2343, 6599, 2876, -6801, -8828, -602, 7116, 2302, -7609, -10069, -1804, 5460, 1220, -7275, -11122, -5221, 1862, 1742, -5284, -12382, -9475, -231, 2779, -4885, -13340, -9881, 196, 3522, -3244, -9940, -8098, -781, 4205, 1891, -4888, -8317, -1069, 8386, 6522, -4019, -7649, 1664, 9982, 5954, -843, -4077, -903, 5725, 7618, 1320, -7625, -6653, 3762, 6907, -2616, -11382, -8352, 220, 2551, -3979, -10079, -9618, -4249, 1720, 876, -7233, -10260, -2408, 7236, 5234, -3775, -6188, 1527, 10132, 9832, 3296, -736, 3584, 11167, 14066, 7762]
1326G762o973J005R026M714p576r558P02Q584L965o260q193r37O232L789k360
1341C922o713m412N435Q065R16r460n583P218R395j290o820l295L891O483L252
1356A1004m332p185j23Q676O832o694r960J083Q777L034n530o538j463L848N832
1371G261q57q442o157N312Q124j033r394m529N648P295k86o610m646K171P788
1386A645L166n326o937l81Q499N201m528q482p15Q240N812m575q167j304N727
1401b125O209r34o716m999L877Q410J455q739o138N289Q836j34o830m872K801
1416d610O255K862k250p485j874Q073P194m660j0193j07Q422N003l965o041j870
1431e246L742O187P52o126o345M013R370P75q274n818M717P978J722o238m959
$$ y = [7762, 789, 1794, 10820, 15534, 7958, -1600, -898, 7686, 11651, 5391, -2802, -3739, 2493, 6282, 3922, -2791, -7203, -1768, 6297, 7213, -2247, -7830, -612, 8783, 7493, 673, -2622, 1269, 7752, 11004, 6672, -513, -636, 8040, 14872, 8178, -1782, -699, 8078, 11112, 5582, -956, -2419, 1429, 7261, 6404, -2038, -8195, -2883, 5241, 4208, -5186, -9715, -4067, 3228, 2942, -3668, -8314, -6143, 1645, 4811, -515, -7452, -7833, 666, 5867, 1339, -7143, -7858, 382, 6194, 1619, -6548, -7852, -2125, 4084, 3150, -3566, -8565, -4688, 3722, 5177, -3562, -9700, -4411, 4425, 4291, -2539, -7411, -4610, 1645, 4507, 2257, -5228, -7102, 971, 8165, 3505, -6688, -6795, 1627, 6630, 2665, -3376, -5246, -1504, 4683, 5435, -691, -7036, -3023, 6347, 7122, -1152, -6970, -2253, 5725, 7447, 1209, -3750]
1446c750J403O181N119m208q035q15Q360N300l499q408j908O272O678k896p660
1461a866k082M324N505J0o512n303K747P667K437o724o582K142Q669K043n895
1476E80n855J481O051L815k832o890k794P032P318k658j0454j769P815N945l804
1491B981o389k484L198N971J436n272o521J493Q683L048p324o937L435P654J549
1506D521m810m953r60O485N000j851p623l520O755O673k776q012k665N513O398
1521D175j422o648m215L264O718J560n831n958J857P893L202o431o961J787Q438
1536A428L253m451o316l65N829M701j738o325l276N134P649j125q691l682N788
1551b187O684l83o709m003K903O032J895m707o748Q35Q626M017o629o461J167
$$ y = [-3750, -2347, 3834, 8953, 4745, -3290, -4105, 4255, 9555, 6056, -2352, -4260, 2012, 8690, 5794, -1866, -3948, 376, 5881, 5891, -621, -5924, -3177, 4490, 6927, 203, -6379, -4237, 4432, 6475, 580, -5275, -3794, 2257, 6072, 3240, -3650, -6444, 588, 7906, 5248, -5206, -6975, 840, 6785, 2981, -3408, -5892, -2694, 3277, 4713, -559, -7080, -5587, 3096, 6144, -1180, -8117, -4682, 2972, 4521, -289, -5242, -6202, 283, 5283, 3432, -4191, -7711, -956, 5717, 2941, -5071, -7736, -2223, 4175, 2753, -3895, -8110, -4846, 1872, 3432, -2399, -8357, -6500, 1393, 4595, -1836, -8797, -7010, 1428, 4681, 230, -6086, -6451, -622, 4079, 2341, -3984, -7260, -2126, 5523, 4398, -4293, -7975, -2187, 4497, 4114, -2595, -6598, -3695, 2337, 4232, -475, -7223, -6388, 2238, 6255, -374, -6835, -5668]
1566e668P915K941m316m794o33N107N024q12o799l509N541P414j387o985l611
1581d572N254N590J24n471m160K093N845K972m541p270J55P564M017n026o890
1596d316L56N948M844m267o507j289N556N440j896o068l501L617P312O10p724
1611a885m339L986P501k62n635m411J886N573L111m062o848m23O850M451m219
1626A274p886L0O851L661l286n755j783L710N483r1n827n453M465P162P1p008
1642d382m470M051O691J087n105n162J409O150L490k988p163j02O078N163l848
1657H99o469r92N611N368k584o202k800M404M965J049o077m972L397P940L64o091
1673b190n467L744O246K709n142m503Q17N926L204k704o145p29N660N407k356
$$ y = [-5668, 2247, 5188, 872, -3922, -4555, 552, 5576, 4764, -2035, -5544, -3, 7411, 6024, -961, -4572, 682, 6272, 6396, 925, -3235, -1142, 4703, 7675, 3134, -4136, -3981, 3583, 7600, 2574, -4316, -3960, 1988, 6832, 2565, -3942, -5231, 325, 5765, 3869, -2199, -5700, -2083, 5229, 5839, -1885, -6224, -2238, 5263, 5001, -634, -5045, -3159, 2414, 5525, 1463, -5385, -5808, 1042, 5493, 1274, -6612, -6582, 269, 3930, 644, -5111, -6894, -3184, 2299, 2208, -3619, -9072, -4607, 2555, 2626, -4382, -8852, -4801, 1890, 2977, -2128, -7290, -5881, 269, 3759, 771, -6392, -6494, -416, 4747, 899, -5570, -6562, -951, 4417, 1833, -4369, -7169, -2765, 2200, 3249, -2828, -7800, -4403, 3537, 3901, -2190, -7657, -3913, 2333, 5042, -100, -4603, -3786, 2140, 5344, 2640, -3505, -4234, 1426, 6833, 4477]
1688D477p743r12N428N288k103n803k356L597M765P68n566m691K228P535J595
1703F507o403m743K359N777K361m015m731L04N214M420k256o890j842O664N023
1718G749k202p508j125M825N330j696n835l228L383M867J545n258m991J136O629
1733C621J758n100n084J311N993K644l539n450r40N020M822j791n853k191M991
1748B12O327k228o838j881N025N011o77n277l767K416N395J707m750n763J487
1763c601P028K362n561n771J138N631L466l773n111p58M284M312j422n612k842
1778f230N191N509p19o214l352M650N281j17m800l372K112N902J484l858n964
1793d497J392O777K327l635o292K29O164K734k343m822j957M952M614j359o233
$$ y = [4477, -3266, -4178, 1250, 6538, 4435, -1368, -3724, -127, 4638, 5406, -160, -4851, -2623, 4912, 6507, 104, -4639, -2280, 3497, 5858, 1843, -2888, -2584, 2630, 7050, 4794, -2096, -3938, 2726, 7749, 5547, -1961, -3086, 1739, 7069, 5373, -462, -3690, -307, 4560, 6105, 847, -4144, -3008, 3621, 5379, 279, -4805, -3494, 2499, 5143, 1604, -3846, -4786, 234, 5056, 3265, -2588, -4779, 212, 6539, 4311, -2527, -4408, 617, 5628, 4951, -326, -4093, -1677, 3718, 5425, 675, -5088, -3601, 3427, 5789, 228, -5543, -4405, 1226, 4692, 919, -4192, -4950, -666, 3646, 2224, -3388, -6230, -1039, 4470, 3751, -2463, -5815, -1165, 4116, 3999, -801, -4173, -2061, 3841, 5325, 1467, -4497, -3105, 3672, 5999, 2364, -3928, -3699, 2465, 5199, 2856, -1966, -3923, 1029, 5643, 4284, -1949]
1808a949l102L944N836L67o814l063L355N144K33l690m617J446N487K835m316
1823A096n713O97O531L338m367n481K41N914L734k697m757j285L745N165J85o246
1839A00l382M123N962k33o073l141K680N871J69m587m624R62N014K904m013n443
1855c711r06O214L013l514n789n95N479L741j726o194j799M082N247O1n863l231
1871e491L675N907R99o170l426K618N580J582m133m697J43M894K916l262n509
1886d374r78M841M428l462o069j524M766L371r66m738l195K568N186J244n546
1901d448m044L101O327R99m888l636K604N032J803k897m003L14N266L875k421
1916B984n687q76N906M044j894n652j319L932M232j145m485k919K229N467M43
$$ y = [-1949, -5051, -1107, 4729, 5096, -1718, -4781, -1426, 3718, 3951, 261, -4356, -2910, 2577, 5412, 1096, -4617, -3920, 2611, 5949, 1582, -3899, -3658, 2256, 5990, 3293, -1464, -2749, 996, 6161, 6346, 100, -3282, 841, 6803, 6570, 497, -2644, 36, 5907, 6076, 1489, -3135, -2173, 2841, 5745, 1732, -3711, -4617, 1597, 4610, 1096, -4693, -5288, 191, 3932, 2206, -3988, -5787, -1705, 3542, 3603, -2260, -5491, -1816, 4091, 5090, -1080, -4506, -1888, 3692, 5274, 1141, -3556, -3413, 1481, 4397, 1135, -4374, -5352, -511, 3917, 455, -5614, -7138, -2372, 999, 33, -4705, -7900, -5332, -146, 1098, -4448, -8492, -5391, 936, 1935, -2953, -6589, -3985, 1047, 2850, -47, -4050, -3736, 1530, 5405, 2984, -2703, -3579, 2327, 6371, 4477, -1175, -2494, 1438, 5670, 4525, 40, -2879, -650, 4817, 5260]
1931E260m620m638J982O195J197m720m240J503M682K529l731m662%M810L844j994
1947C397n806r80M914M587j802n732r19L774N183j668l970k633J915M946J641
1962F847m580m726J238N486J939m744m261J125M553J879l080m114j443L760L613
1977C492j485n714k698M735M323j920o054p55K738M310L43m159k946J005O106
1992A321J579l773m562J933N542K312l859m481J330L751K998k264m009j377L828
2007B69M462k073n471k365M152M363j196n845k856K674M607r70m001l603J337
2022f516M672J812l610m528P24N665K801l359m297K21N155K282j576l689j274
2037e517L351M404M8m621l210L941M829n70n418j474K847L444R32m293l072L21
$$ y = [5260, 640, -3998, -2016, 4179, 5376, 656, -3584, -2081, 2601, 5130, 1399, -3263, -3263, 1547, 5391, 3397, -2409, -3389, 1525, 6112, 4310, -1422, -2341, 1433, 6616, 4948, 978, -1655, 260, 5206, 6847, 2267, -2459, -1221, 4265, 6204, 1460, -2801, -1676, 2877, 4756, 1676, -2438, -3881, -121, 3492, 2007, -3707, -6405, -1670, 2653, 733, -5321, -6076, -3338, 972, 1315, -2844, -5790, -4785, 1321, 2900, -873, -5435, -3502, 2040, 4352, 493, -3988, -2658, 1093, 4091, 1827, -2182, -3559, 269, 4731, 2658, -2813, -5178, -1026, 3337, 2141, -3704, -6560, -3886, 721, -249, -4250, -7853, -6516, -1844, -32, -3642, -8170, -7446, -1781, 1020, -2339, -6636, -6415, -1260, 1022, -554, -4243, -5517, -2166, 2238, 2286, -2335, -5545, -1604, 3225, 2655, -2763, -4237, -1390, 2054, 2986, -1307, -4379, -4058]
2053d058M481K912l162n674L80N415L240m040l753l78M189L613j423m362j414
2068d034L830M448M07n031k252K818N267M86m297k532K196M381J287k792l876
2083C06L98M376L114l066n365J42L641L657k913m820j155M027L897k579m029k466
2099b835L001L588J41m572l048K007N626M51m738l517K593L823J152k760l642
2114b730qL673L607k578n375m65M967L453k796m505j379L607K844k14m028k897
2130d824K191M700k4m045l681K194M399Q82l806l316P75M920J636k707m070l16
2146e092M998K957l086m302q30M847L455j160m316k005L727L729j266l754j788
2161c886J874L644J335l383l827J035N332J050l920l915J547L794J938l009l202
$$ y = [-4058, 423, 3335, 173, -5501, -5121, 294, 3534, -506, -4259, -4637, -448, 3165, 1742, -2620, -4034, -204, 4244, 4651, -380, -2632, 186, 5453, 5939, 1642, -890, 1306, 5687, 6974, 4182, 306, 704, 5080, 8194, 5128, -237, -95, 3546, 7203, 4290, -530, -1685, 2342, 6239, 3660, -369, -2835, 166, 3754, 3895, -677, -3725, -1718, 3908, 4359, -379, -3896, -1303, 2520, 3672, 912, -2730, -2738, 935, 4542, 1964, -3411, -3876, 1091, 4544, 1748, -2757, -4136, -529, 2315, 2101, -1927, -4824, -2633, 2067, 2043, -2002, -5683, -3489, 910, 1792, -2014, -5330, -4555, 365, 2001, -706, -4776, -5092, -94, 2863, -223, -4525, -5355, -508, 2947, 1787, -2529, -4534, -807, 2922, 1656, -2098, -3886, -2012, 1632, 2967, -416, -4243, -3208, 2124, 3174, -746, -4661, -3114, 680, 2618, -391, -3593]
2176c593n84L952L652j664m692k108N211L508j532m428j155L645L107K01l395
2191A25k525J603M533J491l410m356J506M668J918l929k944O34L289L176k126
2206C653l876j851M611L697j859m683j483L951L588j094m275k074L255L656K02
2221E418m079k539K207L177J710k736m164J53N014J984l220m212M64M140J444
2236D761j200m181j190K384M141j628m479k828L406M417q29m970k832K518L782
2251A272M05l614k741J013L965J937l471m267P86M778J745l021l532K80L286K146
2267I67r02l808j659L001M052q74m252k352K996L722J66m079k585J683M047J233
2283A356l774l139Q16M588J957k803m001L69M072K729k113m205m7L551K779j035
$$ y = [-3593, -4177, -225, 3427, 1763, -2929, -5037, 174, 3682, 2150, -2278, -3433, 212, 3319, 3520, 125, -2400, -797, 3736, 5227, 1817, -2539, -1033, 3635, 5553, 1624, -1320, -686, 2603, 5779, 3653, -223, -2074, 2537, 6234, 4375, -308, -1791, 2160, 5748, 4654, 379, -1695, 1560, 5216, 5418, 1339, -1200, 1007, 4184, 5894, 3158, -1006, -853, 4161, 6145, 2925, -1287, -823, 3317, 4761, 3561, -620, -1810, 574, 4715, 3087, -1392, -4220, -814, 3603, 2774, -2196, -5028, -2510, 1272, 1677, -1937, -4678, -3665, 300, 2237, -1234, -5501, -4715, 63, 1808, -1213, -4745, -4465, -1179, 967, 65, -3743, -5402, -2401, 1651, 777, -3475, -5827, -2831, 891, 1057, -3022, -5607, -3924, 123, 1356, -2418, -5557, -4741, -153, 1804, -999, -5000, -4631, -559, 2170, 57, -4148, -4195, -644, 2135, 1100]
2299A100l632j208K498M203k89l963k639K889M373J52l911k390K008L055J049
2314C295k522l009L09L393L006k557m707L24M047K285k127m220J66K643L065l30
2330C061m189j925K459M649J57m704j894K682M056j99k725k624P85L575K051j898
2346C317l852j48L724L283k503m163n55M136K392j051m276j330K581L277p04l652
2362D76k393K873L060J85l778k895J531M434P93l446l774J725L262J364k465l266
2378b314j6K963K880j371m518j284L518L310j406m188r89J934K965J71l870k754
2394d969J882L907O63l821l896J914L698J295l336l151J193K726J639j474l826
2409e556p71L807L443j543m412n4K499K948r4l628k002K308M140k8k857k582J699
$$ y = [1100, -2532, -3740, -1242, 2961, 2672, -1291, -3930, -1041, 3332, 3484, -427, -2817, -809, 2246, 3295, 773, -2236, -1927, 1466, 4472, 1915, -2792, -2468, 1579, 3864, 1737, -2483, -2317, 326, 3391, 3061, -1128, -3053, -594, 4055, 4212, -492, -2386, 296, 4352, 4153, 1428, -1196, -411, 3164, 5215, 3317, -535, -683, 3041, 6324, 3821, -342, -897, 3239, 5631, 4580, 304, -1026, 1555, 4832, 4128, 476, -1917, 956, 4016, 4201, 423, -2472, -941, 3493, 4286, 840, -2934, -1209, 2053, 3417, 952, -2314, -2330, 633, 3513, 2142, -2376, -3660, -142, 3168, 1762, -2426, -3415, -1481, 1484, 1655, -2215, -4969, -3087, 820, 1483, -2338, -6234, -4320, -622, 673, -2663, -5814, -4621, -1895, -256, -1730, -5556, -6327, -2520, 923, -620, -5032, -5086, -2587, 361, 267, -3361, -5363, -3055, 1085, 1057, -1800, -4382, -2683]
2426b683M050Q22j985l640M93M544K110l016m055J362L549K054j567l885o05L159
2442G07K964n29m551k229L898L232o61l746j400J639L333L84k422l404J756L546
2458B517J794k988l505R68L718K400k754l681N19K978K617o56l705j575K884L672
2474E203j042m184j406K515L360m63l454k245J315L545N32l031k917N95L502J446
2490C271l084l283Q01L289J923j705m006j74L097K396n51l165j417K631L474J71
2506C668l903k259K806L467N63l650j727R41L512K44k627l059M13L793J148k268
2522A062l827j07L555J223j964l756l54K861K246r66l295k011L043L261o13l394
2538c036j918K433K990P18k780k265L79L742J738j794l619K91L946K353k037m144
$$ y = [-2683, 1367, 2189, 204, -3436, -2943, 1601, 3711, 695, -3360, -1998, 1551, 3605, 2038, -1847, -2452, 707, 3671, 3142, -1409, -3638, 260, 3492, 2831, -915, -2315, -676, 2657, 3041, 619, -2785, -1029, 2517, 4311, 1323, -2182, -1214, 2504, 4904, 2150, -1531, -1012, 1966, 4583, 3927, 222, -1353, 1531, 5203, 4161, -23, -1429, 1086, 4446, 3983, 529, -1716, -401, 3144, 3676, 645, -2272, -1677, 1825, 3271, 187, -3096, -2295, 994, 2917, 1212, -2794, -2968, 129, 2525, 1974, -1191, -2608, 23, 3497, 3668, -235, -2494, 312, 3779, 4342, 692, -1035, -94, 3418, 3662, 1035, -2024, -1611, 2182, 3330, 1062, -2765, -2872, 683, 1906, -58, -3814, -4168, -1307, 939, -27, -3322, -5333, -2290, 971, 358, -3036, -4954, -2521, 469, 1187, -1593, -3858, -3479, 263, 2001, 207, -3412, -3121, 825, 3178, 1141, -3003]
2554c003J56L538K176j434l407j615L182K718q40l433j152K124K499O2l213k106
2570c748J231L615O46l147k249M80L622J623j689l117K04L187K332q20m174j21
2586b125L231K771p60l257q10K162K981J79l444j917J598M342j8l681k664J171
2602b41L642O86k838k614P7K533K140k824k694j219L613J800j339l620n79K665
2618h12K237j095k697j708K338K984P29k806k241J625L586Q95k303k757J144L254
2634B373J638k852k837M32K881K173j834l517q79K650K674l46m698p00J818K621
2650A597j27l680j552J492L353N5k435k054J70L757J333k427k818J083L274J939
2666B960k311k648L03K791K440j240l110n25K670K448r72l373j361K201L116m97
$$ y = [-3003, -2847, 691, 2867, 1433, -1974, -3589, -407, 2311, 1471, -1962, -3114, -990, 1509, 1571, -1642, -3748, -2517, 1098, 1744, -1403, -3652, -3172, 450, 2073, 384, -2733, -2529, 658, 2990, 2170, -2004, -2125, 1106, 3877, 3117, -140, -950, 1212, 4193, 4372, 928, -989, 609, 4951, 4933, 1252, -1412, -241, 3401, 4087, 1249, -1365, -1288, 1245, 3385, 561, -2133, -3352, 261, 2061, 722, -2898, -3477, -812, 1425, 330, -2367, -4075, -1737, 1247, 1976, -830, -3071, -1446, 2140, 3035, 732, -2025, -881, 2373, 4011, 1159, -1678, -1246, 1635, 3808, 1974, -1543, -2422, 228, 2902, 2556, -2142, -2842, -1024, 1597, 1470, -2210, -3762, -2270, 1083, 1138, -1297, -3351, -3181, 576, 1909, -518, -3336, -2253, 1021, 2960, 649, -1999, -1696, 1095, 3535, 2295, -815, -1340, 1330, 3778, 2806, -567, -1928, 273, 3389, 2892]
2682B892k868k111J297K985N54k762k609R49L722J103l058k636O30L278J721j987
2698A100k377n98K693K399q51k802r43J863L183R5l858j185K026L206j20k524
2714A307k044J788K669P86k059l303J30K735K540k364l623J4L030J597j738k269
2730h04l52J950J775r72k812j700K078L016Q5l618j972K093K561Q0k637k354J408
2747b175K888J071k201k891N89L034J607j828k764m10K674K182j748k903l33K502
2763g06K441j080l133j104J397L155K50l315j260J488K580P08k412k513O71L042
2779B09J268j871k829K2L228K283j795k976n59L212K206j576k517j183L004J953
2795B079L6k770k283K056K652R31l611j911J050K904K66k327j651k37K934J518
$$ y = [2892, 24, -2087, -790, 2195, 2749, -13, -2622, -1673, 2049, 3152, 94, -2542, -1912, 1366, 3087, 1100, -1277, -1875, 818, 3217, 2366, -436, -1379, 484, 3667, 3762, -96, -1281, 745, 3951, 3831, 1307, -737, 1051, 3720, 4506, 2447, -856, -726, 2009, 4549, 2185, -1438, -1424, 1606, 3203, 1465, -804, -1156, 794, 2569, 1597, -1215, -2915, -837, 2179, 2264, -1354, -3326, -1233, 1328, 1408, -1229, -3583, -2175, 713, 1784, -417, -3308, -2719, 315, 1922, 94, -2670, -3080, -406, 1776, 28, -2875, -3208, -706, 1735, 655, -2478, -3582, -2185, 970, 1220, -2095, -3355, -1867, 713, 1421, -991, -3504, -2833, 209, 1477, -394, -3223, -3201, 27, 2310, 515, -2461, -3020, 192, 2398, 822, -1695, -2878, 126, 2079, 2115, -655, -2938, -882, 1770, 2701, -910, -2821, -1771, 1133, 1399, -928, -2579, -2816, 118, 1636]
2811A636j218l414m02L675J139q56l221q09K780K337o34k850j183K074K703K86
2827B043k758j888J909K205P41j914k615M84L536O26j780k236J33K602J734j395
2843A427l085j88K169L054j353l041j039J706K976k40l210q56J735K563L64k363
2859F19k035Q64L587K66j336l544J056K963P87k042k200j30K534J381o38k743
2875f11j208J790K328l11k925k087K284K229q88l031j474J161K890R60k744k413
2891d050O97L175P19j694k560M80K920Q99r28k917j03K787J995q48k800p19K379
2908e68K283j051k226j521J938K416j92k314j484P95K922N69j737k049J45K890
2924H16J867k335k481j7K564K227r04l124L92J777K450j30l323p84K097K929p4
$$ y = [1636, 418, -2996, -3398, 277, 1416, 560, -2661, -3470, -690, 1647, 1013, -1837, -3020, -946, 1757, 2043, -715, -2603, -694, 1511, 2252, 338, -2277, -1793, 1743, 2369, 589, -1647, -1514, 1088, 2822, 1427, -1658, -1846, 323, 3377, 2024, -1017, -2056, -350, 2626, 2386, -824, -1680, 55, 2618, 2982, 619, -1416, -552, 3035, 3301, 1965, -1579, -523, 2440, 3227, 1185, -1015, -1145, 1389, 2770, 2132, -611, -1819, -29, 2299, 1988, -937, -3024, -740, 1489, 601, -2430, -3904, -2743, 147, 1107, -1637, -4050, -3353, -178, 541, -1153, -3713, -3233, -313, 586, -342, -3259, -3362, -575, 1420, 572, -2228, -2947, -568, 1715, 664, -1562, -3083, -1145, 1271, 1079, -1235, -2719, -1924, 998, 1567, -170, -2219, -2074, 816, 2683, 348, -2133, -2150, 414, 2641, 1737, -1387, -995, 782, 3232, 3102, -221, -1005, 1092, 4021, 3947]
2941C947l083j839J798K150M06j294k336L75K642M50j996k233j81L131J129j280
2957A786k940m07K448J368p18k431p34J582K207o23k446j026J363K229O52k384
2973g4k126N73K912J015k238j678O85K562R51j318k381l96K384J722j343k486
2989a236r6K190J850j226k348j016J585J920L20k470j627J138K779N44k509k065
3005b267P91K549Q04k005k068L94K780J239j571k315k69K469K296j692k459j39
3021a463J977K250p43k925p97J365K181M80k855k240J680K493n24k000k051P49
3037b423J926R30j283k579p94K596J445q80k484l31J279K351p44k142n79J880
3053a832K834k92k834l46J035K658N23j983j841Q58K590Q23j604k210J086J611
$$ y = [3947, 864, -975, 823, 2973, 3379, 2085, -251, 124, 2766, 3216, 1220, -1013, -1194, 1937, 3066, 1786, -1154, -1561, 887, 2255, 1537, -894, -1628, -46, 2161, 1538, -908, -1934, -571, 1658, 2310, -74, -2200, -1627, 1285, 2300, 62, -1616, -931, 1631, 2582, 1264, -1117, -1513, 871, 2593, 1250, -1236, -1332, 858, 2708, 1482, -866, -1882, -297, 1623, 1943, -527, -2154, -1016, 1763, 2307, -202, -2267, -1476, 1073, 1877, -128, -2196, -1802, 978, 2217, 646, -1669, -1938, 531, 2827, 1135, -1324, -1463, 514, 2764, 2021, -904, -1701, -336, 1845, 2325, -530, -2770, -1090, 1403, 879, -1121, -3172, -2423, -497, 433, -850, -3429, -4223, -1627, -182, -1062, -3546, -3877, -2598, -247, -991, -3133, -3712, -1832, 1002, 710, -2124, -2470, -1435, 1223, 1746, -237, -2078, -1220, 1370, 2193, 589, -1621, -535, 1076]
3069A076J174j558k058k96K234J266p81l163n16K167J881o85k491j059K257K148
3085A596n85j190j426N84L014N99j147k056M88K937J114k026j449o2K716J067
3101D174q19k910l80J666J776p86k921m77P32K359o26k759q40Q24K537p44k068
3118a262j192O05K721J77j070l007P41K802J385j686k600M50K840J318j948j590
3134a316o53J704K155l78k495j178J534K256m73j724k071J715K264L8j341k595
3150b558R82K268J010k104j894L70J875J087j270k297J41J922J686r55k442j53
3166b332J129J947k22k274j088J857K155l10k165j090P47K602P85k175j382M42
3182a374K291J027j169k275J69K357J260j306k188n12K160J136j153j330q89P95
$$ y = [1076, 2250, 692, -1366, -1662, 572, 1838, 1057, -2106, -2622, -455, 1426, 741, -1750, -2809, -552, 1596, 1011, -179, -1605, -1021, 1993, 2592, 1445, -611, -123, 2814, 3928, 1902, 453, 391, 3107, 4174, 3355, 445, 65, 1731, 3507, 2721, -200, -677, 55, 2414, 1788, -971, -1811, -987, 1550, 806, -1262, -2454, -1849, 872, 1049, -21, -3028, -2287, 515, 1900, 214, -2386, -1936, 904, 2222, 274, -1316, -1969, -265, 1890, 1512, -983, -2161, -627, 1629, 1156, -568, -2639, -924, 1340, 1378, 37, -2558, -1576, 692, 1702, -402, -2296, -1926, -51, 1036, -234, -2531, -2390, -468, 1218, 263, -2179, -2332, -1203, 744, 522, -1752, -2840, -983, 1172, 862, -1303, -2393, -1646, 956, 1741, -434, -1816, -1374, 917, 1944, 775, -1500, -1331, 1026, 2286, 980, -1208, -1720, 440, 1576, 423, -907, -1796, -1001]
3198a001K267l05k285r28N85K440N46k328j458J114K289M86j477j975P45K317
3214A032J721j413j897o94K146K401j743j598n26J862J432j54j937j069J391J736
3230B690M99k480j764J131K589j68j580k404J095J816J178j086k577M42J890J367
3246B638j626j564l08K107J279l00j910j576J764K058n35k074j138J396J745L13
3262B269j834j242J58K483J92j316k038M92J859J98o11k070j65J599J779j109
3278F44k271n24J760K004n72k484j176K125J196m30k349q32O30K213N86k395j460
3295c335P06K511k6j490j647j69J989J384q36k467P05J491J530n44k560m25J751
3312a432K196l08k084n72J259J915J4j684j596N57K070Q40j329k717L04K242J667
$$ y = [-1001, 1266, 961, -1324, -2252, -1667, 773, 1319, -1009, -2467, -1353, 936, 1422, -55, -2030, -1285, 1032, 2753, 1340, -557, -1251, 895, 3296, 1553, -45, -571, 1291, 2723, 2569, 632, -437, 954, 2690, 3189, 709, -1055, 76, 2665, 2497, 917, -1487, -392, 1424, 2602, 1516, -1061, -619, 1271, 2638, 1012, -552, -860, 1247, 2526, 2226, 316, -1260, 504, 2562, 2027, -47, -1185, 211, 1956, 2269, 435, -807, -649, 1834, 2026, 710, -1328, -836, 1023, 1221, 610, -1460, -1625, -26, 1753, 644, -1627, -2151, -391, 1613, 1041, -1443, -2619, -494, 702, 272, -2077, -2909, -2279, -66, 520, -1875, -3335, -2629, -118, -144, -1634, -3281, -3450, -1461, -77, -913, -3380, -2675, -1184, 346, -198, -2758, -3183, -1432, 764, 456, -1628, -2200, -941, 974, 988, -696, -2292, -1735, 335, 1175, -154, -2871, -2567, -325, 1342]
3329A342k007j918J44K052J091j582j671l3J792J766l73j882p58J057J986R6j314
3346b12j358J940J282O18j675j111K12J816J247j042k263K08K226R75j353k241
3362g31j96J489J568j154j579j046J522J887l16k617o59J802J329K54k643p57
3378a847J155J420J025j707j585N82K046J162j487k286J08K037J431j530j741
3393a217p71K744J427q80j945j273J665J680Q8k541j061J372K821j056j576j738
3409b261J389J886N52j673j573k20K696P61j098j713j96J764J373p74k425J84
3425a328J359J726k30j882r71P73J858Q03k374j677J328J945M54k499j242Q54
3441a103J876O58j128k236j05K302J076j367j864n88J463K162q41j846j090J691
$$ y = [1342, -665, -2583, -2439, -387, 704, -878, -2549, -2582, -790, 976, 603, -1279, -2037, -980, 1006, 1102, -212, -1570, 370, 1652, 2270, 595, -516, -304, 1512, 2759, 1717, -546, -338, 1888, 2863, 1510, -731, -927, 562, 2130, 976, -603, -1649, -127, 1760, 1444, -1173, -1832, -30, 1299, 1553, -1090, -1847, -692, 728, 1753, 46, -1539, -957, 1089, 2251, 764, -1522, -1414, 623, 2054, 524, -1217, -1988, 756, 2183, 1303, -642, -1915, -250, 1430, 1518, -1023, -2084, -712, 2109, 1053, -523, -2261, -872, 1014, 1566, -107, -1680, -1900, 796, 1557, 459, -1254, -1450, 314, 1687, 913, -1512, -1328, 31, 1757, 1527, -355, -1326, -553, 1305, 2108, -266, -1943, -615, 1330, 1784, -715, -1957, -1103, 773, 1431, 303, -1933, -2038, 264, 1340, -27, -1891, -2479, -1016, 1146, 305, -1541, -2631, -940]
3457i40J892m58j680p10O22K294R4j239j261K32K410M67j682k067J084K052J055
3474B165j422j418k50K002J059o78j606j060K510J458j254k098K37J285R16O2
3490A908j343p12O85K033K29j713j663J313J879L76j266k236J077J155J196q46
3506B072j931l89K225P28p23j839r03K133J022j88k089j340J296J401N23k083
3522h5j005L2K018N8j305k022P05K211N01j247k084M61J429R11o86j824k51J666
3540e17J119Rk074j195J989J927p37j679j071J706J260K73j543r87q4K174O60
3557A230j272k004P31J659K63j057j371L30J357J283j126j577O4N46K227q52j288
3574h57q87J664J342K59j657j066R55K001M76j457j936N60K677N21k062j553O8
$$ y = [-940, 952, 494, -1186, -1896, -1274, 1020, 1114, -125, -1386, -1154, 1256, 1723, 41, -2026, -942, 1110, 2165, 743, -675, -925, 1077, 2136, 1458, -148, -1208, 1302, 2760, 1506, -592, -355, 930, 1846, 1908, 565, -147, 538, 2571, 2800, 1087, -576, 737, 2616, 2992, 1726, -510, 567, 1722, 2918, 2072, 141, -248, 1977, 2705, 1982, 143, -760, 1373, 2395, 2207, 118, -1222, 74, 1475, 1998, -85, -1090, -1058, 960, 1018, -287, -2309, -1604, 607, 1108, -139, -2223, -1762, -333, 578, -108, -1932, -2183, -517, 602, 611, -1463, -2658, -669, 1258, 521, -1158, -2229, -523, 737, 1010, -533, -1520, -1604, 570, 1230, -42, -2046, -1315, 344, 607, -450, -1821, -1491, -134, 1149, 23, -1554, -1490, -944, 1283, 431, -857, -1744, -80, 1262, 1521, -136, -1202, -247, 1754, 2230, 773, -1163, -603, 2074, 2595, 533, -1020, -952]
3591i52J888J121j428j290n95J921P26r47j431r99J389J518L37j923j654J556
3607g63J947R9j635j635J162K382n34l75j267k7J698Q48r70k446l8K197J523j465
3625G01k167R3J500J270l98j612p40J339J505j77k614o78J208J668j3j730j013
3642a858J019J367J216j532j103J61J481J030q18j331n28J311J069o33j769n35
3658a453J300J597n14j686j328J134J729N17k532n38M28K076l9j561j397P43J705
3675A81O4k89j567p01K092J718j341k146r4J606O20j25j705p41J644J284p88j294
3693a582q05R76J968M31j289j779O10K227Q61j555j223K89K184P54o47k271J66
3710f85J293J244m62j792l27J432J227o02j343o92M28J894j22j706q79O66J421
$$ y = [-952, 936, 2057, 629, -661, -1256, 665, 1391, 444, -987, -1986, -597, 921, 1258, -665, -2319, -763, 1184, 1283, -352, -1987, -825, 1557, 1023, 648, -619, -646, 1052, 1900, 930, -1516, -1554, 643, 2166, 701, -1466, -1373, 127, 1397, 999, -613, -1353, -14, 1491, 1314, -1300, -1978, -770, 898, 885, -845, -1858, -839, 528, 1744, 212, -891, -730, 751, 1781, 963, -368, -896, 415, 1484, 851, -918, -1453, -153, 1444, 930, -756, -2084, -950, 779, 1296, -1236, -1774, -1346, 730, 691, -870, -2267, -1524, 181, 245, -44, -1611, -2312, -220, 1498, 157, -1989, -2083, -477, 143, 18, -1687, -2428, -784, 500, -288, -1582, -2387, -1411, 557, 988, -301, -2080, -1470, 757, 1618, 63, -1160, -871, 1313, 2067, 1420, -851, -685, 608, 1852, 1390, -402, -729, 703, 1930, 1328, -15, -707, -279, 1615, 1493, -213, -1092, -426, 995]
3727I95Q47j695n94q4K295J240j336j425M02J476J021n32j651l0P71J697j24k513
3745G60l16J554J063l65j717j301P49J073k4j785r43M38J086N53j082j945O51
3762a551J398J52p03j451j17K045J113%j730m60J408J818m55k330j7J349J573
3779B042n15j241j422P82J393M44j462j666N22J415L07j053k023J13J281O03j272
3796a752j196O8J456J401o23j527j88R25J630q2j328j123J719J103Q32k282m91
3813a458N17K342M70r91j557r2R78J191j325j559M78J510J059j062j722m6J285
3830A8J328n77k340m74J708J142M9k158k28M47K373j44j547j346Q52K006Q53j589
3848C73j533N07J829J448j175k137O03J582R09l81j657p41J580J116n5j436q70
$$ y = [995, 1842, 147, -447, -531, 1764, 3004, 1668, 243, 645, 2121, 3142, 2610, 959, 929, 1700, 3397, 3273, 760, 444, 1998, 3061, 2696, 979, -322, 427, 1500, 1476, -309, -1252, -814, 272, 825, -257, -2202, -1551, -153, -1, -704, -2155, -2272, -227, 886, 886, -844, -1304, 104, 1922, 1467, -863, -880, 469, 2042, 1527, 286, -1136, -354, 1039, 1483, 21, -1645, -1123, 292, 599, -454, -2477, -2364, -1083, -480, -1752, -2948, -2880, -1424, -23, -646, -2173, -2361, -1436, 194, 112, -1216, -2339, -620, 483, 1315, -967, -1458, -941, 1401, 1871, 880, -677, -769, 209, 1400, 75, -1484, -1006, 504, 1563, 501, -1221, -1267, 18, 1346, 769, -1571, -2045, -337, 805, 854, -1304, -1532, -1085, 1288, 1144, -403, -1749, -897, 1109, 1962, 373, -1160, -653, 1176, 2624, 1449, -688, -85, 1497, 2406, 2025, 368, -373, 1207, 2323, 2268, 832, -38]
3865c8P70J451Q8j459r45K33J598p1j791m31p8J580M08j318j462q6K269l1n14
3884A73j554r0J213J288q5j997k51J742J049R9k025L0K84J640M00j357j236Q42
3902A65J570K90j837j165J33J561M85p96j687n25J536N06m94j758l66J037P25
3919f20n65q84q85J580J345j2j517o00R96J502J08j634q71J214J915M22j626j342
3937a474O83J115Q64r96j444j52J317J389j631j029m54O58J821l07j661q79P81
3954a399J521J12n54j308N89J370J137j633o36J31J713R97j227j623J011R83J214
3971B398o15j074p81J530J589o98k338l53J485J152m05j081j287J068J125K86
3987B001j041j579M17J707M8o32j167K83J505N23n73j823K52J291J124n04j440
$$ y = [-38, 732, 2183, 2271, 812, -133, 100, 1698, 1627, -164, -595, -673, 907, 1315, -3, -1465, -1551, 718, 687, 173, -1381, -1471, -258, 1030, 945, -1052, -1303, 439, 1488, 1587, -438, -408, -124, 1516, 1916, 559, -677, 165, 1735, 2025, 188, -977, -844, 717, 1202, 406, -1281, -1806, -270, 236, -258, -2016, -2382, -1345, -620, -1185, -2069, -2954, -1374, -29, -41, -1558, -2158, -1162, 340, 448, -1186, -2057, -843, 1072, 1494, -132, -1474, -791, 324, 1188, 192, -1252, -1404, -87, 1302, -329, -1358, -1812, -1154, 667, 360, -1301, -2180, -1399, 122, 234, -320, -1628, -1039, 331, 1468, -165, -801, -670, 1043, 2040, 813, -810, 201, 1184, 2398, 1783, 709, -72, 1458, 3047, 2349, 11, -342, 1143, 2295, 1890, 809, -478, 590, 1715, 2001, 960, -619, -202, 1505, 1553, 921, -246, 37, 1542, 2065, 1492, -331, -79, 1212, 2336, 1832, 392]
4004C92l08L66K233r67j188j691J685J139k23j251j256N31J813k22j307r42k67
4021a463J992N24j298j710P83Q76O27j012q04j86J543L36l33j350m82L51J831
4038B25j77j132m89K85K020m12r71j725J330Q15O46l09j496o2J438O61j026j287
4056a666kP12J469j015r55m53J310R20m16j193m69R33J110M94j770n05O25J262
4074C91K97o55j259M17J350L25p52j169J44J099R68q55p39k45Q48R74k01j651
4092g13p12J601J056k44j324p45R31J411J5j294j082M42J617j97k85j659L40J942
4110A100Q6p76o60l47J007J410q58j183k52Q64J217L06j842p74J078J339L0j335
4128D10j390J087J700j04o81j539N31J507J81r38j356J181M33O05o55j699k61
$$ y = [392, 84, 450, 2683, 1716, 528, -1163, 522, 1661, 1438, 187, -1069, -538, 1275, 1053, -254, -1196, -1463, 529, 1053, -245, -1955, -1172, -296, 331, -681, -1485, -1671, -128, 208, -125, -1475, -1957, -1606, 225, 48, -1084, -1573, -1288, 732, 320, -651, -2376, -1046, -231, 415, 106, -1390, -1452, -14, 647, -379, -1666, -1668, -956, 513, -502, -1457, -1910, -600, 320, -96, -1289, -1758, -825, 285, 779, -991, -1496, -871, 391, 688, 33, -1226, -809, 541, 866, 114, -1055, -911, 188, 1156, 301, -438, -683, 165, 1139, 938, -713, -1425, 176, 1232, 988, -336, -1081, -150, 1261, 1276, -18, -1100, -658, 959, 762, 477, -1182, -842, 1100, 1186, 410, -250, -597, 410, 1820, 962, -221, -473, 391, 1608, 1914, 72, -702, 376, 1715, 1745, 410, -980, 107, 1807, 1703, 1022, -517, 14, 1521, 1702, 764, -592, 589, 1022, 1627, 972, -727, -988]
4145i88J223J022n19j254p90R59J282j40j362q40J226O61K57q25j524J019J192
4162E99K19j099j562Q32J646J25j288p16L66P16P22o22j933pJ193R64q36j188
4180a869l58M43J428P0j969m83N16J049M07l90j420J59K356N57j451j104l9J578
4198e20J158r04r65k0R55Q55j50r11m96J032J051q0j789l5Q50J008k42j028r75
4217a206Q27R01k76l07j174L23J722M78q20j128L42J349N73p34n87m6J386L29
4235A952l23j271q26J359J014j1j471l54M77J141k02j008j353J049J198Q5j345
4252A11n44K49J026P95j136r10O9J264M13n30j223mL43J496k6j740m47J233J072
4271A511k86j151r56Q06R80M4j388k53j38J706N27j635j158R01M12J166q22j077
$$ y = [-988, 235, 1257, 738, -516, -1306, -347, 935, 795, -567, -1407, -181, 480, 737, -88, -1612, -593, 599, 818, -281, -1843, -1011, 635, 760, -528, -1244, -878, -162, 560, -62, -1995, -2002, -809, 155, -681, -1869, -2227, -1784, -356, -286, -2255, -2738, -2222, -1173, -766, -1156, -2576, -2417, -61, 496, -955, -2059, -2098, -520, 638, -266, -1231, -1251, -296, 559, 409, -502, -998, 34, 1085, 1005, -784, -819, 31, 1039, 797, -231, -1206, -379, 522, 246, -61, -1235, -912, 810, 1288, 468, -660, -318, 1031, 1604, 870, 283, 237, 1623, 1952, 1629, 358, -468, 891, 1905, 1894, 423, 69, 546, 1687, 1485, 477, -876, 173, 1371, 1456, 111, -433, -184, 842, 1637, 501, -409, -340, 924, 1337, 807, -416, -420, -77, 1419, 1393, -347, -794, 439, 1511, 1225, 74, -882, -76, 904, 948, -440, -693, -831, 875, 1402, -233, -1391, -490, -78, 1088, 266, -811]
4289h11J1J555K99n91q61J40Q5J391o2j602m35O44J278J50j535q90R1J113J15
4308H5n68q63N3R77K72m29j022NR00N55n36n40p44J887P15m95j135k88J077J150
4328A056n9j582l97O59R55K75j370o76L64J204m62l24j064l58J424K18n43r74
4346a654j13J785O9L51j408k21J388M91O24j823j10O17J491r2r55k44P4J627j82
4365A715j072p89J71J467J63j479j090J64J316Q69j285p13m38J695O32p34j568
4382i76J59J087R17l88o73q54M62J715r3j010j227N98J233R26q92j696O21Q83
4400G92P9m20j101j10Q59J323j328r17J07L06Q10l1j331l13J16J778k47r99j00
4419g27K34J099J02j039n65J58M86J142j018o77J68Q66P3m36p13o64O37Q13p9
$$ y = [-811, -800, 755, 1054, 463, -398, -258, -173, 1218, 1156, -446, -881, -237, 1041, 1191, -344, -1234, -1143, -30, 85, -483, -1346, -1293, -316, -44, -473, -1495, -1490, -590, -35, -571, -1111, -1855, 32, 747, 252, -883, -1171, -94, 1056, 997, -585, -982, -323, 632, 907, -463, -1139, -775, 429, -33, -357, -1421, -1779, -355, -137, -680, -1654, -1767, 18, 87, 438, -970, -1191, 197, 688, 1312, -511, -621, -4, 1487, 1395, 440, 196, 270, 1897, 1715, 643, -146, 25, 1492, 1655, 176, -914, -750, 566, 1435, 150, -563, -1001, 694, 1326, 592, -976, -817, 270, 1187, 799, 126, -728, -266, 1449, 1356, 346, -881, -283, 950, 1876, 984, -712, -91, 792, 871, 451, -650, -760, 99, 1422, 94, -823, -716, -410, 400, 369, -962, -1275, -1159, 619, 372, -627, -727, -493, 606, 708, -331, -896, -738, -252, 890, -128, -805, -637, 229, 302, -134, -847, -1511, -874, -61, -140]
4438a40j554q42J543Q09j74r89j43P65O91K23p55n37L85J042O35j098r85J072
4456e2O87L44m15j422Q18O20N35o64j058l64Q43Q38M65j707q87J472Q56n09j047
4475f47l11L72J010k21p77n08K56J598L93j166km23J455P79n59j393J3R97P57
4494A623r23o64p45J302J229p22j340j54P77P77K88j389k61o5J000M34o87j195
4512g15L04J007J70l53j190j73J404J13n60j142M55K80R41P3j055m59O68O86j32
4531C22q28M4Q7J089j86n30q04M5J867k43p32o15n14J837J08p66q46l72J298R04
4551A165j361m50m65O92Q94n90j011l82M43J189n41m29o24J41J313j9m43j092
4569a570O85J033O09j118r25J49J462M85n33r69N75N54J210r72j295m4N88J260
$$ y = [-140, -1694, -2536, -993, -184, -358, -1347, -1490, -725, -34, 189, -566, -1103, -718, 324, 959, -139, -1124, -52, 635, 979, 564, -858, -40, 580, 1115, 451, -607, -971, -128, 710, 1175, -532, -1419, 53, 909, 400, -647, -958, -586, 424, 203, -574, -1082, -826, 772, 1165, -1, -3, -426, 1029, 1808, 1249, -144, -131, 866, 1623, 700, 36, -709, 593, 1822, 1100, -240, -394, 383, 1160, 1448, 59, -202, -267, 733, 1167, 480, -715, -411, 596, 766, 413, -777, -950, 454, 567, 7, -1135, -680, -400, 541, 614, -441, -900, -232, 454, 322, -506, -462, -375, 714, 528, -2, -806, -761, 1106, 863, 131, -484, -998, 839, 947, 181, -665, -1037, 261, 1165, -196, -646, -1111, -419, 475, -115, -1126, -1508, -1065, 124, -417, -846, -1470, -1329, -16, -35, -478, -1570, -885, 148, 757, -361, -1286, -1137, 325, 810, 277, -692, -117, 437, 1647, 675, -620, -664, -76, 1184]
4587A184o10r48n45P9J221m9o38q53L98Q23r9m42j245L88R33O53o25j181P42M51
4607c63P45j26p92j04M30J792m54n26p85P41J255m24n61r20R41N42J22j698l70
4626e55Q29Q69L7j127l72l03J382K38j111k27n93J698J65m11j093m22J373Q81
4644A258j0j405n1L38P92l4o79m45P41K43P67p71j094N52O80L77p29r41k12Q63
4664B40N00p20j282K24P40J183o96j529j02O73O62k01m36r56Q94J093k82o91j24
4683h10j17J197L35j161n0m75J797K69k70j131M13M07J69m07n20l15N63R63n18
4702C39q20o14N77J007p11n24q59J221O18r84l5m91Q09Q77L40j493L1j04J427
4721F11K41n22p31N94K30P94P7j016j43P3J116m85j043j26K31P33N51j012q16
$$ y = [1184, 574, -374, -919, -840, 381, 332, -306, -1159, -761, 62, -37, -479, -1724, -1336, -403, 250, -375, -1556, -814, -363, 382, 256, -536, -640, -210, 1582, 1128, 602, -183, 558, 1813, 1389, 828, -92, 849, 1391, 1513, -185, -555, 274, 1143, 1180, 53, -319, -622, 760, 998, -113, -340, -933, 765, 930, 519, -574, -996, 377, 1258, 1248, -157, -208, 130, 922, 888, 209, -236, 505, 748, 1515, 744, -350, 202, 882, 1259, 530, -411, -623, 240, 740, 20, -1262, -1038, -298, 885, 189, -1340, -1442, -769, -107, -308, -744, -1700, -806, 287, 5, -686, -810, -927, 270, 605, -556, -606, -1081, 716, 985, 715, -416, -3, 404, 573, 166, -354, -669, -106, 857, 339, -481, -1095, -518, 489, -222, -746, -1605, -384, 234, -750, -785, -1276, -467, 410, 750, -743, -712, -816, 611, 852, 330, -401, 193, 423, 1217, 1294, 278, 135, 208, 1324, 839, -204, -330, -99, 634, 1185, 173, -643]
4740f43J79J323K20j184j388J010Q93k3m2j328M42N97O40o51o71L2Q53N74M3j075
4760a99k19J83O14K40m80n77P29R64l51q48q58R64K84N75o56r38j79N59Q53p49
4780h9p79L25P90P74o35j124j09R75K78o5m54q87Q18M50M10p45k50l7Q58L01j287
4801d82m36K88O33M59m32k12j77M09J313r05q36o4O77N34m44r33J55M69N12K6
4821E54n10r85P23O43j33r40n44M81J496j77j151o49J39J344m39k69m29n5N12
4840c89J214p58m91J75M55J035j65j176K73L80Q00q06j06k22j71R70j27l70j410
4859h89P89R68O7q28n81j04Q69j35L5n91O03l7M13J38r88k48O45M81J06m95mQ05
4881A019R2M17q04j38j62Q75J0m89j064M24M63L47n27j076P58K82j69q1q55j48
$$ y = [-643, -464, 859, 1079, -105, -1493, -483, 410, 387, 345, -983, -541, 56, 696, 45, -626, -594, 259, 833, 876, -199, -418, -235, 379, 619, 139, -438, 291, 1255, 904, 56, -802, 162, 446, 1021, 365, -573, -752, -193, 660, -89, -868, -543, 247, 1021, 386, -738, -847, 128, 406, 341, -113, -1000, -182, 268, 678, -67, -317, -354, 504, 805, -482, -918, -630, 3, 462, 30, -182, -359, 50, 1363, 458, -378, -442, 235, 769, 325, -608, -453, 16, 528, 554, 44, -941, -218, 425, 292, -648, -1192, -711, 785, 608, -543, -1192, -1053, 291, -148, -417, -846, -901, -389, 825, 67, -424, -249, 206, 1241, 1076, -100, 173, 553, 1353, 547, 441, 219, 48, 1018, 891, 521, -889, -100, 868, 935, 107, -474, -578, 291, 156, 191, -400, 203, 166, 579, 717, -271, -519, 126, 607, 713, 218, 214, 1019, 1111, 1528, 724, 586, 424, 1299, 1309, 820, -244, 180, 643, 990, 463, -613, 145, 427, 258, 177, -678, -826]
4901h26L60N85J78j230n33J104O26k35p83j03O24l1N48o34n08J65R05p4j02j486
4921a450R55M72R42j216m19J62J69L86K99j588k55Q56N40R4j022J01L48J126o69
4940a69n31n91O50Q2J99o4q32P12L95K00l84m27J29N53M96j55q19qO97P36q46
4961B3l62k01L59R08l28r56R0N43P24J91p15n56O76J00O66j748N30l80P33K99
4981E96q65l4L93q8J091j408Q3o1O04p4R6n88k12O65O32J86j141j83R14K23O71
5002A500p62o11M61R60J23m31n74m23J128N4n58n48p3N02Q74j128j002L63M48
5021C03J36p19q6m45P21M53J6p64l03O4Q93m7n08m48L95O57Q19n24j201N71O97
5042F80O66j229j30l38O55O40r1j200o33P41M75l49p20m87M92M75Pj198k4M7R81
$$ y = [-826, -466, 119, 297, -933, -1466, -362, 264, 29, -754, -857, -233, -264, 284, -350, -858, -693, 212, 138, 36, -1450, -495, -23, 919, -297, -716, -554, -385, 1, 300, -1288, -1543, -687, -147, -53, -1075, -974, -626, 500, -169, -700, -1291, -641, -559, -360, -424, -1256, -544, -149, 51, -333, -760, -631, -78, 418, 263, -556, -564, 133, 869, 23, -339, -540, -181, 727, 399, -557, -467, 76, 800, 991, 276, -280, 396, 496, 1162, -586, -56, -436, 297, 596, -269, -303, 90, 2, 1093, -315, -232, -293, 311, 237, 333, -255, -467, 198, 830, 1016, -125, -308, 606, 829, 1500, 738, 127, 588, 1548, 1671, 1240, 666, 243, 1371, 1425, 867, 319, 246, 748, 1622, 494, -508, -145, 303, 439, -280, -366, -811, -90, 363, 379, -385, -688, -624, 269, 222, -286, -734, -339, 318, 1137, 613, -588, -17, 680, 1346, 117, -13, -351, 304, 944, 853, -347, -980, -239, 236, -113, -833, -1320, -828, -353, -346, -1544, -1568, -1521, -540]
5063e40K23m72o99O1K68L82JN56j262J145Q61jj440L39M20Q14k68q78j95L62J163
5084H40k22p53n72K60J067k38m32j008K57J039J54n31j043O17Q30N42n92j099
5102h84q3P73L24M01r20j09M76Q60m99o17m59P12R26J0n22m15J70M32J83o86j41
5123f8J66P62L4k42p13j98J016K69k77r75L02N51N13r35l52j62N91N96M6p14j018
5144h08R61M55k61j24p80M92j02lj97J23r1N24O32q16k68k3L65Q52q60o08K79
5165b58N24R34j076l66m11N26O21n75k10n8m21J058no12p55K87P48J29r2n96l8
5186f46K60K22m92m47J04R43O49r11n02l3L10N95J75r51l21J028K23m3n63o11
5206a011M81P56m9p07P7l58Q08J56n91k38k95M83O07k40o13L45K66L42q6j91k76
$$ y = [-540, -317, -789, -1488, -1427, -1159, -777, -776, -220, -1482, -337, 524, 523, -917, -578, -158, 656, 388, -490, -685, -323, 840, 618, -135, -707, -447, 620, 382, -50, -1058, -801, 238, 392, -139, -1182, -565, 265, 807, 215, -884, -967, -194, 130, 531, -389, -498, -22, 838, 339, -278, -737, -25, 901, 911, 389, -26, 144, 576, 759, 73, -68, 98, 860, 894, 652, -61, -259, 757, 1026, 749, -226, 76, 627, 1140, 205, -147, -309, 282, 878, 924, 210, -808, 153, 608, 347, 223, -557, -65, -167, -170, -367, -244, -335, 189, 821, 5, -263, -286, 79, 931, 71, -537, -258, 266, 1200, 124, -242, -653, -127, 494, -81, -291, -349, -770, 288, 283, -329, -1084, -797, -49, 80, -12, -608, -646, -386, -164, -656, -1103, -999, -56, 593, -318, -820, -853, -543, 52, 227, -724, -1045, -17, 206, 163, -400, -1011, -530, 226, 177, -530, -453, -811, -3, 153, -438, -676, -971, -488, 119, -121, -734, -389, -123, 219, 133, -58, -334]
5227c34N77L30k54m61n11O43J66O89j043j20N56O05j53l95p57N15Q17j47k78q19
5247c74M52L20J051r92m59K46o86J098K05j40l69J29N06k53m50m6N65J59K37m48
5267G51m14k51J173k88n48l17M8L13N18m31p91K87O27L81n81r01j28J80R58k60
5287C26r22k13P20P03j58p56m74p0J292J58r24kl38M29O13n49o60N96N23N59r36
5308h3j34q74J265K36m65k36m45L68M50m29l96k05P1P22P01j193j80M78k9L8l47
5329f87m24L17N24L28q8l89m13J84P98L38j091l38R68L41o20k9n96N89R23l08
5349C27l39m81K07J28N97q46k15j55M42R55m95p90M40K51O21q5q14L59K48M96
5369H51q84k11l4J039m6Lk80r11J116n6J38p33l40LP81L01m54k80M76k04N13n71
$$ y = [-334, 243, 573, 319, -142, -653, -10, 156, 845, -198, -318, 238, 843, 690, 295, -462, 53, 870, 723, 445, -374, 78, 398, 1449, 457, -2, 244, -442, 656, 861, 721, 352, 481, 987, 734, 284, 238, 803, 962, 1199, 751, 337, 86, 1259, 971, 423, 106, 154, 467, 985, 554, -237, 50, 677, 1058, 477, -424, -552, -372, 586, 326, -596, -809, -89, 614, 456, -300, -774, -844, 448, 606, -318, -320, -658, -229, 384, -165, -825, -229, 294, 853, -83, -217, -1091, 174, 410, -55, -291, -736, -368, 82, -347, -743, -948, -877, -155, 546, -647, -827, -349, -378, -340, -687, -1111, -794, -270, 58, -30, -419, -832, -648, 150, 488, -603, -941, 27, 368, -252, -281, -877, -288, 635, 327, -12, -493, -286, -158, 439, -407, -622, -777, -335, 620, 125, -665, -225, 26, 647, 562, -252, 107, 355, 851, -33, -244, -278, 761, 715, 718, 438, -473, 643, 587, 725, -8, -348, -345, 436, 737, 283, 3, 479, 275, 788, 217]
5391B17j89q4J78J025p56o86J44O94M93r79J81K0j24R20l3r14L3M43J70k85J2
5412D80j097p5J138O10p69p01L42L59J05l35m60L8M99M10j039m02J63L41P26o7
5432B66m94o51N36M59J35k60n98j04J507q24k18l47l59P45K76l18O2m98J37M84
5452f4l15k18K35l1M65l96k29m70O48L24J68q49o27Q86N62q3p52L5R2J080p08
5473b47O02j491J0J034P58n05j034J89J103k82pp71p8K04P04m4m92m34L94O30
5493B43L29m73k72J88J98M55o80l0L18J87N24n36j064M61K86R22m64q76n82J078
5513B12K35l5l24j29M71j60m88P65j231Q25M37P1k16n80N85j93N57l97m79K75
5533B01N03k47k12k84r3L67M98j83q54O17l33Q12k76j180Q8J45J133k6q51n91
$$ y = [217, 28, -56, 122, 1147, 391, -295, -151, 543, 1036, 57, 238, 258, 134, 1054, 1021, 107, 140, 583, 753, 468, 480, -617, -692, 446, 1056, 287, -414, -72, 287, 392, 57, -403, -365, 134, 544, -495, -897, -734, -393, 333, 266, -228, -879, -343, 116, 251, -9, -607, -711, 796, -28, -246, -593, -952, -207, 69, -249, -187, -685, -548, -64, -379, -597, -362, -393, 72, -324, -553, -1023, -375, -51, 117, -732, -1359, -473, 89, 6, -746, -711, -619, 461, -247, 355, -1136, -1126, -92, 666, 161, -873, -684, 419, 137, 130, -641, -719, -515, 189, 145, -347, -781, -387, 243, 572, 99, -173, 15, 213, 668, -12, -42, 276, 463, 987, 451, -613, -152, 134, 1056, 592, -284, -866, 212, 447, 412, 88, -41, 430, 270, -218, 547, -684, 141, 578, 649, 433, -147, 438, 245, 802, 405, -74, 201, 704, 457, 245, -39, -132, 235, 733, 550, -304, 313, -20, 792, 516, -664, -576, -431, 702, 676, -175, -766]
5553g66Q64K61l12n2J77l36Q21J17m56m70j90P02J02m3n71K8M78L29l07n95r90
5574a209J110N68l96m68p20Q94rL72n41q50J366K1m5J68o15N34Q6K24j82q51K81
5595b62N97K45M89j720O48j07R50j24j080m86O28Q27m26K9q51J32M72L96m66m65
5615e74R2J077M31j305k80N58j00O86o03q7l15L77M69Nm65m8J84P34o65j41j12
5636h2K54R6J19m96l3J56P40l08L05j210j01J177l59j2k52J34K99N61p32q76K90
5657c30J204l94n83K43n64O97N47o3m99k90J84K68L46n38p88K45M18K94n92L23
5677A28m05M52R2q92K77P2P75L71j39r64j64K44N14Q5o25j57M52j32P41j200M4
5698d31k16R66l63p22j53Q0M26N87r38k1PP90k12k79j90N2P22J92k76k03n6M44
$$ y = [-766, 98, 359, 47, -5, 172, -164, 657, 774, 318, -152, -342, 360, 462, 419, -152, -124, 354, 683, 376, -219, -1209, -99, 469, 73, -395, -1115, -221, -230, 142, -399, -1249, 117, 138, 93, 261, -354, 180, 266, 490, 308, -543, -262, 335, 580, 1069, -651, -3, -110, 840, 716, -364, -850, -222, 605, 179, 208, -643, -511, -39, 357, -109, -574, -482, 595, 1026, -279, -559, -1, -101, 585, -18, -105, -420, -43, 426, 431, -34, -82, 102, 836, 171, 30, -82, 172, 268, 387, -109, -142, 14, 754, 446, 751, -459, -560, 617, 258, 246, -6, 128, 427, 988, 256, -620, -330, 874, 480, -103, 140, -424, 273, 820, 757, 258, -32, 152, 420, 766, 228, -560, -315, 103, 397, -195, 128, -277, 175, 267, -625, -348, -276, 499, 870, 731, -233, -397, -153, 361, 446, -179, -336, 116, -16, 725, -475, -431, -647, 319, -44, -766, -919, -839, -413, 174, -764, -785, -778, 12, -200, -479, -669, -617, 105, 297, 21, -182, -238, 206]
5720B06K37l7q17K69O52M3M3r8j465O86J144m91k59k78M3Q5N19j010m30L35P04
5741H1K22k36m26q7R44l86m47J83K8j60K94K09l5O0k38L22L47k04q68L36L0J164
5763A133o56p01L28O01J31p13l12M53o06R43j03r69j78j3J279m22m13l78O82N31
5783F17o52j32m06K83N22N3Q8o31J91M72J25m70n59K43Q79k21j15k77l20O16O23
5804I29o40l06m69M07O23k08m66l88L39K00p7Q4j94p6L05L07m22o19J30M29K76
5825A64J88j208L46R69m00j92l8p49K84P12k40o35m01J368j16J14j04j063L87
5844f14J063M28j016n30N58j57J112r29j89l26L89P85m39n24j72L79M48k86l42
5863c62j06J52Q84k24o10o5j4O26K51p55k34N96J22J34l37O7K67K38K65p53L25
$$ y = [206, 443, 406, -411, -142, 510, 553, 596, 498, -967, -281, 863, 372, 113, -165, -122, -37, 482, -528, -958, -623, 81, 303, 67, -359, -446, 498, 112, -335, -152, -124, -284, 10, 219, 184, 244, 6, 328, 675, 471, -397, -61, -31, 1133, 477, -224, 104, 705, 836, 123, -189, 264, -342, 601, 498, -471, -649, -662, 617, 195, -218, -596, 86, 617, -35, -167, -573, -290, 232, 285, 373, -258, -67, 405, 530, 60, -499, -256, 623, 402, 287, 10, -310, 306, 929, 289, -17, -486, -79, 544, 336, -130, -518, -179, 21, -56, 28, -166, -242, 63, 370, -52, -671, -541, -112, 164, 352, -856, -510, 459, 59, -133, -171, -920, -636, 76, -164, -799, -1200, 168, 52, 166, 62, -1001, -614, 449, 877, -139, -669, -111, -268, 844, -85, -274, -600, -211, 574, 135, -389, -561, -182, 266, -20, -362, -468, -316, 568, 344, -266, -331, -345, 281, 532, -223, -457, 139, 261, 395, 58, 125, 392, 630, 895, 142, 467]
5884D67o2O81j71k16m78l63M05L66O3p10LmM58J05l39o87j6J166k7p87K5Q3N71
5907E33p29K64m82J77M62M09q52J11n46N76O96l15m72n12N82N20l09o13l51Q77
5927B6L39p4j141K42n7m9O59r05K29l33L85R52q50rJ08K28L59n89K1j70N22L62
5949B55n80L1l47O88M71j52p50k6q0J92P97p13n83M37J47K80o95j4R3O40L4j74
5971d9l47m35Q07J47m30j31J26j86Q94l59l46l00J216j33j3j01o17L84N08P3n25
5992A83j40j09M5N59p01k07K85o5N20j18k5l76M60J05q98L89j34O97k14K0o12
6013c36m62L06Q21K35j36l41l05O51K25l27l63P4N09k95j51K27n08J080J03p17
6033B90L40p87P03j17J91l54L9J21j26K39r11L72K2L63K84r18L47o28O53O88r74
$$ y = [467, 405, 1086, 915, 699, 221, -142, 263, 629, 692, -18, -15, -19, 439, 544, 205, -482, -498, 668, 641, -146, -121, -38, 533, -196, 68, -414, -237, 225, 634, -218, -107, -653, -77, 619, 304, -168, -680, -98, 422, 113, -500, -851, 26, 365, 291, -850, -608, -665, -714, -55, -960, -731, -1064, -679, 273, -577, -586, -478, -250, 109, -480, -459, -629, -107, 255, -325, -294, -641, 47, 518, 366, -384, -410, -490, -298, 499, -214, -797, -360, -213, 67, -628, -642, -549, 91, 125, -49, -396, -831, -24, 123, -307, -438, -312, -498, 396, 37, -309, -609, 607, 474, 461, 360, -257, 127, 635, 708, 183, 43, -66, -21, 538, -163, -370, -85, -150, 370, 252, 227, -149, 311, 416, -482, -93, -227, 470, 256, 276, -336, -798, -492, 329, 564, 428, 87, -218, 433, 658, 331, -32, 42, 551, 256, 105, 332, -176, 904, 1007, 290, 630, -157, 546, 429, 620, 266, 305, 426, 300, 539, -372, 0, 22, 385, 669, -249, 98, -530, 123, 811, -163]
6054a63j45M21J69J8k90k53m40M14N75J95p80q36P16M42m39O02n04l52N88L14
6074B52n09Pq7K17J86l13p63L53M48K48n20n47J18P05N41n23p34K4P32N9j0o7
6096a83m77K37R87q60J72m81P15K26K22o21n91M64o2M38N8l52R8O61j70l50q7
6117D4k47N62J19j75k92K24o41J125k09k79o70L49L21Q2l37M16o92J023K80j251
6137b48K91J95J50J13J86o23J33K15M77k53n48j4K54K14j6j84m67N09L10l60k3
6158C11j7j57N70l12p41L93l28O32j93r1m39l39J80Q50Q4p78K56K32J89k91p20
6179g09N54J09mN66o30q39P81L64j67L71p16M03J2M78r85j63J40j52P25q62N3
6200f71M6M91j33J04o11L40J00L60k81o96K05J92J15K88m69L39M0l76O91p31J55
$$ y = [-163, -308, 113, 282, 300, 10, -243, -683, -269, 306, 501, -279, -1115, -399, 43, -396, 206, -298, -650, -62, 252, -257, -250, -337, -120, 66, -247, -1010, -657, -209, 39, -481, -1028, -910, -205, 336, -187, -921, -897, -165, -106, -116, -183, -660, -423, 564, -296, -124, -605, 110, 336, 558, -63, -654, -190, -252, 186, 244, -108, -10, 651, 481, 131, 44, -203, 359, 478, 303, 11, 235, -406, 719, 510, 231, -439, -90, 231, 313, -24, 392, -300, 723, 1003, -248, 43, 238, 388, 501, 687, 64, 197, 412, 889, 636, 88, 74, 328, 542, 526, 342, -125, 384, 694, 334, 311, 294, 137, 707, 395, -346, 47, -281, 351, 158, 67, -372, -711, -531, 319, 403, -375, -119, 113, 302, 11, -709, -155, -46, -50, 516, -114, -953, -172, 192, 25, 396, -320, 83, 95, 573, -412, -575, -435, -587, 138, -724, -671, -625, -134, -267, -163, -774, -434, -334, 26, -255, -951, -746, -554, -439, -151, -620, -281, -241, -617, 74, -657, -502]
6221e02L60K34J0l26n90L63O94l0L4o71r0j48K74J21j53J15M87m80J28m2N2l10
6243d70P42k50o23O47M1k62M27o36J92N63j48J7j57k70j92N05L32l97j9M91l17
6264B16K39l35j57j81Q45J42l79K33k43J53j07K69J0q36L46M40M20o28k43n7J94
6285C41J4l7o06M32k3L60j05j107N02N53J25j48m55k10M94M86j1l38l39rO47J19
6307F85j22m69l24M39r8J2l58q5K57R6l44P6m81L00N34R6j055N65M88m66j34j38
6329e26j51M25K56j05o39l6k2L49L45j55l89q9L39O94m06n4l52M83j75L3K41P
6351G3k89M41K54m83j79o4P07k15p40P49n30Q41k22n15k03M86L9N54l66q54J70
6372c46M93L70J13o93M31M83l31l47k1K8J03k86N39l16l40M80l9N5K47l60l28
$$ y = [-502, -142, 92, 102, -224, -814, -451, 243, 213, 247, -424, -514, -662, -388, -267, -420, -305, 182, -298, -170, -212, -160, -470, 272, 22, -601, 46, 87, -175, 252, -384, -192, 371, 223, 240, 83, -187, -379, 126, 458, 61, 42, 533, 216, 455, 120, -37, -218, 627, 769, 390, 623, 380, 533, 426, 695, 705, -131, 215, 655, 1075, 447, 204, 147, 341, 355, 318, -288, 144, 121, 481, 376, -731, -229, 324, 449, 301, -154, -364, 130, 616, 605, 267, -72, -81, 566, 685, 563, 94, -230, 209, 111, 123, -235, -320, -63, 33, -311, -235, -716, -416, 118, 214, -841, -276, 212, -254, -388, -526, -677, -252, 4, -101, -740, -776, -798, -449, -104, -259, -648, -737, -398, 296, -110, -164, -516, -33, -208, -175, 66, 73, -216, 225, 479, -4, -183, -247, 460, 245, -495, 254, -276, 565, 343, -172, -375, 111, 150, 704, 338, -516, -346, 147, 517, 630, -63, 368, 851, 520, 173, 152, 180, 283, -3, 536, 220, -120, 360, 321, 376, 623, 263, -65]
6393f5Q20j62o87N3M00M92k61l05L43l28J03M46n44n2j39N8J67J04k01L2m54O97
6415E17o04q3l01L39O61l25j78n47O09l74P15l23N4k69R3l3J36m62L11N30l49
6436A17L33o29R8j81j13Q85n28r8k65J25Q99q01p59R67n9j73J68m06L18K19M17
6457E34r05p0M04l62K64Jl13J7k03P06l75K36l19O47m9J07o36j94O0J77q2r7j40
6480e92q8K05J5L61o24L00k21L85j14L0m92L96N1M34J5m05J34L19K25r60K32M29
6502C5N95p39k25K58K05r7L55l41M04m77M22Ml53J41n49O53N49n13l87L57J21
6523D18J48j16Q3n77M35N29l43j07q28O35l9j9j47R7K8J74K37m31n07K04Q58j43
6545E89m14ll5k62Q35n33j90l18L68K76R4o6j78q5L14m84P1k86J78L2K65k5l31
$$ y = [-65, 755, 593, -94, -41, 359, 851, 590, 285, 628, 300, 403, 849, 305, 253, 114, 172, 339, 443, 242, 274, -180, 517, -87, -170, -471, -132, 529, 204, 26, -521, 88, -286, 429, 106, 160, -109, -16, -49, 87, -375, -64, 466, 117, 450, -179, -81, -262, -375, 510, -18, -116, -381, -256, 643, -158, -917, 50, -9, -182, -14, -420, -102, 117, 534, -371, -441, -37, -399, -135, -134, -447, -430, -633, 73, -302, -66, -385, 262, 213, 320, -316, -510, -450, -273, -355, -452, -592, -680, -475, -460, -99, -723, -423, -644, -259, -373, -343, -835, -439, -388, 46, 61, -344, -210, 109, 334, -626, -394, 35, 630, -109, -334, -76, 129, 32, 387, 46, 450, -27, 395, 399, 46, 187, -362, 291, 840, 327, -60, 297, 418, 566, 450, 533, -44, 391, 920, 577, 470, -358, 277, 238, 219, 72, 169, 197, 371, 608, 177, -330, -126, 732, 589, 175, 172, 137, -125, 710, 177, -13, -331, 37, 313, 407, 341, 163, 78, 392, -92, -21, -307, -129, -97, 168, 143, -188]
6568a88K72M7k55K22m8K86n50O35k99o05K0K77J71k01j30j34K80K25l94j83P8
6589d74L86Q92m08m44l07k18M91M01m22J56j16K76L49j051M22l10O47o3l07K84
6609A84l96l5L59J82o42K26j20L48K8Q6m9J08n1L81q03k04P53o14K32j92K37j9
6631aj41J069j019j8j55N5N96r7m48k35M49N4J25n3m56M82l79K87r5j33o3L77
6653B01j0k32j62K52J47LL25q83j14P83JJ05j80n79N87r2J26k06m4M84m73K79
6675C18o83L70K69k86M04j68m93j45N08J46m66k26N8J166k42m07k09K51O9k30
6695DJ00M05m51m04O07o3n78l57O46O44k47o78l2jO10m91k42J74O0L17J8R7l01
6718a63J98o7o0k38l40M8K86K9K56j42j99m63M46l6k3J13J16J70N9k62j96m0O47
$$ y = [-188, 84, 131, -124, 98, 50, 336, -214, 421, 122, -483, -463, -186, -15, -216, -346, -480, -200, 25, -369, -552, -474, -88, 804, 396, -48, -355, -573, -82, 319, -103, 53, -63, 213, 562, -489, -67, -377, 270, 207, -100, 184, -212, -247, 112, 294, -348, -122, -242, 106, 134, 220, 171, 279, 228, 609, -194, -398, 355, -259, -27, -219, 18, -1, -142, 927, -92, -110, -265, -210, 386, 289, -159, -394, 55, 109, 234, 181, -275, 207, -172, 115, 20, -113, -176, 201, 191, -41, -203, 49, 196, 199, 524, -359, -473, 310, 311, 416, 236, -343, 244, 152, 278, 72, 28, 512, 39, 318, -365, 5, 274, -12, 392, 224, -269, -414, 94, 240, -226, -452, -394, 772, 530, 123, -86, 165, 234, 4, 104, 509, 58, -346, 261, 198, -380, -737, -91, 553, 306, -372, -404, -405, 205, -286, -528, -354, -294, 23, 41, 138, -163, 35, -32, -92, -330, -670, -622, -336, -307, -51, -193, -392, -855, -409, -445, -468, -355, -239, -69, -10, -272, -468, -508, 139]
6741A39j94j09J45m54M26K68m80k24K01J94kJ47j53j98N49l69J84m79L23L10m50
6762b26L26l97j79M34j5K37j05k92M60J01k53j4p03N20N51j07L1o28L72R7N2J13
6784C75n32L3N30L42r19M34L9l16J09O15n08n38N64J26l07J16o25J84O4N56k90
6805E2k49N7J20L7n72K64k11M60n9L38q08r5P62j88J0j47L35l65J66O7o55k24
6827i05O92J75J52l89m6J71j45J86J0o2l76O91j52q6k23j91O4M4P52j107Q5N27
6849a33K61o11J6M7L77o0j3j78k42P00K81l09j2j42q2L67n8J21l61K65p66P13
6871A81pm07K6N39n81o0L28l93N22J25n75j3n3l10M61M76m49l08L34K78J54n23
6893b55m8k73Q33n2JJ90n07K57K37M13m5j044K29J011o58n80M48k38M55k6n10
$$ y = [139, -55, -164, -19, -473, -47, 221, -259, -483, -282, -88, -90, 57, -96, -294, 255, -114, 70, -409, -86, 224, -226, 100, -297, -476, -42, -57, 180, 75, -217, 243, 344, 91, 77, -626, -106, 445, 338, 369, -259, 113, 210, 262, 375, -157, -124, 406, 748, -171, 263, 302, -14, 95, 710, 202, -336, 228, 354, 47, 163, -462, -278, -214, 342, 52, -197, -140, -20, 17, -555, -291, -502, -42, -101, 237, -571, -666, 96, -92, -82, -229, 106, -259, -93, -26, -681, -905, -213, -38, 114, -275, -321, -150, -295, -109, -99, -161, -537, 154, 2, -84, -307, -498, -434, -390, 362, -745, -660, -133, 128, -483, -467, -420, -43, -103, -116, -294, -536, 164, 445, 136, 124, -18, -100, 267, 209, 330, -31, 234, -532, 181, 174, -233, -207, 332, -249, -309, 19, -374, 148, 273, -302, -315, -368, -678, -217, 259, -190, -498, -164, 114, 268, -255, -303, -576, 257, 205, 206, 396, -111, 146, 383, 796, 751, -293, -64, 947, 289, -291, 157, -81, 374, 348, -162]
6914a62J43O99n87p0O0j24k80N12N21p46j47j44K47K72k23l37j72N15P13j30o78
6935a18l29O54j03K69o38L21l7N5j47K92l96K27m8Q5J12o45P27p33P31K81j246
6956f86K04K28j55L24j70p9L02L87q31P6k21K89O83n58nm85N15l2P73n44o21J99
6978d07M74n15L22l0l26P34l49k6k74L02O3L6K05o96N68p5M79K95r21o46P43l1
7000g5p4O4M27j108R34j71J48p66L10M31L43m12O6m04O04J12j97m79M58K61p7
7021C95l11k80M48L77m99N24q02j68O84j56K45n10N24k3q1j67J6m42J32K40j91
7042d5J57l80L76k05J63L96o99K7M44J62J96o38k93j97M98O3P5o02k29R34K70
7063D73j067J13J84M20k36o1n6l55Q14n41Q41p63j84K34O07n56k81n5J95l3K27
$$ y = [-162, -19, 680, 93, 23, 83, -41, -321, 191, 712, -34, -181, -325, -78, 194, -29, -366, -538, -23, 690, 560, -118, -447, 207, 104, 373, -265, 56, 19, 74, -73, 219, -177, 50, 2, 87, 199, -446, 281, -452, 279, 560, -686, -482, -254, -409, -85, -255, -334, -32, 355, -476, -400, -621, -332, 351, -207, -212, -697, -182, -214, 559, 15, -606, -407, 67, -448, -126, -156, -482, 252, -97, -123, -397, -95, -32, 4, 209, -487, 81, 6, 485, 780, -141, -787, -44, -75, -149, -85, 342, -766, 168, -3, 145, -621, -311, 120, 463, 51, 117, -287, 317, 429, 232, -247, 211, 472, 395, 84, -196, 252, 629, 130, 654, -148, -316, 368, 212, 457, -53, 471, 448, 367, 200, 216, -226, -94, 146, -45, 112, -268, 108, -97, 66, 462, -237, -210, 234, 396, 592, -46, -339, -536, -38, 25, 100, -502, -731, 203, 473, -594, -481, -297, 123, -113, -174, -230, -585, 229, -312, 529, -234, -418, -184, 423, -133, -414, -469, -274, -307, -80]
7084h0k16J4L12j05L59o41O9J73J32J72l78m0J43j58L34m17K65l35Q32n65k79
7105d09l6O26l06K37k50j24n44L22O90J98m77L14l15j18Q61p18%lkJ96k11k03
7127b72K27k9L96J76n34J43n78N28l0j11Q8L84j38K70j12k59n15P14m45J91n9
7148C5r1L80J44l30k83K46J12j48L00n68J90O05k56l15l8oN24p7l55L34l12L94
7170D85K47m66k68M24J41J77m56K95n47m38P73J78l85o4n3J76K40m45J49j00J8
7191H1M63p97L48m17N36k24J41%o91K89K41J93o24jM37J26j3j55l79j56O39M56
7213D93o83l68j17N49K88j86m14K45p5J44Ml93K65O7L92o22j79j83M61L83J33
7234B04m53k10L33j23n84M64p6K22N38o02N43l63o1j82L46M25o36m7K22J93J74
$$ y = [-80, -296, -282, 30, -75, 284, -357, -288, -115, 17, 189, -189, -229, -86, -244, 90, -327, -62, -397, 435, -130, -409, -445, 181, -125, 112, -138, -262, -806, -484, 206, 404, -73, 241, -74, -192, 669, -49, -49, -52, -54, 142, -69, -272, -45, -74, 322, 498, -36, 107, -471, 57, 27, -84, 4, 388, 250, 520, 408, 149, -366, 348, -97, 94, 35, -56, 324, 468, 138, -145, 101, 213, 65, 365, -203, -13, 592, 336, 21, -17, -23, 501, 424, 69, 403, 91, 485, 732, 266, -2, 422, 563, 740, 284, 579, 32, -406, 367, 545, 160, 96, 43, 219, 459, 14, 163, 63, 81, 544, -253, 95, -322, 214, -10, 131, 131, -560, -271, -30, 163, -461, -462, -25, 101, 88, -67, -446, -602, 37, 493, -190, -558, -675, -126, 162, -24, -438, -193, -268, -124, -120, -513, -248, -181, 211, -411, -590, -773, -312, 71, 204, -249, -459, -126, -249, -833, -369, -445, -223, 315, -287, 256, -107, -168, -350, -4, 421, -215, -262, -40, 153, 327]
7255C27m62q5j64J074k28j90n15Q5J85r3L86q9o31J003n19J73j61l3K79K20n26
7276C6K97l84Q5M52m04K65k73j75P54n73n09P31m27l1K71m18M62m85M85K40P4
7297D73m34L80On00J4O0l19N81R4RK86n91L98j97j94J24M5n26N83K95o87j34%
7320b34N48m31K61p53N68L14k50K07k14j0L12p94M29m5R2k00k6k71K28J75k67
7341c61O44j95m39k26N86k60O07r03j98K37P09p47L0L74n7K94k83r0p8l7j91L62
7363b22j41j46N24n49J01L05P4r21P56N3j80L84Q1k37N01o92K07lj93M00J34k74
7385c8k12JQ24J42q82L1J00L63J44K42k94o09O96k81K11k52l67L25j85L58mp33
7407d20Q05k86M26l55l03M14k91N00m80J41m16N58L48m6q49O08j2M59l60j88J69
$$ y = [327, -135, -220, -384, 690, 462, 272, -243, -158, 27, -66, 320, 231, -400, 603, 84, 257, 96, 63, 342, 562, 36, 333, -51, 34, 486, 82, 347, 74, -101, 653, 80, -429, 302, -125, -156, 115, -303, 159, -326, 159, 399, 473, 39, 419, 425, -75, -61, -1, -320, 261, 355, 364, 650, 59, 457, 260, 66, 190, 235, -291, 292, 587, -100, -234, -234, 314, -117, 144, -609, -41, 273, 23, 230, 16, 6, 318, -476, -47, -92, 0, -200, -226, -497, -269, -94, -361, 283, 88, -351, -577, 9, -251, 356, -547, -745, -508, 201, -546, -516, -142, -199, 95, -188, -278, -356, -393, -584, -222, -363, -509, 15, -534, -433, -128, -54, -975, -219, -166, -346, 38, 119, -118, 383, -309, -102, -105, -298, 102, 236, -38, -250, -249, 575, 717, -165, -134, -34, 329, 473, 715, 421, -188, 508, 227, 438, 186, -181, 144, -41, 317, 313, -420, 385, 99, 525, 170, -133, 281, -10, 490, 10, 151, -265, 293, 641, 595, -254, 354, 342, 801, 441, 253, 422]
7428D22l41O58j83n48P73r12K54M9p65N43k28l2N92l14M6l00K09L48r83N38L98
7449B24k64j98Q33q16J31K45J86J36n63l16P14n6q0m95j6Q59q60J92l94j76J8
7470f96O53j87M7j39j1J07k67M28k82m7J46j5J80n24M27l90O61om08M3L22l21
7492b79M57n3k80J35l59K27L42q7q38O80J34p0n9J92J08o70N86m48L1J66q3L81
7514B13l46O6P0K8K18k59l24K88J72k07M63r78P62M99o10M8n0L7m28P05J8j98
7536A87K04Mj26K78j009M66J23M31m05Q7k65K30K26l54j27j91K90J70n9l24J62
7557bJ3L71j98K92p63J27J36J53N2k21k38K81K97m05r0K7K36j50O23p50L9L96
7579B26K23L20o84j78j84P97n80L59l98m21O79l80Q6n1j35Q90l45n23l23O62K30
$$ y = [422, 81, 739, 556, 8, 781, -131, 123, 172, -593, -50, -278, -310, 282, -32, 14, -286, -77, 271, -712, -174, 224, -40, -238, 595, -221, -90, 155, 341, 477, -86, -402, 312, 256, 176, -319, -335, 524, -336, -144, -538, -714, -696, -43, -230, -183, -322, -333, -226, -493, -65, -347, -394, -248, -263, -83, -607, -180, -570, 91, 85, -323, -280, 42, -279, 178, 125, -155, -20, -379, -152, 190, 103, -735, -55, 79, 9, -50, 142, 250, -420, 166, -282, -251, -85, -168, 213, -133, -67, 3, 31, 249, -10, -334, -46, 126, -81, 382, -596, 166, 665, 55, 103, 53, 90, -338, 367, 385, 187, 391, 395, 269, 547, -462, 4, 127, 558, 153, 240, -25, 205, 431, 77, -50, -241, 49, 219, 160, -164, -2, 11, 382, 184, 476, -287, -160, -24, 129, 181, -40, -278, 3, 300, -105, -195, -168, 68, -82, 541, -209, -170, 226, 449, 769, 85, -93, -277, 520, -60, 299, -99, -520, 159, -221, -135, -186, -321, 569, 224, -299, -622, 40, 270]
7600B70l95l12K56M30L0J32m54n96j17K48J4M31k50p7L61J78j92o13L85rK46j67
7622b01K38J83j90l66o3M48L6n07K16j43l32O49l12k3j07M91l45J14n8K59L34
7643C21l99j3L09m53J83K51l70K16L60l72P30l43n86R22l88p8L5n68M39M79k91
7664C84K4n99P36k74Q0j2k54k00j07Q23m45k71k71O45M64j024L25K8JM9L53n34
7686g9l7K15k02K5M02j32L0l98M90k19l61M62n98L17L0JPJ75M23m55k46O4q3J29
7710d0K53l04m27M34Rn98M62J99o07N13k13j74O35n80L49J8k93N60o63K96J80
7731Ik50m9L56m15M75L34l43j73K87l86K60m79L27O09p62K96p52M51QK53j00n49
7753e93R21q7L05l42j03q67L66O20k49k4J77n21K46O09q26N03n65K21p9M63M94
$$ y = [270, -125, -437, -181, 249, 279, 411, -43, -639, -756, -508, -494, -63, -313, -390, -29, 149, -43, -656, -271, -280, -34, -201, 37, 220, 30, -336, -399, 49, 85, -422, -206, -349, -681, -32, -344, -367, -474, 17, -328, -214, -272, -13, 321, -78, -91, 218, -235, -52, 199, -171, 45, 405, 33, 763, 420, -166, 756, 368, 290, 325, -243, 196, 675, 384, 408, -191, 545, 271, 351, 339, 85, -115, -222, 601, 156, -115, -386, 259, 723, -301, 24, 52, 53, 102, 455, -79, -116, 99, -103, -78, 324, 192, 222, -176, 314, 95, -266, 196, -402, -85, -55, -54, -47, 128, 551, 96, -150, -86, -169, -40, 213, -91, -518, -84, -75, -673, -211, -12, -619, -106, -319, -493, 142, -438, -89, -71, -364, 196, -467, -171, 9, -241, -290, 66, -349, 126, 460, 117, -56, 231, -155, 105, -374, -47, 562, -200, 96, -656, -205, -197, 56, -44, -593, 328, 241, 546, 204, 101, -766, -400, 220, -29, -53, 124, -397, -151, 458, -368, 135, -430, -209, -288, 175, 669]
7774F69r26L46j52%J93L40j91l46L76m74L7K2J93j73K37M3l47j50J041m79j2j37
7796A10j66R6J22m13R27l94k87K96R1l60lL15k19J25j5n60L18M73k44J1m47P43
7818E19j76O1J64p13M70k87J0O06n22k16J04j23N00r29Q79m82n6M00m96j52L82
7839e7k9j81K41QL38k84n25Q47n39L30K63Ok83l29J67m69L71l88j75O41o6n5M10
7862B42m45k14l0P78j014N34m16N31M73m94k02o7K05l20k5K77O17k50P0q21O07
7883C6l03O13Mn10K87o10N54q1k3M0o5R5J54k45R9m65Q23k16L4j06k20P63m08
7906B50j71K90j34n3k76Q4o5j10N77m44N28Q5j06l42N93r1l26L26o53Q8K87k38
7928I9m5l3M3L84n5l93K27m87Q99o35O07k98n50K24M9J51k27j93r1K05M57l26
$$ y = [669, -257, 89, -63, -63, 130, 470, 279, -67, 309, -165, -128, -106, 87, -86, 151, 194, -153, -303, 738, 259, 247, 110, -56, 40, 162, -251, 676, 282, -5, 291, 382, 22, 19, 334, 115, 240, 225, -335, -17, 456, 212, 223, -224, 519, 343, 404, 568, -145, 325, 38, 48, 654, 132, -84, 20, -103, 397, -532, 347, -135, -191, 209, -287, -439, -57, -86, -267, -26, -18, 320, 36, -489, 358, -181, 149, 412, 418, 135, -194, -27, -496, -125, -513, -688, -47, -113, -168, 242, -203, -417, -447, 331, -683, -149, -565, -34, 439, -55, -257, -324, -119, -439, -464, -187, 430, 180, 250, -571, 36, -267, 346, 350, -160, 127, -483, 71, -10, -33, 7, -58, 37, 191, -54, 45, -420, 403, 187, 221, 115, -105, 658, 250, 79, 369, 235, 182, -94, -10, -75, -185, 392, -52, 476, 561, 455, 113, 706, 615, 289, 615, -38, 50, 337, 99, 54, 21, 64, 448, 393, 0, 227, -260, 639, 4, 611, 313, -237, -13, 36, 187, -40, -233, -324, -119, 338, 12]
7950A2J87Q3l56J44p7J75n12N43k50j15J88R1L09o51n35M42k3R27l17l62J94k1
7972G6l46M61J6p04K81J00M41l60L22l42k31R4L81k75m32R74k74q3k11k38k8M09
7994C1P9Q5l51j41L00m28L21r23N30N40o6m06N83M49o65k3L77n24k73P16n18Q5
8016b22q0L01l7L99p03M1L32L6J21J74k9m72n9M25j21k17R8J91k58r3R6K5k06
8039b58P49n07j93M87m88l1M39M47p60J72K35q1J47l00J67O1k46K65k35J56l88
8060a62P17j91l1m96P4N4k14J8k24O88p8K00j75m33J67M69k81J95Oj26n44r5O42
8083A80k53j72l2L3J33n8k4J80j51K78k87J71P2L41m40j89J90o18M61J89L3m65
8105d28K23l07N07k86J69l02P35q58N14l34M42j14M1j13M86n62m52L81L00k97
$$ y = [12, 199, 282, -74, 70, -7, 168, -344, 199, -51, -166, 22, 113, 422, -229, -764, -322, -345, 582, 265, -97, 97, 76, -270, 191, 207, -497, -216, -116, 325, -35, 287, -55, -286, -192, 189, -86, -518, 456, 182, 99, -112, -350, -378, 31, 110, 195, -156, -297, 3, -425, -104, -1027, -497, 43, -23, -429, 154, 603, -62, -85, 292, -232, -505, 211, -307, -222, -302, -1, -38, 361, -342, -301, 31, 67, 188, 362, 333, -139, -198, 227, 106, -111, -13, 178, -80, -173, -77, -52, -258, 491, -16, -209, 278, -210, -241, 198, 645, -115, 57, 292, 211, 358, 58, 225, 286, 40, 305, 70, 226, -162, 555, 364, 333, -163, -89, -35, -249, -231, -455, 233, 155, 355, 180, -253, -86, 383, 102, 297, 303, 177, -367, -462, 180, -73, -245, -277, -244, -111, -169, -193, -13, -164, 114, -173, -2, 70, 411, -29, -218, -28, -646, -185, 4, 37, -428, -205, -512, -5, -291, -122, -424, 311, -547, -33, -367, 75, -39, 2, -111, 375, -187, -639, -258, 42, -255]
8125b55m0K99j05N47n40L08m12O50l2l94K74p16O61k61j05J81j77N6O79k91Q4
8146D11q59O07J73k35K3l90K50oj00j18L81Q2K24m73j77N76k32j7K76K4k17J31
8168C34m64J46M68q8n74J51j40J36j43M02M55l23R3o34L67l49M28P6l5k67oo41
8190f08O64
$$ y = [-255, -295, 4, -101, 446, -94, 214, -198, 452, 420, 26, 300, -416, 245, -16, -121, 60, -117, -61, 618, 327, 411, -448, 159, 332, 97, 120, -270, -20, -26, -126, -244, 137, 219, 443, -30, -207, 369, 137, 120, 396, 420, 203, 334, -130, 16, 484, 396, -178, -27, -167, -31, -174, 228, 683, 360, 453, -181, 186, -163, 265, 341, 306, 39, 33, -608, 56]
8191E6
$$ Imaginary data points
##PAGE= N=2
##DATA TABLE= (X++(I..I)), XYDATA
0@%%%%%%%%%%%%%%%Jj1L0m3M7m8M8m9N9p6Q9r8J09j24J40j56J77k00K24k48K76
36A47l09L39l76M19m64N12n63O26o94P68q53R50j067J198j351J540j773K068k460
55a343L002l804N111p590J3856n0046j33047J57494J27861q5225q5426Q0242N1023
68G2108n8683p014Q1584j0843q4383J5807R2439j5763r2458k865P6231J2808n6896
81B2072l1882J4547J9092P951n086k5210k4332J3517L5854J1437k9884l5682P142
94b0464M9990K8219l1788l9584J1895M1213J5415j2418k0021j1820J5244L6770
106F2651N41n1598k1547M9995L0785m6333m1362K5545K2626j8213k080J1204l8434
119a6220l5207N8155O0995o3214q5598M2995Q5819k1990o5527J2339L8893j6152
$$ y = [0, 0, 0, 0, 0, 0, 0, 0, 0, 0, 0, 0, 0, 0, 0, 0, 1, -10, 20, -23, 24, -24, 24, -25, 34, -42, 47, -51, 58, -66, 74, -82, 95, -105, 119, -129, 147, -162, 177, -199, 220, -244, 268, -295, 331, -363, 405, -448, 502, -565, 633, -718, 822, -951, 1117, -1343, 1659, -2145, 2966, -4624, 9232, -40814, -173861, -16367, 111494, 26269, -59157, 21085, 72108, 13425, 6411, 87995, 77152, -7231, 8576, 101015, 85252, -7206, -10071, 66160, 78968, 22072, -9810, 4737, 23829, 31780, 26694, 1484, -22848, -9331, 26523, 37960, 8076, -27606, -20464, 29526, 57745, 25957, -13627, -1732, 39481, 54896, 42478, 22457, 10637, 25881, 62651, 63192, 11594, -9953, 40042, 70827, 24494, -16868, 8677, 31303, 13090, 11010, 22214, -16220, -51427, 6728, 67723, 4509, -81089, -38094, 47725, 25735, -39792, -27453, 11440, -4712]
131d712r125L5610j641n1006N993P0800Q348p0181k0807O3204L5682l7055l5565
144a0455J2584K3828J0223M55j3997k0673Q68L1167K1032k1439l8124r8M0130
157C5501K3563k7526l9295K190L3503J4679j7953k5436r399J4196K0926r62l3013
170i026k2290K2906L3103j3224l7406p707K1680J3759N89p622k4663j2192L5229
183f864L7889k9971n3246J4229N6720M171m0911j1079J9102N159j61J3546q926
196c42l6713J123M9704J0963n5247l0695M1780L6365k3732l3619J634J6658P158
209a4963O478l434k1785q597L1193L1860j7364l9367K221M4437K3002k2200k5660
222a4179O100K5177J5394l168j8221j4112J2379K9027N807l0130k3909J6276L0933
$$ y = [-4712, -13837, 21773, 20132, -30874, -24881, 45919, 54267, -15914, -36721, 26483, 62165, 25110, -10455, 2129, 25957, 36180, 36635, 22638, 1965, 2833, 34000, 55032, 33593, -4531, -4629, 35501, 59064, 31538, -7757, -5567, 27936, 42615, 24662, -774, -10173, 4023, 24949, 23987, -9026, -31316, -8410, 24693, 11469, -25937, -33644, -11964, 1795, 2384, -5238, -29901, -42093, -6864, 31025, 1054, -52192, -37963, 18757, 22928, -17983, -29062, -9960, -4801, -4962, 8584, -342, -37055, -35932, 13772, 24735, -30512, -61207, -19427, 16938, -6794, -40413, -38779, -22121, -14963, -8485, -11919, -33704, -42301, -11108, 20752, 3388, -35979, -33758, 10679, 33681, 11481, -14179, -8079, 17098, 32492, 29324, 11103, -3009, 9370, 38397, 44204, 14074, -9835, 6441, 37374]
235C7374j792k9152j5633J1737J5940M424r776k2095r903K4147K9880j7221l9873
248b1943l26L9819J7111k4189k1269O641J5263J0470M643j2457k4752J611L7547
261B8169J5455l7743l1579K3337L4649r921l0180p214J0894Q147M498l787k0920
274a6195j4631K0773K8068j0900l8293o423L4565K1859j7828k5783J85J8746J7136
287A1279L172j7078j8419P638K9518J1847k4553k3982J1811K9849N925k2749j7694
300a3436O809J7434R617r017k1033q417J9926K3519j1382l3192o025K8303J8706
313B1812j3132k3101m327J1631J5680O180j4090k2758J660L1519J5354k6979k8595
326b9146J3575L1143J912k1068j2521N030J1860R977k354k0538j2741J8101K6586
$$ y = [37374, 35582, 6430, -9203, 2534, 18474, 22898, 13122, -8973, -18876, 5271, 35151, 17930, -21943, -22269, 17550, 34661, 10472, -10797, -4156, 11107, 21577, 26220, 13763, -10989, -9378, 28169, 43624, 5881, -25698, -2361, 32288, 22367, -7813, -15027, -4133, 4014, 8512, 4725, -16195, -30826, -10053, 18015, 7115, -31178, -37601, -3036, 18823, 995, -24788, -24603, -5857, 11279, 14451, -2627, -21046, -13408, 16110, 27957, 3404, -20578, -8767, 21082, 27007, 4258, -13436, -6627, 10807, 20424, 11407, -9626, -18043, 1883, 25402, 14020, -19172, -25197, 3106, 21812, 8680, -14421, -18748, -7117, 8563, 14743, 653, -22105, -20445, 11074, 26428, -551, -29146, -15571, 15572, 17484, -3584, -16105, -11075, 785, 10762, 8408, -12130, -24871, -6770, 19816]
339A9816p406l3816j0458K6965K1424j2120k2861n505J1113J5210O425j5288k1903
352b8404J989K8966J3336k0638k5881O559K6717Q528j5552j7168J768J6507J4966
365A1693m427k1376j1127J9161K6094n491k8224r016K1972K0337n194j9721q734
378a4053R130J7586Q028j2473k2652R4K7133J7183k1235k5642P348K6214N806
391B2467j5293j3967O96J0877J3199J994j9455j6122J4077K7578j250k9440j2292
404a6931K1592K1125o135j9163p057O810J4448J0178r839k2546k075K5543J6555
417C2505j8606k4861L689K4626R056j3131j7142k496J0607J4339P40j9538j6411
430a6623J1314K4551n15k7961j4071J5923J8474k670j7181j1562K958J4688J0753
$$ y = [19816, 12410, -21406, -31864, -4899, 16525, 4405, -18456, -23961, -12848, 2362, 8787, -6501, -28404, -26415, 2551, 15887, -4751, -30632, -24073, 2644, 11172, -4380, -21548, -19780, -3273, 11693, 7266, -14110, -25237, -6076, 20018, 14527, -13697, -22713, -741, 19596, 14402, -5319, -14053, -4923, 12663, 20691, 8218, -14434, -14340, 12793, 29976, 8741, -16901, -9553, 16661, 22467, 7174, -6793, -6097, 4780, 17979, 19973, 518, -15604, -1527, 26051, 24801, -4639, -16931, 4661, 25786, 19651, 488, -6569, 241, 14689, 24867, 15028, -7518, -9593, 15950, 32505, 13899, -10962, -7273, 17353, 26409, 13278, -3864, -6360, 4247, 18586, 19326, -212, -16623, -5309, 19242, 18727, -9234, -23305, -7382, 11092, 8422, -8759, -20321, -17363, -2675, 8078]
443H078r235k2493m383K5403J8612j6940k5796L557K4276J0089j1175j2908k890
456a5805Q115J5493M302j7082j7883R558K6413K851k6388j5363J5167J7925l373
469C930j4891r043R28J1478J1584o643k1901p326K3620J9808j2499k4474N99K3339
483a491J3247p073j3454l425Q908J7991O411j4664j7593Q617K6374N391k1835
496G404j5612J2010J7899J250j5150j2198J92J1450J1058o891k1022r626J7094
509b142J9945j0160k6350l803K0848J3330q209j3452n186P178J4882R804j1865
522D820j9499M700K7396R670k2647j7546J3575J9753k9j3217q342j354P888J2786
536A7954q37k1661j1961J7842K0948j0188k5714l378J7441J2035n332j2275o241
$$ y = [8078, -1157, -23650, -28033, -2630, 15982, -958, -26754, -23197, 1079, 11168, -7, -12915, -15805, -7690, 7803, 12105, -4977, -22860, -13302, 13111, 15962, -10426, -25789, -10622, 7303, 3930, -10961, -20004, -19076, -7598, 3986, -2657, -24558, -31884, -8264, 11544, -955, -25429, -24830, -1491, 11756, 4683, -8771, -12196, -3288, 14703, 21114, 6450, -11143, -2526, 23848, 29239, 7404, -8208, 3802, 21701, 22951, 7801, -4397, -4205, 7245, 18303, 11412, -9610, -19236, -2142, 17803, 7643, -18707, -22510, -1662, 11668, 3459, -9993, -15179, -8001, 6881, 16685, 4820, -14679, -9979, 17417, 27087, 4440, -13106, 469, 20222, 20193, 6976, -1366, -2720, 5168, 17954, 17117, -4544, -16505, 1337, 22285, 12097, -13617, -16995, 446, 12481, 7149, -5126, -11367]
549a1367L198J4749J0187j1362j9197L975K4933R467j8490j6496Q412J7876N165
562B1050j0118j2077k310J0750J2463k368j8791j1285J4821K0619n968k4051p450
575a4715J6088J4389m967j3978o799L828J0898Q729r546j9075k331K1812J2425
588A6758j6818k2235N635J9684K655j2701j0211k052N260J2012J756j8278j6709
601c5244J3339K3421l764k4681p628J8257J2426l805j0029n328K402J2674J3151
614E191o629j9462o23K3612J2724j4888j6392N032J6388O857o443j1601m453P424
628c263J4822J889j6222j3311J1123K0432l33j9300r562J2632J6544J63j0971
641D643q870L618J4760R857n369j6373j601J9130J4961j1025j9662J695J8685
$$ y = [-11367, -8169, 6580, 16767, 5405, -13792, -9817, 15116, 24583, 6093, -10403, -1991, 15885, 21050, 10932, -1145, -3455, 7295, 19758, 17390, -1401, -12686, 2135, 22754, 16786, -7265, -14715, 1373, 15762, 10795, -3183, -9982, -6154, 4744, 13473, 3927, -15148, -17479, 4333, 16758, -60, -22295, -16660, 3024, 5679, -7022, -17233, -19285, -14025, -2013, -257, -18535, -35244, -21905, 1516, -2248, -26929, -34557, -16300, -3874, -7679, -17708, -23036, -20634, -7960, 5191, -1438, -20900, -21523, 2089, 14813, -75, -16467, -11435, 4953, 11810, 5367, -6234, -10687, -3263, 11559, 13448, -2774, -16085, -4962, 15470, 15137, -4163, -13725, -1093, 15451, 15614, 4643, -4227, -609, 14151, 24008, 18639, 2266, 665, 19795, 34756, 23731, 4069, 5764, 24449]
654B4449Q702r892j2519k120M897J0432L148j4134j6399O209K0865K240k1929
667C949j3275J2538J4881k043j0569o438n11Q694J0637k746j9373n989K0250J5240
681B5245j2679j9948J757J5072O868o626j0170n949L268J2987L849j5300j6621
694a8247O799K0113J794j7859j0626P791J3517K516p398r091m20J1948J2386l446
708I777j5843m999J6934J5337o723j8165k505J4749R850o679j2071o338N259J0262
722H845L850j3120j6300J719J7824M882j7808j5715P584J4575J88r263p762j083
736b1584P497J2128O02j5320q584J5851J8482n480j8621j443J5973R685m754r364
750d932n788J650J1657P487j1116j7636J337J8702M711j6840j4070N723J2045
$$ y = [24449, 33151, 23259, 10740, 8620, 13517, 23949, 27097, 12963, -3436, 2773, 23638, 25878, 3949, -9326, 3212, 18093, 16050, 5481, -957, -1468, 7226, 17863, 15117, -4256, -10245, 10005, 25245, 12566, -7382, -5625, 9447, 16315, 9689, -481, -6430, -3162, 9825, 13674, -1626, -18247, -11448, 8665, 10459, -7400, -18026, -10235, 3282, 5798, -1600, -10691, -11111, 837, 13223, 9777, -6066, -11065, 5869, 21206, 14483, -3682, -6187, 8562, 18412, 11733, -338, -6676, -1417, 8845, 12695, -425, -16725, -15006, 2818, 7700, -10108, -25823, -18239, -3664, -3476, -12739, -20501, -21584, -14087, -1959, -1357, -16677, -25261, -9410, 9072, 3592, -15029, -16472, -499, 9186, 4432, -4932, -10720, -9070, 2587, 10074, -1042, -18678, -17341, 1361, 6072, -10768, -24838, -19115, -7070]
763g070K663p404r796k977P937J2289p66j4568p210J4238J6970k930j5202l808
777a7634J3464J2556j7p875o278M219J3211P484p749j4126J338J6965Q838j2464
791A1932j5384K336J5051M389q041j0196j485O307Q737Q9j3166j0603R177J7184
805A6327j719j7938p693J1699J1611l199r798n356K094R221Q831o438j5609k358
819a0325J7163J1222j2399j5117L262J2554M874n993q834m619O500J0563J574
832A0425j4067j0917R920J4708j455j5598o257P672R900p16q654r272J228J0430
846b653P113p613j4088j715J3992R188p950j4155k35J3218Q307m657r638k885
860a3771O952J1240K870j0054r731P372J6340K043j3867r199R301J2808O46r752
$$ y = [-7070, -4407, -11811, -21607, -24584, -16647, -4358, -5124, -19692, -26902, -12664, 4306, 1376, -13826, -17634, -4170, 8386, 8369, 494, -5784, -1565, 11646, 19130, 11381, -2745, -1407, 15558, 24396, 11932, -3452, -1116, 13935, 18324, 10283, 87, -1398, 4909, 13646, 13735, 569, -10034, -857, 16327, 14608, -3330, -11023, 676, 12287, 9088, -710, -6066, -3972, 5249, 14080, 7642, -7967, -10325, 6838, 18060, 5661, -9456, -6194, 6360, 11234, 5241, -3593, -8212, -1712, 8851, 10425, -3642, -14559, -4639, 10069, 8614, -6984, -13241, -5569, 4331, 3615, -5039, -14311, -13083, -2653, 4460, -3153, -17241, -18956, -4964, 4224, -3726, -17881, -18116, -4898, 3409, -1248, -10886, -13771, -6819, 4421, 7291, -2763, -12494, -5122, 11218, 13261, -606, -9805, -504, 12304, 12950, 3198]
874C198p767J434Q706P248n018j4784m732J3950J0646q994j6105j26J1155O469
888E280l679q172n013L387J1805M609j0706j1770P207J6619J767j3068p200P451
902a483J1339K303n732q876j292R908R839m976j4766l836J2893R870p262j3237
916e308l391R162Q199l331r741n959M438R522L164r885j0000L687J4755M144j0754
931a298j0270N381J2582L948p031p628Q7Q323R564j860j2842o632J1977J3037
945A7338m796j4887l710R676Q080k949q931o150K140R154O161j0363j3222L072
959i387J4165L569j1861r306M928R731L273n575p705l207Q693J0493j733j3319
973g241n563J1321J1366k693j2680l565P918Q716L21q700p672K398J0689M932
$$ y = [3198, -4569, -3135, 5571, 12819, 7801, -6983, -11715, 2235, 12881, 3887, -12218, -12344, -1189, 5280, 1601, -6571, -11584, -8197, 3608, 8217, -2489, -14259, -7052, 9567, 11334, -1734, -8934, -1483, 9856, 12159, 6427, -2449, -3741, 6167, 16006, 11030, -3736, -7572, 5321, 15191, 7929, -5308, -8699, 463, 8662, 5331, -4410, -10369, -5931, 3591, 6755, -3130, -13130, -9443, 5312, 9456, -1298, -11568, -6187, 6395, 10343, 3312, -4316, -4229, 4094, 13658, 11798, -1044, -7676, 4301, 17338, 12542, -2345, -6055, 3621, 11701, 8752, -179, -6329, -4189, 4965, 11126, 763, -12459, -9387, 4778, 8347, -3514, -12820, -7892, 1839, 5112, -463, -8168, -11375, -2682, 7811, 6078, -7241, -12804, -1483, 9883, 7190, -5490, -9055, -1137, 7579, 7900, -800, -8472, -6074, 4615, 9547]
987I547q852j1220J581J1899M992r109j1422J836J0788M535n481q825j685O405
1001e011Q819Q4j1200o428Q348J3008p41j3441n162Q363J0729R80p409o573J525
1016d109R496O798o362j2503N04J3471O733r187j0893K057R504M311m034q726
1030b940l594O124J0534r55j2355o874R077J2076j688j1284n788O249R256J914
1044I752o251p586O50J0136O516n960j1258n44J2005P128p218j0708l47Q463O664
1059A1442l827q498m515O399R183k26j0680q250N963J2205J40j1465o929N012
1073d046R935P34o707p850K80Q440O960m856j2043k018J1141P884o003j0546j118
1088i813Q220O291k170p886n334M666J0490K140j0836q384O883J1503N20j0003
$$ y = [9547, 695, -10525, -8944, 2955, 7947, -1162, -12584, -10748, 40, 4575, -906, -9731, -11416, -5011, 3808, 3892, -7308, -13736, -5388, 7620, 6879, -6562, -11724, -3361, 7368, 8348, 939, -5634, -4109, 5387, 12185, 5823, -6680, -6176, 7295, 14028, 4841, -6052, -3995, 5509, 9820, 5786, -2940, -6534, -410, 10124, 9169, -3186, -10060, -983, 11093, 9405, -1879, -7667, -1418, 7838, 9752, 3501, -4085, -3435, 6701, 13217, 7257, -4001, -4545, 7460, 14588, 7370, -3338, -3685, 4778, 11442, 7615, -883, -5398, 1001, 10184, 9958, -722, -8972, -3009, 9196, 9336, -2129, -9058, -4046, 5889, 6623, -84, -7934, -7654, 786, 7746, 2890, -9153, -11171, -30, 7854, 1851, -8695, -9813, -1593, 4698, 2528, -5358, -10692, -6026, 4464, 6604, -4232, -12616, -5733, 5770, 6290, -3713]
1102c713o777M640R161K956n523r289j205R520P686n002j1699j676R802P209n523
1117E67r901j927O857Q191j593p665n338M306R603L545r611p251N386J1701L133
1132A0003r656o722L595R873L869n052p456j585P552Q153k963j2314l609R561
1146C249Q656n349j1066k231N533O343j538o882o527K112J0026L300r141q909
1160a2424M234J1986K992q021o716L208Q471M642k826p689k268P905R416k677
1174A0233j0700m624R212Q914m131r527l817M507P523l70q238p374K024Q959L234
1189E825q574r936K596J0241M320q121p894J931Q997N069l283o310l093P359R794
1204H921k01j0511m325Q055J0554k800r414m501O087O764Q91o246p872J092Q149
$$ y = [-3713, -10490, -5850, 3311, 6267, 744, -8545, -9750, -230, 7456, 2454, -9245, -10921, -1119, 6090, 567, -9334, -11261, -4404, 3787, 2194, -5471, -10809, -6503, 3100, 6645, -2966, -10217, -4831, 6870, 10003, 347, -6375, -2780, 7093, 10962, 5910, -1546, -3131, 4421, 12574, 9611, -2703, -6312, 3249, 11905, 6556, -4510, -6741, -1208, 5135, 3597, -3285, -9812, -7700, 2326, 5626, -3515, -12424, -8190, 3796, 6788, -1233, -7949, -4741, 3730, 8372, 5546, -2143, -4411, 3494, 12910, 10233, -467, -5091, 4121, 13035, 8904, -623, -4440, 67, 7590, 7220, -1018, -8392, -6368, 2591, 5825, -2749, -12685, -10089, 152, 4472, -3649, -11543, -9612, -615, 4454, 1171, -5139, -8232, -873, 8921, 8720, -1791, -6116, 1939, 12493, 9693, 279, -4222, 1865, 8629, 9520, 3274, -4598, -3506, 4643]
1219D643N195p723j0632J164J0692L323q311q456J153O970M080k259p436n061
1233a2658O380R862j039r957n124Q144R324j935q549l545M292P918K147n456p199
1248g395R90R525N132o477r195J430R822N615o679q128n34P971N381k690q129
1263c361l332N469Q056N8r806o427N665J0018m43r860n263M441P182J342m801
1278a062o459P6P524O560m107j0392K7J1235O619o157p205K64P025N785r82o440
1294B311m504M262J0616J128j0525o969N720R170j766q209n100J773N366K683
1308E956n522q490j268O922O328n931r339j235Q029O050l586q299r86O437O791
1323A857o11o445m425N060R228L037q546o497M616J0201J398p718o778L244O827
$$ y = [4643, 9838, 2115, -8517, -7353, 3339, 6662, -1649, -10105, -8952, -1982, 2098, -161, -7597, -12658, -6278, 3584, 2545, -7412, -12536, -4392, 4932, 2997, -5552, -9097, -4805, 3113, 5260, -196, -7395, -6405, 3120, 8252, 1775, -7420, -5990, 3832, 9447, 2768, -5360, -5894, 2077, 7458, 4768, -3361, -6693, -1224, 6832, 6890, -2916, -9343, -3678, 6340, 5897, -3963, -9226, -4785, 2397, 3739, -1062, -7521, -7445, 79, 6639, 2532, -7860, -7833, 3402, 10021, 3864, -3341, -3077, 3948, 9733, 8751, 2311, -2193, 2069, 12685, 13813, 3288, -3681, 2039, 11209, 9443, 1234, -3866, -2093, 3273, 5956, 434, -8056, -9324, -2402, 3926, -2005, -11344, -12579, -4550, 1500, -2086, -10385, -11371, -4934, 1857, 1246, -5199, -9624, -4564, 4664, 7701, -845, -7342, -2726, 7475, 8873, 1155, -5623, -2379, 4448]
1338D448J947m438p267k250N872N996l725r936k883Q319O780m424r766L7N218
1353f072O118n32n195n367K630R780M290q426p201M759J0528K026o995m627K062
1368b222N935M406k214p584k278O473P498l651j0040k050P746N867k926p793l096
1383e929N204N684O63o491o053L274Q544K974o901p655K536R276L639n961p342
1398d538J177P836L608l286o443k343O485O940j193r913l928P150Q362k807q795
1413a688l039N962N797j32m796n428J025Q471M570o375q926J608J0336K951o850
1428C486o171J093N816L378j579o800m402N337Q832j766j0068l562O613P018j698
1443E527p209l553L451O397K073n727o473J340Q686L312n856o844P63Q124L950
$$ y = [4448, 6395, 1957, -5310, -7560, -1688, 4308, 583, -9353, -12236, -3917, 2863, -1561, -11327, -11290, -6072, 46, -486, -5681, -11048, -8418, 1362, 5652, -2774, -9975, -5216, 5312, 7338, 343, -4284, -2222, 3713, 8119, 5905, -1679, -3957, 2516, 10014, 6363, -3677, -5727, 2019, 7886, 4960, -2833, -5929, -725, 4959, 5622, -869, -6922, -3648, 4896, 7870, 969, -6686, -4150, 5126, 8765, 2804, -4538, -3361, 4475, 8083, 4797, -1646, -3989, 2496, 9436, 8243, -1670, -5598, 1552, 9914, 7107, -1688, -4727, 1235, 7032, 6900, 2104, -3324, -2299, 6172, 10742, 4367, -4559, -2951, 7385, 10336, 3486, -2685, -1592, 4224, 7602, 6023, -777, -5179, 158, 8990, 7224, -2844, -6406, 207, 7225, 5527, -1682, -5235, -1784, 4613, 6686, 959, -5514, -4174, 4512, 7824, 1968, -4876, -4113, 4011, 7961]
1458G961n124o890r17O406M845k015o539l912M673O651j67p491n695M497Q518
1473D801j034q034m536L901O808Q88m138n685K76O475N652n145r474Q76R221M657
1489E509n904o346l83N787M471j157o064l963L922Q246J47q008n261N763O856
1504C615K62o255m366K877N628L299l718o816n9Q154N131m724q146N12P678M698
1520G770l428o502j262N057O131k078o073m416M962O829Q08o960n844M056P505
1535F555J466o547n505K714O793J947l830n340p86N793N998k823q539j442P549
$$ y = [7961, 2837, -4053, -4970, 1436, 6281, 4266, -2273, -6185, -1512, 5139, 4972, -2519, -8214, -3717, 4801, 3767, -4267, -8803, -4902, 1906, 2794, -1344, -7029, -6753, -278, 5374, 229, -9245, -8369, 852, 5509, -395, -6741, -7124, -1337, 3134, 1977, -4087, -8050, -4128, 4118, 4265, -3743, -9004, -3241, 3615, 3877, -2378, -6744, -3867, 1761, 5060, 1342, -5474, -5533, 2621, 7752, 3028, -5118, -4606, 3072, 7770, 4342, -2160, -3422, 1635, 7766, 5688, -385, -4801, 161, 6990, 7798, 838, -5006, -950, 6555, 8021, 1474, -4031, -1317, 5476, 7423, 3593, -1747, -2533, 3260, 9258, 6435, -2104, -3546, 4003]
$$ [...]
8191C19
##END NTUPLES=NMR FID
##END=
