##TITLE=1H_SA-36.137
 CDCl3, 8 sc, 
 17.9.2019
##JCAMPDX= 6.0         $$ Bruker NMR JCAMP-DX V2.0
##DATA TYPE= NMR FID
##DATA CLASS= NTUPLES
##ORIGIN= UXNMR, Bruker Analytische Messtechnik GmbH
##OWNER= root
$$ XWIN-NMR		Version 3.5
$$ Tue Sep 17 15:34:08 2019 Russian Standard Time (UT+4h)  she@DPX200
##.OBSERVE FREQUENCY= 200.1315
##.OBSERVE NUCLEUS= ^1H
##.DELAY= (6, 6)
##.ACQUISITION MODE= SIMULTANEOUS
##.ACQUISITION SCHEME= undefined
##.AVERAGES= 8
##.DIGITISER RES= 18
##SPECTROMETER/DATA SYSTEM= spect
##.PULSE SEQUENCE= zg30
##.SOLVENT NAME= CDCl3
##.SHIFT REFERENCE= (INTERNAL, CDCl3, 0, 15.7039)
##AUDIT TRAIL= $$ (NUMBER, WHEN, WHO, WHERE, WHAT)
$$ ##TITLE= Audit trail, XWIN-NMR		Version 3.5
$$ ##JCAMPDX= 5.01
$$ ##ORIGIN= Bruker BioSpin GmbH
$$ ##OWNER= she
$$ F:/spectra/data/she/nmr/H-F/1/audita.txt
$$ ##AUDIT TRAIL=  $$ (NUMBER, WHEN, WHO, WHERE, WHAT)
(   1,<2019-09-17 15:33:11.60 +0400>,<she>,<DPX200>,
      <created by zg, POWCHK disabled, PULCHK disabled
       configuration hash MD5:
       00 E9 B6 7A A2 85 ED C7 34 08 36 98 17 FE 4E 26
       data hash MD5: 16K
       CE AE A9 52 54 45 E6 BA 57 28 75 D2 9E 70 1B 30>)
$$ ##END=
$$ 
$$ hash MD5
$$ 54 7C B6 DA 0A FF 13 B9 E2 A7 35 C5 34 AF 92 59
##$RELAX= 
##$RELAX= 
##$RELAX= 
##$RELAX= 
##$RELAX= 
##$RELAX= 
$$ Bruker specific parameters
$$ --------------------------
##$DU= <F:/spectra>
##$EXPNO= 1
##$NAME= <H-F>
##$PROCNO= 1
##$TYPE= <nmr>
##$USER= <she>
##$AMP= (0..31)
100 100 100 100 100 100 100 100 100 100 100 100 100 100 100 100 100 100 
100 100 100 100 100 100 100 100 100 100 100 100 100 100 
##$AQSEQ= 0
##$AQ_mod= 1
##$AUNM= <au_zg>
##$AUTOPOS= <>
##$BF1= 200.13
##$BF2= 200.13
##$BF3= 200.13
##$BF4= 200.13
##$BF5= 200.13
##$BF6= 200.13
##$BF7= 200.13
##$BF8= 200.13
##$BYTORDA= 1
##$CFDGTYP= 0
##$CFRGTYP= 5
##$CHEMSTR= <none>
##$CNST= (0..31)
1 1 145 1 1 1 1 1 1 1 1 1 1 1 1 1 1 1 1 1 1 1 1 1 1 1 1 1 1 1 1 1 
##$CPDPRG= <>
##$CPDPRG1= <>
##$CPDPRG2= <>
##$CPDPRG3= <>
##$CPDPRG4= <mlev>
##$CPDPRG5= <mlev>
##$CPDPRG6= <mlev>
##$CPDPRG7= <mlev>
##$CPDPRG8= <mlev>
##$CPDPRGB= <>
##$CPDPRGT= <>
##$D= (0..31)
0 1.2 0 0 0 0 0 0 0 0 0 0.03 0 0 0 0 0 0 0 0 0 0 0 0 0 0 0 0 0 0 0 0 
##$DATE= 1568719990
##$DBL= (0..7)
120 120 120 120 120 120 120 120 
##$DBP= (0..7)
150 150 150 150 150 150 150 150 
##$DBP07= 0
##$DBPNAM0= <>
##$DBPNAM1= <>
##$DBPNAM2= <>
##$DBPNAM3= <>
##$DBPNAM4= <>
##$DBPNAM5= <>
##$DBPNAM6= <>
##$DBPNAM7= <>
##$DBPOAL= (0..7)
0.5 0.5 0.5 0.5 0.5 0.5 0.5 0.5 
##$DBPOFFS= (0..7)
0 0 0 0 0 0 0 0 
##$DE= 6
##$DECBNUC= <off>
##$DECIM= 24
##$DECNUC= <off>
##$DECSTAT= 4
##$DIGMOD= 1
##$DIGTYP= 9
##$DL= (0..7)
0 120 120 120 120 120 120 120 
##$DP= (0..7)
150 150 150 150 150 150 150 150 
##$DP07= 0
##$DPNAME0= <>
##$DPNAME1= <>
##$DPNAME2= <>
##$DPNAME3= <>
##$DPNAME4= <>
##$DPNAME5= <>
##$DPNAME6= <>
##$DPNAME7= <>
##$DPOAL= (0..7)
0.5 0.5 0.5 0.5 0.5 0.5 0.5 0.5 
##$DPOFFS= (0..7)
0 0 0 0 0 0 0 0 
##$DQDMODE= 0
##$DR= 18
##$DS= 0
##$DSLIST= <SSSSSSSSSSSSSSS>
##$DSPFIRM= 0
$$ [...]
##$SUBNAM2= <"">
##$SUBNAM3= <"">
##$SUBNAM4= <"">
##$SUBNAM5= <"">
##$SUBNAM6= <"">
##$SUBNAM7= <"">
##$SUBNAM8= <"">
##$SUBNAM9= <"">
##$SW= 24.0689530833862
##$SWIBOX= (0..15)
0 0 2 0 0 0 0 0 0 0 0 0 0 0 0 0 
##$SW_h= 4816.95568400771
##$TD= 16384
##$TD0= 1
##$TE= 0
##$TE2= 300
##$TE3= 300
##$TEG= 300
##$TL= (0..7)
0 120 120 120 120 120 120 120 
##$TP= (0..7)
150 150 150 150 150 150 150 150 
##$TP07= 0
##$TPNAME0= <>
##$TPNAME1= <>
##$TPNAME2= <>
##$TPNAME3= <>
##$TPNAME4= <>
##$TPNAME5= <>
##$TPNAME6= <>
##$TPNAME7= <>
##$TPOAL= (0..7)
0.5 0.5 0.5 0.5 0.5 0.5 0.5 0.5 
##$TPOFFS= (0..7)
0 0 0 0 0 0 0 0 
##$TUNHIN= 0
##$TUNHOUT= 0
##$TUNXOUT= 0
##$USERA1= <user>
##$USERA2= <user>
##$USERA3= <user>
##$USERA4= <user>
##$USERA5= <user>
##$V9= 5
##$VALIST= <valist>
##$VCLIST= <CCCCCCCCCCCCCCC>
##$VD= 0
##$VDLIST= <DDDDDDDDDDDDDDD>
##$VPLIST= <PPPPPPPPPPPPPPP>
##$VTLIST= <TTTTTTTTTTTTTTT>
##$WBST= 1024
##$WBSW= 4
##$XGAIN= (0..3)
0 0 0 0 
##$XL= 0
##$YL= 0
##$YMAX_a= 142273
##$YMIN_a= -150510
##$ZGOPTNS= <>
##$ZL1= 120
##$ZL2= 120
##$ZL3= 120
##$ZL4= 120
##$ABSF1= 10
##$ABSF2= 0
##$ABSG= 5
##$ABSL= 3
##$ALPHA= 0
##$AQORDER= 0
##$ASSFAC= 0
##$ASSFACI= 0
##$ASSFACX= 0
##$ASSWID= 0
##$AUNMP= <proc_1d>
##$AZFE= 0.1
##$AZFW= 0.1
##$BCFW= 1
##$BC_mod= 2
##$BYTORDP= 1
##$COROFFS= 0
##$CY= 11.3945322036743
##$DATMOD= 1
##$DC= 2
##$DFILT= <>
##$DTYPP= 0
##$F1P= 20.1720416913024
##$F2P= 0.152960286110954
##$FCOR= 0.5
##$FTSIZE= 0
##$FT_mod= 4
##$GAMMA= 1
##$GB= 0.15
##$INTBC= 1
##$INTSCL= 1
##$ISEN= 128
##$LB= 0.24
##$LEV0= 0
##$LPBIN= 0
##$MAXI= 10000
##$MC2= 0
##$MEAN= 0
##$ME_mod= 0
##$MI= 1.114404
##$NCOEF= 0
##$NC_proc= 0
##$NLEV= 6
##$NOISF1= 3.799351
##$NOISF2= 2.8
##$NSP= 1
##$NTH_PI= 0
##$NZP= 0
##$OFFSET= 15.70392
##$PC= 1
##$PHC0= -9579.055
##$PHC1= 18.40096
##$PH_mod= 1
##$PKNL= yes
##$PPARMOD= 0
##$PSCAL= 0
##$PSIGN= 0
##$REVERSE= no
##$SF= 200.130013532006
##$SI= 16384
##$SIGF1= 3
##$SIGF2= 2
##$SINO= 400
##$SIOLD= 16384
##$SREGLST= <1H.CDCl3>
##$SSB= 0
##$STSI= 0
##$STSR= 0
##$SW_p= 3612.71676300578
##$SYMM= 0
##$S_DEV= 0
##$TDeff= 0
##$TDoff= 0
##$TI= <>
##$TILT= no
##$TM1= 0
##$TM2= 0
##$TOPLEV= 0
##$USERP1= <user>
##$USERP2= <user>
##$USERP3= <user>
##$USERP4= <user>
##$USERP5= <user>
##$WDW= 1
##$XDIM= 8192
##$YMAX_p= 0
##$YMIN_p= 0
$$ End of Bruker specific parameters
$$ ---------------------------------
##NTUPLES= NMR FID
##VAR_NAME=  TIME,          FID/REAL,        FID/IMAG
##SYMBOL=    X,             R,               I
##VAR_TYPE=  INDEPENDENT,   DEPENDENT,       DEPENDENT
##VAR_FORM=  AFFN,          ASDF,            ASDF
##VAR_DIM=   8192,          8192,            8192
##UNITS=     SECONDS,       ARBITRARY UNITS, ARBITRARY UNITS
##FACTOR=    0.0002076,     1,               1
##FIRST=     0,             0,               0
##LAST=      1.7004516,     0,               0
##MIN=       0,             -150510,         0
##MAX=       1.7004516,     142273,          0
$$ Real data points
##PAGE= N=1
##DATA TABLE= (X++(R..R)), XYDATA
0@%%%%%%%qJ6j6J6j9K7l2M0m9N7p2Q8j04J21j41J65j92K20k52K87l26L72m20M73
$$ 0 0 0 0 0 0 0 0 -8 8 -8 8 -11 16 -16 24 -25 32 -40 48 -56 65 -76 89 -103 117 -135 152 -174 198 -222 251
31B51n33N98o71P51q36R30j035J149j273J410j561J729j916K123k353K611k904
$$ 251 -282 316 -355 396 -440 490 -545 604 -669 741 -820 909 -1007 1116 -1237 1374 -1530
48a530L240l628M082m624N279o090P135q537J0520j3566J8916l1081J11075J4453
$$ -1530 1710 -1918 2164 -2460 2819 -3271 3864 -4673 5847 -7719 11197 -19884 91191 105644
62A05644j16497J02802N0324m8121m8594N2666K73m8211m785M6057l1502n5659
$$ 105644 -10853 91949 142273 94152 45558 98224 98497 50286 45501 91558 60056 4397
74D397K1406O3428k5913o8118l634N2055O868l6706k2356J3904J8965J2001n019
$$ 4397 25803 89231 63318 -4800 -8434 43621 50489 13783 -8573 5331 24296 36297 31278
87C1278k1222k1173P807K9816J5157k2321k7513N322K7045L063k3174j1059J3864
$$ 31278 10056 -11117 -3310 26506 41663 19342 -8171 -2849 24196 27259 4085 -6974 6890
100F890J3701L187l027j4685j6835J1118K7418p425l5885J085M0147P786l8729
$$ 6890 20591 23778 20751 6066 -10769 349 27767 20342 -15543 -14458 25689 33475 -5254
113e254j8830J8177J1443Q04J3633l368l7815j2839M1385K2930l6294k3275L2558
$$ -5254 -24084 -5907 5536 6340 19973 16605 -21210 -34049 7336 30266 -6028 -29303 3255
126C255K3944k0291j6497J1057L749l500J6062R063k7609j8675L2084K7455l0537
$$ 3255 27199 6908 -9589 1468 5217 1717 17779 26842 -767 -19442 12642 40097 9560
139I560l5349J8750L5848j987k2464m332L524l199N329J2850p672k3271L155L1886
$$ 9560 -25789 -7039 28809 26822 4358 26 3550 351 5680 18530 10858 -12413 -9258 22628
153B2628O801l5715j9931L1023L1456j7522l0132P105K0962q386j6827N663N168
$$ 22628 29429 -6286 -26217 4806 36262 18740 -11392 -4287 16675 8289 -8538 -2875 2293
166B293j2942L81K1573m969l7793n116M2289J6695l5735k1284K4799J7725j5434
$$ 2293 -10649 -10268 11305 6336 -31457 -36573 5716 22411 -13324 -34608 -9809 7916 -7518
179g518j0168J0242K75o260J2769J1274j6573j5078J8685J9780j3692j8857R564
$$ -7518 -17686 -7444 -7169 -13429 -660 10614 -5959 -21037 -2352 17428 3736 -15121 -5557
192e557J5497k230o456J26m861k269J4185J1696j4031j7106J1307J9302o675j8875
$$ -5557 9940 7710 1254 1380 -3481 -5750 8435 20131 6100 -11006 301 19603 12928 -5947
206e947r13J1979L466j993K026l426j0966J526J7355N501j7326r602J7578J3381
$$ -5947 -6860 5119 8585 6592 8618 5192 -5774 -4248 13107 18608 1282 -8320 9258 22639
220B2639j6781j8302J1191K0170k831j3188l87L247l335N732J3280q128k4881
$$ 22639 5858 -12444 -1253 18917 16086 2898 2511 5758 2423 8155 21435 13307 -11574
233a1574Q20K7484M332k7306j1138J8679Q257j3558m611R213N64n786O616M324
$$ -11574 -10754 16730 21062 -6244 -17382 1297 9554 -4004 -8615 598 1162 -4624 1992 6316
247F316j5251p241K0682J4910j9465k0740J2586K1039m756j3632O19L992j730
$$ 6316 -8935 -16176 4506 19416 -49 -20789 -8203 12836 8080 -5552 -4933 -941 -2671
260b671K802P147p335j5801M086J8459Q4j7603l339J4614L830j2212l822J0438
$$ -2671 131 7278 -57 -15858 -11772 6687 6771 -10832 -14171 443 4273 -7939 -11761 -1323
274a323N183n034k800j17m607j440J2193R629j1626j4415O190J5920Q36q141r1
$$ -1323 3860 -1174 -3974 -4091 -8698 -10138 2055 11684 58 -14357 -8167 7753 8589 448 357
289C57K289n081J88J0456K150j0609k364J0598J124j0405J325J4067J165j3550
$$ 357 2646 -2435 -2247 8209 10359 -250 -2614 7984 9108 -1297 28 14095 15260 1710
303A710l941P707M72m709M278L221j2626r054J2839J3812j0719j4817O307J1879
$$ 1710 -2231 5476 5948 1239 5517 8738 -3888 -12942 -103 13709 2990 -11827 -5520 6359
317F359m162p800M256L666p910l051J0422L506j0191k561J1604K259j2142j275
$$ 6359 2197 -5603 -1347 2319 -5591 -8642 1780 5286 -4905 -7466 4138 6397 -5745 -7020
331g020J4421L643j3673p354Q750N606l111k75K657o726p087P941J1885m862j2139
$$ -7020 7401 11044 -2629 -9983 -1233 4373 1262 987 3644 -3082 -10169 -2228 9657 4795 -7344
346g344J711Q522m382p388O406P837o845q908L688O722k281j802N214j435j0307
$$ -7344 -5633 2889 -1493 -8881 -2475 5362 -1483 -10391 -6703 19 -2262 -4064 1150 -285 -10592
361a0592n80J1998K288j0589k812R499J579q531R87J0434l24r157J219Q612j780
$$ -10592 -11172 826 3114 -7475 -10287 -788 791 -7740 -6753 3681 3357 -5800 -4581 4031 2251
376B251p403K717O060m373n616O084P024o687p975P597Q713n536o593M050L340
$$ 2251 -5152 -2435 3625 -748 -6364 -280 6744 57 -7918 -321 8392 2856 -3737 313 3653
391C653p286k617Q286K884q840l555O673K475n629J031Q441k110j0054P87J0079
$$ 3653 -3633 -6250 2036 4920 -3920 -7475 -802 1673 -3956 -2925 5516 3406 -6648 -5861 4218
406D218J6q394J174O380l266o358N745Q116m510o693M103M914m202l971O640L272
$$ 4218 4234 -4160 -2986 3394 128 -6230 -485 7631 3121 -3572 531 5445 1243 -2728 3912 7184
422G184p781l438Q734M514r371m201Q046M511o318k919N254j23o975K09P407j4
$$ 7184 -597 -4035 4699 9213 -158 -4359 3687 8198 1880 -1039 4215 4092 -2883 -2674 4733 4719
438D719p632k3N963k250o110M323P906n196j0739K096Q151r57m774K656L262o407
$$ 4719 -2913 -2936 3027 777 -5333 -1010 6896 1700 -9039 -6943 1208 251 -4523 -1867 1395 -5012
454e012l557Q105O652n202n159L677J291n328P49Q559n01r623k244Q541L259n135
$$ -5012 -8569 -464 6188 986 -4173 -496 795 -4533 -3784 4775 4274 -5349 -7593 948 4207 -928
470i28K47M914j795n583K271N938k718n025K746L520n947l925P238M921p808o846
$$ -928 -681 4233 2438 -3145 -874 5064 2346 -2679 67 3587 -2360 -6285 953 5874 -1934 -8780
486h780N964O837l010n651J02Kl132K418O843k897r555Q99J0139J373p749R86
$$ -8780 -2816 4021 1011 -4640 -4538 -4536 -7668 -5250 1593 -1304 -10859 -9960 179 1552 -6197 -5211
502e211Q776j68r175j92Q127J921m612O26J438n550l097R744P382r117j1579M284
$$ -5211 3565 3397 -5778 -5970 2157 4078 -534 92 1530 -4020 -7117 2627 10009 892 -10687 -6403
518f403R802k023n337L074K734o144j993Q696L864o035k717P267J836p938k148
$$ -6403 3399 1376 -3961 -887 1847 -4297 -6290 2406 6270 235 -2482 4785 6621 -1317 -3465
533c465R325L944p010n037L601K224j416K629L375m773n963N005Q930k733j0097
$$ -3465 5860 9804 2794 -2243 1358 3582 2166 4795 8170 3397 -2566 2439 11369 8636 -1461
548a461j538P175L009k382j366p88k382K72M810J4n761j24O368J12q763l841P494
$$ -1461 -2999 4176 7185 4803 3437 2649 267 539 5349 5363 -398 -522 5846 5958 -2805 -6646 848
565H48O036k765m867r65Q86L277O774M12r705n456R643J0281n234j0547J784O310
$$ 848 6884 4119 -748 -1713 -827 2450 9224 9636 -69 -5525 4118 14399 9165 -1382 402 6712
581F712j951l840L047K626l508j834L151l281q240K344J2171K99j3742o273R901
$$ 6712 4761 921 3968 6594 3086 1252 4403 1122 -7118 -4774 7397 7696 -6046 -12319 -2418
596b418N903o371l011M658J573l526K053M987n359p818M461J1964p22j0774j096
$$ -2418 3485 -2886 -5897 -1239 334 -3192 -1139 3848 -1511 -9329 -4868 7096 6374 -4400 -5496
611e496Q220M54o576K79O288%m541J239K241n336m358O256O321n303p891L507
$$ -5496 2724 3178 -3398 -3119 3169 3169 -1372 -133 2108 -3228 -7586 -1330 4991 -312 -8203 -4696
627d696P515j850p504k176J734J573K122J865m307p254j29P109L260l682j153
$$ -4696 2819 969 -6535 -8711 -6977 -5404 -3282 -1417 -5724 -12978 -13107 -5998 -2738 -6420 -7573
642g573M436K494j181k503j570J459N428M076l637o374R77O866q5o801m97O755
$$ -7573 -3137 -643 -1824 -4327 -5897 -4438 990 5066 1429 -4945 -3968 2898 2813 -3988 -4485 2270
658B270L131l337l170j682l142J549Q367L338q873o337P334P728n149o974M634
$$ 2270 5401 2064 -1106 -2788 -5930 -4381 3986 7324 -1549 -7886 -552 7176 2027 -4947 -313
673c13P866l813n782L925M500n290m093N245L285n858j126R378K521j3561p970
$$ -313 7553 3740 -2042 1883 6383 1093 -3000 2245 5530 -328 -1454 7924 10445 -3116 -11086
688a1086R798J0397m514o709L200J340p799j533J0164L513r201k874R243J915
$$ -11086 -1288 9109 4595 -2114 1086 2426 -5373 -6906 3258 6771 -2430 -5304 3939 5854
702E854j1019m589Q484L776p260k991O196K107o049k475M428M31k344M435P039
$$ 5854 -5165 -9754 -1270 2506 -4754 -7745 -1549 558 -5491 -7966 -3538 -3107 -5451 -1016 6023
717F023l326j0604o30R441N264l831m670Q25L140J799o29j431k010K96K182R93
$$ 6023 2697 -7907 -8537 904 6168 2337 -2333 -1508 1632 3431 2802 1371 -639 -343 1839 2832
733B832j446q33K33K98j575k725q89M790O912o88r563o950M248Q808J446o007
$$ 2832 1386 553 786 1084 -491 -3216 -4105 685 7597 6909 -2654 -9604 -5356 3452 4898 -1109
749a109l553J435O98j625Q44Q02j490j647M138K905n673n586N247P661m730q384
$$ -1109 -4662 -3227 -2529 -4154 -3310 -2508 -3998 -5645 -1507 1398 -4275 -9861 -4614 3047 -1683 -10067
765a0067M845J1153j052r081j122N516k37j041N891K510r920o672Q836P791q271
$$ -10067 -5222 5931 4879 -4202 -5324 192 -45 -1086 4805 7315 -2605 -9277 -441 7350 -921
780i21r469O403R619m115p351K071L133n268j907O399K930o797k149P485J225
$$ -921 -10390 -3987 5632 1517 -5834 -3763 -630 -5898 -7805 -1406 1524 -5273 -7422 63 1288
795A288r944l502J0998R845l970r432j313M096J678J727J494k888l663K756O719
$$ 1288 -8656 -12158 -1160 8685 4715 -4717 -6030 -1934 -256 1471 2965 77 -3586 -830 5889
810E889p78q389j072Q913N865n273o342J679N239Q37l821m127o37M467M941j323
$$ 5889 5111 -3278 -4350 4563 10428 5155 -1187 492 5731 6568 2747 -1380 -2017 2450 7391 6068
826F068q426m659M860O574k70m896k713J163L825J766m505o289K292R744L470
$$ 6068 -2358 -7017 -2157 4417 4147 -749 -3462 -2299 1526 3292 -1213 -7502 -5210 4534 8004
841H004p927o390L539M725j478k562R59J001j159J682Q50o451m875P149R782k405
$$ 8004 77 -6313 -2774 1951 473 -2089 -1130 -129 -1288 394 1244 -5207 -10082 -2933 6849 4444
857D444j1248k347P484K937m318l270K023P92J27K648j8n706l717O316P446l854
$$ 4444 -6804 -9151 -1667 1270 -3048 -6318 -4295 -3503 -3376 -728 -746 -6452 -10169 -3853 3593 -261
873b61q800J156Q296P97p481l335N110M027O2K56q70l821L05P323L727p825n621
$$ -261 -9061 -7905 391 1188 -6293 -9628 -4518 -491 -429 -173 -1043 -4864 -4559 2764 6491 -1334 -6955
890f955P058Q591l564r353j250N841L826O27j306m304l202L843M819k945n942
$$ -6955 103 8694 5130 -4223 -5473 368 4194 4821 3515 -789 -3991 -148 4671 1726 -4216
905d216K096P014m75o940l890L856N867K382l044n470j825N663O429k845q399
$$ -4216 -2120 4894 4419 -2521 -6411 -2555 3312 5694 2650 -2820 -4645 1018 7447 4602 -3797
920c797j688P039M873k721m833o28K521K254K24k166j746J302M741m74o384l734
$$ -3797 -5485 1554 6427 3706 -1127 -1755 766 3020 3244 1078 -668 634 5375 4901 -1483 -5217
936e217N460P305k186p591j553O093L234k272l169k463o16L196N666j726q435
$$ -5217 243 7548 5362 -2229 -3782 2311 5545 3273 104 -2359 -2975 221 5887 4161 -4274
951d274l100P057N556m220m551K965L777k876k813P75K005K04K117O18n792m192
$$ -4274 -7374 -317 5239 1019 -3532 -567 3210 334 -2479 -1704 301 505 2622 3240 -2552 -6744
967f744O284R321j689r881l410O244N750n63m010k577j384K705L766n32n611o28
$$ -6744 -460 8861 7172 -2709 -6119 125 5875 5312 1302 -1275 -2659 46 3812 3280 -2331 -2959
983b959N341K405n684n116L715O291K81o233m188J274N159L757k562o680k805
$$ -2959 2382 4787 -897 -6013 -2298 3993 4274 -1959 -6147 -4873 286 4043 1481 -5199 -8004
998h004O672P426k000r729k642P347O166k474n138j812K571L544J567k895l757
$$ -8004 -1332 6094 4094 -5635 -8277 -930 5236 2762 -2376 -4188 -1617 1927 3494 599 -3158
1013c158J959O499N83q509m308O936Q108k956q438k631L811N724L079l348p307
$$ -3158 -1199 5300 5883 -2626 -6934 2 8110 5154 -3284 -5915 -2104 3620 6699 3351 -3956
1028c956k826O940P045l568q601n02O677K356m221l603J599L462K293p10m014
$$ -3956 -6782 158 7203 3635 -4966 -5468 1209 3565 -656 -4259 -2660 802 3095 2385 -1629
1043a629l553L767P265L16p970m843N974P312j114o193k817L717M126J691k472
$$ -1629 -5182 -1415 5850 6166 -1804 -6647 -673 6639 5525 -668 -3485 232 4358 6049 3577
1058C577m868j517N728N117l163q414o17P457L410m055m690L55L977J789j208
$$ 3577 -1291 -2808 2920 8037 4874 -3540 -4157 3300 6710 2655 -2035 -1680 2297 4086 2878
1073B878l653k545K667O590N29q575m594O227Q608j183p872k644L650N187J510
$$ 2878 -775 -3320 -653 5937 6466 -2109 -6703 -476 8132 6949 -923 -3567 83 5270 6780
1088F780k965m987m33N213M653m079p887J597P943K425o722n490J662M772J077
$$ 6780 3815 -1172 -1605 3608 8261 4182 -3705 -2108 5835 8260 1538 -3952 -2290 2482 3559
1103C559k737m547j919L705M916j503p174k241O926N526l532o870o91N431L792
$$ 3559 822 -3725 -5644 -1939 2977 1474 -5700 -7941 -1015 4511 979 -5891 -6582 -1151 2641
1118B641j199l250l400P95N123K906l657m291J900N495N39n834k216M336M112
$$ 2641 1442 -1808 -5208 -4413 710 3616 -41 -4332 -2432 3063 3602 -2232 -4448 -112 4000
1133D000j418l783k508N28L113M178p81o155k796N490N505k741n959l14M137R56
$$ 4000 2582 -1201 -3709 -3181 -68 4110 3329 -2826 -5622 -132 5373 2632 -3327 -3641 496 1452
1149A452j706j060M3J91J924J801k858l614K377O045K17n973l156M580N136n99
$$ 1452 -254 -1314 -1271 -1080 844 2645 -213 -3827 -1450 4595 4812 -1161 -4317 263 5399 4800
1165D800l743k274J162K898K938j088n513k150N217M531k406n855k25M129J273
$$ 4800 1057 -1217 -55 2843 5781 4693 -820 -2970 2247 6778 4372 -1483 -1708 2421 3694
1180C694k118j989O99K578J273j579m506j531M904M823j646p249k697M400M968
$$ 3694 1576 -413 286 2864 4137 2558 -1948 -3479 1425 6248 4602 -2647 -5344 -944 4024
1195D024l88l837k774O33L160K009j673l814l99L789J730l565k835L931M555j647
$$ 4024 3636 -201 -2975 -2342 818 2827 1154 -2660 -3059 730 2460 -1105 -3940 -9 4546 2899
1211B899m047p87K893K482J776q60l890k924L625N262j378o482j314M873K492
$$ 2899 -1148 -1935 958 3440 5216 4356 466 -2458 1167 6429 5051 -1431 -2745 2128 4620
1226D620l003k674N55K47j033R79J238k169k066K065J989k639l000L557N015j049
$$ 4620 1617 -1057 -502 -255 -1288 -309 929 -1240 -3306 -1241 748 -1891 -4891 -1334 3681 2632
1242B632m885j451K715K971N51j017j291k578J221M377J620l914l224J936L710
$$ 2632 -2253 -3704 -989 1982 2533 1516 225 -2353 -1132 3245 4865 951 -2273 -337 3373
1257C373Jk238j251J594K9p27q75j64J437J340J7l276k523J062L265P97k181k440
$$ 3373 3374 1136 -115 1479 1508 781 -94 -258 1179 2519 2536 -740 -3263 -2201 1064 1861 -320 -2760
1275b760k43J629J495k18k251p11L006K864j075k747n5K459M84j158L86J299r08
$$ -2760 -3003 -1374 121 -97 -2348 -3059 -53 2811 1736 -1011 -1066 1393 1877 719 1105 2404 1496
1292A496j065O23N22j899M81L014O00l796j852L544K152k988k858K479K198k087
$$ 1496 431 1054 1576 -323 158 3172 3772 -24 -1876 1668 3820 832 -2026 453 2651 564
1308E64p67K503O32l800j388L955J943j972j904J653j1k625m50L523J121l146
$$ 564 -203 2300 2932 -868 -2256 1699 3642 1670 -234 1419 1408 -1217 -1667 1856 2977 -169
1324a69j144L104Q16l693j372L723K094k737j516J885P91k699q73K761R64j237
$$ -169 -1313 1791 2607 -1086 -2458 1265 3359 622 -894 991 1782 -917 -1790 971 1935 698
1340F98L17J117j338l540k83M153J979k641k899P55J402j60n58j7m8j89M51R57
$$ 698 1015 2132 794 -2746 -3029 1124 3103 462 -2437 -1682 -280 -440 -998 -1015 -1063 -1252 -801 156
1358A56M15j782k278m5J152J038p03K24J205r02k943j868K941L101k94k153m99
$$ 156 571 -1211 -3489 -3534 -2382 -1344 -2047 -1823 -618 -1520 -4463 -6331 -3390 -289 -583 -2736 -3235
1375c235k31r56P16K865Q57k493r29L949K504l374l646K365M350o60k009O29R94
$$ -3235 -3466 -4422 -3706 -841 16 -2477 -3406 543 3047 -327 -3973 -1608 2742 2082 73 702 1696
1392A696k314j628J988J821j365o98L265l1n420l254N961M904l470n961J903M861
$$ 1696 -618 -2246 -258 1563 198 -500 2765 2734 -2686 -5940 21 4925 1455 -4506 -2603 2258
1408B258r52l154J116O52j449J3M232K70m860k552M220K281l462j465M793L357
$$ 2258 1306 -1848 -732 -80 -1529 -1516 2716 2986 -1874 -4426 -206 2075 -1387 -2852 1941 5298
1424E298l777n190J152L980J610J10l01j310k384J90L185O92k475j361K825K479
$$ 5298 1521 -3669 -2517 1463 3073 3183 2882 1572 -812 -622 2563 3255 780 -581 2244 4723
1440D723k045l602L32K717K61j757l33J904j17j344j032l47Q33M74K012O12k211
$$ 4723 2678 -924 -592 2125 2386 629 296 2200 2083 739 -293 -640 193 667 2679 3291 1080
1457A080l295K15L178J213k292k254R52J979j50k154k36J048j61l03J630O11j746
$$ 1080 -2215 -2000 1178 2391 99 -2155 -1203 776 626 -1528 -1764 -716 -877 -1180 450 1061 -685
1474f85q95Q04J292k173j217M076L631k904n596M9M897J350j860o28L96j504r47
$$ -685 -1580 -776 516 -1657 -2874 1202 4833 1929 -3667 -3618 1279 2629 769 141 537 -967 -1914
1491a914K427N78k771r94L581J975l882l995K841M055j925m045N99L295O79j951
$$ -1914 513 1091 -1680 -2674 907 2882 -1000 -4995 -2154 1901 -24 -4069 -3470 -175 504 -1447
1507a447j023l13m97J203K781M59m062j837L909K772k311m262J347M580M75k111
$$ -1447 -2470 -2783 -3280 -2077 704 1163 -2899 -4736 -827 1945 -366 -4628 -3281 1299 1774 -337
1523c37j012R44P30J79O96o08j274J299K219j157l514j084L469K910q85l158j357
$$ -337 -1349 -405 325 504 1200 592 -682 617 2836 1679 -1835 -2919 550 3460 2575 -583 -1940
1540a940R64K035J029j755j765K99K191J53j472j325M20K039N23K08j667p34J490
$$ -1940 -976 1059 2088 333 -1432 -1133 1058 1211 -261 -1586 -1166 873 1396 1604 -63 -797 693
1557F93J942k13l272J1K931J685k026k374N03J822Q95Mj398j415M9K783J508k527
$$ 693 2635 2422 -850 -839 2092 3777 1751 -623 -120 1702 2597 2601 1203 -212 -163 2620 4128 1601
1575A601l777Q8M602J619k452k840P89J195n1p76m4q7P48O01n36k156j824L374
$$ 1601 -2176 -2088 2514 4133 1681 -1159 -370 825 774 -2 -46 -133 615 1216 680 -1476 -3300 74
1593G4L832j582n164m07M126K980k500k889k61J073J875J025j349k411j01K800
$$ 74 3906 2324 -2840 -3247 879 3859 1359 -1530 -1791 -718 1157 2182 833 -1578 -1679 1121
1609A121J376k214j739J146K329p26k433q89J431J367l20j715j622Q55K550J874
$$ 1121 2497 283 -1456 -310 2019 1293 -1140 -2029 -598 769 449 -1266 -2888 -2033 517 2391
1625B391k777k680j14L018J749r03k316j253K75K057J504p48j787O7J295k84j178
$$ 2391 -386 -3066 -3180 -162 1587 684 -1632 -2885 -2610 -553 951 203 -1584 -1517 -222 -506 -1684
1642a684L46J844P41j622j824k89J207J586P94j253k516p04K931K803j260l506
$$ -1684 -1338 506 1247 -375 -2199 -2488 -1281 305 1099 -154 -2670 -3374 -443 2360 1100 -2406
1658b406k64K133J363r13n36J20m49O66Q88m2j449N36K145K63l002j202K713K517
$$ -2406 -2670 -537 826 -87 -623 -503 -952 -286 602 560 -889 -353 1792 2055 -947 -2149 564 3081
1676C081j319k404m14J629J632K48j051k377j9K465K468j602l391m72K556J263
$$ 3081 1762 -642 -1056 573 2205 2453 1402 -975 -994 1471 3939 2337 -1054 -1526 1030 2293
1692B293j663r71M57Q22J00q72o72r9J902J068j269k853o71L033K659j206k903
$$ 2293 630 -341 116 938 1038 166 -506 -605 1297 2365 1096 -1757 -2428 605 3264 2058 -845
1709h45o21K103J259L33p93j251j9J083O56j109j763R03J940q7k636p83J580J224
$$ -845 -1466 637 1896 2229 1436 185 166 1249 1905 796 -967 -64 1876 1789 -847 -1630 -50 1174
1727A174j53j038j254p27J453J412O0l082r22K525J894j435k107o1J070J457k23
$$ 1174 1021 -17 -1271 -1998 -545 867 927 -2155 -3077 -552 1342 -93 -2200 -2261 -1191 266 43
1744D3o52j806j12K051J282r57k601N54K713M46j990j383O53J851L83q37k109
$$ 43 -609 -2415 -2527 -476 806 -151 -2752 -2198 515 961 -1029 -2412 -1759 92 475 -362 -2471
1761b471n91J875L119o22l437j452K249L497r35k775j155J778J621l39j573j302
$$ -2471 -3062 -1187 1932 1310 -2127 -3579 -1330 2167 1232 -1543 -2698 -920 701 362 -1211 -2513
1777b513N80K260J017j981k833R23L520Q37k978k312J142K542P23j605j351j67
$$ -2513 -1933 327 1344 -637 -3470 -2547 973 1810 -1168 -3480 -2338 204 927 -678 -2029 -2196
1793b196K056K204l25l316r13L017L171q81l368q43J783J699M22j590j173k66
$$ -2196 -140 2064 1739 -1577 -2490 527 3698 2817 -551 -1394 389 2088 2510 920 -253 -519
1809e19J535Q95j324j834N65J912p7k601j638J010K429Q18j224k510j081J962
$$ -519 1016 1911 587 -1247 -682 1230 1153 -1448 -3086 -2076 353 1171 -53 -2563 -3644 -1682
1825a682K936M91l459j685J653K840n5j756j271O85J930O58o93j954N67J939J538
$$ -1682 1254 1745 -1714 -3399 -1746 1094 1039 -717 -1988 -1303 627 1285 592 -1362 -795 1144 2682
1842B682j919l192J115L889K17k766k817J037K949J147j445k061j991K103L165
$$ 2682 763 -2429 -1314 2575 2792 26 -2791 -1754 1195 2342 897 -1164 -3155 -1052 2113
1857B113M58m481k741K213L539j15k662m08J287Q60p70n78k9P27J481M12k399
$$ 2113 2571 -1910 -4651 -2438 1101 986 -1676 -2084 -797 63 -707 -1285 -1314 -587 894 1306 -1093
1874a093k401R91M466J211l386l008P28L764J112j613k328q53J183J653L97j741
$$ -1093 -3494 -2503 1963 3174 -212 -3220 -2492 1272 2384 771 -1557 -2410 -1227 426 823 -918
1890i18j444J226J261k62j340n41J670J599q28k448o96J741K245J29k369j640
$$ -918 -2362 -1136 125 -137 -1477 -2018 -348 1251 423 -2025 -2721 -980 1265 1394 -975 -2615
1906b615Q81K658O38j915k056J82K380J836n52k504j969J360K715J11j624q87
$$ -2615 -1734 924 1562 -353 -2409 -2227 153 1989 1437 -1067 -3036 -1676 1039 1150 -474 -1361
1922a361K240J184j792j899O53K520J125j234j592j017Q94K389J389k918l073
$$ -1361 879 2063 271 -1628 -975 1545 2670 1436 -156 -1173 -279 2110 3499 581 -2492
1937b492J400M430Q93l655k652J253K446k52r42l39N5K52Q82r60j475k68K468
$$ -2492 -1092 3338 4231 576 -2076 -823 1623 1371 429 90 145 397 1279 319 -1156 -1424 1044
1954A044K476k005l602k11L565J277k061k286R51J853Q54j178j952j043J315K393
$$ 1044 3520 1515 -2087 -2298 1267 2544 483 -1803 -852 1001 1855 677 -1275 -2318 -1003 1390
1970A390J011k160k619N80K242L90j952j084J557J463m85k181j401J345J539N30
$$ 1390 2401 241 -2378 -1798 444 834 -1118 -2202 -645 818 333 -1848 -3249 -1904 -365 165
1986A65j457j378L98R56J253j219k023k20K161L314j116l020j624K300K345o61
$$ 165 -1292 -2670 -2272 -1316 -63 -1282 -3305 -3525 -1364 1950 834 -2186 -3810 -1510 835 174
2002A74j717m1J903M99q35o83o90o0K090K125j128l147l56K900J094l053k241
$$ 174 -1543 -1584 319 818 -17 -700 -1390 -1450 640 2765 1637 -1510 -1866 1034 2128 -925 -3166
2019c166K669L441o10l157j185K13J103J889L80j913k383O65L028N69l477j379
$$ -3166 -497 2944 2334 -823 -2008 -1795 -692 1197 1577 -336 -2719 -2054 974 1543 -1934 -3313
2035c313L233L102j710l488N47K405O19j395m65K91K8J606J200j928l217K33M499
$$ -3313 -80 3022 1312 -2176 -1629 776 1395 0 -465 -174 -146 1460 2660 732 -2485 -2252 2247
2052B247K038k835l132J258K250n2k136j54J029J167k18n30j050r23N74J799M83
$$ 2247 4285 1450 -1682 -424 1826 1774 -362 -516 513 1680 1462 932 -118 -1041 -467 1332 1815
2069A815j761q92J284K222j659l024j08L140J997j012k078o21O11P89P54M70p37
$$ 1815 54 -838 446 2668 1009 -2015 -2123 1017 3014 2002 -76 -697 -86 703 1457 1927 1190
2086A190j682J007J799n86k219q4K075J010k017j275J929J546r47k483j51R99
$$ 1190 -492 515 2314 1728 -491 -575 1500 2510 493 -782 1147 2693 1746 -737 -888 111
2102A11P95L33Q54j051l021k77L021J619k076j836J336J593j609k125P72J841
$$ 111 906 1239 2093 1042 -1979 -2256 765 2384 308 -1528 -192 1401 -208 -2333 -1561 280
2118B80l23j022K34M70o86k15J274j74k293j29L193J436l229k724J004L334N10
$$ 280 -43 -1065 -831 -361 -1047 -1262 12 -162 -2455 -2584 609 2045 -1184 -3908 -2904 430 940
2135I40j975J25P19n22n13O80O4m22k7J230J99j930l16J869J418j997j757J498
$$ 940 -1035 -910 -191 -713 -1226 -546 -482 -904 -931 299 498 -1432 -1748 121 1539 -458 -2215 -717
2153g17K928j47j716j814K03R09Q39J580n44j431o60P28M80l76j02P24J125r00
$$ -717 2211 2064 348 -1466 -1263 -354 485 2065 1521 90 -570 158 638 262 160 884 2009 1109
2171A109k151j01J357J228n92j373K34J139L15n97m09l16o12Q64J517o8j813q47
$$ 1109 -1042 -1143 214 1442 850 -523 -289 850 1165 568 159 -157 -769 95 1612 1544 -269 -1116
2189a116J055J543m97j457Q76R96j9j279m37J179l85k88J030K27q26j070J382
$$ -1116 -61 1482 985 -472 404 1400 1381 102 -335 844 459 171 1201 1428 602 -468 914
2206I14O65j312j830J948K240L7k415j453J003P91O08k0l18j012n3P95N00j488
$$ 914 1579 267 -1563 385 2625 2662 247 -1206 -203 588 1196 1176 858 -154 -207 588 1088 -400
2224d00l86J123J453r40j958J47J370K0p43p24Q70O19J39m34o01o20k3J932L54
$$ -400 -786 337 1790 850 -1108 -961 409 429 -314 -1038 -168 451 590 156 -445 -1065 -1088 844 1198
2243A198j352j180N63J035L20j185n52O05J74R8p5m24k20j33k75J11J83R93l51
$$ 1198 -154 -1334 -771 264 584 -601 -1153 -548 -374 -276 -351 -775 -995 -1128 -1403 -1292 -1109 -116 -467
2262d67n91n20j1K01R75Q21o69j256m58Q39O99j3o4L55k99q09M49J134K93r46
$$ -467 -1058 -1578 -1589 -1388 -413 408 -261 -1517 -1975 -1136 -437 -450 -514 -159 -458 -1267 -818 316 609 -337
2282c37p24N41O37J04m76M6o7l19p7J157J72q30m30L30M30j74J61P51k10r71l66
$$ -337 -1061 -520 117 221 -255 -209 -276 -595 -672 485 657 -173 -603 -273 157 -17 144 895 685 -286 -652
2303f52R94J048k88q16L98l36j36N74J020m92j555o4J111O07m5mm55j107J88R61
$$ -652 342 1390 1102 286 684 348 212 786 1806 1314 -241 -305 806 1413 1368 1364 909 -198 -10 951
2323I51N31l35q61J98j49K01j26M04M81j40j012n61M42R42O81n30j364n07Q19
$$ 951 1482 1147 286 484 335 536 410 814 1295 1155 143 -418 24 966 1647 1117 -247 -754 65
2342F5Q46L52j162j028L94J101K02o73p01N8O61M89q50n95L98J027J49j383r81
$$ 65 911 1263 101 -927 -533 568 770 97 -604 -546 115 604 -246 -841 -443 584 733 -650 -1631
2361a631J121J398k41j227p73K75J367R75r03j784r17J682K017p38j261m43P66
$$ -1631 -510 888 647 -580 -1353 -1078 289 1264 361 -1423 -2340 -658 1359 621 -640 -1083 -317
2378c17O52m60l46K06L31K48k75q83o41J193J424K7j965j103J200J453J33j107
$$ -317 335 -125 -471 -265 66 314 39 -844 -1485 -292 1132 1159 -806 -1909 -709 744 877 -230
2396b30p73l26R30N13J23q73o74P71R56o21q57j54J131O58m82j035k64P31P07
$$ -230 -1003 -1329 -399 114 237 -636 -1310 -539 417 -204 -1061 -1215 -84 574 92 -943 -1207 -476 231
2415B31L58j357r16J186J489J58j286j367J431J405K66j219j198K33J247J123
$$ 231 589 -768 -1684 -498 991 1149 -137 -1504 -73 1332 1598 379 -819 -586 661 1784
2431A784n84j178n74J160P83p50r16R4J345M71j436j075O1J511P96o83j792p74
$$ 1784 1200 22 -552 608 1391 641 -275 -181 1164 1635 199 -876 -815 696 1492 809 -983 -1757
2449a757J853J717r1k465n94J452J920o62j134m51Q75J078L96j478j092P25J807
$$ -1757 96 1813 1722 -743 -1337 115 2035 1373 239 -212 663 1741 2137 659 -433 292 2099
2466B099M00j568j434Q37J774l32j485j110J103J035P1j360j455M54J504J116
$$ 2099 2499 931 -503 334 2108 1776 291 -819 284 1319 1390 30 -1425 -971 533 1649
2482A649r23k264m97J616J281m20j464r05R44Q55o81n88K63O81N41k24j282m18
$$ 1649 726 -1538 -2035 -419 862 442 -1022 -1927 -983 -128 -809 -1397 -1134 -453 88 -136 -1418 -1836
2500a836P13J951J67j846j234J194K077L31j467j360j03J537J410q93j602p19
$$ -1836 -1123 828 995 -851 -2085 -891 1186 1517 50 -1310 -1413 124 1534 641 -961 -1680
2516a680J596J207l57k023l20J415J317m65j619l16Q90J632q24j947q31J928J723
$$ -1680 -84 1123 766 -1257 -1577 -162 1155 690 -929 -1245 -355 1277 453 -1494 -2325 -397 1326
2533A326n36k336r57J223K255P93j715k283j13K595J443r77j481n87J923M29n52
$$ 1326 790 -1546 -2503 -1280 975 1768 53 -2230 -2343 252 1695 718 -763 -1350 573 1002 450
2550D50q36P08J374J39j361j355K11J480J739n79k682j214K228K335l05k614j076
$$ 450 -386 322 1696 1835 474 -881 -670 810 2549 1970 -712 -1926 302 2637 2332 -282 -1358
2567a358J312J933k41j238o62rO81J020m07r59m46J625Q71j630j769J111J640
$$ -1358 -46 1887 1646 408 -254 -263 418 1438 1031 72 -374 1251 2122 492 -1277 -166 1474
2584A474L41j713j040J55J219J062p87j141p92P86J901M39j810j810R14K020M69
$$ 1474 1815 102 -938 -783 436 1498 711 -430 -1222 -436 1465 1904 94 -1716 -802 1218 1687
2601A687j307j237M79J235k03r95o14R34J082K74j469j233K37J637Q06p97j693
$$ 1687 380 -857 -378 857 654 -341 -955 -21 1061 1335 -134 -1367 -1130 507 1313 516 -1177
2618a177o91K209J420l88k198m18J392J441p91j083m48J063O65o52o33k00M05
$$ -1177 -1868 341 1761 1373 -825 -1243 149 1590 799 -284 -732 331 996 344 -289 -489 -84
2635h4R94oj004j774P96K122K40j886j069J453J151m81j327j21K31R82O22k16
$$ -84 910 904 -100 -1874 -1078 1044 1284 -602 -1671 -218 933 452 -875 -996 -765 217 839 623
2653F23p33j263Q37J582m4j543j73J324Q51j383r64R48J346k17o95O5K03l00K63
$$ 623 -110 -1373 -536 1046 1002 -541 -714 610 1461 78 -886 62 1408 1191 496 561 764 464 727
2672G27Q70q58q68N29J683J19j416j146M45J211k9q58j07N23L02n81j82o6p15
$$ 727 1597 739 -129 400 2083 2202 786 -360 85 1296 1267 409 302 825 1127 546 364 298 -417
2691d17N38J593p9j282q73P76R82m34j276M31J439M11j317r03k2Q12K95N74j13
$$ -417 121 1714 1635 353 -520 256 1238 804 -472 -41 1398 1809 492 -411 -433 379 674 1248 1135
2710A135q30p63N91J113m07j519Q11J426N15k127q27J371R05j148j217N04M55
$$ 1135 305 -458 133 1246 839 -680 131 1557 2072 -55 -882 489 1394 246 -971 -467 -12
2727a2O07l24l97q49j183P89K451J95k283j217J524J037r66j118Q09J515l08j131
$$ -12 595 271 -126 -975 -2158 -1369 1082 1277 -1006 -2223 -699 338 -628 -1746 -937 578 270 -861
2745h61j86L18k62L41J038J96j157m12J642J41j995j689J982K289j13j744p71
$$ -861 -1047 -729 -991 -650 388 584 -573 -985 657 798 -1197 -2886 -904 1385 1272 -472 -1243
2762a243P8M90L48J090j92j502n16J391L89j061j132J407O39m17r74l1J002J73
$$ -1243 -1165 -675 -327 763 571 -931 -1447 -56 333 -728 -1860 -453 186 -231 -1205 -1236 -234 -61
2780f1j065m45M8R29N75N01o10j708p28J681K138j97j673q42J220Q59q90q50Q43
$$ -61 -1126 -1571 -1523 -594 -19 482 -128 -1836 -2564 -883 1255 1058 -615 -1457 -237 622 -268 -1118 -275
2799b75R07j79k79j73o39q5O69J180p54j251P17J352K94k427q61J292K223k0j565
$$ -275 632 453 174 1 -638 -723 -54 1126 372 -879 -162 1190 1484 -943 -1804 -512 1711 1691 126
2818A26p21M28L9Q09J86O4j104j39J531L51j712n94J386R82p80j381M97J749l92
$$ 126 -595 -167 -128 681 867 931 -173 -312 1219 1570 -142 -736 650 1632 852 -529 -32 1717 1325
2837A325j557j92L88K66O73P84p90j836q30J643J547p08j353M1Q41m1j246M8O71
$$ 1325 -232 -424 -36 230 903 1687 897 -939 -1769 -126 1421 713 -640 -599 242 201 -1045 -997 -326
2856c26M5n3j22K93j073O2P08P41j006r42J003J208m94j438o90J233Q94K8r46
$$ -326 -281 -334 -456 -163 -1236 -1174 -466 275 -731 -1673 -670 538 44 -1394 -2084 -851 43 71 -875
2875h75l04k27M33Q35k62n32p34Q24J335q42j195j34O05M78j25o13J00R24M25
$$ -875 -1179 -1406 -973 -138 -400 -932 -1666 -842 493 -349 -1544 -1678 -1073 -595 -720 -1333 -1233 -309 116
2894A16o83j220M46Q47R05j21o88j219N07J236P72j243r80J048J080J06j450n35
$$ 116 -567 -1787 -1341 -494 411 290 -398 -1617 -1110 126 898 -345 -1325 -277 803 909 -541 -1076
2912a076R29M84n4l86J0j07K01M45J29q51j39R25R57j069j005K58J442L60j082
$$ -1076 -147 337 283 -103 -93 -200 1 446 575 -276 -415 510 1467 398 -607 -349 1093 1453 371
2931C71m92R4O03M49K20o66j070Q8J128P65m96j167K05N22K78o41n69R27J29L44
$$ 371 -121 -27 576 1025 1245 579 -491 -403 725 1490 994 -173 32 554 832 191 -378 549 678 1022
2951A022r18n35P3P64P01l98j072l31J008R30n64j091l27O33J068j52q00q79L37
$$ 1022 104 -431 -358 406 1107 709 -363 -694 314 1244 680 -411 -738 -105 963 811 11 -868 -531
2970e31P15L74n95l89L66M77K44q95k98N88Q54N17q29j228Q0J884Q13j261j346
$$ -531 184 558 -37 -426 -60 417 661 -234 -532 56 910 1427 598 -630 -550 1334 2147 886 -460
2989d60j8J720P13p21r96l59L25L66K94k61n21j74Q07k93j270n42J527P86r78
$$ -460 -478 1242 1955 1234 238 -121 204 570 864 603 82 -92 715 422 -848 -1390 137 923 -55
3008e5j345JN92R41J71p99j187J17P89R55l01j035n31Q22R57p46k38j7M69K1j85
$$ -55 -1400 -1399 -807 134 305 -494 -1681 -1564 -775 180 -121 -1156 -1687 -865 92 -654 -892 -909 -440 -419 -604
3029f04m93J80O21MN09j186o67R96Q87j51p45n40M45J094K96n05j289l3R36Q32
$$ -604 -1097 -917 -296 -292 217 -969 -1636 -640 247 96 -649 -1189 -744 350 646 141 -1148 -1181 -245 587
3049E87j34o53m81N86M12k26m49K88M28M49q7o74P9N19Q65l98j133l62P77J278
$$ 587 453 -200 -681 -95 317 91 -358 -70 358 807 720 46 125 644 1509 1111 -22 -384 393 1671
3069A671M17q65r64J19Q84M49k55o58k26M46N40n22m97M8N13M92q32l78J45M56
$$ 1671 2088 1223 259 378 1262 1711 1456 798 572 1018 1558 1036 539 587 1100 1592 760 382 527 983
3089I83Ol61l54l86O77M48m33p35n70P58L02k50n53m80K57L04o6P1j49j90J19
$$ 983 989 628 274 -112 565 1013 580 -155 -725 33 335 85 -468 -948 -691 -387 -453 -382 -531 -721 -602
3110f02Q5L49l00J09k6K6j05r7N59m4M45l14m14K06j70O61m6j94m99l01Q96o5
$$ -602 -517 -168 -468 -359 -385 -359 -464 -561 -2 -46 399 85 -329 -123 -293 368 322 128 -371 -672 224 159
3132A59o1k58R8m25M27K59l8m05P8K35m46P1k99K41L78n64J91J28k02O4l08l63
$$ 159 98 -160 -62 -487 -60 199 161 -244 -166 69 -377 -306 -605 -364 14 -550 -359 -231 -433 -369 -677 -1040
3154a040L41L89R1J41o22L02M39K97k52J9k24j97K22K33K84K64m63J3m03o7N75
$$ -1040 -699 -310 -219 -78 -700 -398 41 338 86 105 -119 -316 -94 139 423 687 224 237 -166 -233 342
3175C42N41Q4r13m08K81P66j18k27J02k99K22k30J57L30j12n51L43j83K27j04
$$ 342 883 967 54 -354 -73 693 575 348 450 151 373 143 300 630 518 -33 310 127 354 250
3195B50k31R8q18r9P45R3r2o19K17L44K92l20N51k89k79J89M91K18k6jj81J40
$$ 250 19 117 -701 -800 -55 38 -54 -673 -456 -112 180 -140 411 122 -157 32 523 741 715 714 533 673
3217F73j59J18P50k20n07p37R8O52J61K15p44n55j11L65N49k34k11l23J1o02L12
$$ 673 514 632 1382 1162 655 -82 16 668 829 1044 300 -255 -366 -1 548 314 103 -220 -209 -811 -499
3238d99K99k50J75m5n08J00J0N07l78m09N9L37J62K77l23lm92j02N52P92k3p39
$$ -499 -200 -450 -275 -320 -828 -728 -718 -211 -589 -998 -939 -602 -440 -163 -486 -489 -981 -1083 -531 261 238 -501
3260e01J01N28J5n68L05j52J85m29l1L49kl95l9o4l20L6Q93K76n52j423K99R79
$$ -501 -400 128 143 -425 -120 -272 -87 -516 -547 -198 -200 -595 -634 -698 -1018 -982 -89 187 -365 -1788 -1489 -510
3282e10J209m93q03p6J38J41L10P9r1J52L17O7p20k35M15J005k93j286m7R54Q74
$$ -510 699 206 -597 -673 -535 -394 -84 -5 -96 56 373 440 -280 -515 -100 905 612 -674 -721 233 1107
3303A107o69q70j38J026L25L40m24o09l13N54K55Oq12K23Q85J98r03o87N62Q20
$$ 1107 438 -432 -570 456 781 1121 697 88 -225 329 584 590 -222 1 886 1084 181 -506 56 876
3323H76P5q93j8L07m3J24k55m72N0Q20N74q1p67p99O2J407L32r41o85Q59L89n35
$$ 876 951 58 40 347 304 428 173 -299 -249 571 1145 1064 297 -502 -440 967 1299 358 -327 532 921 386
3345C86o07J99Q78k65k18j19m74l73O32O85m36j224j41J427M35j253j312O49Q96
$$ 386 -221 -22 856 591 373 254 -220 -593 39 724 288 -936 -1077 350 785 -468 -1780 -1131 -235
3364b35j89k78m93J10n16O64M19k99q65O27J129K13j367r98R22J381n79p52K65
$$ -235 -424 -702 -1195 -1085 -1601 -937 -518 -817 -1682 -1055 74 287 -1080 -2078 -1156 225 -354 -1106 -841
3383h41Q23p0n22l29k03n1J051P84p00j418o13J595J105q42j245K61Q53L11p18
$$ -841 -18 -88 -610 -939 -1142 -1193 -142 642 -58 -1476 -2089 -494 611 -231 -1476 -1215 -362 -51 -769
3402g69n85N57P41m70J09l2l65K55N95J98j374o66J513J169p1j637o07J040P49
$$ -769 -1354 -797 -56 -526 -417 -449 -814 -559 36 234 -1140 -1806 -293 876 805 -832 -1439 -399 350
3421C50J44n85l26O93J51J90j76n02l81Q12O93K63j858k55J455K73j645q5Q60
$$ 350 494 -91 -417 276 427 617 441 -61 -442 370 1063 1326 -532 -787 668 941 -704 -789 71
3440G1J446p75j543k74O7R25L82N42q75j266J69J700O77j067j186Q71J548k42
$$ 71 1517 742 -801 -1075 -1008 -83 299 841 -34 -1300 -1131 569 1246 179 -1007 -136 1412 1170
3458A170j249L74P64m73k48k02N27l4L07M21p93j868K26K287R26j267j746K57
$$ 1170 -79 295 1059 586 338 136 663 629 936 1357 564 -1304 -1078 1209 2135 868 -878 -621
3476f21J589L39j002k90j90L39N44l90k32n44q3J268K19j135q10R13J390m30k048
$$ -621 968 1307 305 15 -175 164 708 318 86 -458 -541 727 946 -189 -999 -86 1304 874 -1174
3495a174L3J757P62o60j471l62Q09O18M01o60p68l79Q34J206p73j452m10J571
$$ -1174 -1141 616 1378 718 -753 -1115 -306 312 713 53 -715 -1094 -260 946 173 -1279 -1689 -118
3513a18P28j183p07P01M96k18p39m07L34R83K85l1j081q68M86J707O59j446q94
$$ -118 610 -573 -1280 -579 -83 -301 -1040 -1447 -1113 -130 155 124 -957 -1825 -1339 368 1027 -419 -1313
3532a313Q01J178m4j540l15J410O55q2q28Q2m67N17Q24j85j039j75J114Q35j032
$$ -1313 -512 666 622 -918 -1233 177 832 750 -78 4 -463 54 878 693 -346 -521 593 1428 396
3551C96j476j48J800Q13j080o83j72M75Q24K85j190o54O78J253K96j285j168N36
$$ 396 -1080 -1228 572 1385 305 -378 -550 -75 749 1034 -156 -810 -132 1121 1417 132 -1036 -500
3569e00J348J04q88k22L34J080k54j073m45J62J253O88m60j453k03Q28J172j98
$$ -500 848 952 64 -158 176 1256 1002 -71 -516 -354 899 1587 1127 -326 -529 299 1471 1273
3587A273j583L77N84P12n54j035p5R43M65k98p11p27O56J027l76r75j32M69O72
$$ 1273 -310 67 651 1363 809 -226 -301 642 1107 809 98 -629 27 1054 678 -297 -429 40 712
3606G12K28r97p20L96J287j90p19q91N39J007J68m30j151J35N10P42K6q34n02
$$ 712 940 -57 -777 -381 906 716 -3 -894 -355 652 820 390 -761 -626 -116 626 652 -182 -684
3625f84K41P93n5o89k73J001L23m15r34K77M18O12j45p69m89l28P71O69n65p31
$$ -684 -443 350 295 -394 -667 334 657 242 -692 -415 3 615 470 -299 -788 -1116 -345 324 -241 -972
3645i72l1R03L53n30o62q5R73O6j23p18RN28Q97p60j66m2M90P29m17q99n80R92
$$ -972 -1003 -100 253 -277 -939 -1024 -51 15 -108 -826 -817 -289 608 -152 -318 -360 130 859 442 -457 -1037 -45
3667d5Q19J5j093m98O17Q22k6l98o15QN75K77k06l16j82L5J32m11j82M28Q22J07
$$ -45 774 789 -304 -802 -185 637 611 213 -402 -394 181 458 252 -64 -246 -211 -79 -490 -672 -244 578 685
3689F85j069m36j5J449L02p05p05l6O45P07m8n82m50j32P94O63o03m72L37M32
$$ 685 -384 -820 -835 614 916 211 -494 -530 115 822 774 192 -258 -390 404 1067 464 -8 329 761
3709G61r2n40j51M30K27q2o98k32K43K63L10l40r77J11Q75L94n15r08j06P88O88
$$ 761 669 129 -22 408 635 553 -145 -377 -134 129 439 99 -878 -767 108 502 -13 -921 -1027 -239 449
3730D49k54k67j00p3L0O15l49k19O3K14J4n45l09N75R05j55p88o83O06K81M02
$$ 449 195 -72 -172 -245 -215 400 51 -168 -105 109 123 -422 -731 -156 749 594 -194 -877 -271 10 412
3751D12p21m15k09Q44L32r5o27l70N55m1M04p20L30M6K8j93m27J8L83P70n11o43
$$ 412 -309 -724 -933 -89 243 148 -479 -849 -294 -335 69 -651 -321 -275 -247 -440 -867 -849 -466 304 -207 -850
3773h50J7N43J54L9J36p88L64N98j13k03o40J10O86Ok87J5N6k76J62M76m19K13
$$ -850 -833 -290 -136 -97 39 -749 -385 213 100 -103 -743 -633 53 59 -228 -213 -157 -433 -271 205 -214 -1
3795am65N7M86l40k25N30K29P0n03j47M76M25j6n18l05r5K45P3K35m67j81J76
$$ -1 -466 -409 77 -263 -488 42 271 341 -162 -309 167 592 576 58 -247 -342 -97 -24 211 -256 -437 -261
3817b61M83p2k70j08L07J72K5k09O4K14j66J58K05Nk77M62Om20m21L51P22j77
$$ -261 222 150 -120 -228 79 251 276 67 131 345 179 337 542 547 270 732 738 318 -103 248 970 793
3839G93k98o16N15J53J44M6n53q2o0M72R0l44n8r4J45k45J84K79q9j71l67l27
$$ 793 495 -121 394 547 691 737 184 102 42 514 604 260 202 108 253 8 192 471 382 211 -156 -483
3861d83p3L56L1K13l89k44P3P64l00J35k95j38M53K83rl50k82j17J08K23q4M31
$$ -483 -556 -200 -169 44 -345 -589 -516 248 -52 83 -212 -350 103 386 377 27 -255 -372 -264 -41 -125 306
3883C06n40m98K63J44l32J15L18k62j26J14L67O9Nj32m3Q7N48k62L51n69j4k93
$$ 306 -234 -732 -469 -325 -657 -542 -224 -486 -612 -498 -131 -62 -57 -189 -232 -145 403 141 492 -77 -91 -384
3905c84L14M98j10q17r2J81Q3k97p9P89k90q58K69J26J02L13P9j98k85k8Q55k6
$$ -384 -70 428 318 -499 -591 -410 -327 -624 -703 86 -204 -1062 -793 -667 -565 -252 -173 -371 -656 -684 171 145
3927A45k62j70J10N32K13k73k44k2N37k98m1N0M24k7j85l15k67L72L59J89k00
$$ 145 -117 -287 -177 355 568 295 51 29 566 268 227 277 701 674 489 174 -93 279 638 827 627
3948F27p44K76L80K48j45q24pJ48K28j68J26j45k08l51L69L94O3j76J88m13k61
$$ 627 -117 159 539 787 642 -182 -189 -41 187 19 145 0 -208 -559 -190 204 267 91 279 -134 -395
3969c95m7N69N39l74j30l25j40O06k17J39j21j9m18L66J55J7o57J78P37k38n32
$$ -395 -442 127 666 292 162 -163 -303 303 86 225 104 85 -333 33 188 205 -452 -274 463 225 -307
3990c07j33N43L02p32k1O0M80k6J45k01n91N5K56M30j77m26j68P31K44p67n98
$$ -307 -440 103 405 -327 -348 -288 192 166 311 110 -481 -426 -170 260 83 -343 -511 220 464 -303 -901
4011i01K61N16M96k87J1J99p30O7L26J71l70j74O50k15p08j16N95P02k75q15N4
$$ -901 -640 -124 372 85 96 295 -435 -368 -42 129 -241 -415 235 20 -688 -804 -209 493 218 -597 -543
4032e43N68NL1p91M63k90K46L39Q6n25k25K75L64K27m38j66N23J1n02l21N40M7
$$ -543 25 30 61 -730 -267 -557 -311 28 114 -411 -636 -361 3 230 -208 -374 149 160 -342 -663 -123 -76
4054g6j81L2J46K2o54L86K42L9o31J55R39L22j042p78N45R05k65j29K55j45q59
$$ -76 -257 -225 -79 -57 -711 -325 -83 -44 -675 -520 419 741 -301 -1079 -534 371 106 -23 232 87 -772
4075g72O41Q66L27q41m47P93J44m77m25Q70J13l22m96M79M85k15k19m01J52l13
$$ -772 -131 735 1062 221 -226 567 711 234 -191 679 792 470 -26 453 938 723 504 103 255 -58
4095e8J61J102rj142o15L97P99j93o25j30Q46k25o96R0J88k89r3L67M53l41l54
$$ -58 103 1205 1196 54 -561 -164 635 442 -183 -313 533 308 -388 -298 -110 -399 -492 -125 328 -13 -367
4116c67J6Q2l34j77P86P00k95j069l90M31K80P6L07l5m89m42L12Q02p2o65j94
$$ -367 -351 -269 -603 -780 6 706 411 -658 -1048 -617 -337 -261 46 11 -478 -920 -608 194 122 -543 -737
4137g37M95K68m26j89J99j8m43Q4M47N24m45j07J57l27l79N15O85L22j001m90
$$ -737 -242 26 -400 -589 -390 -408 -851 -767 -320 204 -241 -348 -191 -518 -897 -382 303 625 -376 -866
4157h66L73M95j0l71QN40l36o9K96K09p35R1N47L73k35m99L69M94q89k45Q66P67
$$ -866 -493 2 -8 -379 -371 169 -167 -236 60 269 -466 -375 172 545 310 -189 180 674 -215 -460 406 1173
4179A173p62l29k16K50l1J66J97q2k41n56P91K02k76m30K7M98j21n01M6N41k20
$$ 1173 411 82 -134 116 85 251 448 366 125 -431 360 562 286 -144 -117 381 260 -241 -195 346 126
4200A26k69j35p7M48J02K56r6m55k77M90L56K36n09m04K91L63J00k48J83P7m22
$$ 126 -143 -278 -355 93 195 451 355 -100 -377 113 469 705 196 -208 83 446 546 298 481 558 136
4221A36K27O2p1n30J72M48J6m27j21k46M26r8k67K95M12N6m41l29j85K34N01K10
$$ 136 363 425 354 -176 -4 444 460 33 -88 -334 92 -6 -273 22 434 490 49 -280 -465 -231 270 480
4243D80l39m11J05K97N76o38o46M85M42J40o22k57O04j19k37k50J13K08Q8R5j4
$$ 480 141 -270 -165 132 708 70 -576 -91 351 491 -131 -388 216 97 -140 -390 -277 -69 19 114 100
4264A00p18m6N55KJ08l45l10L86L89m55j20m7M72Nj76Lk72j61N11M03j30p40K7
$$ 100 -618 -664 -109 -107 1 -344 -654 -268 121 -334 -454 -501 -29 -24 -200 -197 -469 -630 -119 284 154 -586 -559
4287e59N86J6m02k85N56N58O0p61m22K11N07J98j12m90m28J70P18M34p48k36J28
$$ -559 27 43 -359 -644 -88 470 530 -231 -653 -442 65 263 151 -339 -767 -597 121 555 -193 -429 -301
4308c01P42j95m21k10K63N91l98l52M55j73N32L60n26m85j87J134q4q9r70Q1O17
$$ -301 441 246 -175 -385 -122 469 71 -281 174 1 533 893 367 -118 -305 829 745 656 -314 -233 384
4329C84L13m02n22k15M98N02j66j71p22N26M08k2l71j26L9N11N0n60j20M11O82
$$ 384 697 295 -227 -442 56 558 392 221 -501 25 433 411 40 -86 -47 464 514 -46 -166 245 927
4350I27m29q21j51J03J015K66n47o30m16P58R05m37o10l41J74Q28m43j74j08K36
$$ 927 498 -323 -474 -371 644 910 363 -267 -683 75 980 543 -67 -408 -234 594 151 -23 -131 105
4370A05M42m67l60K10L35K96j15p40m50N08O44K73r14o76L09Q56K8l94o97J69
$$ 105 547 80 -280 -70 265 561 446 -294 -744 -236 408 681 -233 -909 -600 256 284 -110 -807 -638
4390f38N61L82n0n22r6J59K09l40j21o1M13L53m72m34J89K68P50m9q98l8M11N46
$$ -638 -77 305 255 -267 -363 -204 5 -335 -456 -517 -104 249 -223 -657 -468 -200 550 501 -397 -435 -24 522
4412E22L72q38l77M2N97N55m01l78J2J33N3K1l89K01O6r4m90m59L50O27J60m95
$$ 522 894 56 -321 -279 318 873 472 94 106 239 292 313 -76 125 191 97 -393 -852 -502 125 285 -210
4434b10m29j63P31K91o3l82o78O87M57R7p08J55M87N26n8n76j0O23K18J02o29
$$ -210 -639 -802 -71 220 157 -225 -903 -216 241 338 -370 -215 272 798 740 164 154 777 995 1097 468
4455D68p32Q22P47m36q03K29O8O03J16q30m61K3O04L17m57o39p1M84K24m2l52
$$ 468 -264 558 1305 869 66 295 363 966 1082 252 -209 -186 418 735 278 -361 -432 52 276 234 -118
4476a18n48M4P64l90k51N2L46L46l68k49P4L99O14n4q10l04O22N12J95l81p26
$$ -118 -666 -622 142 -248 -499 -447 -101 245 -123 -372 -298 101 715 661 -149 -453 169 681 876 495 -231
4497b31N4O88K33m62n72J36L65M59m34p59J36N37nn0m47j03N81R5l60n95J5N20
$$ -231 -177 511 744 282 -290 -154 211 670 236 -523 -387 150 145 95 -352 -455 126 221 -139 -734 -719 -199
4519a99O01o23o82k27R08L76j60p23k08M24L23M74k68p22K03O56J88m24l93K05
$$ -199 402 -221 -903 -1130 -222 154 -6 -729 -937 -513 -190 284 16 -706 -503 153 341 -83 -476 -271
4539b71O32J08o59m46L72N71J63j75p37m6P35K33j29j017J60L44O26l66n10o8
$$ -271 361 469 -190 -636 -264 307 470 295 -442 -488 247 480 351 -666 -506 -162 464 98 -412 -480
4559d80R7Q02l52k72p7j32N82M5m08R9J20K76k6m65l19M25L03L35l32q14R8Q56
$$ -480 -383 419 67 -205 -282 -414 168 213 -195 -96 24 300 274 -191 -510 -85 218 553 221 -593 -495 361
4581C61M87n13r2m09J89M15K30n59J7j36M38m79m6j49O64L15m03p48k04Q55K45
$$ 361 848 335 243 -166 23 438 668 109 126 -10 428 -51 -97 -246 418 733 330 -418 -622 233 478
4602D78k79k42o58M75O88K56k56r49K57N49K56l33m88j41O31K38n57l79M23K80
$$ 478 199 -43 -701 -226 462 718 462 -487 -230 319 575 242 -246 -387 244 482 -75 -454 -31 249
4622B49j67j85l74L68K50O6j36n95k23L12P82k06n79m29Q87K74j50k66l97K92
$$ 249 82 -103 -477 -109 141 207 71 -524 -747 -435 347 141 -438 -867 20 294 144 -122 -519 -227
4642b27j19N96l06j19J10J25k87j70J70J9M90L01p65m84K71N72Q2k12p7l25J73
$$ -227 -346 250 -56 -175 -65 60 -227 -397 -227 -208 282 583 -182 -666 -395 177 259 47 -30 -355 -182
4663a82o0J57m17K34j11K75M00l59j63j05M75k82l8l39N10O58m68m96NL94J03
$$ -182 -242 -85 -502 -268 -379 -104 296 -63 -226 -331 144 -138 -176 -515 -5 653 185 -311 -306 88 191
4684A91J8K64m76L5L26L24k47p14o4O51N08l24m16k4o4K22k2J20k27J34J26Q2
$$ 191 209 473 -3 32 358 682 435 -279 -343 308 816 492 76 52 -12 210 188 308 81 215 341 423
4706D23m14k3K52L14K56r59k22L29O91n40J7o3Q2K94m08M46o83J5J60M20L73o39
$$ 423 9 -14 238 552 808 -151 -373 -44 647 107 124 61 143 437 29 475 -208 -193 -33 387 760 121
4728A21m64M03L77r2o84J70K81P7r8n20P39m18n6J70K7j47k2K85J04l22q05L33
$$ 121 -343 60 437 345 -339 -169 112 189 91 -429 310 -108 -164 6 33 -114 -136 149 253 -69 -874 -541
4750e41N26K71l54j68J79k40MK6O0L50n05K1L07j04qm1K59q3m31m1N61K55m60
$$ -541 -15 256 -98 -266 -87 -327 -323 -297 -237 113 -392 -371 -64 -168 -176 -217 42 -41 -472 -513 48 303 -157
4773a57n50M81L09q7R4k57L9n94R0O48J55m02n25O25L90o71o3O35O8l04j66K73
$$ -157 -707 -226 83 -4 90 -167 -128 -722 -632 16 171 -231 -756 -131 259 -412 -475 160 228 -76 -242 31
4795C1K60l31k12M62k63j83M30K27K5m63o78M43L89P7n7K2J15o06m35R66M77n14
$$ 31 291 -40 -252 210 -53 -236 194 421 446 -17 -695 -252 137 214 157 179 294 -312 -747 219 696 182
4817A82l79N85k4l5n4m85P21l33k20M16J70J05l75l22M34j64j43K72M26q9p82
$$ 182 -197 388 364 329 275 -210 511 178 -42 374 544 649 274 -48 386 222 79 351 777 688 -94
4838i4J9L86K74k53l57L06K82n71K94J06n59q1K31N59M4n79j3L09J16m06k01Q68
$$ -94 -75 311 585 332 -25 281 563 -8 286 392 -167 -248 -17 542 586 7 -6 303 419 13 -188 680
4860F80O4k69o68j30L98N16r0J81j20n08j88M55J32q30J39J47K57k15k37K20p8
$$ 680 744 475 -193 -323 75 591 501 682 562 54 -134 321 453 -377 -238 -91 166 -49 -286 -66 -144
4881a44k71Q0J45k37J92m5j54l3P9k39N93J99j45n32k01L73J38J06M6j03r9l1
$$ -144 -415 -335 -190 -427 -235 -280 -434 -467 -388 -627 -34 165 20 -512 -713 -340 -202 -96 -50 -153 -252 -283
4903b83J06J27m56p0L15M74j92m52PK46K2k60j04K02K17r9o6j2k0L09J5o5k16
$$ -283 -177 -50 -506 -576 -261 213 21 -431 -424 -178 -156 -416 -520 -318 -101 -200 -266 -278 -298 11 26 -39 -255
4926b55K12n9K20k1k73j7K35K43j74k31K13j66K20k22J75K47Lr7Q9j26m01p2J08
$$ -255 -43 -102 118 97 -176 -193 42 285 111 -120 93 -73 147 -75 100 347 350 253 342 216 -185 -257 -149
4949a49M74m7l36p3J07L06k7k14L68q9J56k2l09j03J95J7P8K04n58L12L30n66
$$ -149 325 278 -58 -131 -24 282 255 41 409 320 476 454 145 42 237 254 332 536 -22 290 620 54
4971E4J62k03L82p0m54J37p5N44k93J20n11L0J25K77J52j27k49m64R6N44O2p4
$$ 54 216 13 395 325 -129 8 -67 477 184 304 -207 -177 -52 225 377 250 1 -463 -367 177 239 165
4993A65k31J42K3n3k45J40K45j22q6j87J84K77p5K03o87k6K03N05m10j68l01L20
$$ 165 -66 76 99 46 -199 -59 186 64 -22 -209 -25 252 177 380 -307 -333 -130 375 -35 -203 -504 -184
5015a84M9J40j89n4k08J43J57k2j66j49M76k76P7j57K24M35j83l32m13J88R51
$$ -184 -135 5 -184 -238 -446 -303 -146 -168 -334 -483 -7 -283 -206 -363 -139 296 113 -219 -632 -444 507
5036E07j75m94j29m36K63M99p5j15l59L7K0K50K33j62n0m7L9k48J71K87J19j99
$$ 507 332 -162 -291 -727 -464 35 -40 -155 -514 -477 -457 -207 26 -136 -186 -233 -194 -442 -271 16 135 -64
5058f4k3k56L06N2M04n23O3j28j69O23k89Q1l46M6K93N0K44l83J36k62N39j71
$$ -64 -87 -343 -37 15 419 -104 -41 -169 -338 285 -4 77 -269 -223 70 120 364 -19 117 -145 394 223
5080B23k69N19l02N5l12J1N04k9J70n52j64L20N20l56J58n43o0N66l1q8q5n8m7
$$ 223 -46 473 171 226 -86 -75 429 400 570 18 -146 174 694 338 496 -47 -107 459 428 340 255 197 150
5103A50j61L88k91l23M43n9m39j56M19J85L35l14k38j19l5L21L99m96j37J7K74
$$ 150 -11 377 86 -237 206 147 -292 -448 -29 156 491 177 -61 -180 -215 106 505 9 -128 -111 163
5124A63j85q6J05L9n2L27j33%J90k89K1K4j00k22j6J18n4l58J42K84K43n80J62
$$ 163 -22 -108 -3 36 -16 311 178 178 368 79 100 124 24 -198 -214 -96 -150 -508 -366 -82 161 -419 -257
5147b57l92K89J90K28m73R2j01k4M79q8k2l97L35K75p1j70K79k23o8M8o1L08m11
$$ -257 -649 -360 -170 58 -415 -323 -424 -448 31 -57 -79 -476 -141 134 63 -107 172 -51 -119 -71 -132 176 -235
5170b35M15n0p6o8n8J07M0j60l15L05l03K70j28j05l2K46j17o2j11K52J0L12J6
$$ -235 180 130 54 -14 -72 35 75 -85 -400 -95 -398 -128 -256 -361 -393 -147 -264 -326 -437 -185 -175 137 153
5193A53q2l17J51j19J10jR3P0L80n16j26K05L53k4p4l12J31K36j6K08o1j54l75
$$ 153 71 -246 -95 -214 -104 -105 -12 58 438 -78 -204 1 354 330 256 -56 75 311 295 503 442 288 -87
5216h7M00m3j89R8P3k09K8J00k68L98m3O0j98rj63M28O7k44m97K08N3L83k61l30
$$ -87 313 270 81 179 252 43 71 171 -97 301 258 318 120 111 -52 376 443 199 -298 -90 -37 346 85 -245
5240b45K61J09K35J18k99j51o8j41M12r2M7j82J80l40N9j54K06J88P6m07j30K9
$$ -245 16 125 360 478 179 28 -40 -181 231 139 186 4 184 -156 -97 -251 -45 143 219 -188 -318 -289
5262b89J59O12n02k33n65P07J4N52j93p14J29K58L3j87R2M1K79l02j12l91O92
$$ -289 -130 482 -20 -253 -818 -111 -97 455 262 -452 -323 -65 -32 -219 -127 -86 193 -109 -221 -612 80
5283H0K14k69l02L5MK00J83j42j75m29N19M46m49l87o1J98N85k24j55k84L28q6
$$ 80 294 25 -277 -242 -238 -38 145 3 -172 -601 -82 364 -85 -472 -533 -335 250 26 -129 -413 -85 -171
5305a71J13k17O7L94l52K29k63k33M92O67k16r01QK96M12L62l61m89K15K02K55
$$ -171 -58 -275 -208 186 -166 63 -200 -433 59 726 510 -391 -383 -87 325 687 326 -163 52 254 509
5326E09j19k44j02M5M65k37l05J1M40N5k26n3l03J62pj14J84k44M8J68N14o99
$$ 509 390 146 44 89 554 317 12 23 463 518 292 239 -64 98 91 -23 161 -83 -35 133 647 -52
5348e2k61j49N44M76l08l02k27N09J3J1j65n3j15N89k57k29l19N07L03l64j92
$$ -52 -313 -462 82 558 250 -52 -279 230 243 254 89 36 -79 510 253 24 -295 212 515 151 -41
5369d1j70K28M68j7r77N8M94N06m42j62j57k87O01K81j95l50p8J57N02n75k80
$$ -41 -211 17 485 468 -509 -451 43 549 107 -55 -212 -499 102 383 188 -162 -240 -83 419 -156 -436
5390d36L8M36K73n74m6J73J19p6j66J17K68k76r8M25m06l34L56M77o8k90m52M55
$$ -436 -398 38 311 -263 -309 -136 -17 -93 -259 -142 126 -150 -248 177 -229 -563 -207 270 202 -88 -540 -85
5412h5M22l79n00J66K10L55j88J1k5n19K72M7Q7k26J23K70J02l31l77J74O19r4
$$ -85 337 -42 -542 -376 -166 189 1 12 -13 -532 -260 -213 -126 -352 -229 41 143 -188 -565 -391 228 134
5434A34n2p9l34K39K08J91K8m64k30N95K92j40r49L30P37K5p35J03K81K7Rl62
$$ 134 82 3 -331 -92 116 307 335 -129 -359 236 528 388 -561 -231 506 531 -204 -101 180 207 216 -146
5456a46J67RlK83%m09l64M71L96n6p96l00R00M49m14n65K96K79kj30j0P6j06l1
$$ -146 21 30 27 310 310 -99 -463 8 404 348 -448 -748 152 601 187 -378 -82 197 195 65 55 131 25 -6
5480fp8L14j35M5L65J90q08j35J56Q50p9m08m93J16J98j95N13l90l72M17L62k81
$$ -6 -84 230 95 140 505 695 -113 -248 -92 758 679 271 -222 -106 92 -103 410 20 -352 65 427 146
5502A46k46j77K29L77l36n84N76J56p5n4l99L37J08j2O2m93N2l48O42K86l75n14
$$ 146 -100 -277 -48 329 -7 -591 -15 141 66 12 -387 -50 58 46 108 -385 -333 -681 -39 247 -128 -642
5524f42N06M51k79k31j16K26J74J03n09K06r1n6J13j01p5l98N32N96p0r47r1M29
$$ -642 -136 315 36 -195 -311 -85 89 192 -317 -111 -202 -258 -145 -246 -321 -719 -187 409 339 -608 -699 -270
5546b70L32m2j93l11M97L1k08k4J48j27K71N6n11l1N12K95k11m00k13K82M46n4
$$ -270 62 20 -173 -484 13 44 -164 -188 -40 -167 104 160 -351 -382 130 425 214 -186 -399 -117 329 275
5568B75k94j48K64r4L46R8j50k75o1J81L99n10LK52K53k97k05K01J28J71n12J43
$$ 275 -19 -167 97 3 349 447 297 22 -39 142 541 31 34 286 539 242 37 238 366 537 25 168
5590A68j76J82J59l80K33l8m38O28J96m16k86J79K68k80n2j9K11j44LR1O2j86
$$ 168 -8 174 333 -47 186 148 -290 338 534 118 -168 11 279 -1 -53 -72 139 -5 -2 89 151 -35
5612c5K22J44L9k29Q0K65j72p5k50j1L30J20j77j7k75O2J3M07p48L13j49K3L29
$$ -35 187 331 370 141 221 486 314 239 -11 -22 308 428 251 234 -41 21 34 441 -307 6 -143 -120 209
5635B09k61j38k81N17q1k44N8M49l45J5q2L12j27j2K52n25nJ04k2K27N9o02J5
$$ 209 -52 -190 -471 46 -35 -279 -221 228 -117 -102 -184 128 1 -11 241 -284 -289 -185 -207 20 79 -523 -508
5658e08K97p3J41l10j55M12J26k29K18K2j00j42J92k94M18J70m2l00N8j69L63
$$ -508 -211 -284 -143 -453 -608 -196 -70 -299 -81 -59 -159 -301 -109 -403 15 185 143 -157 -99 -268 95
5679I5LN6k97j42K15N41m12j03k40L38j3j85R7M20q1l52%R3qJ73J7q2m67R2J73
$$ 95 98 154 -143 -285 -70 471 59 -44 -284 54 41 -144 -47 373 292 -60 -60 33 25 198 215 133 -334 -242 -69
5704f9J43j79j9J55j27J08kK06j85j93l02K75M74o6l0l62j27N16J03m21K33j31
$$ -69 74 -105 -124 31 -96 12 10 216 31 -162 -464 -189 285 219 189 -173 -300 216 319 -102 131 0
5726@K41j95k72L09L32q2k35j08k9O8K85q8r3j58K46L25k18j67k86k64O40j9j37
$$ 0 241 46 -226 83 415 333 98 -10 -39 29 314 226 133 -25 221 546 328 161 -125 -389 251 232 95
5749I5k53K75q6l33L65k24L07j4Q3l56Q9k11O27k54j53r1J12l37L29j3K13n32
$$ 95 -158 117 31 -302 63 -161 146 132 215 -141 -52 -263 364 110 -43 -134 -22 -359 -30 -43 170 -362
5771c62n2K37J22J14r1k72j07K86j48O2K48P4n17M8l0K2M37r6k40J30pJ04j45
$$ -362 -414 -177 -55 59 -32 -304 -411 -125 -273 -211 37 111 -406 -358 -388 -366 71 -25 -265 -135 -142 -38 -183
5794a83K6j39N6k10P1K47J29j20M1n77M11L91j37j02k42Q7j09L88m69M95l6pk74
$$ -183 -157 -296 -240 -450 -379 -132 -3 -123 -82 -659 -248 143 6 -96 -338 -251 -360 28 -441 54 18 11 -263
5817b63K06N7m6P2O2j56qJ29L00l0J07l03j2k7jJ01N0j92J70J51k40K79j25k35
$$ -263 -57 0 -46 26 88 -68 -76 53 353 323 430 127 115 88 87 188 238 46 216 367 127 406 281 46
5841D6J7J31j26KJ99k09P8o9j36j46M09K39l87k5l25L38L59m65j47L52j22K08
$$ 46 63 194 68 70 269 60 138 69 -67 -213 196 435 48 23 -302 36 395 -70 -217 135 13 221
5863B21K62m49J02J36K14l48J07l31J54K55k08L99m30J82N5j27n6m83N71q9K77
$$ 221 483 34 136 272 486 138 245 -86 68 323 115 514 84 266 321 194 138 -345 226 137 414
5884D14n23r1L07K64k39j9m28K30J07J28m8j36k93J41J91J1l0j18P0Oj92K7P4
$$ 414 -109 -200 107 371 132 113 -315 -85 22 150 102 -34 -327 -186 5 16 -14 -132 -62 -56 -248 -221 -147
5907a47J81m0k73K91o6k14K79j37J28l3j13J38L71m06l5L0O2K91k29k96l23M07
$$ -147 34 -6 -279 12 -54 -268 11 -126 2 -31 -144 -6 365 -41 -76 -46 16 307 78 -218 -541 -134
5929a34J14K60n3j0l50k04K75k10j55M40L40l74j58P3J74K03l14k42Q2l09M61
$$ -134 -20 240 187 177 -173 -377 -102 -312 -467 -27 313 -61 -219 -146 28 231 -83 -325 -243 -552 -91
5950i1L60J01m95p0j25J78N10k05m6o8R7k05j99O51j71k74R0r1k17J25N02j11
$$ -91 269 370 -125 -195 -320 -142 368 163 117 49 146 -59 -258 393 222 -52 38 -53 -270 -145 357 246
5972B46k33j51L27L10l82m2j38O8L73l08J90k6j01L0j82J40k18J29J86r8M6k06
$$ 246 13 -138 189 499 117 75 -63 5 378 70 260 234 133 163 -19 121 -97 32 218 120 166 -40
5994d0Q8O5L49k81m39J74K95L28m96K4k99J31K07J3n1q7j5j31J52r1p0J7N12n95
$$ -40 48 113 462 181 -258 -84 211 539 43 67 -232 -101 106 119 68 -19 -34 -165 -13 -104 -174 -157 355 -240
6018b40J24l18J61L35K24j22k77R7k32L40j5r7j76K50J22J10l64J01n03N12K00
$$ -240 -116 -434 -273 62 286 164 -113 -16 -248 92 77 -20 -196 54 176 286 -78 23 -480 32 232
6039B32k20j70J19P4%j40J36l21K95J31j20k15j17K65K00m66k20L37N01j52l79
$$ 232 12 -158 -39 35 35 -105 31 -290 5 136 16 -199 -316 -51 149 -317 -537 -200 301 149 -230
6060b30k6j80L27j07M55R8l17j54RK07j68o6M74K13l27l31K2L27n5l3J19k29J35
$$ -230 -256 -436 -109 -216 239 337 20 -134 -125 82 -86 -152 322 535 208 -123 -101 226 171 138 257 28 163
6083A63j70M34j92k90M0J86N21m27p5j36K30J73m65J3L67l32j6j3k0J99o12O41
$$ 163 -7 427 235 -55 -15 171 692 265 190 54 284 457 -8 5 372 40 24 11 -9 190 -422 219
6105B19j60K80n40J91J51M37l48m17L98Q9J23k59j75j20K97k3Q7k55K0k43K33
$$ 219 59 339 -201 -10 141 578 230 -187 211 300 423 164 -11 -131 166 143 230 -25 -5 -248 -15
6126a5K72m09l3l6N32o25P6j56M02R7n83M60o1l3k7N3l75O1K36L1L03j14l72J10
$$ -15 257 -152 -185 -221 311 -314 -238 -394 8 105 -478 -18 -79 -112 -139 -86 -461 -400 -164 -133 170 56 -316 -206
6150b06L47L17m80j96M05k50m17L88Q6j16K2Q2K52k53l26rL96O9p59L41L41k6
$$ -206 141 458 -22 -218 187 -63 -480 -92 -6 -122 -100 -18 234 -19 -345 -354 42 111 -648 -307 34 8
6172Hn6j75K84k48l84L45J96O4l99L66j79N55l12j00K35j12m5%p7OK72o70M49
$$ 8 -48 -223 61 -187 -571 -226 -30 34 -365 1 -178 377 65 -35 200 88 43 43 -34 -28 244 -426 23
6195B3J06j12J83K21l20m74K53J11L11k52m70M21M43n18P2q7L17k34l8L7J98m0
$$ 23 129 17 200 421 101 -373 -120 -9 302 50 -420 1 444 -74 -2 -89 228 -6 -44 -7 191 151
6217A51J5rk93J07O9M50l4k80k03l20O88K50l88J9p2N5N8l1K77l29l17K81K90
$$ 151 166 157 -136 -29 40 490 456 176 -27 -347 341 591 203 222 150 205 263 232 509 180 -137 144 434
6240D34k35j05j63L76M8m70J35O3J69jl13k18Q9K36k17K72l00l3J96M3N4p22N63
$$ 434 199 94 -69 307 355 -115 20 83 252 251 -62 -280 -191 45 -172 100 -200 -233 -37 6 60 -662 -99
6263i9p4J13j34j20K04j28L16l8j34N0l47K90J22k19J28J03N8r0k24l62P3L70
$$ -99 -173 -60 -194 -314 -110 -238 78 40 -94 -44 -391 -101 21 -198 -70 33 91 1 -223 -585 -512 -142
6285a42n7J00j42k31K05K63k32J06j95J64O7J07j54N1N1KJ92l50j1L18o6l35J
$$ -142 -199 -99 -241 -472 -267 -4 -236 -130 -325 -161 -94 13 -141 -90 -39 -37 155 -195 -206 112 46 -289 -288
6308b88J81k46J16K01r0l41K18J92o7j39k52L41J97J51j84J95l16k0M02k99o9
$$ -288 -107 -353 -237 -36 -126 -467 -249 -57 -124 -263 -515 -174 23 174 -10 185 -131 -151 251 -48 -117
6329a17K93k26L44l76N7M4K88K67n89j47J26j32N54k04r2O5N1OO0k39O1j42k9
$$ -117 176 -50 294 -82 -25 19 307 574 -15 -162 -36 -168 386 182 90 155 206 212 272 33 94 -48 -77
6352g7K41j73J29m2r1K38K24j96J9j25j90m4O2P6n1j09L73j20j10m7N7j29J89
$$ -77 164 -9 120 78 -13 225 449 253 272 147 -43 -87 -25 51 0 -109 264 144 34 -13 44 -85 104
6375A04l33j14L56K43l33j74L6K03q5k6R3J48k9R2n06L37p6K63L6q1m29J8K27
$$ 104 -229 -343 13 256 -77 -251 -215 -12 -97 -123 -30 118 89 181 -325 12 -64 199 235 154 -275 -257 -30
6398c0K11J3j06j45j10K27p0R1j93J62J0K1J25p31M50q0P0j49j05L7K64j10k1
$$ -30 181 194 88 -57 -167 60 -10 81 -112 50 60 81 206 -525 -75 -155 -85 -234 -339 -302 -38 -148 -169
6421a69j23K87j47J49j42r7n6O9L57j03q6k09n0K93lp3j89J93qO9J04p5J84j74
$$ -169 -292 -5 -152 -3 -145 -242 -298 -229 128 25 -61 -270 -320 -27 -30 -103 -292 -99 -107 -38 66 -9 175 1
6445AJ24o59K01L78Q5Kp0o8j67J77J91p1k56K24k60K82R4r2j58K0L31k78L7O8
$$ 1 125 -534 -333 45 130 132 62 -6 -173 4 195 124 -132 92 -168 114 208 116 -42 -22 309 31 68 136
6469A36J96l1l85j46J3J03L16K80o23O0J28M44l44J08j28J82J14m5l2j76oJ60
$$ 136 332 301 -84 -230 -217 -114 202 482 -141 -81 47 491 147 255 127 309 423 378 346 170 164 324
6491C24j1Pk91J91J40j14J4n06J09O25N2n33J79m88K58J73K2j97k95J26J60J44
$$ 324 313 320 29 220 360 246 260 -246 -137 488 540 7 186 -302 -44 129 151 -46 -341 -215 -55 89
6513H9j96m3J99p5j90J45j4J01J60j59k25L01l09K83J78m93J15J60k41L22k05
$$ 89 -107 -150 49 -26 -216 -71 -85 16 176 17 -208 93 -216 67 245 -248 -133 27 -214 108 -97
6534i7k26J63O3J24o6L5j16R7j8k60J74j8k11K47J95J16l51k57K64N1k07J00K95
$$ -97 -323 -160 -97 27 -39 -4 -120 -23 -41 -301 -127 -145 -356 -109 86 202 -149 -406 -142 -91 -298 -198 97
6557I7l00K72j10l07j1M30J79k05j26j76m7R8K04K2j47K79j75lk4N2k64M17j64
$$ 97 -203 69 -41 -348 -359 71 250 45 -81 -257 -304 -206 -2 20 -127 152 -23 -26 -50 2 -262 155 -9
6580iJ20p1l56N56k39L9l2k07K63j31J07k16O3J09o3Lm9l53M81J37j12k31K22
$$ -9 111 40 -316 240 1 40 8 -199 64 -67 40 -176 -113 -4 -67 -64 -113 -466 15 152 40 -191 31
6603C1L1j58K35j56J43j28J03n9J38j93M75o13L92l00k61J13J62l3N26p64L9K15
$$ 31 62 -96 139 -17 126 -2 101 42 180 -13 462 -151 241 -59 -320 -207 -45 -78 448 -316 -277 -62
6625f2L09k19j18K7q0K27m2j80N0J65j6j63L20k9k9m1j96K09p5k71J97K9l65L4
$$ -62 247 28 -90 -63 -143 84 42 -138 -88 77 61 -102 218 189 160 119 -77 132 57 -214 -17 12 -353 -319
6649c19K48Oj46j3M40m22M3K92N6q7K4m04m8oJ79M67m23J44l44p2K85L6r0J76
$$ -319 -71 -65 -211 -224 216 -206 -163 129 185 98 122 -282 -330 -336 -157 310 -113 31 -313 -385 -100 -64 -154 22
6673B2j38j16K0k02L01j57J55p5n3L74R7m09o6J85j47J47L57m39J19l61K01K14
$$ 22 -116 -232 -212 -414 -113 -270 -115 -190 -243 131 228 -181 -247 -62 -209 -62 295 -144 -25 -386 -185 29
6695B9P0R0j38l33m8L13j96L15J77m06k5K65J18k92l6M76m30q9N52k35N8r2j91
$$ 29 99 189 51 -282 -330 -17 -213 102 279 -127 -152 113 231 -61 -97 379 -51 -140 412 177 235 143 -48
6718d8p2L13OJ31j65j36J50k23J38j75q1K58P1J50j36j89R6n1l10K69J70J88O7
$$ -48 -120 193 199 330 165 29 179 -44 94 -81 -162 96 167 317 181 -8 88 37 -273 -4 166 354 421
6741D21l87l26M79j82R8o9M54l52m35O7L19r5O5j10MJ9J08m0J23p8j35K44k04
$$ 421 34 -292 187 5 103 34 488 136 -299 -232 87 -8 57 -53 -49 -30 78 38 161 83 -52 192 -12
6764a2r0L8o0K46k13R1K2J05L30m16M9j02K82m37j69R1K92l41M46m07R1q8K36
$$ -12 -102 -64 -124 122 -91 0 22 127 457 41 90 -12 270 -167 -336 -245 47 -294 152 -255 -164 -252 -16
6787a6L70k94n21J68L28j01k44j02L81j59Q3j31k16L65j47L0M20k33m55J71m9
$$ -16 354 60 -461 -293 35 -66 -310 -412 -31 -190 -107 -238 -454 -89 -236 -206 214 -19 -474 -303 -352
6808c52K32q0k59K39K31j96j3M37j75k58k47M49m9K70l42K00j09j61p6N88Q9m13
$$ -352 -120 -200 -459 -220 11 -185 -198 239 64 -194 -441 8 -41 229 -113 87 -22 -183 -259 329 418 5
6830El24L70K31k50m4k11K21J94j63k1Q8k21l28M85K02r0l4k15L39j61j33J90
$$ 5 -319 51 282 32 -12 -223 -2 192 29 8 96 -125 -453 32 234 144 110 -105 234 73 -60 130
6852A30J45J12l93n2J6m9J17J91n5k49K41k02M14P3n83K65N6j8J87n86L30j52
$$ 130 275 387 -6 -58 -42 -91 26 217 162 -87 154 -48 366 439 -144 121 177 159 346 -240 90 -62
6874f2r3K56j4L51l41o8l9l12p6K61K18j3M3l64L71J32k12j92k0L97m65N58k54
$$ -62 -155 101 87 438 97 29 -10 -322 -398 -137 81 68 111 -253 118 250 38 -154 -174 223 -242 316 62
6897F2N5j26l66K51K97r6k60O5J08k6n53N95L88k23m09n9K8K70O2j02J19l85M6
$$ 62 117 -9 -375 -124 173 77 -183 -118 -10 -36 -589 6 394 171 -238 -297 -269 1 63 -39 80 -305 -259
6920b59R2n7P2r9J23M2K33j73j15K21r4J57k89k19J76K31j1j92M3j95K64M05m76
$$ -259 -167 -224 -152 -251 -128 -86 147 -26 -141 80 -14 143 -146 -365 -189 42 31 -161 -118 -313 -49 356 -120
6943a20p3j6L55ln0m04P5K95q1l1L7J69pj59M5J39l44K33M30j15m38k24M39p5
$$ -120 -193 -209 146 143 93 -311 -236 59 -22 -53 -16 153 146 -13 32 171 -173 60 490 375 -63 -287 152 77
6967G7o4O4m1L6lJ63l22L9k2m16P90l37j14j42M17n1k48r8M40P8p2Q3l93oJ15
$$ 77 13 77 36 72 69 232 -90 -51 -73 -489 301 -36 -150 -292 125 74 -174 -272 168 246 174 257 -136 -142 -27
6992b7K92j4m71L5M59r6J47j93j46J91j29J74r1k47J56K59r0j22j15m2O8J97j87
$$ -27 265 251 -220 -185 274 178 325 132 -14 177 48 222 131 -116 40 299 209 87 -28 -70 -2 195 8
7015HJ95rn5J44m67j59L16M42k59J51m70LJ38P1L4N9k19J8r8k6n5n2N32l52m9
$$ 8 203 194 139 283 -184 -343 -27 415 156 307 -163 -160 -22 49 83 142 -77 -59 -157 -183 -238 -290 242 -110 -159
7040a59j19k0J99n0j48o3p0L12k13L69l3k47L58L4J02m18k74R0r9P07n16J23j06
$$ -159 -278 -298 -99 -149 -297 -360 -430 -118 -331 38 5 -242 116 150 252 -166 -440 -350 -449 258 -258 -135 -241
7063b41L23m2j68j19R0J88r9J02k21P4n6K2L80k19l96J84L26K42j66l12k54L85
$$ -241 82 40 -128 -247 -157 31 -68 34 -187 -113 -169 -147 233 14 -382 -198 128 370 204 -108 -362 23
7085B3J3P4k07%J06K97j08j38J1p4j78O7K1K02J17J56j8m34n5L34K96k60k79q1
$$ 23 36 110 -97 -97 9 306 198 60 71 -3 -181 -114 -93 109 226 382 364 -70 -125 209 505 245 -34 -115
7109a15K81j4K96n22Q9J66J05K8r3k38o2R2j94J97J81k58J16K21m29K96j32J45
$$ -115 166 152 448 -74 15 181 286 314 221 -17 -79 13 -181 16 197 -61 55 276 -153 143 11 156
7131A56K0J10m36l0K42J74J11l72p7J72l10L13o7p4K33j64Q1L15n21O2l9lJ56
$$ 156 176 286 -150 -180 62 236 347 -25 -102 70 -240 73 6 -68 165 1 82 397 -124 -62 -101 -104 52
7154E2j10K08k37J1L1k20K74k92L68K00k91j87J48j8rk4m2k03J85K79l30q9J17
$$ 52 -58 150 -87 -76 -45 -265 9 -283 85 285 -6 -193 -45 -63 -72 -96 -138 -341 -156 123 -207 -296 -179
7177a79R8J31p3k18q4K16L63n41L79l41M53j00l65Mo8K25L92k12Kql57M01k42
$$ -179 -81 50 -23 -241 -325 -109 254 -287 92 -249 204 104 -261 -257 -325 -100 292 80 82 74 -283 118 -124
7200a24P0P0l40K62P2j76j24L02j04O5K0J31j08J61q7R8m99N72l70K1K76j72M1
$$ -124 -54 16 -324 -62 10 -166 -290 12 -92 -27 -7 124 16 177 90 188 -311 261 -109 -88 188 16 57
7223E7J89k21O7p6K60Q8j69J97j84j74o9K45k12j12L60j17K09j81J29J17j92P4
$$ 57 246 25 92 16 276 364 195 392 208 34 -35 210 -2 -114 246 129 338 157 286 403 211 285
7245B85Kj07k96K15j1J90j58K14n28L5L27J39k50k14J2M3J9J62k29K58K0K50k88
$$ 285 287 180 -116 99 88 278 120 334 -194 -159 168 307 57 -157 -145 -102 -83 79 -150 108 128 378 90
7268I0K2k5j57N7j37j9K96j26j70p5L95k30j51K65n8k52M2K5K65K9l79K88l06
$$ 90 112 87 -70 -13 -150 -169 127 1 -169 -244 151 -79 -230 35 -23 -275 -233 -208 57 86 -293 -5 -311
7291c11O4K76j07K91k15k56L68k48K90l10J91p1k0m03K09L20l0o4P5l84J82M02
$$ -311 -247 29 -78 213 -2 -258 110 -138 152 -158 33 -38 -58 -461 -252 68 38 -26 49 -335 -153 249
7313B49m60RK86l27N47j06O5k91m13M06J75o58J39K72O3ml1L02l18j39J20M4M8
$$ 249 -211 -202 84 -243 304 198 263 -28 -441 -35 140 -518 -379 -107 -44 -48 -79 223 -95 -234 -114 -70 -22
7336b2R6J75j27pk71kK07N0p8N7M0j98K48J2j79L66k02J08o7l7k89L79k44k32
$$ -22 74 249 122 115 -156 -158 49 99 21 78 118 -80 168 180 1 367 165 273 206 169 -120 259 15 -217
7360b17J77K39k39L78j63j61J60n5L13k93K89j13K09n17J65K5J69l56J42J62l82
$$ -217 -40 199 -40 338 175 14 174 119 432 139 428 315 524 7 172 197 366 10 152 314 -68
7381f8J51j62p2M36n42J48J06O5o4j23R0K99k32J54K9l53K75k53J99l00J71r9
$$ -68 83 -79 -151 285 -257 -109 -3 62 -2 -125 -35 264 32 186 215 -138 137 -116 83 -217 -46 -145
7403a45K49j65J33l28L65k55k5k00M84k20K96k56J58r4j67J33K9J09K04k59k66
$$ -145 104 -61 72 -256 109 -146 -171 -371 113 -107 189 -67 91 -3 -170 -37 -8 101 305 46 -220
7424b20J5J33j89K55J86j70j88n7n7L55l07K74K0j07j7%k31R8K8L0j36L52O4n88
$$ -220 -205 -72 -261 -6 180 10 -178 -235 -292 63 -244 30 50 -57 -74 -74 -305 -207 -179 -149 -285 67 131 -457
7448d57M65P9j79K01K56p11O8O3M23k78l93O08J9j45j47k54L39L56m93L67k00
$$ -457 8 87 -92 109 365 -346 -278 -215 208 -70 -463 145 164 19 -128 -382 -43 313 -180 187 -13
7469a3K27j13n3K27m28J1k4M60r5l11nJ01L68l61K20j24l17M40k18P7O6l29K87
$$ -13 214 101 48 275 -153 -142 -166 294 199 -112 -117 -16 352 -9 211 87 -230 210 -8 69 135 -194 93
7492I3k72L43K07k28J62k62L1l73J53L51J95l33M8k97K77L41n02K75k06k32M32
$$ 93 -179 164 371 143 305 43 74 -299 -146 205 400 67 115 -182 95 436 -66 209 3 -229 203
7513B03l1j14K01n8n3P1k36K7j08kP8K72k60m0L02j71k59j80R0J95N5L2L15m21
$$ 203 172 58 259 201 148 219 -17 10 -98 -100 -22 250 -10 -50 252 81 -178 -358 -268 -73 -18 14 329 -92
7537i2r5J97k78J35J65n9n3q9J24j7k05K40r1P4k18M26m4j32k81j9L7K48j22J46
$$ -92 -187 10 -268 -133 32 -27 -80 -169 -45 -62 -267 -27 -118 -44 -262 164 120 -12 -293 -312 -275 -27 -149 -3
7561ck38K59l3K01k64L27m67M02m21J36nk63L10J19K1k26J32m1J33J0k33nN21
$$ -3 -241 18 -15 186 -78 249 -218 184 -237 -101 -106 -369 -59 60 81 -145 -13 -54 79 89 -144 -149 372
7584C72n77K86P1m05j63L72L04j07l59J43m6J11M0k74K73R2k60Q2K99p1k11M1
$$ 372 -205 81 152 -253 -416 -44 260 153 -206 -63 -109 2 42 -232 41 133 -127 -45 254 183 -28 13
7606A3P0QP8o2m1K43j49j70K05n5n2K7J66k79J54j04ol7J05N6k68J63j12J98l15
$$ 13 83 91 169 107 66 309 160 -10 195 140 88 115 281 2 156 52 46 9 114 170 -98 65 -47 151 -164
7631a64j26L86L0o4K2R8l6j20Pj22O2K8M4j69n8J78M0M8K19j33l0k49J28Mj3K04
$$ -164 -290 96 126 62 84 182 146 26 33 -89 -27 1 45 -124 -182 -4 36 84 303 170 140 -109 19 23 10 214
7657B14k44K1K7K9p4k48L72J6j77J07o3J11j5j62J00j16k8n1O4J67k59J86J4L7
$$ 214 -30 -9 18 47 -27 -275 97 113 -64 43 -20 91 76 -86 14 -102 -130 -181 -117 50 -209 -23 -9 28
7681B8j98J26J86k6r5j20j18k9K99j11j36K70l43J61K05n0rk16K05J07k14r0K07
$$ 28 -170 -44 142 116 21 -99 -217 -246 53 -58 -194 76 -267 -106 99 49 40 -176 29 136 -78 -168 39
7704C9K59k23J1k25P5r5K48j02N5J48l57J1J39M63n51j17L4J76J56R3k09P4K34
$$ 39 298 75 86 -139 -64 -159 89 -13 42 190 -167 -156 -17 446 -105 -222 -188 -12 144 237 28 102 336
7727C36j89l3Nk89M27o5k0k19J57N8j14j20K12QL1K08m26oJ65J39q0J62k60j60
$$ 336 147 114 119 -170 257 192 172 -47 110 168 54 -66 146 154 185 393 -33 -39 126 265 185 347 87 -73
7751g3Q8J40k03K68j54jj48L1O7m7K34o6J46j42j36K06k04L00j80q5j46K02J2
$$ -73 15 155 -48 220 66 65 -83 -52 15 -32 202 136 282 140 4 210 6 306 126 41 -105 97 109
7774A09l49N01j53N0j37j36M11l80K04l7l00J84J51l83L60j83j10J2j0J47r6j0
$$ 109 -240 261 108 158 21 -115 296 -84 120 83 -217 -33 118 -265 95 -88 -198 -186 -196 -49 -145 -155
7796a55R0l49M17ML1M7k75r6J72j85K72rj46K75l26L37P5k16M7p5M6nk9O8l0m55
$$ -155 -65 -414 3 7 38 85 -190 -286 -114 -299 -27 -36 -182 93 -233 104 179 -37 10 -65 -19 -24 -53 15 -15 -470
7822d70L36J48j6K51l92q0K32r5k42J61L3K05Rk36M65j02m48K93m9J96l29L49
$$ -470 -134 14 -2 249 -143 -223 9 -86 -328 -167 -134 71 80 -156 309 207 -241 52 3 199 -130 219
7844B19K4j88Q8j68K29Q5k00j6o3l4J30k4R2k93L35mM9l58J28K70J38l68J25k66
$$ 219 243 55 143 -25 204 289 89 73 10 -24 106 82 174 -119 216 212 261 -97 31 301 439 71 196 -70
7868g0J79P0R9m63R0K29q0j62K88r8l1K65l40J93j65K14k00P1P1J01j26J92l61
$$ -70 109 179 278 -185 -95 134 54 -108 180 82 51 316 -24 169 4 218 18 89 160 261 135 327 -34
7891c4J88k9J34k76J52J73l18N7j47k1L75l14o2J01K36R8k56j51j36R2J22j11
$$ -34 154 125 259 -17 135 308 -10 47 -100 -121 254 -60 -122 -21 215 313 57 -94 -230 -138 -16 -127
7913a27Lk00K84n2p5J01k52L08K56J4o02L44l01J99J76J3k15o2K06K29k69k67
$$ -127 -124 -324 -40 -92 -167 -66 -318 -10 246 260 -342 2 -299 -100 76 89 -126 -188 18 247 -22 -289
7935b89K62O4j33J49j31N7j27L46m76J50j2J77L35m10J06k25L33k62J60k05k33
$$ -289 -27 37 -96 53 -78 -21 -148 198 -278 -128 -140 37 372 -38 68 -157 176 -86 74 -131 -364
7956c64L87n1k71J31J7J94q7J82l95j50L53J80J0o9l83J61K40Q3k71J69k08J0
$$ -364 23 -28 -299 -168 -151 43 -44 138 -257 -407 -54 126 136 67 -316 -155 85 168 -103 66 -142 -132
7978a32J76J38k87J09J82j82l2l37L00J58k47J30j5o6J33l0K5K06m96jJ67j16
$$ -132 44 182 -105 4 186 4 -28 -365 -65 93 -154 -24 -39 -105 28 -2 23 229 -267 -268 -101 -217
8000b17M19l62N3J95j02L19o43N67m9j34j80J56L2J76j42j87O7j9k06M47P3j15
$$ -217 202 -160 -107 88 -14 305 -338 229 180 46 -134 22 54 230 88 -99 -32 -51 -257 190 263 148
8022A48q7J59j17J86k31j20R5M1L4q8j11J77R6l20J28k8J59l24K28k06j90J7J94
$$ 148 61 220 103 289 58 -62 33 74 108 20 -91 86 182 -138 -10 -38 121 -203 25 -181 -371 -354 -160
8045a60L98k16m36M23o9J96m2l05N8o6J71k02p8J59J54Q5k02k01J68N0J80k6r1
$$ -160 238 22 -414 9 -60 136 94 -211 -153 -219 -48 -250 -328 -169 -15 70 -132 -333 -165 -115 65 39 -52
8068e2j35R9M22j23l91R8o7K77K2l42j17K13j52K64M7m09K66m4K38k18j60K07
$$ -52 -187 -88 334 211 -180 -82 -149 128 150 -192 -309 -96 -248 16 63 -346 -80 -124 114 -104 -264 -57
8090e7K9J14k28L09J48l86J02j1J00l71J40J78k23O8O3j13J60kRp6J32J28j04
$$ -57 -28 86 -142 167 315 -71 31 20 120 -251 -111 67 -156 -88 -25 -138 22 20 29 -47 85 213 109
8113A09j6Oj69l8J15L50m53J36P9K71n65pJ76p5m9L75k01J19j55Q4L15l37j22
$$ 109 93 99 -70 -108 7 357 -96 40 119 390 -175 -182 -6 -81 -130 245 44 163 8 92 407 70 -52
8136e2K2r6L50J10l10NK30m46o6J42K78kRP8m63L88k09J82m35L05j38O2O5J06
$$ -52 -30 -126 224 334 24 29 259 -187 -253 -111 167 165 174 252 -211 177 -32 150 -285 20 -118 -56 9 115
8160A15l14L8O2L96k10k5k6J68P0k46j06j38J5j66M72k24K41j00J98Mj82k48J26
$$ 115 -199 -161 -99 297 87 62 36 204 274 28 -78 -216 -201 -367 105 -119 122 22 220 224 42 -206 -80
8183h0L08l17k93L07J48rk97M07
$$ -80 228 -89 -382 -75 73 64 -233 174
8191A74
$$ Imaginary data points
##PAGE= N=2
##DATA TABLE= (X++(I..I)), XYDATA
0@%%%%%%%%%%pJ5j6J6j6J8k6L2l4M2n0N8o6P5q9J03j18J34j51J69j91K15k42K73
$$ 0 0 0 0 0 0 0 0 0 0 0 -7 8 -8 8 -8 10 -16 16 -18 24 -26 32 -34 41 -48 55 -63 71 -80 89 -102 113 -129 144
34A44l03L36l73M14m59N07n62O24o90P64q47R40j045J163j301J460j647J873k149
$$ 144 -159 177 -196 218 -241 266 -296 328 -362 402 -445 495 -550 613 -688 772 -875 998 -1151
53a151K496k951L575m483N934q621J5218n6898j03629J23982Q0248n5231m8416
$$ -1151 1345 -1606 1969 -2514 3420 -5201 10017 -46881 -150510 -26528 53720 -1511 -49927
66d9927O0038K5674m1048N11N3551j2607m6032K6491O0041k8389o7790R108O1098
$$ -49927 10111 35785 -5263 -4752 48799 36192 -9840 16651 76692 48303 -19487 -10379 50719
79E0719M360m5444j7574K4900K0065k025j5917j9888r605J6214K6784K587k9906
$$ 50719 55079 9635 -7939 16961 37026 35001 19084 -804 -10409 5805 32589 35176 5270
92E270k4219J2448K8353m55k4346o849J9938J3733n184r426r723n624J5622K4097
$$ 5270 -18949 -6501 21852 21397 -2949 -9798 10140 23873 18689 9263 -460 -6084 9538 33635
106C3635p646l1641N007L9100L771m0733j4091K9649J7531q289j570o433k8054
$$ 33635 25989 -5652 -645 38455 42226 1493 -12598 17051 34582 26293 24723 18290 -9764
119i764m590M1173J7881m0169k5164L3533K2865k7302k1976J5715J0865o252O136
$$ -9764 -14354 26819 44700 4531 -20633 12900 35765 8463 -13513 2202 13067 6815 12951
132A2951N303k2351j2733L2047K4914l0215l0271K6548L7841r888l0844k923J2707
$$ 12951 18254 -4097 -16830 15217 40131 9916 -20355 6193 44034 34146 3302 379 13086
145A3086J904J884P739q020j9141N489K7749R64l2922j2181L5373K7552k4871
$$ 13086 14990 16874 24613 16593 -2548 2941 30690 31654 -1268 -13449 21924 49476 24605
158B4605l2201J1270K6367o876j8026O809J0816r258l504J5687n406l1206Q4M0211
$$ 24605 -7596 3674 30041 23165 5139 11948 22764 13506 10002 25689 20283 -10923 -10839 29372
172B9372R518m2359k2127K8724J8316k0959j4937J1957M568p950N509P247j5649
$$ 29372 38890 -3469 -25596 3128 21444 485 -14452 -2495 2073 -5877 -368 6879 -8770
185h770j3779J7684J7020j7121k0225J1130J7038n849j1559M91J364l78J0285
$$ -8770 -22549 -4865 12155 -4966 -25191 -14061 2977 -2872 -14431 -13940 -12576 -12954 -2669
198b669P021j5292j4457J3286J8991q101j9006L548J6561L265o298j026p56n389
$$ -2669 4352 -10940 -25397 -12111 6880 -1221 -20227 -16679 -118 3147 -3151 -4177 -4933 -10322
212a0322L643J5056K043j8510q382J6963J1278j6635j5261J5229K0012o173j7481
$$ -10322 -6679 8377 10420 -8090 -16472 491 11769 -4866 -20127 -4898 15114 8941 -8540
225h540Q36R405R91L036R009o798j9101N004K6794K631k7286p466K3773J0831
$$ -8540 -7704 1701 2692 5728 14737 7939 -11162 -6158 20636 23267 -4019 -11485 12288 23119
239B3119j5607p435J0892J455q532K639M175j0837n582J8189J0938k1761j8354
$$ 23119 7512 77 10969 12424 3892 6531 10706 -131 -5713 12476 23414 1653 -16701
252a6701J7394K2339p682j7145K038R049q24n10L746n644j1285O226J7253j382
$$ -16701 693 23032 15350 -1795 243 9292 8468 7958 11704 6060 -5225 1001 18254 16872
266A6872j9407k729J5342L934j3662m329J1275M138q743n460J793r51M79R139
$$ 16872 -2535 -5264 10078 14012 350 -3979 7296 11434 2691 -2769 -976 -1927 -1448 7691
280G691M503j2820j3111Q891J5995k489j2927k157M655k218o77P693J534j0668
$$ 7691 12194 -626 -13737 -4846 11149 8660 -4267 -6424 -1769 -3987 -4664 3029 4563 -6105
294f105j588J0993K847r700Q72J2574l56j4129k119J1683L849n651J609L318q964
$$ -6105 -7693 3300 6147 -3553 -2681 9893 9537 -4592 -6711 4972 8821 3170 4779 8097 -867
309h67n662J3664J1849j2169j5224P387J3228n790j0930K598M649o349k877R082
$$ -867 -6529 7135 18984 6815 -8409 -1022 12206 6416 -4514 -1916 2733 -3616 -6493 2589
323B589K370j0910l116J0464K661j1908j213J3692K514j4761o175J1556P300n396
$$ 2589 4959 -5951 -9067 1397 4058 -7850 -9063 4629 7143 -7618 -13793 -2237 5063 -333
337c33k905K676l090m279P902R972p225j2417L150J0810k623p544N775P340o958
$$ -333 -3238 -562 -3652 -7931 -29 9943 2718 -9699 -6549 4261 1638 -5906 -131 7209 251
352B51q828N306Q278k436m295L056o67q236M31J1150J319j1280l081J0031K499
$$ 251 -8577 -3271 5007 2571 -1724 1332 665 -7571 -7140 4010 5329 -5951 -9032 999 3498
367C498q685J15R132j017r874J030Q277r39p661K402O987k562n223O216O572o552
$$ 3498 -5187 -5072 4060 3043 -6831 -5801 2476 1537 -6124 -3722 3265 703 -4520 1696 8268 1716
383A716o722P608Q763o213q169M577N581n907k822Q087K692q569l133P867L400
$$ 1716 -5006 2602 11365 5152 -3017 1560 7141 1234 -1588 6499 9191 622 -2511 5356 8756
398H756o039n74N811k819r712J341J0685l69r665O34O776k579o351M971P258m850
$$ 8756 2717 2143 7954 5135 -4577 -3236 7449 7080 -2585 -1951 4825 2246 -4105 866 8124 3274
414C274p617M174N702m506m754N496L485p518k840Q984M167r341m569Q872M114
$$ 3274 -4343 -169 5533 1027 -3727 1769 5254 -2264 -5104 3880 8047 -1294 -5863 3009 7123
429G123o973m035O077J357n707M41P089l06p878M9O894j160n898L326O203o039
$$ 7123 150 -3885 2192 3549 -2158 -1717 5372 5066 -2812 -2763 4131 2971 -2927 399 6602 563
445E63j0278L479J0031j169p057J201L152m659l098P418M798p184o759M048K990
$$ 563 -9715 -6236 3795 2626 -4431 -3230 -78 -4737 -7835 -417 4381 -2803 -9562 -5514 -2524
460b524m242k5O767q67r550m19R876L098o451j355M573q06m877K798N540k719
$$ -2524 -6766 -6791 -24 -891 -10441 -10860 -984 2114 -4337 -5692 -1119 -1925 -6802 -4004 1536 -1183
476a183m678K775M718l373k270P317M860p664o414P038P608m265o788J155K673
$$ -1183 -5861 -3086 1632 -1741 -4011 3306 8166 502 -5912 1126 8734 4469 -2319 -1164 1509
491A509j973J156L995l777q499J746J0069L20r145j058P608j164q773P28J0016
$$ 1509 -464 692 4687 910 -7589 -5843 4226 4546 -4599 -5657 1951 787 -7986 -7258 2758
506B758J888n892o96L099k612j525Q503N338r546j0138O822J0535l313q029J396
$$ 2758 4646 -1246 -1942 1157 -1455 -2980 5523 10861 1315 -8823 -2001 8534 5221 -2808 -1412
521a412L089m611j895P318K930p913m307O461K109p268j010R323L209q633m874
$$ -1412 1677 -2934 -4829 2489 5419 -2494 -6801 -340 1769 -5499 -6509 2814 6023 -2610 -7484
536g484N766M163j601J43K424l922m763N132P210m296r905J493R456L304m843
$$ -7484 -1718 2445 844 987 3411 -511 -5274 -142 7068 2772 -7133 -5640 3816 7120 2277
551B277k386J151n34J360L799o9n515o79N458j008q837k112Q272M986n849o171
$$ 2277 -109 1042 508 1868 5667 5598 83 -596 4862 3854 -4983 -7095 1177 6163 314 -5857
567e857K01K350K506L376k130q220k518J0503Q776p799j0073L695R567nl533L078
$$ -5857 -5656 -3306 -800 2576 446 -7774 -10292 211 8987 1188 -8885 -5190 4377 4372 839 3917
583C917L913l148k261K824j091m861L276J0292j588j4291m670J0787N793q304
$$ 3917 7830 4682 2421 5245 4154 -707 2569 12861 11273 -3018 -7688 3099 8892 588
597E88m908N098K033m794m50L011l857n957O148J1209k384j1317k4R750J428o807
$$ 588 -4320 778 2811 -1983 -2433 578 -3279 -9236 -3088 8121 5737 -5580 -5604 4146 5574 -1233
613a233K57P181J64n348L84L168l345k740O377O059n281p101M878P773l132q257
$$ -1233 -976 6205 6369 1021 1405 4573 1228 -1512 4865 10924 5643 -1458 3420 11193 8061 -196
629a96o85N065K334k67p61m316o168J819P252J494n810k071K927R14l718k921
$$ -196 -881 4184 6518 6251 5490 1174 -4994 -3175 4077 5571 -239 -2310 617 1531 -2187 -5108
645e108L74L066M312J764m559n807K625P608mo264O19P342J994o398m094L27l38
$$ -5108 -4734 -1668 2644 4408 -151 -5958 -3333 4275 4271 -1993 -1374 5968 7962 1564 -2530 -2203 -2541
662b541K617O381N97r392n407P678P120o673p355N538P943l760o939L973M755
$$ -2541 76 6457 7054 -2338 -7745 -67 7053 380 -6975 -1437 6506 2746 -4193 -220 4535
677D535m353l995N953M638m618j761P724J243j2677n726J1920J0589o976q995
$$ 4535 182 -3813 2140 6778 2160 399 8123 9366 -3311 -9037 2883 13472 6496 -2499
691b499L064L215n614j272R374J987r167l633R058J970j0366l881R441M302p476
$$ -2499 565 3780 -1834 -3106 6268 8255 -912 -4545 4513 6483 -3883 -7764 1677 5979 -1497
706a497l502O217J820p081k619M592J251l042J524M224n264r789J856J0718L236
$$ -1497 -4999 1218 3038 -4043 -6662 -2070 -819 -3861 -2337 1887 -3377 -13166 -11310 -592 2644
721B644o231m909K508M365J024j577j769q58J526K379R25j662j288N09M31p10
$$ 2644 -3587 -8496 -5988 -1623 -599 -2176 -3945 -4803 -3277 -898 27 -1635 -2923 -2414 -1983 -2693
737b693j137J770N365M205k907r018l124Q032R214p29p108k956L915J842r29n54
$$ -2693 -3830 -2060 3305 7510 4603 -4415 -7539 493 9707 8978 1870 -1086 2829 4671 3742 3188
753C188O97j074j231K609J701n931n230M893O039m843p734M827R944k506j0867
$$ 3188 3885 2811 1580 4189 5890 -41 -5271 -378 5661 818 -6916 -2089 7855 5349 -5518
768e518n50Q009J655k451L224K495p396m211J0180Q110q463q811Q436R682m891
$$ -5518 -6068 1941 3596 1145 4369 6864 -532 -4743 5437 13547 5084 -3727 4709 14391 9500
783I500r210K334M267m265k982N367J831p305l428N965J254q953k098J1129O942
$$ 9500 290 2624 6891 2626 -356 5011 6842 -463 -3891 2074 3328 -5625 -7723 3406 10348
798A0348q864j0438O16O730K005p56o51k416k663K631N243j831p479l3R424M096
$$ 10348 1484 -8954 -8338 -1608 397 -359 -1010 -3426 -6089 -3458 1785 -46 -7525 -7558 1866 5962
814E962p321o204L501N895Kl953k016K270M910L286l544p366j906O671N989k824
$$ 5962 -1359 -7563 -4062 1833 1835 -2118 -4134 -1864 3046 6332 2788 -4578 -6484 187 6176 3352
830C352o020k017L022K637l63m411m401L641Q942J339r632n292M849O911k524
$$ 3352 -2668 -4685 -1663 974 611 -3800 -8201 -4560 4382 5721 -3911 -9203 -4354 2557 33
845C3l586J914J834l64K01Q45m200j971O822P780n460j0921q6R029L214o197l183
$$ 33 -3553 -1639 195 -169 32 877 -3323 -5294 1528 9308 3848 -7073 -7159 1870 5084 -1113 -4296
862d296K815K328p03L42L85m360j929O220N131n612q071K329Q649n67q347j858
$$ -4296 -1481 847 144 486 871 -3489 -5418 802 5933 321 -7750 -5421 3228 2661 -5686 -7544
878g544O382L297k319k125p00k230P13O493Q65p503m706Q321P661n436r301J537
$$ -7544 -1162 2135 -184 -2309 -3009 -5239 -4526 1967 2832 -4671 -9377 -1056 6605 1169 -8132 -6595
894f595Q820L480k304k590k718q09M132M371l631n176K125O678j303p418j443
$$ -6595 2225 5705 3401 811 -1907 -2716 1416 5787 2156 -3020 -895 5783 4480 -2938 -4381
909d381N534N259j258m620m207N90O302L685m566p874P23P408L780n055n170J229
$$ -4381 1153 6412 5154 534 -3673 -3083 3219 6904 2338 -5536 -4813 2595 6375 1320 -3850 -2621
925b621L891J328j436k487j541K043L488j127n323j533O374N540m007p928M79
$$ -2621 1270 2598 1162 -1325 -2866 -823 2665 1538 -3785 -5318 1056 6596 2589 -5339 -4860
940d860P178L016m193l919m94J592K836K994k734p256j055Q230M438o062n716
$$ -4860 2318 5334 1141 -2778 -3272 -1680 1156 4150 1416 -5840 -6895 1335 5773 -289 -6005
955f005K817M063k735l679J670K552p20j77j39l944j910O911P072m772j0180m59
$$ -6005 -3188 875 -1860 -5539 -3869 -1317 -2037 -2214 -2353 -6297 -8207 -1296 5776 1004 -9176 -9635
971i635Q398N341l450m832j963K015L463K980j592m835M40N378J928n537l691
$$ -9635 -1237 4104 654 -4178 -6141 -4126 -663 2317 725 -4110 -3670 1708 3636 -1901 -5592
986e592M542N836j661o980k236M443N192R33m422n748j80P361N361m963q927o17
$$ -5592 -1050 4786 3125 -3855 -6091 -1648 3544 4477 55 -5693 -5873 1488 6849 1886 -7041 -7658
1002g658Q621M855m988n910L01M437L208k29l631l006K852N881j168p494j891
$$ -7658 963 5818 830 -5080 -4779 -342 2866 2637 -994 -4000 -1148 4733 3565 -3929 -5820
1017e820Q427O244n173q328k28O981N175k12m837n698N2P572N169n324q388J442
$$ -5820 2607 8851 3678 -4650 -4878 2103 7278 7066 2229 -3469 -3417 4155 9324 4000 -4388 -2946
1033b946P948J551o034l152L045L211J7k583l008j892M402N284k317q611k527
$$ -2946 5002 6553 519 -2633 412 3623 3640 1057 -1951 -3843 559 5843 3526 -5085 -7612
1048g612P359O429l421o948n74M893L881j075l835l264P94N832L364n007p064
$$ -7612 -253 6176 2755 -4193 -4767 126 4007 2932 -903 -4167 -3373 2459 5823 816 -6248
1063f248J551Q116K022n660m390K062M294P72k837l192q71L266M251j624p234
$$ -6248 -4697 3419 5441 -219 -4609 -2547 1747 2519 -318 -3510 -4381 -1115 3136 1512 -5722
1078e722k837P179P328m262q656j150N991M521j111m130l395J706O125L037n027
$$ -5722 -8559 -1380 5948 1686 -6970 -8120 -2129 2392 1281 -2849 -6244 -4538 1587 4624 -403
1093d03o088L428Q028J213p567l868M717N669o78m172l285N48L916L873k829o528
$$ -403 -6491 -3063 4965 6178 -1389 -5257 -540 5129 4451 279 -3006 -2458 1458 5331 2502 -4026
1109d026n83P227L578n707p454J402O591K451l126m229j369K093M533J465m180
$$ -4026 -4609 2618 6196 489 -6965 -5563 1028 3479 353 -3876 -5245 -3152 1381 2846 -1334
1124a334l965L229N380r28n554j228M920L628l199l913n7K660L082K302k919n269
$$ -1334 -5299 -2070 3310 2382 -3172 -4400 520 4148 949 -2964 -3021 -361 2721 5023 2104 -3165
1140c165n94O299M441l996n963R62M781R86k566j594P93N47J343P97k861l034
$$ -3165 -3759 2540 6981 2985 -2978 -2016 2765 3751 1185 -409 384 931 2274 3071 210 -2824
1156b824K286M919j276o199k007N800L961k369m465q99L100K634J408k217m633
$$ -2824 -538 4381 3105 -3094 -5101 699 4660 2291 -2174 -3073 27 2661 4069 1852 -2781
1171b781m97N905M025l923n138R94M936J046l280k041J663K113J96k556k918M00
$$ -2781 -3278 2627 6652 2729 -2409 -1415 3521 4567 1287 -754 909 3022 3218 662 -2256 -1856
1187a856M332L279l567o456k55O455L990k051n644j597K062K668J104k581l918
$$ -1856 2476 5755 2188 -4268 -4523 1932 5922 3871 -1773 -3370 -1308 1360 2464 -117 -4035
1202d035K4L740P44m269j994L566L851k753m569K64L808J676p49j672k865m27
$$ -4035 -4011 -271 473 -3796 -5790 -2224 1627 -1126 -5695 -5431 -1623 53 -696 -2368 -5233 -5660
1218e660M590N004k382n551j73O191K203l570k534J547J682o85J30O7j608k110
$$ -5660 -1070 3934 1552 -3999 -4172 2019 4222 652 -1882 -335 1347 662 792 859 -749 -2859
1234b859K317J590k593k436K765L536k476m905n98M316L172j215j952j348p61
$$ -2859 -542 1048 -1545 -3981 -1216 2320 -156 -5061 -5659 -1343 1829 614 -1338 -2686 -3447
1249c447K053L636P73m121k375L298L466m18l383k60K173Q16p14m82Q66J561P76
$$ -3447 -1394 2242 3015 -1106 -3481 -183 3283 2865 -518 -778 1395 2211 1497 1015 1881 3442 4218
1266D218p71k319j340K472L054k29l754j843J018J948R20j215k234j02K714J299
$$ 4218 3447 1128 -212 2260 5314 5085 1331 -512 506 2454 3374 2159 -75 -177 2537 3836
1282C836k046l360L31L197M26j862K45J202j010j081J475J298j432J83K051j19
$$ 3836 1790 -1570 -1239 1958 2384 522 767 1969 959 -122 1353 2651 1219 1402 3453 3334
1298C334m018j122L506K516l040k609K463K342k053j390K179R98l322l36L579
$$ 3334 -684 -1806 1700 4216 1176 -1433 1030 3372 1319 -71 2108 3106 -216 -552 3027
1313C027J438l058k554J418J217k065L40L431J10l666j624L204O29l397q59L525
$$ 3027 4465 1407 -1147 271 1488 -577 -237 3194 3304 -362 -1986 1218 1847 -1550 -2409 1116
1329A116J759l244k447K439Q76j878o16K852J449j831r66Q57l55k583R17M318
$$ 1116 2875 -369 -2816 -377 499 -1379 -1995 857 2306 475 -491 366 11 -2572 -1655 2663
1345B663P82l539k184J549K010M9j071J35L01kq0N02l94j359r73P56K147P56q44
$$ 2663 3445 -94 -2278 -729 1281 1330 259 394 695 693 613 1115 721 -638 -1611 -855 1292 2048 1204
1364A204p25K14n95k063m28L231K464k265l646p33P79m4P38K278j8l370j026L309
$$ 1204 479 693 98 -1965 -2393 838 3302 1037 -2609 -3342 -2563 -2607 -1869 409 391 -2979 -4005 -696
1382f96J639l832k552L371M928j027l441P2J646j036r71K654K587j545j401J905
$$ -696 943 -2889 -5441 -2070 2858 1831 -1610 -1538 108 -928 -1899 755 3342 1797 396 2301
1398B301m25m512j032O646M127n023n630K549N096j233l970O74K483r13l40K847
$$ 2301 1876 -2636 -3668 2978 7105 2082 -3548 -999 4097 2864 -1106 -432 2051 1138 798 3645
1414C645l66m954j898M539K989l659j810M185J683n375m670L025N099O07k316
$$ 3645 3279 -1675 -3573 966 3955 296 -1514 2671 4354 -1021 -5691 -2666 2433 3040 724
1429G24r65j321j355J056L562O92l079n76K727J712l063k916J521L313J8j745
$$ 724 -241 -1562 -2917 -1861 1701 2393 -686 -1262 1465 3177 114 -2802 -1281 2032 2050 305
1445C05l15R66K73j720j049J295J075N96J023l52k805k414J269L772N94k518j852
$$ 305 -10 956 1229 -491 -1540 -245 830 1426 2449 2097 -708 -3122 -1853 1919 2513 -5 -1857
1462a857J205K345j243k539k17J717N44o33M56k45j407j585J037J597j586l83
$$ -1857 -652 1693 450 -2089 -2306 -589 -45 -678 -222 -467 -1874 -3459 -2422 -825 -2411 -2794
1478b794L286K217m042n086K185N540J158k806r55J035m27q21K098R74j976p39
$$ -2794 492 2709 -1333 -6419 -4234 1306 2464 -342 -1297 -262 -689 -1510 588 1562 -414 -1153
1494a153L119J890l877l265L142M193k404l732Q49L964R9l056j135P08J73J388
$$ -1153 1966 3856 -21 -3286 -144 4049 1645 -2087 -1238 2726 2825 -231 -1366 -658 -485 903
1510I03J413p59l383j594M272K110l430l631K317M300k23l616q88J457Q34L7P03
$$ 903 2316 1557 -1826 -3420 852 2962 -468 -4099 -1782 2518 2295 -1321 -2209 -752 82 119 822
1527H22o16r19J134J475q99k968O60M003K164k355l206k87J992J675P7k387j111
$$ 822 206 -713 421 1896 997 -1971 -1311 2692 4856 2501 -705 -992 1000 2675 2752 365 -746
1544g46J142J564j48k417r04J293J622J26n95j640p17J680J294j594k328M84K938
$$ -746 396 1960 1812 -605 -1509 -216 1406 1532 937 -703 -1420 260 1554 -40 -2368 -1884 1054
1561A054J384k533k467J065K450M80j189j335m01J113K107O00k863l129J877M514
$$ 1054 2438 -95 -2562 -1497 953 1433 244 -1091 -1492 -379 1728 2328 -535 -3664 -1787 2727
1577B727J148l652k710J458K297o08j136k73N41L49Q7n45j995k67L002K578k751
$$ 2727 3875 223 -2487 -1029 1268 660 -476 -749 -208 141 228 -317 -2312 -2579 423 3001 250
1594B50m375L22M748J458l209l056R69K197J150j91j375j684M94L118J063k432
$$ 250 -4125 -3803 945 2403 -806 -3862 -2893 -696 454 263 -1112 -2796 -2302 816 1879 -553
1610e53j475J885J950j095k896O67K274J378r37j739q12J067K605L39k528k303
$$ -553 -2028 -143 1807 712 -2184 -1517 757 2135 1198 -541 -1353 -286 2319 2658 130 -2173
1626b173Q97L455R34j964k676n40J839J753P74j565j583Q34J179L3j118N50J025
$$ -2173 -1276 2179 3113 1149 -1527 -2067 -228 1525 2299 734 -849 -15 1164 1197 79 629 1654
1643A654K88j643j279M42K257P78l71j541j666J99L013J819j993l550J07K922
$$ 1654 1942 299 -980 -538 1719 2497 2126 585 -1081 -882 2131 3950 1957 -1593 -1486 1436
1659A436P38j058j067J07J65N5N82j17j556N30J931o66k288p29K655K041k170
$$ 1436 2174 1116 49 156 321 376 958 841 -715 -185 1746 1080 -1208 -1937 718 2759 589
1676E89k549M64K411J373j009j298j737N71K869J335k113k755M24K990J096j879
$$ 589 -1960 -1496 915 2288 1279 -19 -1756 -1185 1684 3019 906 -1849 -1425 1565 2661 782
1692G82j120N75J164n85j316l00O68J098k9j595k244M99L078J805k409k910J2
$$ 782 -338 237 1401 816 -500 -800 -132 966 937 -658 -2902 -2403 675 2480 71 -2839 -2827
1709b827K588J519q90j293j179P84J509J89r89j091J249K292p60k206k61J784
$$ -2827 -239 1280 390 -903 -2082 -1298 211 400 -589 -1680 -431 1861 1101 -1105 -1366 418
1725D18J385r27j437m72J92J331J242j053k316l46K889J156j861j979M78J904
$$ 418 1803 876 -561 -1033 -841 490 1732 679 -1637 -1983 906 2062 201 -1778 -1300 604
1741F04P84j044j162j166N23K064J357j812k311J041K542L36k429p34J878J190
$$ 604 1388 344 -818 -1984 -1461 603 1960 148 -2163 -1122 1420 1756 -673 -1407 471 1661
1757A661r1j810j180K86K374J996j618l096o13L021K942j498l543k66K687J328
$$ 1661 1570 -240 -1420 -1134 1240 3236 1618 -1478 -2091 930 3872 2374 -1169 -1435 1252 2580
1773B580q41j450m52R85K345p2k299k079J499L300k59l272j983K046K305k66k115
$$ 2580 1739 289 -163 822 3167 3095 796 -1283 216 3516 3257 -15 -1998 48 2353 2087 -28
1790b8j292O70J786J329j653k805m9L004K315k139l284k76K813J929l60j519q84
$$ -28 -1320 -650 1136 2465 812 -1993 -2042 962 3277 1138 -2146 -2422 391 2320 1960 441 -443
1807d43O83J939L64j270j300R63K000n25k396p23J254K221K77k510k217p5K231
$$ -443 240 2179 2543 1273 -27 936 2936 2411 15 -708 546 2767 3044 534 -1683 -1758 473
1824D73J883j604l575j273K491K606j026k638r64J551J358L35j099j608N10K466
$$ 473 2356 752 -2823 -4096 -1605 1001 -25 -2663 -3627 -2076 -718 -383 -1482 -3090 -2580 -114
1840a14N70k459k056J298L501L16l243j287K382K597J46k569j687M8K576K355
$$ -114 456 -2003 -4059 -2761 740 1056 -2187 -3474 -1092 1505 1651 -918 -2605 -2557 19 2374
1856B374p52m323j717L404L075j119l268k10J912J148j649q06J94J067N93j58
$$ 2374 1622 -2701 -4418 -1014 2061 942 -2326 -2536 -624 524 -1125 -1931 -1737 -670 -77 -235
1872b35j877j367K197L302J76l771k205K605L620K38k517k179L78J991J673l88
$$ -235 -2112 -3479 -1282 2020 2196 -1575 -3780 -1175 2445 2683 166 -2013 -1635 356 2029 1641
1888A641j552j096J367J110n14j381J4J606J003j506j958j95K214J637p98k197
$$ 1641 89 -1007 360 1470 956 -425 -411 1195 2198 692 -1266 -1461 753 2390 1592 -605
1904f05p08J472K390k51k576j668J330K219J238j690k474o57J764K219l10k381
$$ -605 -1313 159 2549 2298 -278 -1946 -616 1603 2841 1151 -1323 -1980 -216 2003 1693 -688
1920f88n61J941J013j866k009J587K032j86j726j200j70J876J747J35k794k228
$$ -688 -1249 692 1705 -161 -2170 -583 1449 1263 -463 -1663 -1833 43 1790 1925 -869 -3097
1936c097K295L899m9m051k047K669K428p66j824j40L31N68M83q02j190L08K577
$$ -3097 -802 3097 3048 -1003 -3050 -381 2047 1281 -543 -683 -352 216 699 -103 -1293 -985 1592
1953A592J055k513l447Q70L902R99l289j994J441K632o4j724j659J73J909J903
$$ 1592 2647 134 -3313 -2443 1459 2458 -831 -2825 -1384 1248 1184 -540 -2199 -2026 -117 1786
1969A786P9l008j833J592K445j30j934n05J912J206j127k017m16J770J397k17
$$ 1786 1865 -1143 -2976 -1384 1061 931 -1003 -1508 404 1610 483 -1534 -1950 -180 1217 1000
1985A000j903j191R73J178L27j453j828K56K090K057j860l030p95K665K043j468
$$ 1000 -903 -2094 -1121 57 384 -1069 -2897 -2641 -551 1506 -354 -3384 -4179 -1514 529 -939
2001i39j981N82K202j62j159m18M0O94J206J138j512k463M09L299Q20k542j791
$$ -939 -2920 -2338 -136 -298 -1457 -1875 -1835 -1141 65 1203 -309 -2772 -2363 936 1756 -786 -2577
2018b577L019K686j284l469m33K189J645N47p37j580k351J641L004j60l351j339
$$ -2577 442 3128 1844 -1625 -2058 131 1776 2323 1586 6 -2345 -704 2300 2140 -1211 -2550
2034b550L450K360k830l021J157K819j13k011p35P17R20R51j85j138k338J321
$$ -2550 900 3260 430 -2591 -1434 1385 1272 -739 -1474 -757 163 1114 929 -209 -2547 -1226
2050a226L687J160l601k917J821L139j84k567j72J713M81o75o32p93n7Q56J342
$$ -1226 2461 3621 20 -2897 -1076 2063 1879 -688 -860 853 1334 659 27 -766 -823 33 1375
2067A375n16k067n32J592J416j754k499R38K936Q88j951k515M85J231P35j10K39
$$ 1375 859 -1208 -1740 -148 1268 -486 -2985 -2047 889 1777 -174 -2689 -2204 -973 -238 -348 -109
2084a09j168j160J029J563o15j389pK422Q61k713j137J968J649j314k213J58K079
$$ -109 -1277 -2437 -1408 155 -460 -1849 -1856 566 1427 -1286 -2423 -455 1194 -120 -2333 -2175 -96
2101i6Q55K20k92j335j618N21L521J144l008k050J501K268j263k160J548J796
$$ -96 759 979 687 -648 -2266 -1745 1776 2920 -88 -2138 -637 1631 368 -1792 -244 1552
2117A552m80j845K89Q70p10K19N05L4j872K55K475Q59l282k505K533L434r46k432
$$ 1552 1072 -773 -484 386 -324 -105 400 434 -1438 -1183 1292 2151 -1131 -3636 -1103 2331 1385 -1047
2135a047q5Q82K61p65K56L28j18k87J091k08j302m99K025R29j765j587J567K661
$$ -1047 -1132 -250 11 -754 -498 -170 -288 -575 516 308 -994 -1493 532 1461 -304 -1891 -324 2337
2153B337r30k685q27J457J633J23N45j035j070k84J395P59l64n88N72P16q96j403
$$ 2337 1407 -1278 -2105 -648 985 1108 1653 618 -452 -736 659 1418 1054 466 1038 1754 858 -545
2171e45J64J706J305j355j550M47J079L31j116m34j45L2Q69Q32n27j966m49J244
$$ -545 -381 1325 2630 1275 -275 172 1251 1582 466 32 -113 -81 788 1620 1093 -873 -1322 -78
2189g8J160n02j125m0J586m25j390l34J194Kl09N45r1q94l43O92Q92j762o01J807
$$ -78 1082 580 -545 -585 1001 576 -814 -1148 46 48 -261 284 193 -701 -1044 -352 540 -1222 -1823 -16
2209a6K121j357k681m81J601J610l08n99j22q39K01Q02K86r07q22J431J064j600
$$ -16 2105 748 -1933 -2414 -813 797 489 -110 -232 -1071 -870 -68 218 -689 -1511 -80 984 -616
2227f16j383P35J609L17j466n39R87P72p50l7o19k69Q30R95K2j250q89Q49J849
$$ -616 -1999 -1264 345 662 -804 -1343 -356 416 -334 -371 -990 -1259 -429 566 588 -662 -1551 -702 1147
2246A147m77q17j22P46P44l06m45n67p5N63O7l35K40M53j38m61r15M88Q73M47
$$ 1147 670 -147 -269 477 1221 915 470 -97 -172 391 458 123 363 816 678 217 -698 -210 663 1110
2266A110J63j028j130m31J408P25r8o71J05p3j77J67N39M05q79o59J212N16p91
$$ 1110 1273 245 -885 -1316 92 817 719 48 153 80 -97 70 609 1014 135 -524 688 1204 413
2285D13k00l01M34l77K99O84J81j003o90N45O06n91N7L75j30r48J69R85K13p65
$$ 413 213 -88 346 -31 268 952 1133 130 -560 -15 591 0 57 432 302 -646 -477 508 721 -44
2305d4n41J56L86J87L19J97p14j169L42J107P15m75m90q11J38J11J162M08n27
$$ -44 -585 -429 -43 144 463 660 -54 -1223 -881 226 941 466 -24 -835 -697 -586 576 984 457
2324D57j217L41K24n4k07O71J91l96p31q1M92O61N11j120q92n83J382J196k99
$$ 457 -760 -419 -195 -249 -456 215 406 10 -721 -802 -310 351 862 -258 -1150 -1733 -351 845 546
2343E46j553n58M83J151K91o55n80k15P88K47p63n43M81J069N0j478JR14Q51j26
$$ 546 -1007 -1565 -1082 69 360 -295 -875 -1090 -302 -55 -818 -1361 -880 189 239 -1239 -1238 -324 527 401
2363D01j864k30P16J404K57j033j934L19J394J575o66j538l65J331O44n39q26
$$ 401 -1463 -1693 -977 427 684 -349 -2283 -1964 -570 1005 339 -1199 -1564 -233 411 -128 -954
2380i54O55M57j1k36k43K7Q38J207p84j836m51J785J592m44j406q59P45Q91N59
$$ -954 -299 158 147 -89 -332 -305 533 1740 956 -880 -1331 454 2046 1602 196 -663 82 973 1532
$$ [...]
8191F2
##END NTUPLES=NMR FID
##END=
