##TITLE=1H_SA_33.156
 CDCl3, 8 sc, 
 21.11.2019
##JCAMPDX= 6.0         $$ Bruker NMR JCAMP-DX V2.0
##DATA TYPE= NMR FID
##DATA CLASS= NTUPLES
##ORIGIN= UXNMR, Bruker Analytische Messtechnik GmbH
##OWNER= root
$$ XWIN-NMR		Version 3.5
$$ Thu Nov 21 15:48:24 2019 Russian Standard Time (UT+4h)  she@DPX200
##.OBSERVE FREQUENCY= 200.1315
##.OBSERVE NUCLEUS= ^1H
##.DELAY= (6, 6)
##.ACQUISITION MODE= SIMULTANEOUS
##.ACQUISITION SCHEME= undefined
##.AVERAGES= 8
##.DIGITISER RES= 18
##SPECTROMETER/DATA SYSTEM= spect
##.PULSE SEQUENCE= zg30
##.SOLVENT NAME= CDCl3
##.SHIFT REFERENCE= (INTERNAL, CDCl3, 0, 15.7039)
##AUDIT TRAIL= $$ (NUMBER, WHEN, WHO, WHERE, WHAT)
$$ ##TITLE= Audit trail, XWIN-NMR		Version 3.5
$$ ##JCAMPDX= 5.01
$$ ##ORIGIN= Bruker BioSpin GmbH
$$ ##OWNER= she
$$ F:/spectra/data/she/nmr/H-F/1/audita.txt
$$ ##AUDIT TRAIL=  $$ (NUMBER, WHEN, WHO, WHERE, WHAT)
(   1,<2019-11-21 15:46:43.68 +0400>,<she>,<DPX200>,
      <created by zg, POWCHK disabled, PULCHK disabled
       configuration hash MD5:
       00 E9 B6 7A A2 85 ED C7 34 08 36 98 17 FE 4E 26
       data hash MD5: 16K
       4C D3 38 1C 65 F2 9C E9 4C 2D 8D AE 09 43 75 90>)
$$ ##END=
$$ 
$$ hash MD5
$$ 36 24 A0 02 E4 FF C6 16 5B 05 61 7B 1D E3 25 3F
##$RELAX= 
##$RELAX= 
##$RELAX= 
##$RELAX= 
##$RELAX= 
##$RELAX= 
$$ Bruker specific parameters
$$ --------------------------
##$DU= <F:/spectra>
##$EXPNO= 1
##$NAME= <H-F>
##$PROCNO= 1
##$TYPE= <nmr>
##$USER= <she>
##$AMP= (0..31)
100 100 100 100 100 100 100 100 100 100 100 100 100 100 100 100 100 100 
100 100 100 100 100 100 100 100 100 100 100 100 100 100 
##$AQSEQ= 0
##$AQ_mod= 1
##$AUNM= <au_zg>
##$AUTOPOS= <>
##$BF1= 200.13
##$BF2= 200.13
##$BF3= 200.13
##$BF4= 200.13
##$BF5= 200.13
##$BF6= 200.13
##$BF7= 200.13
##$BF8= 200.13
##$BYTORDA= 1
##$CFDGTYP= 0
##$CFRGTYP= 5
##$CHEMSTR= <none>
##$CNST= (0..31)
1 1 145 1 1 1 1 1 1 1 1 1 1 1 1 1 1 1 1 1 1 1 1 1 1 1 1 1 1 1 1 1 
##$CPDPRG= <>
##$CPDPRG1= <>
##$CPDPRG2= <>
##$CPDPRG3= <>
##$CPDPRG4= <mlev>
##$CPDPRG5= <mlev>
##$CPDPRG6= <mlev>
##$CPDPRG7= <mlev>
##$CPDPRG8= <mlev>
##$CPDPRGB= <>
##$CPDPRGT= <>
##$D= (0..31)
0 1.2 0 0 0 0 0 0 0 0.06 0 0.03 0 0 0 0 0.0002 0 0 0 0 0 0 0 0 0 0 0 0 
0 0 0 
##$DATE= 1574336802
##$DBL= (0..7)
120 120 120 120 120 120 120 120 
##$DBP= (0..7)
150 150 150 150 150 150 150 150 
##$DBP07= 0
##$DBPNAM0= <>
##$DBPNAM1= <>
##$DBPNAM2= <>
##$DBPNAM3= <>
##$DBPNAM4= <>
##$DBPNAM5= <>
##$DBPNAM6= <>
##$DBPNAM7= <>
##$DBPOAL= (0..7)
0.5 0.5 0.5 0.5 0.5 0.5 0.5 0.5 
##$DBPOFFS= (0..7)
0 0 0 0 0 0 0 0 
##$DE= 6
##$DECBNUC= <off>
##$DECIM= 24
##$DECNUC= <off>
##$DECSTAT= 4
##$DIGMOD= 1
##$DIGTYP= 9
##$DL= (0..7)
0 120 120 120 120 120 120 120 
##$DP= (0..7)
150 150 150 150 150 150 150 150 
##$DP07= 0
##$DPNAME0= <>
##$DPNAME1= <>
##$DPNAME2= <>
##$DPNAME3= <>
##$DPNAME4= <>
##$DPNAME5= <>
##$DPNAME6= <>
##$DPNAME7= <>
##$DPOAL= (0..7)
0.5 0.5 0.5 0.5 0.5 0.5 0.5 0.5 
##$DPOFFS= (0..7)
0 0 0 0 0 0 0 0 
##$DQDMODE= 0
##$DR= 18
##$DS= 0
##$DSLIST= <SSSSSSSSSSSSSSS>
$$ [...]
##$SUBNAM2= <"">
##$SUBNAM3= <"">
##$SUBNAM4= <"">
##$SUBNAM5= <"">
##$SUBNAM6= <"">
##$SUBNAM7= <"">
##$SUBNAM8= <"">
##$SUBNAM9= <"">
##$SW= 24.9337058887773
##$SWIBOX= (0..15)
0 0 2 0 0 0 0 0 0 0 0 0 0 0 0 0 
##$SW_h= 4990.01996007984
##$TD= 16384
##$TD0= 1
##$TE= 0
##$TE2= 300
##$TE3= 300
##$TEG= 300
##$TL= (0..7)
0 120 120 120 120 120 120 120 
##$TP= (0..7)
150 150 150 150 150 150 150 150 
##$TP07= 0
##$TPNAME0= <>
##$TPNAME1= <>
##$TPNAME2= <>
##$TPNAME3= <>
##$TPNAME4= <>
##$TPNAME5= <>
##$TPNAME6= <>
##$TPNAME7= <>
##$TPOAL= (0..7)
0.5 0.5 0.5 0.5 0.5 0.5 0.5 0.5 
##$TPOFFS= (0..7)
0 0 0 0 0 0 0 0 
##$TUNHIN= 0
##$TUNHOUT= 0
##$TUNXOUT= 0
##$USERA1= <user>
##$USERA2= <user>
##$USERA3= <user>
##$USERA4= <user>
##$USERA5= <user>
##$V9= 5
##$VALIST= <valist>
##$VCLIST= <CCCCCCCCCCCCCCC>
##$VD= 0
##$VDLIST= <DDDDDDDDDDDDDDD>
##$VPLIST= <PPPPPPPPPPPPPPP>
##$VTLIST= <TTTTTTTTTTTTTTT>
##$WBST= 1024
##$WBSW= 4
##$XGAIN= (0..3)
0 0 0 0 
##$XL= 0
##$YL= 0
##$YMAX_a= 118224
##$YMIN_a= -79889
##$ZGOPTNS= <>
##$ZL1= 120
##$ZL2= 120
##$ZL3= 120
##$ZL4= 120
##$ABSF1= 10
##$ABSF2= 0
##$ABSG= 5
##$ABSL= 3
##$ALPHA= 0
##$AQORDER= 0
##$ASSFAC= 0
##$ASSFACI= 0
##$ASSFACX= 0
##$ASSWID= 0
##$AUNMP= <proc_1d>
##$AZFE= 0.1
##$AZFW= 0.1
##$BCFW= 1
##$BC_mod= 2
##$BYTORDP= 1
##$COROFFS= 0
##$CY= 11.3945322036743
##$DATMOD= 1
##$DC= 2
##$DFILT= <>
##$DTYPP= 0
##$F1P= 16.9975609425685
##$F2P= -3.02152046262296
##$FCOR= 0.5
##$FTSIZE= 0
##$FT_mod= 4
##$GAMMA= 1
##$GB= 0.15
##$INTBC= 1
##$INTSCL= 1
##$ISEN= 128
##$LB= 0.24
##$LEV0= 0
##$LPBIN= 0
##$MAXI= 10000
##$MC2= 0
##$MEAN= 0
##$ME_mod= 0
##$MI= 1.114404
##$NCOEF= 0
##$NC_proc= 0
##$NLEV= 6
##$NOISF1= 3.799351
##$NOISF2= 2.8
##$NSP= 1
##$NTH_PI= 0
##$NZP= 0
##$OFFSET= 15.70392
##$PC= 1
##$PHC0= -9786.348
##$PHC1= 13.60086
##$PH_mod= 1
##$PKNL= yes
##$PPARMOD= 0
##$PSCAL= 0
##$PSIGN= 0
##$REVERSE= no
##$SF= 200.130013532006
##$SI= 16384
##$SIGF1= 3
##$SIGF2= 2
##$SINO= 400
##$SIOLD= 16384
##$SREGLST= <1H.CDCl3>
##$SSB= 0
##$STSI= 0
##$STSR= 0
##$SW_p= 3612.71676300578
##$SYMM= 0
##$S_DEV= 0
##$TDeff= 0
##$TDoff= 0
##$TI= <>
##$TILT= no
##$TM1= 0
##$TM2= 0
##$TOPLEV= 0
##$USERP1= <user>
##$USERP2= <user>
##$USERP3= <user>
##$USERP4= <user>
##$USERP5= <user>
##$WDW= 1
##$XDIM= 8192
##$YMAX_p= 0
##$YMIN_p= 0
$$ End of Bruker specific parameters
$$ ---------------------------------
##NTUPLES= NMR FID
##VAR_NAME=  TIME,          FID/REAL,        FID/IMAG
##SYMBOL=    X,             R,               I
##VAR_TYPE=  INDEPENDENT,   DEPENDENT,       DEPENDENT
##VAR_FORM=  AFFN,          ASDF,            ASDF
##VAR_DIM=   8192,          8192,            8192
##UNITS=     SECONDS,       ARBITRARY UNITS, ARBITRARY UNITS
##FACTOR=    0.0002004,     1,               1
##FIRST=     0,             0,               0
##LAST=      1.6414764,     0,               0
##MIN=       0,             -79889,          0
##MAX=       1.6414764,     118224,          0
$$ Real data points
##PAGE= N=1
##DATA TABLE= (X++(R..R)), XYDATA
0@%%%%%%%%%%jRj6J6j6J6k1K9l2L6m4N2o0P0q1R2j06J22j37J53j74J96k20K48
34A31k77L08l42L80m22M68n19N76o38P06p82Q65r60J070j194J336j501J699j938
53a034K234k614L119l831M920o819J1103m2600J7771M8256l6150m5221k9023J3166
67f6723K0207K1937Q189N13j3397j3911j1830K447J6375L1144K0963j2140m4825
80d1051l1430J7236N2182L1211j7951m2726k0489J2926K3870R899j151k081q23
93a0378n408p441m178P774J9439J8512l074k6168k4588P516L4003K2506j5123
106A3392l3875j1940J9212J8152q305k1018n406J2964R338q398j6060o114Q227
119b9831J2025O151o310j2410j043J4600J2083q647j6609N687K7596J4997j9698
$$ plain form
0 0 0 0 0 0 0 0 0 0 0 0 -1 8 -8 8 -8 8 -13 16 -16 20 -24 28 -32 38 -43 49 -57 65 -72 81 -93 103 -117 131
34 131 -146 162 -180 200 -222 246 -273 303 -335 371 -411 454 -506 564 -630 706 -795 904 -1034
53 -1034 1200 -1414 1705 -2126 2794 -4025 7078 -35522 -17751 30505 -5645 -50866 -79889 -66723
67 -66723 -46516 -24579 -16390 -15877 -29274 -43185 -55015 -52568 -36193 -5049 15914 3774 -41051
80 -41051 -72481 -55245 -3063 28148 10197 -32529 -53018 -40092 -16222 -6323 -7474 -9555 -10378
93 -10378 -15786 -23227 -27405 -19631 -192 18320 15246 -10922 -35510 -27994 6009 28515 13392
106 13392 -20483 -32423 -13211 4941 -3364 -24382 -29788 -16824 -7486 -15884 -31944 -38058 -29831
119 -29831 -17806 -11655 -17965 -30375 -31418 -16818 -4735 -13382 -29991 -24304 3292 18289 -1409
132a409l0712l155K8090K7489K08k1140k0983m383J3302J7729P753n746q057j337
146b351l24o582m242J5949K9415J0634k8111l9929o631L5803M0827N200k9960
159A9698l3153j0163J3089J9472J0667k021j1001j3850j2598q269L162J9078K4888
172A8999M652k9268m0837r298L5479M5598J0739k9865l5094q338J6694K1718J3008
185A4187J193q222j2786j1613m039M947J5738K0923P021k2551l6716j2465L0354
198a4029M2629R598k8738l0576k497J9216J6741L358l153k592k463n352o336j857
212f051P979J4522O996j3391k5963j2353J6720K6098L807k2303k1271K600J7825
225d785Q242r359j1489J933J2053O177n991j0786k905R455J2619J937j0236r737
$$ plain form
132 -1409 -32121 -35276 -7186 20303 20511 -629 -21612 -25995 -12693 5036 12789 7043 -1014 -2351
146 -2351 -2675 -9257 -13499 2450 31865 42499 14388 -25541 -32172 3631 44458 49658 19698
159 19698 -13455 -23618 -10529 8943 19610 17589 6588 -7262 -19860 -28129 -24967 -5889 18999
172 18999 23651 -5617 -46454 -55752 -20273 25325 36064 6199 -28895 -37233 -20539 1179 14187
185 14187 15380 7158 -5628 -17241 -21280 -16333 -595 20328 27349 4798 -31918 -44383 -14029
198 -14029 28600 38198 9460 -21116 -23613 -4397 12344 15702 12549 9957 7494 2142 -4194 -6051
212 -6051 1928 16450 23446 10055 -15908 -28261 -11541 14557 18364 -3939 -25210 -22610 -4785
225 -4785 3457 -5902 -17391 -15458 -3405 2772 -3219 -14005 -16910 -7455 5164 7101 -3135 -12872
239a2872M323J2170K476j2779r730J1171K0430P53k3285k0172Q149K7336J6656
252B4626q042k1278j2478M626J5423J3120J807p090o670j372k565n440J723J7480
266A3870J8043o972l2408k5748R433L4314K3340r593k9232k2355l78J8200J8624
279I138O934p677j1957p549m276j493P678J9631J7671o699l2622k6600R366L8391
293I936K8182q257l1941k3599K951J9704J6546M381m994q710q026o157m73Q630
307a827J6986J4450n183k5992k3110O261L2011K5464o845k8948j9214N322J7644
320G019R978j622n906n042l295l062l170Q13P506J1362R37j5441j9067q9K1593
335B514J9079o018k2488r750J1668J5030L63j0942o029N663R738J542q259q785
$$ plain form
239 -12872 -8549 3621 6097 -6682 -16412 -5241 15189 15942 -7343 -27515 -19366 7970 24626
252 24626 16584 -4694 -17172 -12546 2877 15997 17804 10714 4044 2672 107 -5333 -3610 13870
266 13870 31913 24941 -7467 -33215 -23782 10532 33872 24279 -4953 -27308 -27686 -9486 9138
279 9138 16072 8395 -3562 -11111 -15387 -16880 -9202 10429 28100 21401 -11221 -37821 -28455 9936
293 9936 38118 29861 -2080 -25679 -22728 -3024 13522 17903 12909 4199 -3827 -9984 -10457 -1827
307 -1827 15159 29609 24426 -1566 -24676 -18415 13596 39060 32215 3267 -15947 -10625 7019
320 7019 16997 15375 9469 4427 1132 -1930 -5100 -4287 3219 14581 15518 77 -18990 -19079 2514
335 2514 21593 15575 -6913 -16663 -4995 10035 10398 -544 -6573 -910 8828 10370 2111 -6674
349f674J007J0076R044m025j0712l964Q332Q164m510j1153J45J5036J0753q507
363A3012k0192q293J4170K1728O364j3680j9418p392R343J4965O650n490r174
376B593m306n33l012l729O504J6035Q280j5976k8846j0890K0893L0815R114j8719
390H223k6342j0940J0054J8486J2007p70j0010r978n195k037K355J1609J7124
403A4586N956j7927k8605j0014K1993L2269J1108j8231k7527j1476J0124J9241
415A497J2495r04j0223r329m921r80J886Q991J3726O119j3507k4553j1303J6338
429a4668K8680J0688j7186k5329p836J1949J5549M227n656o287j662j017k536
442a1084k174L489R423O893n393j6275r513R567J9577P968j2135j6644l09J3655
$$ plain form
349 -6674 -5667 4409 13453 9428 -1284 -5248 3084 11248 6738 -4415 -4270 10766 21519 13012
363 13012 -7180 -15473 -1303 20425 26789 13109 -6309 -13701 -4358 10607 17257 11767 2593
376 2593 -1713 -2246 -5258 -8987 -2483 13552 21832 5856 -22990 -33880 -12987 17828 26942 8223
390 8223 -18119 -29059 -19005 -519 11488 10718 708 -9270 -14465 -16502 -14147 -2538 14586
403 14586 20542 2615 -25990 -36004 -14011 18258 29366 11135 -16392 -27868 -17744 1497
415 1497 13992 13088 2865 -6464 -11385 -12365 -10479 -1488 12238 18357 4850 -19703 -31006 -14668
429 -14668 14012 24700 7514 -17815 -25651 -13702 1847 6074 418 -5869 -7531 -8548 -11084
442 -11084 -13258 -9769 -346 6547 1154 -15121 -24634 -15067 4510 12478 343 -16301 -16610 -2955
456b955R933m325r130j168P675O914j103p611o136M062J0150N459o229r563MR053
472E030M616q339p598N931J4371K773j4144j5395J667J7014J5746j535j6728j4833
486a1424p7J2935J2184O93p808p169j232j352l215Q46J0603J1736k098j9882j8950
501b4210K801K3870K1045j233k0368k0140k049J5048J7638O781o202j0308o670
514c997j651Q55N058J1343J1703k410k1374k1889K362K6303K3537k434k3771k1719
528a8084j103J4972J5992N065n944r959p153k130O86M021R537J0076k386j8313
542d723j9162J069K1259J9191k568k0575j7718J02J2565J0986Q22o703o626j067
556a3148J224l84o91M320Q631L563q027j3251k139J3933J5175l8j4481r917M377
$$ plain form
456 -2955 6978 2653 -6477 -7645 30 6944 5841 -1770 -7906 -3844 6306 11765 5536 -4027 -4023 5030
472 5030 9646 1307 -6291 -360 14011 16784 2640 -12755 -11088 5926 21672 20137 3409 -11424
486 -11424 -11501 1434 13618 14311 6503 -666 -1898 -3250 -6465 -5619 4984 16720 14622 -5260 -24210
501 -24210 -21409 2461 23506 22273 1905 -18235 -20284 -5236 12402 19183 12981 2673 -3997
514 -3997 -5648 -4793 265 11608 23311 20901 -473 -22362 -20000 6303 29840 27406 3635 -18084
528 -18084 -19187 -4215 11777 16842 10898 939 -6214 -8344 -7658 -3637 5900 15976 13590 -4723
542 -4723 -23885 -22816 -1557 17634 15066 -5509 -23227 -23125 -10560 426 1248 -5455 -12081 -13148
556 -13148 -11924 -12308 -12999 -8679 -48 3515 -4512 -17763 -19902 -5969 9206 9168 -5313 -15230 -10853
571a0853J2686M066p509p947J479Q275M171n151q611k156O686Q397N49p576n646
586i140L753O788K5p293k119Q432R205m400j4877q786P603J5891P347p758j6600
601a1929j0091M468J4055Q890l658r861m930J186P80j306M731J1333Q069q173
615C564j9125q456J3036K3925J2602r632k1239j2225O519J7754J2490j101r651
628H461q454l216l62K423P370J1394M717j0346j9734r771J2365K4749J2660j0577
642B1679k2197j2301N947J6272J1841r05r780r408m043J37J906M371O999M113
656A4631p720j7529j1267Q776K1408J1155j0184j9520r094Q209J4465P193k976
669G547o702k496J669J471o60O68N442O905j372j1345r298M481J4015P824p433
$$ plain form
571 -10853 1833 5899 -1610 -9557 -8078 197 4368 -783 -9394 -11550 -4864 3533 4082 -3494 -9140
586 -9140 -5387 1401 1426 -5867 -7986 446 9651 5251 -9626 -18412 -10809 5082 12429 4671 -11929
601 -11929 -22020 -17552 -3497 5393 1735 -8126 -13056 -11870 -11090 -12396 -7665 3668 11737 3564
615 3564 -15561 -24017 -10981 12944 25546 15914 -5325 -17550 -11031 6723 19213 18112 8461
628 8461 7 -3209 -3571 -1148 6222 17616 22333 11987 -7747 -17518 -5153 19596 32256 21679
642 21679 -518 -12819 -6872 9400 21241 20336 10556 1148 -2895 -2758 -852 3519 10518 14631
656 14631 6911 -10618 -21885 -13109 8299 19454 9270 -10250 -19344 -11135 3330 10523 7547
669 7547 845 -1651 18 1489 829 1497 6939 13844 12472 1127 -8171 -3690 10325 18149 10716
684A0716j2565l894P894Q438L15p559m250L391P878J780o151p554J284Q044O018
699A3785l243q767k975M220M151l814o356r0P778L412r124j2801l372J1245J3386
714G435J342j2472j3423j926J0130J2420L736n958p393j244J605O24J512O540
728B928Q810K70j2995j4715p9J6946J7553J372j4997j7619m958J1327J6308P591
742A7742n710j1094n371Q6K784M101P636Q286q10j4481j5731p03J7066J8756J729
757B4286j7311j9348m995J0721J5008M389o789j0106n258q49J168K719O108O985
771F728L02j1312j2784j492J4442J7142K521j3380j4761j494J0144J1550K015
784I621n637o058j579J668J245q63J068M892L627l941r715m275Q311J2564K327
$$ plain form
684 10716 -1849 -5743 2151 10589 10904 3345 -905 2486 10364 12144 5993 -1561 -277 7767 13785
699 13785 10542 1775 -1200 3020 7171 3357 -2999 -3089 4689 8101 -1023 -13824 -17196 -5951 7435
714 7435 8777 -3695 -17118 -19044 -8914 3506 7242 1284 -6109 -7353 -5748 -5124 -3612 2928
728 2928 11738 12008 -987 -15702 -15781 1165 18718 20090 5093 -12526 -17484 -6157 10151 17742
742 17742 12032 938 -4433 -4347 -1563 2538 10174 18460 17650 3169 -12562 -13265 3801 22557 24286
757 24286 6975 -12373 -17368 -6647 8361 12750 5961 -4145 -9403 -10252 -9084 -6365 -257 6728
771 6728 7030 -4282 -17066 -18558 -4116 13026 15547 2167 -12594 -14088 -3944 7606 9621
784 9621 3984 -2074 -3653 -1985 -740 -1603 -535 4357 7984 4043 -5672 -9947 -1636 10928 13255
799A3255r274q911J197R366M989l699o657j436N433N017j948q090n544L627P653
814D978J570o426o892J63M671J014m485k418M392N953j188q719p697M191J2046
829A153R343l291j2951r062K709J1895R114j538q316n821l60K230Q48J863N803
844C619N416m603j3396q721O824J7513J1815n425j6855j1924L392J4351J2087
857A4093O12q866r073k874J948K229M155O776L324p072j5130r503P620J7389J0773
872A6401o011j7621j2474K389J3929J1880R86q929q506k226K431L591L019N174
886D033M161l953j2060q374M931J4660J0539m754j4916j0112L758J1898P817k374
900E254p190l430J279K389J19o18K399N197P58o607p533R26R221P448k657r948
$$ plain form
799 13255 3981 -4930 -3733 5633 10622 6923 266 -1170 4263 9280 7332 -758 -6302 -2675 4978
814 4978 6548 122 -6770 -6607 -1936 -922 -5407 -7825 -3433 2520 1332 -7387 -15084 -10893 1153
829 1153 10496 7205 -5746 -14808 -12099 -204 8910 7372 -944 -6765 -7125 -4895 -4047 -2184 3619
844 3619 9035 4432 -8964 -17685 -10861 6652 18467 13042 -3813 -15737 -12345 2006 14093
857 14093 14705 5839 -3234 -6108 -4160 -1931 2224 9000 12324 5252 -9878 -19381 -11761 5628 16401
872 16401 10390 -7231 -19705 -17316 -3387 8493 9479 550 -7956 -10182 -7751 -4160 -1141 4033
886 4033 8194 4241 -7819 -16193 -11262 3398 13937 9183 -5733 -15845 -12087 -189 7628 5254
900 5254 -1936 -5366 -4087 -1698 -1579 -2197 202 5399 6157 -450 -7983 -7057 2164 9612 6955 -2993
916b993n595M374P491J078n384n507J152N231K915l865p172j668N811O729r2o452
932c947m586K901M920K37m174k03N563L932m310q685l327P232J0847L934p999
947B335j2660m204P449J1817M377n317p768k703J675J599J586M284N213N88p813
962D58j0769k088J0918J4594M129j0421j5423o440P792J4214O713m904r755o530
976g512K57L253L167M055M833o8q267j2065k165J1727J5893M329j1616j5325n750
991a5254Q878J3669O406m372r109n489J163K745K335L051M431Q12p186j0219k539
1006a0678R628J2878L728r250j2416l447P121J0122M263m897o772k163K740K725
1020C582j565m52K618K633j620o809m891L923Q402L260n793q228j689N966N696
$$ plain form
916 -2993 -8588 -4214 3277 4355 -1029 -6536 -5384 -153 2762 -1103 -8275 -9943 -4132 2597 2505 -3947
932 -3947 -8533 -5632 -712 -475 -4649 -4852 711 4643 333 -8352 -11679 -4447 6400 10334 2335
947 2335 -10325 -14529 -7080 4737 9114 3797 -3971 -6674 -4999 -3400 -1814 2470 7683 8271 458
962 458 -10311 -12399 -1481 13113 17242 6821 -8602 -15042 -7250 6964 13677 8773 -982 -7512
976 -7512 -7255 -4002 -835 3220 8053 7985 -282 -12347 -14512 -2785 13108 17437 5821 -9504 -15254
991 -15254 -6376 7293 13699 9327 218 -5271 -4108 -1363 972 4023 8454 9266 2080 -8139 -10678
1006 -10678 -1050 11828 15556 6306 -6110 -9557 -2436 7686 11949 7052 280 -1883 857 3582
1020 3582 2017 1565 4183 6816 5196 -1613 -6504 -2581 5821 9081 3288 -4940 -6629 -663 5033
1035E033j571n865l173L810N987K8n715n101J810O616M111l598n953j331L246
1050a666L090j941k465J703M596N72o705o477J511Q632Q203j184r989r470L31
1065a1259J0095R462J90p950o517m01K881J614J288L809L175l018r798p292L759
1080i962J2266J0419k690j3476j2221Q03J1904J1128J506q383q645j949K165L230
1094c905L675M555J803l589r687o833L697J2922J0604k365j3259j1025R3J1688
1108a626J0982J335p055p972k535L087L422K461K608K017j832o998o781J698J0472
1123C283R558j646j1210r221J484R476P467o58o421n140Q94L570J083j636j85
1138F98L204J890m215n871o19N872O156r34o604m881K097O017K636l207n120l25
$$ plain form
1035 5033 3462 -2403 -5576 -1766 4221 4249 -1466 -6567 -4757 1859 5970 2372 -3581 -4912 -1666
1050 -1666 1424 -517 -2982 -1279 3317 3889 -2816 -9293 -7782 850 9053 7869 -2120 -11590 -11259
1065 -11259 -1164 8298 8488 538 -5979 -6380 -3499 -1885 -597 3212 6387 3369 -6429 -13721 -9962
1080 -9962 2304 12723 10033 -3443 -15664 -14861 -2957 8171 9677 1294 -7351 -9300 -7135 -3905
1094 -3905 -230 4325 6128 2539 -7148 -13981 -10284 2638 13242 10877 -2382 -13407 -13314 -1626
1108 -1626 9356 10691 3636 -4336 -6871 -3784 -362 2099 4707 6724 4892 -2106 -8887 -7189 3283
1123 3283 12841 11195 -15 -9236 -7752 1724 9191 8533 2112 -3028 -2134 1436 2519 883 698
1138 698 3902 5792 1577 -4294 -4913 959 7115 6181 -423 -5304 -3207 2810 5446 2239 -2881 -3206
1154c206N060M228k148o123k860M201O398J174m717m616P13L537J645j863j821
1169c98K952K874j775o614l833M066R450M399n701j0705n459N335J0049N056l964
1184E732p735l849J409K588J543J720K864N47n593q602k786P492J1178M374p364
1199C518j2857o954N536J1931P633l058r324o568Q46L994L375K998K919j47n661
1214a819q167k445P734J2062M827o882j3370o455O164J1804O656l708q305n373
1228g277P09L885K478J724K445K75m166o930k805N834R968L881n785j0291m727
1243a0782M847R093L645l606o450k381K032K425K83j652K84K758M00l961m599
1258g664J615O399M065l332n824k316M474N426M01m703k852J956N630K063m097
$$ plain form
1154 -3206 1854 6082 3934 -2189 -5049 -848 5550 6724 2007 -2609 -1896 1641 3286 1423 -398
1169 -398 2554 5428 3653 -2961 -6794 -2728 6722 11121 5420 -5285 -10744 -5409 4640 9696 5732
1184 5732 -2003 -5852 -4443 -1855 -312 1408 4272 4819 -774 -9376 -12162 -4670 6508 10882 3518
1199 3518 -9339 -16293 -10757 1174 8807 5749 -3575 -10143 -9297 -5303 -1928 1070 3989 3842 -1819
1214 -1819 -9986 -12431 -4697 7365 12192 5310 -8060 -14515 -8351 3453 10109 6401 -1904 -7277
1228 -7277 -6568 -2683 -205 1519 3964 4239 73 -6857 -9662 -3828 6140 10021 4236 -6055 -10782
1243 -10782 -5935 3158 6803 3197 -3253 -5634 -3602 -1177 -894 -2546 -2262 496 896 -3065 -7664
1258 -7664 -6049 350 4415 1083 -4741 -7057 -2583 2843 3244 -1459 -4311 -2355 3275 5338 1241
1273A241n612j17N842M747j491n332k540K081L412l72k012P33K784O49l494n287
1289d768l07O309P220M68p713r123n56P677Q337J030o436p141j481K482K763J313
1305G4R98J412j714o322n597P58R148R146m64j0265j0406q94R437J0783K276o637
1321A733q095k362K582M684K459K068J132k122o708n560K155R506Q529o65r854
1336e18j0143p40Q567J0393K338o363p951j953L283L857J680Q55R58q95m856n107
1352f595L04O851P624m54q446q628l33P509P104K4o172m943M95L428J810j664
1368b086n07J879K060j426m129j899L797N482J464m061m912L66M687L243j541
1383B417m435j331M024M296m67n170l160K153N825K859l012n008o10L215K366
$$ plain form
1273 1241 -4371 -4488 1354 6101 4610 -722 -3262 -1181 2231 1859 -153 580 3364 4013 519 -4768
1289 -4768 -5075 1234 8454 8922 1209 -7914 -8470 -793 7544 8574 2138 -5003 -6484 -4002 -1239 74
1305 74 1072 2484 770 -5552 -11149 -10391 -1243 7903 7439 -2826 -13232 -14126 -4689 6094 8370 1733
1321 1733 -6362 -8724 -6142 -1458 1001 3069 4201 2079 -4629 -10189 -8034 1472 10001 9336 -518
1336 -518 -10661 -11401 -2834 7559 9897 3534 -4417 -6370 -3087 770 2450 3305 4263 3368 -1488 -6595
1352 -6595 -6291 560 8184 7730 -716 -9344 -9677 -2168 4936 4960 -1212 -6155 -5660 -2232 -422 -2086
1368 -2086 -2593 -714 1346 -80 -4209 -6108 -2311 3171 4635 574 -4338 -3972 715 3958 2417
1383 2417 -2018 -3349 675 4971 4504 -666 -3826 -1673 4152 7011 3999 -1009 -1619 1596 3962
1398C962l4j911R68K366j082m004l587K314O811M444l690q759o186L355Q726N461
1414I154l107p583m119R70K616K721J452R45M1l627n730k312M789Q622M966m451
1430E347j0741o865L872J0676P255k411q137o126J61M317L732J895J041o20l361
1445C5n654k348M944R327N148m756j0578o429M080J0151O410k142q206n298J007
1460d309L613K815O46M76n5k468m710k913L018P521M084m002q124m833L031P543
1476A333M621k370o051l101K474L451K53j392l51J980P60k113l629K1M576L471
1492C933o60m396k937J878M661J518k841l822J536M130K383k680m939q16M800
1507A748M398J98m191l880J298K875J553j315m60Q83J135k354l600j135M078O032
$$ plain form
1398 3962 3928 2017 2985 5351 4269 265 -3322 -1008 5803 10247 6557 -2202 -8388 -5033 3693 9154
1414 9154 6047 -1536 -5655 -4685 -2069 652 2104 3049 3090 -537 -6267 -8579 -3790 4832 9798 5347
1430 5347 -5394 -12259 -8387 2289 9544 7133 -1004 -7130 -6969 -2652 1080 2975 4016 3396 35
1445 35 -5619 -7967 -3023 6304 11452 6696 -3882 -10311 -6231 3920 10330 8188 -18 -5316 -4309
1460 -4309 -696 2119 2765 3241 3186 718 -3992 -6905 -3887 3634 7718 3716 -4408 -9241 -6210 1333
1476 1333 5954 3584 -2467 -5568 -3094 357 610 -782 -1133 847 1607 -506 -4135 -4114 462 3933
1492 3933 3273 -1123 -4060 -2182 2479 3997 1156 -2666 -1130 3000 5383 2703 -2236 -3052 1748
1507 1748 6146 6344 2153 -1727 -429 2446 3999 2684 2224 3107 4242 1888 -1712 -2847 1231 7263
1523G263J289n581p975j900O053P905K471n274p401j789L273L130J717M71j93
1538C459o33m357m184M07O471P564K52p590r435j818P331R786K653n881p471l256
1554f702K858M151L005J207r9k324m349m002Q74O840O860J018q146q555k319O867
1570b816R193K398n311p084l139K692M164J888j40j46r94k579l834j67M684O133
1586D942J157n809p601j113N672O537J442n032n322j46L538K251r58j751N16K008
1602C31k2l234j998J771M721J490k451m338l89L182L167n25l677j526K028M068
1618B598O71l898m120J330N158L375k060m657j915K279K820N26j154o02J159O58
1634B168l003k786J056N493M621j859p206n280J562Q211N309j668o452m502L06
$$ plain form
1523 7263 8552 2971 -5004 -6904 -851 7054 9525 4251 -3150 -4939 -1666 1464 3181 3652 3459
1538 3459 2826 -1531 -5715 -5308 1163 8727 8979 1389 -8046 -9864 -2533 7253 9906 4025 -3446 -6702
1554 -6702 -3844 307 3312 4519 4420 2096 -2253 -6255 -5381 1459 8319 9337 1191 -7364 -9683 -2816
1570 -2816 6377 8775 3464 -3620 -6759 -4067 97 1985 1845 1699 705 -1874 -5708 -5875 -1191 4942
1586 4942 6099 290 -7311 -8424 -2752 3785 5227 195 -5127 -5273 -1735 516 -442 -2193 -1677 331
1602 331 309 -2925 -4923 -3152 1569 3059 608 -3730 -4119 -937 2230 1705 -1972 -3498 -1470 2598
1618 2598 3269 -629 -4749 -3419 1739 5114 3054 -1603 -3518 -1239 1581 2107 953 351 1510 2168
1634 2168 -835 -3621 -2565 2928 7549 5690 -1516 -6796 -5234 2977 8286 6618 166 -4336 -4030
1649d030L632K873J179J11n58k445l845j703K975O730M246k560q644o245K008
1664f276Q799P183j018p145o166m19M312L939J438jj315k458l923j787L392O499
1680E054M368k716q674o034K086Q527O680j476p064n494K43M161K835M16l01m05
1696B206j576k871k281J755N082M236k161o566m800J532O580M201j259n338l215
1711d475J066L675J012j438r13N42J446o94k450j275K495L473K28l286k940Q56
1727b678L635J746k113l290m8L309K886j442m489j715K931M544J227l443l926
1742b866l62K661K483j35o68m13O26j131k566n41K494M825K102m681o298k334
1758f804M406P501K832m290o371k434K325L843K421K11j268q76k335k829j41M690
$$ plain form
1649 -4030 -398 2475 3654 3765 3207 762 -3083 -4786 -1811 4919 9165 6605 -2039 -8284 -6276
1664 -6276 2523 9706 8688 1543 -4623 -5042 -730 3209 4647 4646 3331 873 -3050 -4837 -1445 5054
1680 5054 9422 6706 -1968 -8002 -5916 2611 9291 7815 751 -4743 -4500 -339 2496 2912 2611 2206
1696 2206 630 -2241 -4522 -2767 2315 6551 4390 -2176 -6976 -5444 1136 5337 4078 -1260 -4475
1711 -4475 -3409 266 1278 -160 -1073 -531 915 221 -2229 -3504 -1009 2464 2692 -594 -3534 -2678
1727 -2678 957 2703 590 -2700 -2748 561 3447 2005 -2484 -4199 -1268 3276 4503 1060 -2866
1742 -2866 -3228 -567 1916 1781 1113 700 1326 195 -2371 -2912 -418 4407 6509 1828 -4470 -6804
1758 -6804 -2398 5103 7935 3645 -2726 -5160 -2835 1008 3429 3640 2372 1496 -839 -3668 -3809 881
1774H81O098J198n508p941k435N707Q488L183m313o973l699K421M539K756M57
1789D859j073j328l181k972K41N345N558P28n117p649k418N005P867L545m193
1804E217p048l176K455M259J862l44j091n01j876k089n59K773M719J188l586o111
1820c908k236M123N662K160l617n116j024L106K543l48j773o93J486Q10j442k173
1836b440O26K852J805j181l630j260K316K781J02k529k373J640L122Q61k701l711
1852c720K24L812L716r97l926l236J509K767J699q77r68n4L35j497j910N46L439
1869H62L888p09n230n200O05O313N932j99n881m970k56L733L390J098n19j395
1885A462j906k164j141J906M863M032j575o950n516J433O766O793Q7o511o339
$$ plain form
1774 881 6979 8177 2669 -5272 -7707 -2000 6488 9671 5358 -1615 -5314 -2893 1646 4402 4859
1789 4859 3786 2458 -723 -3695 -3454 1891 7449 8177 3060 -4589 -7007 -2002 5865 9410 5217
1804 5217 -1831 -5007 -2552 1707 3569 3225 2134 1633 -243 -2332 -2891 -118 4601 5789 2203 -3908
1820 -3908 -6144 -2021 3641 5801 2184 -2932 -3956 -850 1693 1345 -428 -1121 365 1175 -267 -2440
1836 -2440 -1814 1038 2843 1662 -1968 -3228 -912 1869 1971 -558 -2931 -1291 1831 2692 -9 -3720
1852 -3720 -3496 316 4032 3035 -891 -4127 -2618 149 1848 971 3 -51 284 -1213 -3123 -2577 862
1869 862 4750 4041 -1189 -6389 -5784 529 6461 6262 381 -4589 -4845 -1112 2278 3376 2857 1462
1885 1462 -444 -2608 -3749 -1843 3020 7052 5477 -1473 -6989 -5556 1210 8003 8090 1579 -4760
1900d760m29L787M262J715r84j506k055k355j040J541N211L701j559o689n473
1915f633O75O708O634o23o134n456K59L627L495Q13j295j062n47k054j286R95
1931a884L749L401j013m381m725M17N011M187k79m645l531Q50L525J657j630j686
1947i77J10J612q5j843j622J311K348J567k316l102J88K147J892r93k874r53K474
1964a116K429o78l668j945J492M159J439k612l759r80K162K674M61q99j036N36
1980a341l45j509p58J909L902J561k097n549k661K696O577L542l162n842k739
1995e816J578M360K523n51j253j049j672j845M86K946M454J517l704o356l083
2010g465M193P230L729l706o519l957K150M423L007o1k018j574k062j594M37L216
$$ plain form
1900 -4760 -5189 -1402 2860 4575 3591 2085 30 -2325 -3365 -1824 3387 7088 5529 -1160 -6633
1915 -6633 -5958 750 7384 6761 627 -4829 -4570 -943 2552 3365 2070 1008 461 -1593 -2879 -1884
1931 -1884 1865 5266 4253 -128 -4853 -4436 575 4762 4483 -162 -3693 -2843 682 2339 709 -977
1947 -977 -867 745 660 -1183 -2805 -1494 854 2421 105 -2997 -2809 -662 1230 237 -2637 -3590 -1116
1964 -1116 1313 635 -3033 -4978 -3486 673 2112 -500 -4259 -5239 -3077 -403 58 -841 -1877 -1341
1980 -1341 -1686 -3195 -3953 -2044 1858 3419 1322 -4227 -6888 -4192 2385 5927 2765 -3077 -5816
1995 -5816 -4238 122 2645 2094 841 -208 -1880 -3725 -3239 -293 4161 5678 1974 -4382 -7465
2010 -7465 -3272 3958 7687 3981 -2538 -6495 -4345 78 3085 3024 1006 -568 -2630 -4224 -3787 -571
2026e71M375J051l907n681k851M089O724L412k910n717l078J468M548K506n23
2041B935j505p61q21j271m8J672L397J738k573m852k604L237M632K209k203m460
2057a278j599K289L115M17j933j306R43J164p26k007n43J610J898l64l088j531
2073b939J124J886N18k079j995N42K970N08j576l519o58L212L414J63l414k979
2089d822M62K371K577j18j598n73M34o46j238K29K139L266K33m450m180k61N125
2106a050N172N0m330m680q85L471L829J223q81j689j637j267o30J265L627K990
2122D578j210m784n359M9N462N675J042n511n946j109L114M644J380o78k449j422
2138b524j449j95J453L744K733p74m307m931M85M915N900N53m845m985n92L096
$$ plain form
2026 -571 3804 4855 948 -4733 -7584 -3495 3229 6641 3731 -1986 -5064 -3596 952 3458 2935
2041 2935 1430 669 -152 -1423 -1471 201 3598 5336 2763 -2089 -4693 -1456 3176 5385 3182 -1278
2057 -1278 -2877 -588 2527 2944 1011 -295 648 1812 1086 -921 -1464 146 2044 1680 -1408 -2939
2073 -2939 -1815 71 589 -1490 -3485 -2943 27 535 -1041 -4560 -5218 -2006 1408 1571 -1843 -4822
2089 -4822 -4360 -1989 588 470 -1128 -1701 -1267 -1913 -3151 -2922 -783 2483 2716 -1734 -5914 -6175 -1050
2106 -1050 4122 4172 -158 -4838 -5723 -2252 1577 2800 1919 230 -1407 -2674 -3304 -2039 1588 4578
2122 4578 3368 -1416 -6775 -6726 -1264 4411 5453 -58 -6004 -7113 -3999 645 2025 1347 -1102 -2524
2138 -2524 -3973 -4168 -2715 1029 3762 2988 -1319 -6250 -5765 -850 5050 5603 758 -4227 -4819 -1723
2154a723M006O69j347j054q33o07n21Q66K489K511k30l151l517P0L508M558J72
2171E866l791l106J49K535J863o84k012n12J222K18r57j537k6J978J179j218k474
2188a307o81J403K099l80j896j368J433K646J9k721k805J344L812K039j998l393
2204a754j907J532K870Q64l89j299p30J33p02q8P68K534J883j806m095k698K366
2221b518N373L504k189n342l127J392L570L087l6j972k279j488n63K61J912L448
2237C033J106k813n562k807K943O227L386k115o158l531J165M666L217R7k086
2252G68j940j276o61L89K102L075J347k597m816k375K455N466L346j602n041l343
2268d703J409M139K417j22j971o12k72m36k5J003K512J123j110l481k095J366
$$ plain form
2154 -1723 2283 2952 1605 551 -282 -889 -1410 -544 1945 4456 4226 1075 -2442 -2372 1136 5694 5866
2171 5866 2075 -1031 -882 1653 3516 2832 820 308 1530 1748 791 -746 -772 1206 2385 1167 -1307
2188 -1307 -1988 -585 1514 1134 -762 -2130 -697 1949 1968 -753 -3558 -2214 1598 3637 1639 -1754
2204 -1754 -3661 -2129 741 1605 1216 -83 -813 -680 -1382 -1470 -702 1832 3715 1909 -2186 -4884 -2518
2221 -2518 2855 6359 4170 -1172 -4299 -2907 663 3750 3714 1742 -537 -2025 -2588 -2327 -415 3033
2237 3033 4139 1326 -4236 -7043 -4100 2127 5513 3398 -2760 -6291 -5126 -460 2757 2854 768
2252 768 -1172 -2448 -3109 -2720 -618 2457 3804 1207 -3609 -5984 -3529 1937 5283 3681 -1360 -4703
2268 -4703 -3294 845 3262 3140 1169 557 285 -151 -176 827 3339 4462 3352 -129 -2224 -858
2284h58L710K584j883l509k399J926K733M95j323j535M18R72M39j525r17Q61J804
2301A993N59j460k220J86J912J432j624j517J81J647J479j615k498j432K633L054
2317B710Q63l035l041k44K015K950L26j837p31k60J16k85k97J870K366L04l122
2334F68l949p19L922M445P90l733m907j044K696L233J421j324j998j710q29M0
2350b998R31K715K284q87l638m244j55M561M914P75m008n334j679K940L950K266
2366B393j622k104j975m58N64N19K830K228o84l372l902j26M007N305R20m048
2382D75m298j141K995L735J039j619j294j199j78J60M19J592J410J75k262k772
2398b763n22K706L144N98k269l491J34K149J981j35k024n88Q84R57m19j312k76
$$ plain form
2284 -858 2852 5436 3553 44 -2355 -429 2304 2799 1476 -59 359 1331 1770 245 -672 189 1993
2301 1993 2552 1092 -1128 -942 970 2402 778 -739 -558 1089 2568 953 -1545 -2977 -344 2710
2317 2710 3573 538 -2503 -2747 -732 2218 2544 707 -24 -284 -168 -453 -750 1120 3486 3790 668
2334 668 -3281 -4000 -78 4367 5157 1424 -3483 -4527 -1831 1402 2823 1499 -499 -2209 -3038 -2998
2350 -2998 -2067 648 2932 2045 -1593 -5837 -5992 -1431 3483 4258 250 -5084 -6763 -3823 127 2393
2366 2393 771 -1333 -3308 -3766 -3202 -2683 147 2375 1691 -1681 -5583 -5709 -1702 3603 4523 475
2382 475 -3823 -4964 -1969 1766 2805 1186 -108 -1307 -1485 -1325 -906 686 2096 2271 9 -2763
2398 -2763 -3285 -579 2565 3163 894 -2597 -2463 -314 1667 1532 -492 -1080 -196 761 342 -970 -1246
2415a246J504J458m13k062r68J033J422N22j285j590J563J765J64k104j535J53
2431a619K984K321n57l176k190J180K858J184n05j147q61j0j85k34L44K252Q38
2448C477r76l854j957R86M394L263j503m499l309L67L572L275J7k137k545q16
2464b245j92P32J513K045J022j840m376k500J854M872M049j994n122l537Q96L926
2480h97K965M61k146k124j126q7R18J503K375P55j700l591k433K057M567K893
2496D390j067m499l163P39L378K912m95j831k127K93K88p9L91J640J036q21k533
2513a548k345J371L060K225j170k902k103J291K704J265j177k039L01J310N78
2528H21j220r32M85J685R38j128j327m06J592Q79j99j214l35J561J306p02k046
$$ plain form
2415 -1246 258 1716 1303 -759 -1727 -694 728 1250 -35 -1625 -62 1703 1867 -237 -1772 -1619
2431 -1619 1365 3686 3129 -47 -2237 -1057 1801 2985 2480 1333 472 462 277 43 387 2639 3477
2448 3477 2501 -1353 -3310 -2324 2070 5333 3830 -669 -3978 -3611 -39 3236 3253 1116 -1429 -2245
2464 -2245 -2437 -1705 -192 1853 2875 1035 -3341 -5841 -3987 885 4934 2940 -2182 -5719 -4823 -897
2480 -897 2068 2529 383 -1741 -2867 -2954 -2036 -533 1842 2597 897 -2694 -5127 -3070 1497 4390
2496 4390 3323 -1176 -4339 -3600 -222 2690 2195 364 -1763 -1470 -1182 -1261 -870 770 1806 985 -1548
2513 -1548 -3893 -2522 538 2763 1593 -1309 -3412 -2121 583 1848 671 -1368 -1067 243 821
2528 821 -399 -1331 -846 839 1777 649 -678 -1084 508 1387 1188 -26 -361 1200 2506 1804 -242
2545b42j322J797L080R99k036l053o05K005K698O96j341j833m37N06l11L20P40
2562A661J740M13k622l355m88K927L876J060k975m358j392K284L777J527j045
2577C030k447j893K27Q7J185K032J687o76k792l432l41L209M613J324l216m956
2593b359j950K724M068J681j070k620j501n81J052R74J481J848q76k368l285p12
2609c494L049L881J284k969m289j348K189L098J077j636j718r83N9q9N69M04J328
2626D12L13j482k241n28J998K636J062j781k598r88K120J875K02j623p77M94J341
2643D35N66j587o28P75J374J88j122j282O11J458N25p43r26L12J628K78r94k093
2661a225O9K307K303l59k909k238M50K262J547J7j978j410k87M35J39N64J169
$$ plain form
2545 -242 -1564 233 3313 4312 2276 -777 -1382 623 3321 4017 2676 843 406 912 601 921 1661
2562 1661 3401 3814 1192 -2163 -2651 276 4152 5212 2237 -2121 -3513 -1229 2548 4075 3030
2577 3030 583 -1310 -1083 -996 189 2221 3908 3232 440 -2992 -3333 -124 4489 5813 2597 -2359
2593 -2359 -4309 -1585 2483 4164 3094 474 -1027 -1608 -556 418 1899 3747 2871 503 -2782 -3494
2609 -3494 -445 3436 4720 1751 -2538 -3886 -1697 1401 2478 842 -876 -1859 -1800 -1889 -1320 -916 412
2626 412 725 -757 -2998 -3526 -1528 1108 2170 389 -2209 -3197 -1077 798 1000 -623 -1400 -906 435
2643 435 1001 -586 -1214 -439 935 1123 1 -1281 -670 788 1313 570 -356 -44 1584 1862 868 -1225
2661 -1225 -1156 1151 3454 3095 186 -2052 -1602 660 2207 2224 246 -1164 -1451 -1016 -877 -313 856
2678H56J041j227k247k262R67L878K835m53l775k989K23L392L079M37j954k206
2694d05p07L24Q61J213J350R84j420l366j941J352L918L400j134l733l654M55
2710b503L704L031N86k157k449r39K8J018J394J125L53j503k737k345Q18L538
2726I62K262m33l943k888lL181K422p5j951j806J61P43M40M09M87R52k51j500
2744h31j583j36K626K024n42k564j609N93K503J087j137j593K5R57J102n57j018
2761f53rJ436J451n57j312n27P86J217m22j131l26P87R97p28j603r72O68K004
2779A106J091j636k545j226J241K902N62q68k031n34M80L89M82N43J277M18j476
2796A75k378p31J810L647J277k196l951j493K138K829K136j161j905j786O2P20
$$ plain form
2678 856 1897 670 -1577 -3839 -2872 1006 3841 3388 -387 -3376 -3153 239 3318 3755 1801 -405
2694 -405 -1112 -788 73 1286 2636 3620 2200 -1166 -3107 -1755 2163 5563 4429 696 -2958 -2503
2710 -2503 1201 4232 4818 2661 212 -727 -699 319 1713 2838 3191 1688 -1049 -3394 -2576 962
2726 962 3224 2791 -1152 -4040 -4043 -862 1560 1485 -466 -2272 -2111 -1368 -928 -519 -32 920 669 -831
2744 -831 -2414 -2550 76 2100 1558 -1006 -2615 -2022 481 1568 431 -1162 -1137 -180 922 365 -653
2761 -653 -662 774 2225 1668 356 -171 615 1832 1410 279 -47 740 1737 1009 -594 -1566 -898 1106
2779 1106 2197 561 -1984 -3210 -1969 933 1495 627 -1404 -1938 -1458 -1069 -587 -44 1233 1651 175
2796 175 -2203 -2934 -1124 2523 3800 1604 -2347 -3840 -1702 1127 3263 2102 197 -1589 -1527 -807
2812h07J354J270J344k19j929k464o56K753L763J167k441m050j846J575L689J662
2828D165p58l054j995M0O59J080O69M72k1j841k549q66K761K906J322k247l056
2845b313j697J805L106J097j338j578j106K78O54L22L67M81J96q71j840m33J066
2862a804K057J135q92k478j040J587K564J59j210j019j65J749N54q02j008Q5J092
2879E64Q11j483n26p65Q13Q50p25r54j01J090J57o50j486n25J892J992kk216j805
2898c069n8K082K380J91j923j021m72O95M63K21Q02M06n23j832j652M21L006K610
2916B727k19k820k866q2K781L326N15j679j937r00N69J138J399J110m8q39k249
2933g4j822Q82K828K611k85l631l042m10K894L207J76k048k030r80P22R07J391
$$ plain form
2812 -807 547 1817 3161 2942 1013 -1451 -2107 646 4409 5576 3135 -915 -2761 -1186 2503 4165
2828 4165 3407 353 -1642 -1602 -943 137 806 1278 1257 -584 -3133 -3999 -1238 1668 2990 743 -2313
2845 -2313 -4010 -2205 901 1998 660 -918 -2024 -1746 -1092 -770 -403 78 274 -597 -2437 -2870 -1804
2862 -1804 253 1388 496 -1982 -3022 -1435 1129 1288 78 -941 -1106 643 1197 395 -613 -528 564
2879 564 1375 -108 -634 -1399 -586 264 -461 -1415 -1516 -426 -269 -919 -2405 -2930 -1038 954 952 -1264 -3069
2898 -3069 -3127 -1045 1335 1526 -397 -1418 -1890 -1195 -732 -511 291 697 174 -1658 -3310 -2889 117 2727
2916 2727 2508 -312 -3178 -3260 -479 2847 3362 1683 -254 -1154 -585 553 1952 3062 3014 2175 -74
2933 -74 -1896 -1014 1814 4425 4140 509 -2533 -2943 -49 3158 3334 1286 -744 -1724 -1002 -95 1296
2950A296P17K36j166j820j515R66K334K372j70l096k635k52K667K416k3j316k020
2967a009m16R05M07O07Q6K80Q6m34j709J63K003J733j46j973j778K66K205J129
2985B405n11j943o10J044O96k02j278p83J078Q22j40q13q82J35M36O62o83k32
3003g99L51M00K36j271j033N61J742J178r74j991j636O90K494J352j104j615j265
3020b684R23M34N31N62P90J43j050j698o76J933K582J343j250l226j485J059L528
3037A759J804q60k376j616j46Q92J384M58O28k94j485j881k30J475K984J502j732
3054B266l347k249J532L097K135p90k325j691n6J258J145M70J65o1j345j619r11
3071b326J885K418J539j697k742j772J780K686J395p64j895q40J58J105L26J25
$$ plain form
2950 1296 2013 2249 1083 -737 -2252 -1286 1048 3420 3250 154 -2481 -2733 -66 2350 2327 1011 -1009
2967 -1009 -1425 -520 -113 494 580 860 946 512 -1197 -1034 969 2702 2556 583 -1195 -929 1276 2405
2985 2405 1894 -49 -659 385 1081 879 -399 -1182 -104 718 578 -235 -1117 -982 -546 116 -567 -799
3003 -799 -448 -48 188 -1083 -2116 -1555 187 1365 391 -1600 -3236 -2546 -52 1300 196 -1419 -2684
3020 -2684 -1761 -1327 -796 -234 556 699 -351 -2049 -2725 -792 1790 3133 1883 -1343 -2828 -1769 1759
3037 1759 3563 2703 327 -1289 -1435 -543 841 1299 1927 1633 148 -1733 -1963 -488 2496 3998 2266
3054 2266 -1081 -3330 -1798 1299 3434 2644 319 -1372 -1428 -170 975 1445 1610 1549 204 -1415 -2326
3071 -2326 -441 1977 3516 1819 -923 -2695 -915 1771 3166 2402 507 -333 -175 930 1256 1381
3087A381M30L52n99j130o74R12J226J257j025j939j007Q39J355Q84j015j274l15
3104c42J008O57m32j198K2Q27P77n40j270m40O54P15J34j233o3L93P43q28j339
3123a755j33Q74J843M79j664k117m05J632K198N09j640j621n01J088N67J245J02
3140G01o1l34j232j428L98K242J971J16k498k914m64K469K656J061j874k131j578
3157b900P80J291J318M72r2o37j958j067M13K383K353n92k592k314p00K604K763
3174A525O54j561k416r86Q00J425J083L80M94j519j296q78N87J978K025j4k192
3191H9k258k7J938K382N85j503j549n23R25P81L83r8J69m21j09j540J63Q34J799
3210B020K69j616j469l82J718J199o17j267p13P76P43p4q63l41J69Q29Q61q38
$$ plain form
3087 1381 1811 2163 1564 434 -240 672 1898 3155 2130 191 -816 23 1378 2262 1247 -27 -342
3104 -342 666 1323 891 -307 -285 542 1319 779 -491 -931 -277 438 572 -661 -724 -331 412 -416 -1755
3123 -1755 -1888 -1014 829 1308 -356 -2473 -2878 -1246 952 1461 -179 -1800 -2301 -1213 -646 599 701
3140 701 640 306 -926 -2354 -1956 286 2257 2373 -125 -3039 -3503 -1034 1622 2683 809 -1322 -2900
3157 -2900 -2120 -829 489 961 869 232 -1726 -2793 -2380 3 2356 1764 -828 -3142 -3842 -1238 1525
3174 1525 2179 618 -1798 -2784 -1984 -559 524 904 1398 -121 -1417 -2295 -1708 270 2295 2281 89
3191 89 -2169 -2196 -258 2124 2709 1206 -343 -866 59 840 1223 1125 1294 873 764 -776 -613 221 2020
3210 2020 2289 673 -796 -1178 540 1739 1122 -145 -858 -82 661 587 -276 -617 -448 381 1242 404
3228D04r55k84R97M29r8m70j58N39R1o80j056P59J233J069o3k257j315P77J973
3247I35J184l27j696j075J70R31R78L34l6r9p81j151q99J060K158J255j166l016
3265a241j680P19K356K297q06k226j619m26J061J360O24M77m65j664j295k65J446
3282a347K380J333j372k810j648J148K650K000m57j941j974j9J513R89N92M74
3298A511n58r66q55o66J052J983J111q35k294j451J045K234J390n69j512j767
3314a147O76N00M38L75m07M5N8j204p33O02Q62J091l62j645j011L95J376J091
3332A000r03j220K68Q21N54l77m24l19O83O79J89j098m95J25P59L75o00j98N56
3351C75M74l01j160k01J392J157N03j469j703l27J309K222J51j052j608p88N96
$$ plain form
3228 404 -551 -835 162 591 493 23 -135 404 495 -185 -1241 -482 751 1820 1757 -500 -1815 -1038 935
3247 935 2119 1792 96 -979 -809 122 1100 1434 1398 1299 518 -633 -1532 -472 1686 2941 1775 -1241
3265 -1241 -2921 -2202 154 2451 1645 -581 -2200 -2626 -1565 -205 419 896 431 -1233 -2528 -2793 -1347
3282 -1347 1033 2366 994 -1816 -3464 -2316 334 2334 1877 -64 -2038 -2057 -544 445 1037 1511
3298 1511 953 -13 -868 -1534 -482 1501 2612 1777 -517 -1968 -923 1311 2701 2132 620 -1147
3314 -1147 -471 29 467 842 435 480 538 -666 -1399 -797 65 1156 794 -851 -1862 -1467 -91 1000
3332 1000 97 -1123 -855 -34 520 143 -281 -600 83 762 951 -147 -642 -517 242 617 17 -181 375
3351 375 849 548 -612 -813 579 1736 2239 770 -933 -1260 49 2271 2422 1370 -238 -1026 -430
3368d30R61N59n8l27l70r96j251J53J619J496M7j725k603l84J444K764Q08j376
3386C31k215j125R71J599Q78L53m18o55j070p92J3J826K092J94j963k471p82J873
3404a361K828N56r61k051r17M48J480J061L15j4n18j216l74q7J570J681M27k013
3422H54k144k12J007J993O05j064j747o84N94R67J44j74n14M72n00m73n44O64
3440g56J367J80l53j452n09J556Q04J18q50p90J79J186Q5o81n27O5P06Q50n39
3459F39o57n88R85K44P70n54%M60K08m38o99J98J109N73Kj625j450K06J578J630
3479B591n32j642j724K87P39J041Q6k13l43n59j003k77R47J181J715j005k469
3496a180j307L34K582J618m60j676j649k88J237Q62Q26n1o82o68j446p0Q36K021
$$ plain form
3368 -430 531 1090 1032 705 335 -661 -1912 -1759 -140 1356 1403 -322 -2925 -3309 -1865 899 1707 331
3386 331 -1884 -3009 -2038 -439 439 792 374 -281 -1351 -2143 -2130 -304 1788 1982 19 -2452 -3234 -1361
3404 -1361 1467 2023 1062 -989 -1906 -1458 22 1083 1398 1384 866 -350 -724 -811 759 2440 2867 854
3422 854 -1290 -1502 -495 1498 2103 1039 -708 -1392 -798 169 313 139 -375 97 -403 -876 -1420 -756
3440 -756 611 791 438 -1014 -1523 33 837 955 105 -685 -506 680 765 84 -443 -378 328 1178 639
3459 639 -18 -606 379 623 1393 839 839 1299 1507 1069 370 568 1677 2250 2252 627 -823 -617 961 2591
3479 2591 2059 417 -1307 -1020 -281 760 846 633 290 -269 -1272 -1549 -602 579 2294 1289 -1180
3496 -1180 -2487 -2153 429 2047 1587 -89 -1738 -2026 -789 73 899 848 166 -502 -1948 -2018 -1182 839
3514H39J106p65j877j867O21K353K100j79j814j689J44P25J201P17m39n68r29
3531c21p21j27L89J491J062q35j977j413J05K137J482m17j375j049M2Q68Q71l1
3549A81l05L52j30n26k07K0M20J297o15q34j001K78J246N88K8j417l67R25P30
3568F63J06p55m87M24J104L06l25r15mJ051K32M8p87K05J57K4p83m23N81P69O05
3589A796q14j773o61R90K173O23j083j904o82R47P24O84Q1Kp28p65n37M99R02
3608D74J220L54j266k111p93J004K163J283j296j894j381N93J452J244J89n58
3624F77m66o17o74J44J735J334K51j547k401n96J196K685P37j345j850j225M16
3641a546J696L14L22p90l07m17j095K82J177J340R9j161j786m90J163J530J009
$$ plain form
3514 839 1945 1180 -697 -2564 -1943 410 2510 2331 517 -1172 -1028 -303 898 1615 1176 608 -321
3531 -321 -1042 -1169 -780 711 1773 938 -1039 -2452 -2347 -210 1272 855 -520 -1569 -1527 -659 212 181
3549 181 -124 228 98 -428 -635 -615 -195 1102 487 -347 -1348 -1070 176 764 792 -625 -992 -67 663
3568 663 769 14 -473 -49 1055 1361 1036 121 117 1168 1400 1448 661 866 1023 1047 264 -159 422 1191 1796
3589 1796 982 -791 -1452 -462 1711 2334 1251 -653 -1335 -388 336 1020 1101 1103 375 -390 -927 -428 474
3608 474 1694 2048 782 -1329 -2122 -1118 1045 2328 1032 -862 -2243 -1650 -198 1046 1235 677
3624 677 211 -406 -1080 -936 799 2133 2384 837 -1564 -2160 -964 1721 2458 1113 -737 -1962 -1546
3641 -1546 150 464 786 -4 -311 -728 -1823 -1541 -364 976 1075 -86 -1872 -2362 -1199 331 1340
3658A340j039j647l25J66J079K92k69k49k42O1j76m86L18Q85M48p3j354l17P98
3677g90J030N92p35q81K81N13N93k40j026L12N56R12n21q57l85N51M31J81j74
3696C43m28J28o2k91Q8l43Q55Q88l5j042j341J18J428J396j17j252j051k82P28
3715b72J294M2n80L5n94o81l77O46J391P37j85j713j550M92J736K173j50j652
3733G92j812K41Q39J060O37K3k25j030q07n13Q59J372J091j137j599j353j5J965
3751C88J619K67j859j635j27P74J416M79k58q83m43n97j11P15J030N47l09j897
3769h84r58K31J625J205k7j432j300N0O76J076j87m23N8m45L49l02l9O83O85o
3789F35r22k95k97O31P63j38n54q41O95Q31J92r28m96K09R43J31k31r39o55O48
$$ plain form
3658 1340 301 -1346 -1671 -1505 -426 -134 -403 -652 -894 -833 -1009 -1495 -1177 -292 156 83 -1271 -1588 -790
3677 -790 240 832 97 -784 -503 10 603 363 -663 -351 205 1117 596 -261 -646 -95 336 517 343
3696 343 -85 43 -19 -310 -222 -565 290 1178 1143 101 -1240 -1122 306 1702 1585 333 -718 -1000 -272
3715 -272 1022 1064 484 519 -75 -756 -1133 -487 904 1641 1456 -257 -1807 -1315 421 2594 2444 792
3733 792 -1020 -779 60 1120 1757 1780 1555 525 -282 -795 64 1436 2527 1390 -209 -1562 -1577 388
3751 388 2007 2274 415 -1220 -1347 -573 843 1322 1064 181 -262 -859 -970 -255 775 1322 1013 -884
3769 -884 -1842 -1611 14 1219 1192 -240 -1540 -1490 -814 262 75 -348 -290 -735 -386 -688 -727 -44 641 635
3789 635 -287 -582 -879 -248 515 377 -177 -1018 -323 508 700 -228 -724 -515 428 559 328 -611 -1266 -618
3809f18R80L43p06m98L90K12n46P9j30J149Jk37j569o73J021J299Q85o89j588
3828h95m88J8J485M97M20n94m69m75j09l36J232J090M04j028j681o78J302J342
3846A037J493p81k008j075K98J475R60J31n68q07n89k53J74J269O44O15r69k044
3864i98q84J043K096J125j124j829p20K79J298N86N09q01p20o05j15L09Q15R25
3882A189R2q63r91j186J091J572M97k65j597p20L60J275K32k5n87m8m2l8k84J25
3902b13O61M09j79n62q68K72J025r8k29p09K3N20K49j74p56k7L46O74K8q50m63
3923i21K63O40J07R9m00j57J9J9j32p6N62P29J31r17j023l67J454J270O8j098
3943B70j230k82P50J050M83m62k61l46n25L1M31J053R69o77j267j323R0J792J497
$$ plain form
3809 -618 362 705 -1 -499 -109 103 -443 -364 -494 655 656 419 -1150 -1823 -802 497 1382 693 -895
3828 -895 -1383 -1365 120 617 1037 443 -26 -501 -610 -946 286 1376 1780 752 -929 -1607 -305 1037
3846 1037 2530 1749 -259 -1334 -1036 439 1399 1530 962 155 -434 -687 -513 756 1400 2015 1046 -998
3864 -998 -1882 -839 1257 2382 1258 -571 -1291 -1012 286 872 1381 580 -140 -745 -860 -551 264 1189
3882 1189 1281 418 -573 -1759 -668 904 1401 1136 -461 -1181 -821 454 686 661 74 26 -16 -54 -338 -213
3902 -213 448 857 678 116 -752 -480 545 447 218 -491 -468 52 301 127 -629 -656 -310 364 392 -458 -921
3923 -921 -658 -18 89 188 -212 -369 -350 -331 -463 -539 23 752 883 -34 -1057 -1424 30 1300 1368 270
3943 270 -960 -1242 -492 558 1041 579 318 -28 -553 -522 -91 962 1931 1254 -13 -1336 -1246 546 2043
3962B043K86j320j706n01Q24J267R72m27j088q78J89m62O16J068P37o82j214j354
3980a630M9J705J378M69j467j659j65P15J365N57n56m65o02k50J99M09N88Q01
3998A441M0j390j035P1J261J144Q0p71j372k82P56R90J18o30J2O1k16l56q7K79
4018A14N38J25n93p98l40P00P04m96k24o06J80O20R8n00m67l7N96M26N7j118m57
4039a478N97O47L63l50j93k12j49O1J49j49Q57M04k70j226q17Q41J378P20o3j894
4059g84n64P15Q22P91j32k57q75N6n79O85N39P75K77j074j006q21P37J592Q68
4078A765n14j865j344O03R36J330Q5p79l96r47M6K64J047R26o5q84j340n17Q02
4097h47J421J343p99j459j292M62J125Q05M55q64q63J0J23J72O99O35J0k15j193
$$ plain form
3962 2043 2329 1009 -697 -1198 -374 893 1865 1438 350 -528 -339 -801 -185 883 1620 938 -276 -1630
3980 -1630 -1581 124 1502 1971 504 -1155 -1320 -605 760 1317 761 296 -306 -556 -357 52 640 1441
3998 1441 1481 91 -944 -873 388 1532 1612 841 -531 -813 -57 933 1051 421 433 494 278 -78 -165 114
4018 114 652 777 184 -614 -954 -254 450 -46 -270 -876 -696 -76 22 -478 -945 -982 -386 40 97 -1021 -1478
4039 -1478 -881 -234 129 -221 -414 -626 -775 -714 -565 -714 143 547 277 -949 -1766 -925 453 1173 1110 -784
4059 -784 -1348 -633 189 980 848 591 -284 -228 -807 -122 417 1192 1469 395 -611 -1432 -695 897 1765
4078 1765 1251 -614 -1958 -1355 -419 911 996 217 -179 -1126 -1080 -816 231 1157 1092 208 -1132 -1649 -847
4097 -847 574 1917 1118 -341 -1633 -1171 -46 759 1214 350 -513 -503 -380 -208 491 1126 1136 921 -272
4116b72n43L36J691O62q28r14o26M51J063l2j08m85l01J79k51O5l56N15K20k79
4136A87k71o92K04O62M99m11q94k17P13M36k49o77Q2M1O47M25n29o26l54M99N10
4157a5K97o08j74M7j12j27K76J33N78m1n49o47j76P16J682J38j273j059m32O37
4177g09J485J84m42p86m7l70M7J59P50M73j56j184j244L32J091J380K95j023j398
4196a163n56N53J565O75n35o53o85l00K30R17M40R07p44j104j031o8J375J337
4214A160L61j222j337l07Q88J294L16j00o78o88N6L62N7P94J88J20r53n67k19
4233d75Q91J095J48p95j225m67Q79Q37J34o31k50N6J54l11K19j82N14J36j03n83
4253D1l19M84K98K90l31m44j68O06L79m63r89L15O24K35k76k01n34J60N57K04
$$ plain form
4116 -272 -815 -479 1212 1874 1046 132 -494 -43 1020 988 880 395 94 273 22 87 -269 246 466 187
4136 187 -84 -776 -572 90 589 178 -716 -933 -220 216 -33 -710 -628 -587 60 485 -44 -670 -1024 -525 -15
4157 -15 282 -326 -500 -453 -565 -692 -416 -283 295 254 -295 -942 -1118 -402 1280 1418 145 -914 -1346 -709
4177 -709 776 960 518 -268 -315 -685 -638 -479 271 744 588 -596 -1840 -1508 -417 963 1258 235 -1163
4196 -1163 -1719 -1166 399 1074 539 -114 -799 -1099 -869 48 488 1395 651 -453 -1484 -1552 -177 1160
4214 1160 1521 299 -1038 -1345 -457 837 1153 1053 375 -313 -257 105 162 956 1144 1264 311 -256 -475
4233 -475 416 1511 1659 864 -361 -828 51 888 1022 391 141 197 351 40 259 77 591 727 624 41
4253 41 -278 206 504 794 463 19 -149 457 836 373 -616 -301 323 558 282 81 -453 -293 264 468
4273D68L0m30j59j95K89J0L84M9O85l48p05n77k44J506O77n35j025q98K43O92
4293h3R05j91m78l55l35q1N50J57N67K53n46j160r17N97J379J196l19j743j376
4312a980P15P86J246rp36o47l51K19j42J089L52K64n18j458m01O30J336R50o1
4331A284j460j359P12O47J278k46n39o40k08J38n0J022Q0Q3j37r97m66J67J116
4350D25Q92o44q47m52J03Q80L32j59p04j6J77K39k73k62L00L57J40l35q49P3O29
4371FL23o2m57l83N02L32K02n14p07L03J148j30l20o72k03O54N02L4k7m92k92
4392b53L21k04%J9O65k34k00r02M8N90R77K69o70j145m10L77R71Q38n50p52l76
4413f21k02J09L51P35M71m44o66j013j11J096J073K78o08j777m14O36J131O43
$$ plain form
4273 468 498 68 -91 -286 3 13 397 446 1131 783 78 -499 -743 763 1440 905 -120 -1018 -775 -83
4293 -83 822 631 153 -202 -537 -618 -68 89 656 909 363 -797 -1714 -1117 262 1458 1139 -604 -1980
4312 -1980 -1265 -479 767 758 22 -625 -976 -757 -899 190 542 806 288 -1170 -1571 -941 395 1345 1284
4331 1284 -176 -1535 -823 -176 1102 856 317 -323 -531 -393 -443 579 659 742 605 -392 -858 -691 425
4350 425 1317 673 -174 -626 -523 357 689 530 -174 -190 -13 226 -47 -309 -9 348 488 153 -696 -623 6
4371 6 329 267 -190 -573 -71 261 463 -51 -758 -455 693 563 243 -429 -632 22 524 558 531 39 -253
4392 -253 68 -136 -136 -117 548 314 114 -788 -740 -150 827 1096 426 -719 -1129 -752 219 1057 507 -245 -621
4413 -621 -823 -714 -363 372 843 399 -267 -1280 -1391 -295 778 1056 448 -1329 -1743 -1107 24 667
4431F67j46k86j044Oj18Q34K58N22m59p57p48K14O40J334N89q77j299p04P62J064
4451D52L11k56o68k62k70K38M93J06L49L04p33q51j98O81J167L24r11j164q6P54
4471b20P56P1l32l85k90M21Pj33j70L12P0K8l71j55J73M07q7J43m75j68N39M61
4493F02n18k06m07L84J002l15k53p73L00N50L82L9o45k99N4P2N11k84J98jo5n08
4515a80o26L76O02R34k57r82q88L13N02J109l26k20p25j38m8K33M36K19K98n03
4535A29q97n05M40Q47Q34q3r24j190K23Q45Q29N12p57j198J48j99M26Q14L18P
4555F19o55o40o39O24R78Q95j40j548o40j5Q46J096k56k98p38j19k2K65M28N1
4575I2K62p7j044n93P59R56K41Or85n41j38Q43R36l57l99j91K7L03q2Q1j45k6
$$ plain form
4431 667 521 235 -809 -803 -921 -87 171 693 234 -523 -1271 -1057 -417 917 1506 629 -670 -1374 -612 452
4451 452 763 507 -161 -423 -693 -455 38 144 493 797 64 -787 -985 -304 863 1187 276 -888 -974 -220
4471 -220 536 607 275 -110 -400 21 28 -105 -275 37 107 135 -236 -391 -218 189 102 245 -230 -398 141 602
4493 602 84 -122 -529 -145 857 542 289 -484 -184 366 748 787 142 -157 -103 -31 480 196 394 393 328 -180
4515 -180 -806 -430 172 1106 849 -133 -1021 -708 -206 903 577 357 -368 -506 -554 -321 115 334 632 129
4535 129 -768 -1273 -833 14 848 765 -159 -1349 -1126 -281 548 1060 303 -895 -747 -946 -520 294 612 619
4555 619 -36 -676 -1315 -691 287 1182 1042 -506 -1146 -1161 -315 781 525 227 -511 -630 -652 -387 41 92
4575 92 354 277 -767 -1360 -601 355 596 602 -383 -924 -1062 -219 717 360 -39 -230 -203 100 18 99 -46 -72
4597g2N92m51k46J10M3M89J24n69R8R3J6%j77n3m27J005L11l76q08k48N72N10
4619E36j24j37l87K63j53K40j13n2M18j4m96k35l07O28O99R4m34p97k93K33J293
4640H62L40n41q48n3k39N02M20L1L48k09q72n23J5R87R30L99r50j008o29N68J019
4661E49M14l51m44j033L78K04Q5P67j47K6n66n76k85P18P48N18q70r61n25O49
4681g02O53O23k54q06l56K36M16j18K98q8J79p65j08L27O1P63M12o08q52l40P12
4702c17O70L50m06r07J68N93m64L32j80n5L75o7J5o62M35J65O2j18J2j60K41J65
4724B47k88k43J73J41M29M28o51n97r2K62Q21o1l50p7m25K54L02m7l1J70p8k75
4746A2q57K14O72P07J08p34q33m9N12Q50J82o26o20K16K39J60K45K84J34l96o96
$$ plain form
4597 -72 520 69 -177 -67 -24 465 589 20 118 211 227 227 50 -3 -430 575 886 510 -298 -546 26 536
4619 536 412 275 -112 151 -2 238 125 73 491 477 -19 -254 -561 67 766 860 426 -371 -664 -431 862
4640 862 1202 661 -187 -240 -479 23 443 474 822 613 -259 -782 -767 220 1150 1549 599 -409 -1038 -470 549
4661 549 963 612 168 -865 -487 -283 -198 569 422 448 -118 -694 -979 -261 487 1005 135 -826 -1351 -702
4681 -702 -49 574 320 -486 -842 -606 -190 -308 -10 -98 81 -684 -792 -465 -404 359 771 163 -689 -1029 -317
4702 -317 353 703 297 -610 -442 151 -313 19 -161 -216 159 92 107 -555 -120 45 107 -11 1 -159 82 247
4724 247 -41 -284 -111 30 459 887 236 -361 -453 -191 630 569 219 142 -283 -29 273 226 195 365 287 12
4746 12 -845 -631 41 748 856 122 -711 -760 -248 602 784 158 -462 -246 -7 153 398 682 816 420 -276
4767b76l92K77P62P40qq88j151p0J221P47J17m77n58q50J28P58L18J84j00l26
4787A56o10n49L41R21O95k09r89n43m33J018O03J05l27n32m86L80Q6N17J71l65
4807e0j20n97j35M69O92J57m13R1q01q2P76L61l2k33l86q7M05J56k92l95N22J30
4829A36k38M6m79L24L50J18l04j2n99Q83J5o52r5K62M39J60l44k66j42J59L56
4850A17K26J08n25o09K78J87K95L4J50j23k40m94R8M58N33M05n15o40o02N93M88
4871B22P81m82l16o84pL02L51L13J66l69k90l99qM20Q19M48q72p57n63K93J408
4892G76K58q2o69q14J1J44O21J11L28m05l08n78L28P0P80K65m06j337J02N35M40
4913A70N64l87k90o19l11N80o2N55J0J95l07o32k24M69R26k04R3j117k70L91N91
$$ plain form
4767 -276 -668 -391 371 1111 1103 215 -936 -1006 215 962 1079 602 44 -806 -678 80 398 582 482 156
4787 156 -454 -1003 -662 259 954 745 -244 -787 -1220 -202 401 506 179 -353 -839 -459 -373 144 315 -50
4807 -50 -170 -767 -902 -433 259 416 3 94 -707 -789 -13 348 316 83 -303 -390 15 171 -121 -516 6 136
4829 136 -102 -56 -535 -211 139 257 -47 -59 -658 225 240 -412 -507 -245 194 354 10 -256 -398 -239 117
4850 117 343 451 -74 -683 -405 -218 77 111 261 138 -102 -596 -498 -40 493 898 383 -257 -859 -266 222
4871 222 1003 521 205 -479 -486 -184 167 480 646 277 -13 -412 -420 0 819 1267 395 -362 -925 -632 776
4892 776 1034 952 283 -531 -520 -376 245 356 684 279 -29 -607 -279 -209 571 836 430 -907 -805 -270 170
4913 170 734 347 57 -562 -873 -293 -355 200 210 405 98 -534 -758 -289 637 433 526 -591 -861 -470 121
4934A21l2K04o69K35J78l7K61l65K06j19j67M79j83m64K27K68J1n69O9M06O2J37
4956B59l50j58L23J31L67l40q31J50K53M60M00n51k11l57L86J52L0J72q4J61p21
4977c59j63O5O06O97k24m57j089N1Q39N74J89m7p55l95J34O73L8K77j50r0n31
4998a17m01O04N63N65j24n44j460K19P46Q92L00m91q10m11K89J54N49k0J5l62
5018A56k44k09r8R42M46m28o04p00N4N13O59J04m96k42m21K00M18M25j51j42k67
5039h5j09k30K30K92N69Q2p37m68K10J76Q43k83m09j04j22K81K24k55o0j98K26
5060G3J44M2o02L90l0L31l71k14k8M15j00L6k54j86L20M5Ol78N4k45N69K40o0
5083A97n17m1j05J68K88K47p6j85P3j39m96O15J68J79P1j037m0O3P66N90k72n14
$$ plain form
4934 121 89 293 -376 -141 37 0 261 -104 102 -17 -184 295 112 -352 -125 143 154 -415 -346 60 122 259
4956 259 -91 -249 74 205 572 232 -599 -449 -196 264 664 113 -98 -455 -69 83 113 285 201 362 -359
4977 -359 -522 -457 149 846 622 165 -924 -873 -34 540 729 682 -73 -468 -334 339 377 654 504 414 -117
4998 -117 -518 86 649 1214 1090 546 -914 -695 51 943 1243 752 -58 -469 -180 -26 523 503 518 156
5018 156 -88 -297 -395 547 993 565 -39 -739 -685 -172 487 591 95 -147 -568 -368 50 475 324 182 -85
5039 -85 -194 -424 -194 98 667 749 12 -456 -246 -70 773 490 81 -23 -145 136 360 105 45 -153 73
5060 73 217 259 -343 47 17 348 -23 -237 -265 150 50 86 -168 -354 -34 11 17 -361 -307 -552 17 257 197
5083 197 -320 -361 -466 -298 -10 237 161 -24 49 -90 -586 29 197 376 447 -590 -630 -567 199 789 517 3
5105Cj04l03N27J04L70k5m53m15l16k20P01O59L64k40p95n08L37R72K27J86q80
5126A91m56k41L96L10L74Q8m93J4l84q0M52O00r7k3p88o36K74L93J047l78l83
5147A80o82q5M79P07k65j29O5q4l35k45L80M14J42n1q28k02J69M98K79J46o36
5168h3j88M02k28L40O0l19O2K05j3k01J4j77K50L9L8m55R3J13K50n57J06K73K25
5191B49K48p18m56R2K32L80J04j93m76L5J54P4J62j51J92l40J58l08k69O46N74
5212C89J32n39n62k29L38O04M74m90o40k62L80M09K54J78l50o5j56k39q0M98N94
5233F38Q5o78r22R2L50P08P51p94o86m36J88J005M1J36k53l24l17J30J39J08N05
5254D66L37p63n58n5L08P23L20o61j22p49L83N84P1k9J38k24l68k1j32M27R2M17
$$ plain form
5105 3 -101 -404 123 227 597 572 119 -296 -612 -832 -131 528 892 652 -143 -651 -314 658 885 1071 191
5126 191 -265 -506 -110 200 574 662 169 183 -201 -281 171 771 674 651 -137 -773 -499 -106 941 563 180
5147 180 -502 -587 -108 599 334 205 270 186 -149 -394 -14 400 542 491 -337 -539 -370 128 407 553 -83
5168 -83 -271 131 -97 243 303 -16 46 251 238 37 51 -126 124 163 201 -254 -161 -48 202 -355 -249 24 249
5191 249 497 -221 -677 -585 -353 27 131 -62 -538 -503 -349 -275 -113 -264 -72 -412 -254 -562 -831 -185 389
5212 389 521 -18 -580 -809 -471 133 607 117 -523 -785 -405 4 258 436 86 21 -135 -374 -454 44 638
5233 638 723 45 -877 -785 -435 273 1024 230 -456 -892 -704 301 342 478 225 -99 -416 -286 -147 -39 466
5254 466 803 40 -518 -573 -265 458 778 117 -5 -754 -371 213 284 255 393 169 -199 -220 -352 75 167 584
5276E84j84k56m22L82K93K73m56m73P1J81K53n4l52p7M49m0k47l4k37R7N22j10
5298A63O3l27Q2J26n3k25q2L42K40m2m63l50M21K9L15K04p02l06J30L32K06O1
5320A64o2N6n79M6P8J76M05LJ39p19n13K08R36J45P0q51l13j46O13J55O2R5j13
5343E5k85l85L21PN10K09j77o23m28p4J129M98l30m10o08l4L22N67J80p7k13m66
5365c12k55M92J68M48M6j33o10m10J19P01N20j39m11l61j27M35K29K84o7n70J38
5386A85J8j98Q5K42j21L86p72q4K50Q4M23k02l50k71m9P02n0J30k14j73L64Q5
5408D70l66l99J2L85K50k63J1L5p7L08j13l66j51K22M40j71l25O7j70O64R1j89
5430C65p87K82j83M88M04l3l91j36j88j08k75N16N77l83o9l78m06J31O72N52l30
$$ plain form
5276 584 400 144 -278 104 397 670 214 -259 -188 -7 246 192 -160 -237 212 172 -75 -109 -346 -249 273 163
5298 163 226 -101 -19 107 54 -171 -253 89 329 287 -176 -526 -105 -76 239 443 -259 -565 -435 -103 103 164
5320 164 102 158 -421 -375 -297 -121 284 287 426 -293 -806 -598 338 483 553 -298 -611 -757 -144 11 73 168 55
5343 55 -230 -615 -294 -287 223 432 255 -368 -796 -870 259 757 427 17 -591 -625 -303 264 444 367 154 -312
5365 -312 -567 -75 93 541 587 454 -156 -566 -447 254 774 635 224 -137 -264 171 400 684 617 47 185
5386 185 203 5 90 332 211 597 -175 -259 -9 75 498 296 -54 -325 -374 328 278 408 194 21 385 470
5408 470 104 -295 -283 102 352 89 100 135 58 366 253 -113 -264 -42 398 227 -98 -31 -201 463 554 365
5430 365 -422 -140 -323 165 569 536 145 9 -179 -287 -562 -46 531 148 79 -299 -705 -574 98 650 320
5451C20o67n74J40Q30J16Q2j44o16j85L45L8K61Q38m48m82m02m84L22R88K66m12
5472A32p35l37K29O12M57R1k76k13l53J34j23M45N3K76l76k54l45M40O84K3K1
5493E85o54j02P5L08N11n26n7Q2k97j50K13L1M14L3n83J19k43J36L5M47J5o42
5515b50n7L45J99o7M0n07N05p1L18m68n8k53M88K6Nj30j33Q0k49kK48K1L67J29
5539E26m01j57J27M02k8J26l85l38K69m6K14R0k72m77M23m99J06L15L48n6j9l59
5561i1k62l53M56Q29k22o11k65k34M99M75J82n9m11m35nl4N34J64J57j95m31m40
5583g52J10Q05L3J89n28k45l82O70K90k7k6l09k91K82j06J52L96p9K29o59l64
5604f12J63M10M83j91m5n00l47L64O05k55J11k58j25J51j32j93L93J69p0j19m86
$$ plain form
5451 320 -347 -921 -781 49 165 247 103 -513 -698 -353 -315 -54 784 336 -146 -548 -1032 -710 278 544 132
5472 132 -603 -940 -711 -99 358 449 173 -40 -393 -259 -382 63 116 392 16 -238 -583 -143 541 564 585
5493 585 -69 -171 -96 212 723 197 140 222 -75 -225 -12 19 433 466 -117 2 -241 -105 -70 377 392 -250
5515 -250 -307 38 237 170 210 -297 208 137 455 -13 -71 -324 164 190 195 65 -68 12 -237 -239 9 30 397 526
5539 526 125 -32 95 497 469 595 210 -128 141 95 309 399 127 -350 73 -426 -320 -5 343 287 268 -91
5561 -91 -353 -706 -250 579 357 -254 -519 -753 -254 221 403 344 -67 -502 -507 -541 -7 157 314 119 -312 -752
5583 -752 -642 163 196 385 -143 -388 -770 -100 190 163 137 -172 -463 -181 -287 -135 261 182 411 -248 -612
5604 -612 -449 -39 444 253 208 -292 -639 -275 330 75 186 -72 -197 -46 -178 -371 22 191 121 2 -484
5625d84K7M85L45l38l7l23M2K94L13l33k18N9P6Q5q5Ql0K8K94N9j65o8j83M08
5649B59k01j5K32p6K46j59j70l15L03M26rj10m30k12R3L44K85N4l02j8l01J90
5671A14j58K82K51J30l64l36m18L40M68J50k29m98l80M1N56L03k0m6l08l09K18
5692b13j87N04J82k98R3n12n44N72L48N44m88k06k67J04L46K80K27l63l39J16
5712a01l03K28L78P7j45j23l71p2L68K87J68k53l20j76J8K82M34l37O1k74K7j25
5734b72K9nL08J06l73j29j43L62j01L38o4j31l34J56J39K05k93J79M7N2O0k2l32
5757b18M33n7k5J92l19J9K00l03j91N78p6J73Q9m87N6j47qR13o04j8k39p1J34
5780B4L79J68m11K76o19K20j00L55k5j6K49o85j96J41N25L60j60l76m55m79Q79
$$ plain form
5625 -484 -457 28 373 35 -2 -325 -283 11 324 -9 -227 -168 -92 -7 -92 -84 -114 -86 208 267 102 34 -149 259
5649 259 58 43 275 199 445 286 116 -199 104 530 521 411 -19 -231 -138 206 491 545 243 225 -76 114
5671 114 -44 238 489 619 255 -81 -499 -159 309 459 230 -268 -648 -607 -51 252 232 186 -122 -431 -213
5692 -213 -400 104 286 -12 81 -431 -975 -403 -55 489 1 -205 -472 -368 -22 258 485 122 -217 -101
5712 -101 -404 -176 202 279 134 11 -360 -432 -64 223 391 138 -182 -358 -340 -58 376 39 100 -174 -147 -272
5734 -272 -243 -248 60 166 -207 -336 -479 -117 -218 120 56 -75 -409 -253 -114 91 -202 -23 24 76 136 114 -218
5757 -218 215 158 133 325 6 25 225 -78 -269 309 233 406 495 8 64 -83 -91 822 218 200 -39 -110 24
5780 24 403 571 160 436 -183 37 -63 292 267 251 500 -185 -381 -240 285 645 485 109 -346 -825 54
5801E4K43K79M5q2o54k1J90K36J1J62j50m25k95L21K33K90L78l73o22l37O6Q39
5823C88j70K40l92k51K54l2r5M59P6k18j55l66m0L77L18P9l49n24j71M05J68J56
5845A57m9l18M8r1L90r4j20K55j02P1o54J27K78K67L4k0k89N3J23%J09l48L78
5868B05k6K9r6j51j26M54r2r4j17J05j4J36j04j41p4L46J0J15m41M8o0M06J87
5891E05j85l48n2j03L81K37l24Qj90K86l08j13L62J11J25l98l7l54M31M62J34
5912F30n23m1j23k78M59K13p0j39j7l60J04l4K81N25k29M0n87j16J4L74M72j63
5934D32n41l06K52j1P29nl70j75j23j55J88L7K34N0l88l46M05O4J64J03j00k63
5956a25n62M18K05NK50j65n4k03k32L34m0K35j08m8l9j11j16N31m07j8m8J57J54
$$ plain form
5801 54 297 576 621 539 -115 -136 54 290 301 463 313 -112 -407 -86 147 437 815 442 -180 -517 -451 388
5823 388 218 458 66 -185 69 37 -58 401 477 259 104 -262 -302 75 393 472 123 -401 -572 -167 1 157
5845 157 108 -210 -162 -253 137 43 -77 178 76 147 -507 -380 -102 165 199 179 -110 -57 66 66 175 -173 205
5868 205 179 208 112 -39 -165 289 197 103 -14 91 77 213 109 -32 -106 240 250 365 -76 -28 -88 318 505
5891 505 320 -28 -80 -183 198 435 111 119 -71 215 -93 -206 156 267 392 -6 -43 -397 34 496 630
5912 630 107 66 -57 -335 124 337 267 128 111 -249 -145 -179 102 627 398 438 -149 -265 -251 123 595 432
5934 432 -109 -415 -163 -174 555 550 180 5 -118 -273 -85 -48 186 236 -152 -498 -93 -29 135 238 138 -125
5956 -125 -687 -269 -64 -59 191 26 -28 -231 -463 -129 -169 66 -42 -90 -129 -240 -356 175 -232 -250 -298 -141 13
5979A3j20K89k4l35j7j86N39j81k30J29J73M8J59m50l30O00j38M6r9K19J25l27
6001i7j1n1j35M46M9K9l39k25J50K40J77p7j11k8l8j06L11k41M00J87k82k94k32
6024b78Q1M71L97P7l14m43n52O92J72M22m37k83J84l14J26J27L47j37k35l87k99
6045e83N89J87J92M1l47l72j54K08O80j73Po1m51J87O5j6K28n6L1m40p9o2K32
6068a47L33k11q3o23N23j36M10K41k14k03l39N07k91L82j54P7N5J07m67L33L3
6089A33J40l92j55j27J79J31K61J13m17o2k7J49J49P6o65L04L74n7L2k55j22R6
6111a42Pj46oJ77K05j14j42l66K79L48J88P7n59j93K23L7M10J41m58k33q4K39
6133a12J17K06J72j80Q6q8o66J60O88J09p8m16l96J74K47R1K78k56j7ok99L16
$$ plain form
5979 13 -107 182 158 -177 -194 -380 159 -22 -252 -123 50 98 257 -193 -523 77 -61 -15 -114 105 230 -97
6001 -97 -108 -159 -294 152 201 230 -109 -334 -184 56 233 156 45 17 -21 -127 184 -57 343 530 248 -46 -278
6024 -278 -197 274 671 748 434 -9 -561 131 303 725 288 5 189 -125 1 128 475 338 103 -284 -583
6045 -583 6 193 385 426 79 -293 -447 -239 441 268 275 214 -237 -50 15 -1 227 171 202 -238 -317 -379 -147
6068 -147 186 -25 -108 -731 -208 -344 66 307 93 -110 -449 58 -233 149 -5 72 127 234 -233 100 133
6089 133 273 -119 -274 -401 -222 -91 170 283 -134 -196 -223 -74 75 151 -514 -210 164 107 139 -116 -238 -142
6111 -142 -135 -281 -287 -110 95 -19 -161 -527 -248 100 288 365 -194 -387 -164 -127 283 424 -34 -267 -351 -112
6133 -112 5 211 383 203 289 201 -465 -305 383 492 414 -2 -398 -224 23 114 392 136 119 113 -186 130
6155A30K96k38J93r8m88rJ9Q21J8k50l66m68N02P2K81Q7j57l20j58j10L45j96
6177i4M51j54N0n12k9M96m5L79l88q6l36K18K79J84k51l94M73m0k1m8J24N0Q7
6200C93m23J46k92K81K15j32r6j08Qj10M26l91K3j9K09j04k08J01M22n29J04J00
6222A6L21n13MO0j0L3k79K35R8J23m60mJ87j16K8N78k14j90j11Q9K32M0L61k77
6246B31l19j63M75n99L46J54k1j69k63J21L71K87k85j58P6m04K56R7L40k24j69
6267b0j77Q9L33m20L88J88n22l8j86P5K02L32M9n64J7j35J65N84K2k79j48k26
6289b71J30R0R6J75j13J8q8j33p3J77J96M14m28m92K3N27J97j88J77k43j53J9
6311E7p2K46j64J80k47K4K67l31J81J47J21k78j67K02o2K70J4l21k00L10R6l50
$$ plain form
6155 130 426 188 381 283 -205 -214 -195 626 644 394 28 -440 62 134 415 502 345 25 -133 -243 102 -94
6177 -94 357 203 253 -259 -288 208 163 542 154 68 -268 -50 229 413 162 -232 241 201 180 132 256 306 393
6200 393 -30 116 -176 105 320 188 92 -16 -8 -118 308 -83 -60 -79 130 26 -182 -81 341 -188 -84 16
6222 16 337 -176 -172 -112 -122 -89 -368 -133 -35 88 -372 -376 -189 -305 -277 301 87 -103 -214 -125 107 147 508 231
6246 231 -88 -251 224 -375 -29 125 104 -65 -328 -207 164 451 166 8 84 -320 -64 33 373 149 -20
6267 -20 -197 -108 225 -195 193 381 -141 -179 -365 -290 -88 244 293 -271 -254 -389 -224 360 382 103 -45 -271
6289 -271 -141 -51 45 220 107 125 37 -96 -169 8 204 618 190 -302 -279 248 445 257 434 191 38 57
6311 57 -15 231 67 247 0 24 291 -40 141 288 409 131 -36 166 104 374 388 67 -133 177 273 -77
6333g7J34l06K8L18r4j58L2j53M05p8n2N1Q2k4j58J28l0j26j01K92J54k92j97
6356b22l72P19J57J15l51j41J11N0j77J69oJ41j70m40J0J20K62L37o9o83J07J90
6378a43Q2L33j39r9l75N2J24L8N16l41j35j7k19J81l82M95L51j07n97j9k56O58
6400AK78j1k29l09R6o3K72j12M11L3o20J13j51L75J01K54m2l93j4M1m1L03Rm41
6424a39J58l91N27O5j53o1N8L35l04k83L69n8r0N3pl33J00N8K50q5jm76J32M37
6448A61k5k72K08k80N1M94k37J31k27k00K41j07j8K75k46K4NJ60n8L69Nm85l83
6471d14N9L29J7L03K50m32l38m7P5Q0M26j16j83K25l73Q4j10K45J08l32M7n89
6493f86N79J11j7J70m26j29K3P3L76R1q1j05j43j50K4J95K52L75o39l84Q5N36
$$ plain form
6333 -77 57 -249 -221 97 3 -155 -123 -276 129 51 -1 50 132 108 -50 78 48 -78 -179 113 267 -25 -222
6356 -222 -594 125 282 397 46 -95 16 66 -111 58 52 193 23 -417 -407 -287 -25 312 243 -440 -333 -143
6378 -143 -61 272 133 34 -341 -289 -165 -127 389 48 -87 -104 -323 -142 -524 -29 322 215 -382 -401 -657 1
6400 1 279 268 39 -270 -174 -237 35 -77 334 367 -253 -140 -291 84 185 439 397 4 -10 31 -10 293 302 -139
6424 -139 19 -372 155 220 67 6 64 399 95 -188 181 123 33 86 79 -254 -154 -96 154 69 68 -408 -276 161
6448 161 136 -136 72 -208 -157 337 100 231 4 -196 45 -62 -80 195 -51 -27 -22 138 80 449 454 -31 -414
6471 -414 -355 -26 -9 294 544 112 -226 -273 -198 -118 308 192 9 234 -139 -55 -165 80 188 -144 -97 -686
6493 -686 -107 4 -13 157 -269 -398 -375 -302 74 165 84 -21 -164 -314 -290 -95 157 532 -107 -491 -406 130
6515A30K87j79K25l57l45J73j77N34k6r3l24M19l33pL17p8L98m93q8j01q6L88
6537A84j3j01J38J09n28k10N00j86n3PL0r1j1K31J26O8k9p6k0LJ02j32j14J52
6561H6j51J83L03k57k85J16J92K01l21K08k97O8K07R3k85j39L88k22l4j57J65
6582F2K81k9M7j49m00M4L15j01L05J3l94l76M56j9l07K91m4K0K5j25k69P36k16
6605A66k8l02k36j17M25L31j30j90l09J59j52K32J35L95k59j51j31j5J11P7L52
6626C63k66l92J71q5J64J71M36m61k29P7j47J93J05L5n3k31J23r3o6K53K8K4j60
6649d0j91q2M63j70K35l23J20m41L04m8K56k06J49J93l16L48m69K40J82k48L36
6670B92m47R6J64l9P7j78m26L72J93j5L9j98L75k47K17m69J98j69M07j54l6J84
$$ plain form
6515 130 417 238 463 106 -239 -66 -243 291 265 172 -152 267 -66 -73 244 166 564 71 -17 -118 -204 184
6537 184 171 70 208 317 -211 -421 79 -107 -160 -153 -123 -214 -225 6 132 200 171 95 75 78 180 48 -66 86
6561 86 -65 118 421 164 -121 -5 187 388 67 275 -22 46 253 346 61 -78 310 88 54 -103 62
6582 62 343 314 361 212 -188 -144 171 70 375 388 -6 -382 74 55 -252 39 -5 15 40 -85 -354 382 166
6605 166 138 -164 -400 -517 -92 239 109 -81 -390 -231 -383 -151 -16 379 120 -31 -162 -177 -66 11 363
6626 363 97 -295 -124 -209 -45 126 562 101 -128 -51 -198 -5 100 135 82 -149 -26 -119 -185 68 96 120 -40
6649 -40 -231 -313 150 -20 215 -108 12 -429 -125 -173 83 -123 26 219 -97 251 -218 22 204 -44 292
6670 292 -155 -59 105 66 143 -35 -461 -89 104 89 128 -70 305 58 275 -194 4 -165 242 88 52 236
6692B36j57J34k25k99L77M2J44K49l87j32k99J68L17K34j89k80k27k7K83k03K44
6713CJ87j65j17J91j83J10L67m3m40k19j96R4M80R9m7j39k26lK36J1K25j07k25
6736a07N5L27p93Q34J54n69n2k21J3k54N97J55N2k59m2Pk83M50M5k66P0j89j3
6759b89K1P4M46j70J06l26M8N2j07J08P5j62k36P0J80m4J09j53K68J08l41Q5j01
6782a79J13j54K62j01N0l0r0K00l41J85k96L25L00r5o1j63j36L87j65L2k8J85
6804B00K6j82J76n1j27k98L19M7l91O47j85P5k09r9m14O90J16k99p1L55m08j2
6826i5mJ49k0J77j66j87l0O7M81O2k38k90k4j8M90p4j31o4q7k56Q4J39L40j17
6850A88j15r8k48K05J22K17j54P9n4n15K64K1K88K37m04l70J32N3K37K52k00m7
$$ plain form
6692 236 79 213 -12 -311 66 108 252 501 114 -18 -317 -149 168 402 213 -67 -294 -321 -38 -241 3
6713 3 190 25 -92 99 -84 26 393 350 -90 -309 -505 -411 69 168 121 -18 -244 -247 -11 0 225 118 -107
6736 -107 -52 275 -518 316 470 -99 -151 -372 -359 -613 -16 139 191 -68 -110 -103 -386 64 109 -157 -87 -276 -289
6759 -289 -268 -194 252 82 188 -138 -90 -38 -145 -37 38 -124 -360 -290 -110 -154 -45 -198 70 178 -163 -78 -179
6782 -179 -66 -220 42 -59 -9 -39 -129 71 -270 -85 -381 -56 244 149 88 -75 -211 176 11 43 15 200
6804 200 226 44 220 169 42 -256 63 110 -281 366 181 256 47 -52 -466 224 340 41 -30 325 -83 -95
6826 -95 -99 50 30 207 41 -146 -176 -109 372 434 196 -94 -118 -136 354 280 149 85 -2 -258 -174 -35 305 188
6850 188 73 -25 -273 -68 54 271 117 196 142 -373 -109 -88 200 437 33 -337 -205 -152 85 337 137 90
6872I0J1k59j54oK07L55j54k74j46m0lJ56J73Q2l70L57k31J53P6j9L42o29K00
6895h3J1J30j95Q3J17k10J27NJ25J32m25K22j84KK79k34J52r3R9K00j61l3j01
6918c5J0j4JM36j55j18J02j54l4J00m24L08J63j91k12o8K00J50R4K7k04M0l91
6941c69M63Qj29P1J29j01J1Q4LM7O3j89k33j1l2N67n8k00j61k85K01J4O14m94
6965A3J84j57k68J21L6j39O80k10l43j27l75M91J65J65j88L3j80k00K9M25J02
6986B57l39j8j41K34J57j85q4M11k38m69J49J51r9N41j70q0Nl39M42q3j93L96
7008C05j98k51K87l41j2L30N6n6j91r3J30J15j16J41k23l3j97M37J07l96L00p0
7030C1O3p6N09o58L4J50J7j46m5N1n3M6m0J51KK22o5k74l62K57J55L89J6j94k07
$$ plain form
6872 90 101 -158 -312 -318 -111 244 90 -184 -330 -370 -373 -217 -44 38 -332 25 -206 -53 23 4 346 -283 -83
6895 -83 -72 58 -137 -54 63 -147 -20 -15 110 242 -183 39 -145 -143 136 -98 54 -39 60 260 99 66 -35
6918 -35 -25 -39 -38 398 243 125 227 73 39 139 -285 23 186 -5 -217 -285 -85 65 159 186 -18 22 -369
6941 -369 94 102 -27 44 173 72 83 167 170 217 280 91 -142 -153 -185 382 324 124 -37 -322 -121 -107 507 13
6965 13 197 40 -228 -107 -71 -210 470 260 -83 -210 -585 -94 71 236 48 81 -99 -299 -270 155 257
6986 257 -82 -100 -241 -7 150 -35 -119 292 54 -415 -266 -115 -214 327 157 77 82 -257 185 102 -91 305
7008 305 107 -144 143 -198 -210 120 176 120 -71 -164 -34 81 -35 106 -117 -150 -347 90 197 -199 101 31
7030 31 94 18 527 -131 -97 53 70 -76 -121 -70 -123 -77 -117 34 36 258 193 -81 -443 -186 -31 358 374 180 -27
7055b7q6J24j88K54R2j15j82L0J98P4L24l46J57k33j30j76M27J40ql68Rk3j6J85
7079A16L3K7O4l77J78p7Q8K45J17j83o8l36Q7K20J10q5k09K5l28J56M55l33J17
7102D2l03K53k02J54n2L81k86K46n9l67k3J69K33J69j86k53O5k1J15k10J57j99
7124a77K56R4m45M77j14j13M8Qq2j40L07j78J33j45q0K93k95O5L6j21J16l25M28
7147D6Mj79l2p1L56j36j02Rj87N49k21j77J44l4R0j74K02l07o0L35J99l31K89
7170B12o77N32l08K53N86k32n40k45L09j9Q7J80p8M6J09o85K37O31r3j42j48J20
7192A35k96J48L72j80L5M0l85mJ01L7J53j76R7n28L70j7J97J53l10J11k94J96
7214d5J8Q6P1q0m08L28K5K6j67K17L6j14Q6m99J25J50K69j10J67j17j02j66M33
$$ plain form
7055 -27 -113 11 -177 77 169 54 -128 -98 100 174 498 152 309 76 -54 -230 197 337 329 -39 -30 -53 -69 116
7079 116 149 176 240 -137 41 -36 52 297 414 231 163 -173 -86 134 244 159 -50 -25 -353 -197 258 -75 42
7102 42 -261 -8 -210 -56 -108 273 -13 233 174 -193 -216 -47 186 355 169 -84 -19 -40 75 -135 22 -177
7124 -177 79 173 -272 205 91 -22 26 34 -48 -188 119 -59 74 -71 -151 142 -153 -88 -52 -173 -57 -382 46
7147 46 50 -129 -161 -232 124 -12 -114 -105 -292 257 36 -141 3 -31 59 -115 87 -220 -280 55 254 -77 212
7170 212 -465 67 -241 12 598 366 -174 -419 -110 -129 -42 138 60 106 215 -470 -233 398 305 163 15 135
7192 135 -161 -13 359 179 214 254 -131 -135 -34 3 156 -20 77 -451 -81 -98 99 252 -58 53 -241 -45
7214 -45 -27 59 130 50 -358 -30 -5 21 -146 71 107 -7 79 -420 -295 -145 124 14 181 64 -38 -204 229
7237B29m02J06KN8j0J64j61k9j19K16l34K50j53M71k69J42j41ON2k03J58j55Q
7260a14j22L02Q4j92j99J11J00l9K29m8j47N6p4J30R1j48J90k00Pl90J34J83J88
7283A32J21k07Q5o6j98r0K70j54J82%k45J61n3N58k79o9m64o8J69J21N12M8k01
7306B65n62J67J32J46k36K04j65k88K46J08j59N47j17o9Q7m62L30j4j1j18MJ43
7328A78l23K82m12M47J36l32j35q8M07k73K40k28L26k42k62K58k6L70rl26J33
7349A21j39J63p9J6j7J8j97J42l4J5k02M29K1l25k2p6L92l01K7j68m6L07L73k82
7373A36k33j16o2j11L19q2K13K5k85R9P7J0j49N4K7j86K89j2K3L8q3m35J61O36
7397C53l8k18m0No70K37M21L41o9m90J92o3k35K46o9J32r5J07j32n32M72K32L42
$$ plain form
7237 229 -173 -67 -65 -7 -17 147 -14 -43 -162 54 -280 -30 -183 288 19 161 20 26 78 -125 33 -122 -114
7260 -114 -236 66 150 -42 -241 -130 -30 -69 160 112 -35 21 -53 77 168 20 210 10 17 -373 -239 -56 132
7283 132 253 46 131 65 -133 -223 47 -107 75 75 -170 -9 -62 496 217 148 -316 -384 -215 -94 418 466 265
7306 265 -297 -130 2 148 -88 116 -49 -337 -91 17 -142 405 288 219 306 -156 174 160 149 31 35 178
7328 178 -145 137 -275 172 308 -24 -159 -247 160 -113 127 -101 225 -17 -279 -21 -47 323 314 -12 121
7349 121 -18 145 66 82 65 83 -114 28 -6 9 -193 236 257 -68 -90 -166 226 -75 -48 -216 -262 45 418 136
7373 136 -97 -213 -275 -386 -67 -149 64 89 -196 -97 -20 -10 -159 -105 -78 -264 25 13 36 74 -9 -444 -283 353
7397 353 315 97 57 62 -608 -371 50 391 322 -168 24 -39 -274 -28 -97 35 -60 47 -85 -617 -145 87 429
7420D29m46J85l43o7J46N4L25l5k85J96m08K21J3J25L57l06k03j66L45Lp8j6j35
7443h9j52r4M42J02lk36k03J22K2o7K12K22l14L47k47k84kL98K25l02q9L5j5k9
7467AJ49l01L99j14q2k13K03k75O9N57m09qo1k35J92J25o8K15K47l68j05J78k62
7490a66K7L3K44K9l19kj84K64j73J32N61n55k7ml4O3L11N1n55J84k9k5J47J98
7514A71j23k08K52k10K29Q4j78j21L3k81L73k52J34K45kk74R1r2j4kJ91K64l38
7537b8J33l64J31L65r3j05J29l7k73J4j27L96j49k05K72l02M85k33K68Q5k48k63
7559a49k34M76o1O9J16j38n8k96L28l8J32l9n3l08J42L7k55O20l51K94m57O0K89
7582A26J43J51k90l4J04k87J5j02K32k09J93l69M31k55j28N81l78o3j57J21M15
$$ plain form
7420 429 -17 168 -175 -242 -96 -42 283 248 -37 159 -249 -28 -15 110 467 161 -42 -208 137 140 62 46 -89
7443 -89 -241 -335 107 209 206 -30 -233 -111 -89 -156 56 278 -36 311 64 -220 -222 176 401 99 10 45 30 1
7467 1 150 -151 248 134 52 -161 42 -233 -164 393 -16 -24 -85 -320 -128 -3 -71 144 391 23 -82 96 -166
7490 -166 -139 -106 138 167 -152 -154 -338 -74 -247 -115 446 -109 -136 -140 -174 -111 200 251 -304 -120 -149 -174 -27 171
7514 171 48 -160 92 -118 111 195 17 -104 -71 -352 21 -231 -97 148 146 -128 -37 -129 -143 -145 46 310 -28
7537 -28 105 -259 -128 237 144 39 168 131 -142 -128 -255 141 -8 -213 59 -243 242 9 277 362 114 -149
7559 -149 -383 93 32 101 217 79 21 -275 53 15 147 108 55 -253 -111 -74 -329 291 -60 234 -223 -163 126
7582 126 269 420 130 96 200 -87 -72 -174 58 -151 42 -327 104 -151 -279 302 -76 -139 -296 -175 240
7603B40r3j63l2K15O2k5n0l55J04j81L35J24q8k4j54L16J88m36K69l28l3N5q5
7626a39j6L17j24J97K12o31l86M15pJ38L88o80J21k14J98K4L06q2J96m08j38O8
7648b45K03l2K70p5k30Ro8J61K66j53m7j78L1p3N3R3k61M07k3q8l45K00M39l4
7672B80p7l63k07K48K35J57j94J18o2m14K60o7K64K4j67M86n20j51K07l33N7L89
7694A70l18k5O4L24q2j97l58L81J31j8n7j71J94K04k52L03k50j86L88k22OJ34
7716A63k42J97k52L13q3j2P5q9LP5l3l52L32R9pjJ54j57J45p43Q3O45j51k16j85
7741b39M02k36p4O44j23j82k13j68K6k6K58j25N0j23R8M12m48P0M04l44l74N71
7763B60m18K53P2j84K56l06j62O9N1K52l33J51O6r3q0K14k52L34j32k53J25r7
$$ plain form
7603 240 147 -16 -48 167 229 204 154 -201 -97 -278 57 181 93 69 -85 231 419 -17 252 -76 -109 -54 -139
7626 -139 -155 162 38 235 447 -184 -570 -155 -162 -24 364 -316 -195 -409 -211 -187 119 37 233 -175 -313 -245
7648 -245 -42 -74 196 121 -109 -100 -168 -7 259 106 59 -119 -88 -161 -108 -15 -276 131 108 20 -325 -125 314 280
7672 280 203 -160 -367 -119 116 273 79 197 135 -279 -19 -86 178 202 35 521 1 -150 57 -276 -219 170
7694 170 -148 -173 -109 215 133 -64 -422 -41 90 72 15 -156 38 242 -10 293 43 -143 245 23 29 163
7716 163 -79 118 -134 179 96 84 159 70 73 148 115 -237 95 194 187 186 340 183 328 -415 -332 313 162 -54 -239
7741 -239 163 -73 -147 497 374 192 -21 -189 -163 -189 69 -56 -6 -129 -31 381 -67 3 407 63 -311 260
7763 260 -158 95 167 -17 239 -67 -229 -160 -109 143 -190 -39 27 -66 -146 68 -184 150 18 -235 -110 -207
7785b07L72J63l21k5k43J85j0j50N45k01p4q8q4J77j09K20n7k17K92n61L46J25
7807G8j55J24j04r2j02J16L00jj96K30k41J10k92K75k4O5j96L19m23J28K27r6
7829E0R4p8k10L27j5j14Q8k15J46O8q0M4L0l55P6K26M92m90O7P7k97J86K8p4J04
7854A75K6j88J02q7J97j02j28K69n31J28J49O3j11K68k87j05J3J05n5L03j70k21
7876a87L99m02N6Q1m5L63j33o4l4m18M06K49l36qJ82m75J88J49J28k8j96r3o3
7899b81j19M20J78P2k95j09k35K10J82n1O3j33L1k71L29J66l50L88K5k48n3Rj10
7922a82L97j0j44k24K49p8m6J37j78O3l8k22K28L46k94Q9N5j75k86r6M86r0j08
7945a21M27l08P7%r9mq5J03K15J24m32K26n9j17J60K17k06j9n6Q5j69Q8j00L18
$$ plain form
7785 -207 165 328 7 -18 -261 -76 -86 -236 309 108 34 -54 -138 39 -70 150 93 -124 168 -393 -47 78
7807 78 -77 47 -57 -149 -251 -135 165 164 -32 198 -43 67 -225 50 26 91 -105 214 -209 -81 146 50
7829 50 144 66 -144 183 168 54 142 -73 73 141 61 105 135 -220 -144 82 574 84 151 228 -69 117 145 71 175
7854 175 201 13 115 28 225 123 -5 264 -267 -139 10 73 -38 230 -57 -162 -149 -44 -99 204 34 -187
7876 -187 212 -190 -134 -53 -98 265 132 68 34 -384 22 271 -65 -73 109 -366 -178 -29 99 71 -125 -218 -281
7899 -281 -400 20 198 270 -25 -134 -369 -159 23 -28 35 -98 -67 -338 -9 157 -193 195 220 -28 -81 -72 -182
7922 -182 215 205 61 -163 86 8 -38 99 -79 -16 -54 -276 -48 298 4 93 148 -27 -313 -409 77 -13 -121
7945 -121 306 -2 75 75 -24 -28 -113 -10 205 329 -103 123 64 -53 107 324 118 99 43 128 -41 47 -53 265
7969B65l94J00R8k11K20J14J23N4l70j5j03M1J24J44R9j38l36J09j04K53j81K12
7991A04Q7m13K26l12L37K22l8l30q8O6K28K8K9K67p23J87M2q6J83K15Q7l23j41
8014a46j63O7L00Q6R2l28J23Pj13J1N2L7L4j57j42L08R6q6nk7l53L8p6N44j04
8039I5J50p1j82m37M07l3l9K34l55J84j06J7J49j40L0M3K49j38l34K51lK24p7
8062A18j51j72QL99k82r6K19O0n7k11j89K47K9j54N50j64k62J34j41L40p6K75
8084D24J08m91J99l47K12l75L68mj85j9J1O8N3Q9r4r3j16J99n5n3L12k39j28m4
8108b00J85j24L5K45k07K60k61k31L8M23J63j40q3j19p5J86r6L0N7o3M7l46j4
8131b90L83L2l26L62k73M3k07J61K26K8k76N5k97M78J35k57J83L1k75r8K68j13
$$ plain form
7969 265 -129 -29 69 -142 78 192 315 369 -1 -16 -119 -78 46 190 289 151 -185 -76 -180 73 -108 104
7991 104 191 -222 4 -308 29 251 213 -117 -205 -139 89 117 146 413 -310 -123 -81 -167 16 231 318 -5 -146
8014 -146 -309 -242 58 144 236 -92 31 38 -75 -64 -12 25 59 -98 -240 68 164 78 73 46 -307 -269 -345 199 95
8039 95 245 174 -8 -445 -38 -71 -110 124 -231 -47 -153 -136 13 -127 -97 -54 195 57 -277 -26 -29 195 118
8062 118 -33 -205 -197 202 -80 -176 43 103 46 -165 -354 -107 -78 -232 318 154 -108 26 -115 225 149 424
8084 424 532 41 240 -107 105 -270 98 94 -91 -110 -99 -31 22 111 17 -76 -192 7 -48 -101 211 -28 -156 -200
8108 -200 -15 -139 -104 141 -66 194 -67 -298 -260 163 326 186 103 -16 -91 95 -1 29 86 23 70 -276 -290
8131 -290 93 125 -201 161 -112 -69 -276 -115 111 139 -137 -82 -379 99 234 -23 160 191 -84 -182 86 -27
8153b7l2R6o1J20j28r9J58J71k67P2k25j03K31J20J93n53L91l0J87k43J45Q0j99
8176cJ47k3o5k74q3K11p2N7m6J20J47l19K31l36M
$$ plain form
8153 -27 -59 37 -24 96 -32 -131 27 198 -69 3 -222 -325 -94 26 219 -334 57 27 214 -29 116 196 -3
8176 -3 144 121 56 -218 -301 -90 -162 -105 -151 -31 116 -203 28 -308 -304
8191c04
$$ Imaginary data points
##PAGE= N=2
##DATA TABLE= (X++(I..I)), XYDATA
0@%%%%%%%%%mJ2j6J6j6K0k8L2l8M6n4O2p1Q5j00J14j30J49j67J89k14K41k70L02
33A60l41L82m25M72n25N85o49P17p92Q77r71J075j192J326j478J649j848K082
51A104k357K695l120L664m397N446p081J0020j6971O3122O6099p4287m5382j2837
65a4282L5107K2943J0173j2736j4865k1670j0784k245J3355J7107J7820j704k6977
78A1242l9625p622L6890M9207Q365l9416m4473m470K9066K6487M74j3344j0232
91B549l763m990l954J716J0900J3882M912j4357k4811r411K1718L4804J1116k5783
105A4528k9770K366K9016J7254j2180j9749k06J6346N581j3953j5941j463J0989
118B818P408m246j3852j2587J46J1892N358j2895j4591P567K2392L614k5692k3414
$$ plain form
0 0 0 0 0 0 0 0 0 0 0 -4 8 -8 8 -8 12 -16 16 -22 24 -30 32 -39 46 -54 60 -70 79 -88 101 -113 128 -142 160
33 160 -181 201 -224 248 -277 308 -341 376 -416 461 -510 565 -627 699 -779 870 -978 1104
51 1104 -1253 1442 -1678 1986 -2411 3035 -4046 5974 -10997 52125 118224 43937 -1445 -14282
65 -14282 20825 43768 53941 41205 26340 4670 -6114 -8359 4996 22103 39923 38219 11242
78 11242 -28383 -36005 885 50092 58457 19041 -25432 -29902 -836 25651 26125 12781 2549
91 2549 -1214 -6204 -10158 -8442 2458 16340 21252 6895 -17916 -27327 -5609 29195 40311 14528
105 14528 -15242 -12876 16140 33394 21214 1465 1259 17605 23186 9233 -6708 -8171 2818
118 2818 10226 5980 -7872 -20459 -20313 -8421 -3063 -15958 -30549 -22982 -590 3024 -22668 -46082
132d6082J0567L3550J8290j4519k8115j3533R024K0624J4546k236j4325j1352
144b3561r0K793p50K226J4192J7816m999l2091k5817J5876M6691L0483j4820l8474
158a0525k1651J1672K9897K1866K394j1958j4452j0180j937N029J1817J5998R634
171C7604j3944l4663k6455J2086M3805L1006j4583m4802k8778J0233L0769K1032
183B3310J509j1190j4622j0456j588O749J2613J4188P990q792k7290k5060P458
196b5181L8927L0927j2088m1002k4992J2652K8573J4187n301j0605m549m87j010
209E1P29N493J1128R771j263j6026j8012J887K4618K0845p268k7799j6192J1219
223h19J9648K189j5476j2084M277J0249L43j0572j0114R71J0809Q292m395j2804
$$ plain form
132 -46082 -35515 -1965 16325 1806 -26309 -39842 -30818 -10194 4352 2116 -12209 -23561
144 -23561 -23651 -20858 -21608 -19382 -5190 12626 7627 -24464 -50281 -34405 12286 42769 27949 -10525
158 -10525 -32176 -20504 9393 31259 33653 21695 7243 -2937 -4874 155 11972 27970 37604
171 37604 23660 -11003 -37458 -25372 18433 49439 34856 -9946 -38724 -28491 2278 23310
183 23310 24819 13629 -993 -11449 -13037 -6288 6325 20513 28503 19711 -7579 -32639 -25181
196 -25181 13746 44673 32585 -8417 -33409 -20757 7816 22003 16702 6097 1548 1061 51
209 51 780 6273 17401 27172 25909 9883 -8129 -6242 18376 39221 31953 4154 -12038 -819
223 -819 18829 21018 5542 -6542 -2265 7984 8327 -2245 -12359 -11388 -579 7713 3318 -9486
237i486o607P352J1322o95j2399n957J2397J4519p284k4422j1761J7576K5943
250A0498M175k0785k3023l582J4397J7505O097o156j2160n784K563L841J301O109
264e004J4052P594j4947k8281q438K5617L5202Q474k5844l1720r995J6098K3989
277F797J2927o616j7070j4040k794L848N875R805J2273K867j7885k8536r358K5485
291a6422L8265J1830k6514l5617j0400J9546K6629J0889p067j4204j0325l750
303a7140J894P420J0547J0948J312j4641k3023p916K0312L3037J2342k1420l0656
316a6984p374J9262K3202O131q850r283l691M76J007J590M074O655M644n859j6286
331a286j1055Q708K2883J0216j5814k3437l306J7193J3900n269j3739l740Q545
$$ plain form
237 -9486 -16093 -8741 2581 1886 -10513 -16470 -4073 10446 3162 -21260 -33021 -15445 10498
250 10498 14673 -6112 -29135 -32717 -18320 -815 5282 -874 -13034 -18818 -16255 -12414 -11113 -5004
264 -5004 9048 16642 1695 -26586 -35024 -9407 25795 34269 8425 -23295 -33290 -17192 6797
277 6797 19724 13108 -3962 -18002 -20796 -16948 -11073 -1268 11005 13872 -4013 -32549 -41907 -16422
291 -16422 21843 33673 7159 -28458 -38858 -19312 7317 18206 11139 -3065 -13390 -17140
303 -17140 -15246 -7826 2721 13669 14981 340 -22683 -30599 -10287 22750 35092 13672 -16984
316 -16984 -24358 -5096 18106 24237 15387 6104 2413 2889 3896 5486 9560 16215 20859 15000 -1286
331 -1286 -12341 -3633 19250 29466 13652 -9785 -13091 4102 18002 12733 -1006 -4746 3799
344C799P799k653r713n276N021J0858L912q096j1041j025J0188O207o557r488
358f065L247J2922M659j3610j6391J440J9974J6832l699k0185j5156L438J7493
371D899J4353l19j1417j0160j034M632J456P13O301R673j260j9813k1127M163
385a8940K8938K3343p399k9410k2393L040K0990J8470K674j1655j4969q072J658
398a3725N609P060Q902P115n849k1799j9873O763K9888K4603o062k9745k3583
411c0696L158K1757K0017L766j1185j4745o564K826N825O790P567O567l374j6999
425e290j6658K560K5033K3395l459k5834k1173M292K0942J4786k515j1437p463
438b821L18K304j98O00M445N625P28j0351j3386k262J4587J6267j095j8370j4376
$$ plain form
344 3799 11598 8945 -768 -6044 -1023 9835 13747 5651 -5390 -6415 3773 9980 3423 -6065
358 -6065 -2818 10104 14763 1153 -15238 -13798 6176 23008 19309 -876 -16032 -12594 4899
371 4899 19252 18933 7516 -2644 -3678 954 2410 3123 9424 19097 17837 -1976 -23103 -18940
385 -18940 9998 33341 25942 -3468 -25861 -22821 -1831 16639 19313 7658 -7311 -15383 -13725
398 -13725 -8116 -1056 7846 14961 9112 -12687 -32560 -25797 4091 28694 22632 -7113 -30696
411 -30696 -27538 -5781 14236 18002 6817 -7928 -14492 -11666 -5841 949 8516 15083 11709 -5290
425 -5290 -21948 -19388 5645 29040 25581 -253 -21426 -17134 3808 18594 16079 4642 -2821
438 -2821 -2503 -199 -397 203 4648 10273 11001 650 -12736 -14998 -411 15856 14761 -3609 -17985
453a7985N030J6443N752q976j0209J134R392M134m227q012j963O642R303J142
467G600q763p928L210J0149K614q360n888P568J0748k597j5254r395R428J8885
481A2017Q290j1415j8583p325R853J6161Q462o020j1778o367K417L405R92K266
495B375Q099L904r512j9081r600J3719K4368R972j5879k5178j2698J0348K0741
508A578J2679m232j4535j1008k031N595O714O555P015K427r907j8819r198J5506
522a1661K8107J2880j6827k8219j1717J2508K2049J2014m493j3347j0476j862
534a1044M890O545N864O218K611q075j6704q351J2638K3784J1319j3722k3441
547g468r753J1021J7622P189o534j1696n890J136L015O74l64K131L998k078j0251
$$ plain form
453 -17985 -12955 3488 9240 264 -9945 -8811 581 4715 488 -7524 -9487 -2845 6458 7600
467 7600 -1163 -9091 -5881 4268 6882 -1478 -7366 202 10950 8353 -6901 -16296 -6868 12017
481 12017 20307 8892 -9691 -17016 -7163 8998 17460 11440 -338 -6705 -4288 -883 109 2375
495 2375 10474 14378 4866 -14215 -23815 -10096 14272 24244 8365 -16813 -29511 -19163 1578
508 1578 14257 10025 -4510 -15518 -17549 -11954 -5240 1315 8330 10757 850 -17969 -27167 -11661
522 -11661 16446 29326 12499 -15720 -27437 -14929 7120 19134 14641 1294 -9182 -11044
534 -11044 -6154 391 6255 12473 15084 7009 -9695 -18046 -5408 18376 29695 15973 -7468
547 -7468 -17221 -6200 11422 18611 12077 381 -5509 -4373 -1358 -684 -1048 1083 5081 3003 -7248
562g248r053M103J5336R832p246j6092n717J0736J2741J113r576o331M597Q596
576E791J786p134p034J716Q414N916l700r018l311N368O847j290o793r2Q156N455
592A1077p254j2398j664J3815J4248j51j3950j4554j563J1965J3580K030j0554
605D627j2264l807M242K994p65J797N637n73j3784j5541Q03J8728J9088q37j9476
620i131j9874k194J7233J8717N009r521j3474o149L160N696N772N544M524l588
634A724j4079j3472J756J9249K0158k14j9754k0536j178J6938J8854N680r235
647E891j2533n630L049P130N398L993L069k185j0035j3163j165J5122J8034N27
661A7502j9738j9148o53J4724J3544J54r590r011j496M133L138P35P26M051L104
$$ plain form
562 -7248 -16301 -12198 3138 12970 5724 -10368 -16085 -5349 7392 8505 -1071 -7402 -2805 5791
576 5791 7577 443 -6591 -4875 3539 9455 5755 -3263 -6574 -1206 5641 4351 -2442 -2534 5622 11077
592 11077 3823 -8575 -10239 3576 17824 17673 3723 -10831 -12394 -429 13151 15181 4627
605 4627 -7637 -11444 -7202 -4208 -4973 -3176 2461 1888 -11896 -27437 -26634 -7906 11182 10345 -9131
620 -9131 -29005 -31199 -13966 4751 9760 239 -13235 -19384 -16224 -10528 -4756 788 5312 1724
634 1724 -12355 -25827 -24071 -4822 15336 15122 -4632 -25168 -26346 -9408 9446 15126 5891
647 5891 -6642 -12272 -9223 -2093 3305 7298 10367 8182 -1853 -15016 -16181 -1059 16975 17502
661 17502 -2236 -21384 -22037 -7313 6231 6385 -3205 -12216 -13712 -9579 -6441 -5706 -4980 -929 2175
676B175l814r321l497R836J3761K292j1119j1230J321J1203P798l885q191k307
690d978O193O279n19o875m364N135R593L656n607o885Q91P419N349l087m624K516
706A0092P318R78r957q455K862J3395Q170p118j6033r636M372J3068Q572l934
720A3694j1562p972J156M423K875J278L786L085m804j2863p560R046J8733J0174
734B3489r363j9430j1912N552J6905J3510k238j3310j1794j421N981O334M177
747F480L959J289o190j2917p250J0390K0221J1845q899k0580j2697O716J8753
760A1120J2480l334j3059j0486j567M712M170K423K402L95n641j1887q027O594
774i705J5403J0033p193j8090j0522O578J5071Q535l911r362n760J711M582K015
$$ plain form
676 2175 -1639 -10960 -14457 -4621 9140 11432 313 -10917 -9596 1607 9405 5520 -2671 -4978
690 -4978 1215 7494 6975 100 -4264 871 10464 14120 8513 1628 2519 9938 15287 12200 7576 10092
706 10092 17410 18388 8431 -24 2838 16233 24403 17285 1252 -8384 -4012 9056 17628 13694
720 13694 2132 -5840 -4684 -261 2614 3892 7678 10763 5959 -6904 -14464 -5418 13315 23489
734 23489 14126 -5304 -17216 -11664 5241 18751 16513 3203 -8591 -10012 -4031 2303 6480
747 6480 10439 11728 5538 -7379 -14629 -4239 15982 27827 18928 -1652 -14349 -7633 11120
760 11120 23600 20266 7207 -3279 -4846 -134 4036 6459 8861 9256 3615 -8272 -16299 -9705
774 -9705 5698 15731 8538 -9552 -20074 -13496 1575 10110 6199 -3163 -8923 -7212 -2630 -615
788f15m64M01K809L55n788p330K49J0197R555l317j2037o297O283J0618L279n814
804B084n735J666P703M230l251o149j106P165P259n70p977m809L322O067r5m320
820E484k213L957L349m198q676l223P606J0743K889r562j2799l438R373J3166
834A2458L955p373j0268l156L830N317J729Q53K703K09p654j0660j560J2426J5259
849A8068K061j4000j7216l488J2120J6035O265p139j2211o518L184P375N194L244
863A2974K169j801r140r980n4J2995J5614J420j5050j7718m305J0960J5293N958
877A9335p531j3401p174K471O224M629J352J284j277o546q781k169J0397J3712
891A2525K797j1801j4958l586J0003J2645L013q015r254j877L702L343j23j130
$$ plain form
788 -615 -1079 -678 2131 2486 -3302 -10632 -10383 -186 9369 6052 -5985 -12282 -5999 4619 7898 2084
804 2084 -3651 -1985 5718 9948 6697 548 -558 6607 13866 13296 5319 510 3832 9899 9804 5484
820 5484 3271 7228 10577 6379 -2297 -5520 2086 12829 15718 6156 -6643 -10081 -708 12458
834 12458 16413 9040 -1228 -4384 -554 4763 6492 7345 10048 10257 2603 -8057 -9617 2809 18068
849 18068 20129 6129 -11087 -14575 -2455 13580 19845 12706 495 -6023 -2839 4536 9730 12974
863 12974 15143 13342 4202 -5778 -5832 7163 22777 24197 9147 -8571 -12876 -1916 13377 19335
877 19335 11804 -1597 -8771 -6300 -76 4553 5905 7189 5912 -634 -9415 -11584 -1187 12525
891 12525 15322 3521 -11437 -15023 -5020 7625 10638 2623 -6631 -8508 -4806 -1463 -1586 -2716
905b716J667K445j676o423l708M722R555M352o268r863r74P985P156j315o759
920a820l367L632N008J268n752n482Q95O907M712l976p510l157M531N073p94m202
936d034K79M370J317n175o612J547R616Q327k327j1353r261J992J1859R463j092
951H916j0277p625M43N133L540J348J707J376k614q476n617M856J3327J0043m339
966A1741j4524j1406K999J4364J2689q2j0869j0745j935N450O464L376R32n00
980G954m362q439o033M485J3540J0668m907j6246j2126L159J4372J2164r53j0337
994B939j0028j384N553N533K163P28K7k647o916o183L251J1917Q961m188j3264
1009c538r835L137J1291R010j521q237o720Q91N188L488j539r72J898J773l031
$$ plain form
905 -2716 -1049 1396 -280 -6703 -10411 -5689 3866 8218 1950 -7913 -8887 -902 6254 4939 -1820
920 -1820 -5187 -1555 3453 4721 -1031 -6513 -5618 1289 6001 2025 -5485 -8642 -4111 962 168 -4034
936 -4034 -3755 615 1932 -3243 -9855 -8308 1308 9635 7308 -4045 -13306 -11314 545 10008 8916
951 8916 -1361 -8986 -8543 -3410 130 1478 3185 4561 1947 -6529 -12146 -7290 6037 16080 11741
966 11741 -2783 -14189 -11190 3174 15863 15781 4912 -5833 -7768 -2318 4146 7522 8454 7954
980 7954 3592 -4847 -10880 -6395 7145 17813 12906 -3340 -15466 -12307 2065 14229 13276 2939
994 2939 -7089 -8473 -2920 2613 4776 5504 5531 2884 -4032 -10215 -6964 4953 13914 9726 -3538
1009 -3538 -13373 -10236 1055 10065 8544 307 -6413 -5522 -334 3154 1615 643 2541 4314 1283
1024A283n406j372O700O765k62q070o625J877P302M403m170o556r67N260M309
1039D471k372o574k560M196O634J026n387n874R44M876K170k041k414J850L138
1054B083j169o186l057M613Q864L609o011j0993m579O537J1360N604n470r890
1068d685m515L434O082K802M7J234k30m348o965j673Q162J1716L837r253j4148
1083h503n688Q416J4062P012n674j1948o721K172O908M545J447M75k009o044o990
1098h540j033Q849J1441L740r613j4187n668Q499J3751O590n631j0945o201K444
1112f504O048M569O64l78j054l343n864k134O038J0199M477p866j1725m841P769
1127c945J0611M138n503q213k970L502M705P98k012m09K055K28m338l691J851
$$ plain form
1024 1283 -4123 -5495 1205 7970 7708 -362 -6987 -5110 2192 6595 2425 -4131 -5098 162 4471
1039 4471 2099 -4475 -7035 -2839 3795 4821 -566 -6440 -5496 -620 1550 -491 -2905 -1055 2083
1054 2083 914 -5272 -8329 -3716 5148 8757 2746 -8247 -12826 -6289 5071 10675 5205 -4685
1068 -4685 -9200 -5766 316 3118 3165 4399 4169 -179 -7144 -8817 -655 11061 14898 5645 -8503
1083 -8503 -14191 -5775 8287 15299 9625 -2323 -9044 -6872 36 4581 6028 6503 4494 -1550 -8540
1098 -8540 -9573 -724 10717 14457 4844 -9343 -15011 -6512 7239 13829 8198 -2747 -8948 -6504
1112 -6504 -456 4113 4777 4399 3345 2 -5862 -7996 -1958 8241 12718 4852 -6873 -11714 -3945
1127 -3945 6666 10804 5301 -2912 -5882 -2380 2325 3123 1111 702 2757 2985 -1353 -5044 -3193
1142c193O653L960m274p436k611M394N947N28n142m153J063N455J675l824n737
1157f695N7N654M846j710o065l435K659M990Q15k195j400K086J596k430n084k36
1173f547O476P334k3q845q486K28R329R164L02q026p547q04M861M751J492Q1J74
1190C914j921m956m746K185R988P755k042j1248j0114n1J0786J1339J799r331
1204C357j0343k967N346O542K975n70j123k515o046m201L132J0162Q238j677j1608
1219a298j0368L4J1496J1402J431r037r471j674N405N692J908j29p83j942m145
1234a479m044J833P391P571q12r392q571M67Q947Q508j70p030o270k61M939L405
1250E032j007k271J7J502j149l613k536K540N713J567n775o300j01N741M392k629
$$ plain form
1142 -3193 3460 7420 3146 -4290 -6901 -2507 3440 3968 -1174 -5327 -4264 1191 2866 -958 -6695
1157 -6695 -6638 -984 3862 2152 -3913 -7348 -4689 301 1116 -1079 -2479 -393 1203 -1227 -6311 -6547
1173 -6547 -71 7263 7240 -1605 -10091 -9863 -534 8630 8932 906 -6641 -7445 -2584 2167 3659 3740 3914
1190 3914 1993 -2963 -7709 -5524 4464 12219 10177 -1071 -11185 -11236 -450 10889 12688 3357
1204 3357 -6986 -9953 -4607 1935 4910 4340 3217 702 -5344 -9545 -6413 3749 11987 10310 -1298
1219 -1298 -11666 -11632 -136 11266 12697 3660 -5811 -7485 -2080 3612 5520 5391 4608 2666 -1479
1234 -1479 -5523 -3690 3701 11272 10460 1068 -7503 -7036 1911 10419 10249 3219 -3051 -3312 1627 5032
1250 5032 4025 1754 1771 3273 2124 -1489 -4025 -1485 4228 5795 20 -6280 -6381 -640 3752 1123
1266A123n225j952L396M274M3m988m093K294O714K365l975n789m66L957L334j019
1282gj953j70K090j98l722k508K089O619L989l425q533n597M675J0318N310l340
1298E637q806m877K260N902L120k96o69q22k795m761k050M319R041L916o625j1129
1314h635o329N336J1848O778l914j0553o571J723O308N370P04j103j822l185m711
1329h756j102O085R376L515o379j1360n274N565J1528O917l574r676o205J901
1343g439O822M346P32j509j086j365l257j516L761P472L948m174r028n210M383
1358c120R505M773m055p981l510K837M272J353k460j592J425R02k209l574qM194
1374G52M083j812n515l386K429N610J206k959m431J10M521K740k621m795j570
$$ plain form
1266 1123 -4102 -6054 -2658 1616 1659 -3329 -7422 -5128 1586 3951 -24 -5813 -6279 -2322 1012 -7
1282 -7 -1960 -2130 -40 -238 -3960 -6468 -4379 2240 6229 2804 -5729 -11326 -6651 3667 8977 5637
1298 5637 -3169 -8046 -5786 116 3236 2940 2271 1449 -1346 -6107 -8157 -3838 5203 9119 2494 -8635
1314 -8635 -14964 -9628 2220 8998 5084 -5469 -12040 -10317 -4009 1361 2065 962 -860 -4045 -8756
1329 -8756 -9858 -3773 5603 9118 2739 -8621 -13895 -8330 3198 10115 6541 -3135 -9340 -7439
1343 -7439 -617 3729 4461 2952 1866 501 -2756 -4272 -511 6961 10909 6735 -2293 -7503 -3120
1358 -3120 6385 11158 7103 -878 -4388 -1551 2721 4074 1614 22 1447 2349 140 -3434 -3442 752
1374 752 4835 3023 -2492 -5878 -3449 2161 3367 408 -4023 -3913 608 3348 727 -4068 -5638
1389e638M241N105J69m976m799Q71N249K216j813j959J181J141m12l581r76M307
1405C26O009J219o376p469j321P358Q538J765p253p912j373M089M857J849j258
1420C048j352k147l640k575J224O309O431q18q269r178j131Q414J0420K217p533
1435A420r305k984M423O424L163q14k190k602l163k737J640O554O727M9q530r070
1451a0995o64Q832J0042K087o840q400k475N163N874K240j113j365j144j902l041
1466c701P83N463N665L00o546p699m54O440P618P01n701o021q97M238L995m12
1482C772k644o23J548K74k376k128J658M207J719l007m801j114L721M397n02m730
1498f29k702K424M448M63l824l682R78N204L546k097n599j702K654M183M02j828
$$ plain form
1389 -5638 -1397 3708 3877 -1099 -5898 -5027 222 2438 625 -1334 -153 988 576 -3005 -3981 326
1405 326 6335 7554 1178 -6291 -7612 -254 8284 10049 2796 -5116 -6489 -2400 2457 4306 3048
1420 3048 1696 -451 -4091 -6666 -5442 867 7298 6480 -1789 -10967 -12098 -3684 6736 8953 1420
1435 1420 -7885 -10869 -6446 -22 3141 2327 137 -2465 -5628 -8365 -6725 -171 6556 6605 -1925 -10995
1451 -10995 -11659 -2827 7215 9302 2462 -5938 -8413 -3250 2624 4864 3751 2386 1242 -660 -3701
1466 -3701 -2918 2545 8210 8510 1964 -5735 -6189 251 7869 8570 2869 -3152 -4049 189 4184 3772
1482 3772 1128 505 2053 2327 -49 -2177 -519 3688 5407 2400 -2401 -3515 206 4603 4101 -629
1498 -629 -3331 -907 3541 4004 180 -3502 -2524 2680 6226 4129 -1470 -3172 -518 3665 4067 2239
1514B239j075J217L56k071k218J174M798L551k287o643n132K223Q027O009k012
1529H156q080n968J651N660L772m49j499j467k142k620j141L193O132L852m029
1544E021r432n685L379R852P032k500r467o698Q57O742M599P08j935k335k699
1559b561k904m92L848P157L360m431q992n246L948R339O377k015q474o120Q80
1574f326N601M804O99k170j967j430j513j332K282M888L846k651p112m927K636
1589d672P856M689k460o056m352J956M858J875k294j969O33J671n21k733r92K935
1605D24L586l31l908l253J065M241K043k175l651p09L453L352j317m657j880L031
1621f86M843J322l956m474k51L997K744l50k363m99M18L45j832j455K550M358
$$ plain form
1514 2239 1164 2381 2737 666 -1552 -378 4420 7971 5684 -959 -6091 -3868 4159 10168 8156
1529 8156 76 -5892 -4241 1419 5191 4742 3243 1776 -366 -2986 -4127 -934 5198 9050 5021
1544 5021 -4411 -10096 -6717 3135 10167 7667 -1800 -8498 -7641 -899 3700 4408 2473 138 -2561
1559 -2561 -5465 -5957 -2109 5048 8408 3977 -5015 -10261 -6313 3026 9403 7388 -1086 -7206 -6326
1574 -6326 -725 4079 4778 2608 641 -789 -2302 -3634 -1352 3536 7382 4731 -2381 -7308 -4672
1589 -4672 3184 7873 5413 -643 -4995 -3039 1819 3694 1400 -569 64 1735 1214 -1519 -2511 424
1605 424 4010 3679 -229 -3482 -2417 1824 3867 1692 -1959 -2668 785 4137 2820 -1837 -3717 -686
1621 -686 4157 5479 1523 -2951 -3202 795 3539 3189 826 327 745 1090 -742 -2197 353 4711
1637D711J876m123p104k271N966P351K197n241p501j931L612M622K308j176k400
1652H96r87k196j719N29M716M853P7o145p867j545O285R059K926n671q944l430
1668i163L864O333L386j054k777k466k286j258J123M796M993L94o464p578j563
1683i720O164R085K675n687q211k770M090N899J961j606k232j205q66j059k56
1698c738L355M230R06m410o273j670M959O909J497m579n828j029L507L887L67
1713B090k325j740J208J144q39k330J33K998K689j471l663k195K599L660P03k950
1729b89k825J302L521J317k843l776K31M225L656j057m606k783J796L750J742
1744C361j480j398k57J39m90j449Q86K994L179p66n903m612J406O633N798j120
$$ plain form
1637 4711 6587 2464 -4640 -6911 -945 6406 8603 3362 -4139 -6070 -2458 2164 4472 3296 896
1652 896 -91 -2287 -4006 -3477 1239 6092 6169 24 -7843 -9388 -3103 5956 8882 3211 -5733 -9163
1668 -9163 -5299 1034 4420 3366 589 -1877 -4163 -5421 -4298 498 5491 5885 -579 -8157 -9720
1683 -9720 -3556 5529 8204 2517 -5694 -8464 -4374 1525 3486 1880 -352 -1557 -2423 -3482 -3738
1698 -3738 -383 3847 4753 343 -5930 -7600 -2641 4268 5765 1186 -4642 -5671 -2164 1723 2090
1713 2090 -235 -1975 -767 377 -462 -2792 -2659 339 3028 1557 -2106 -4301 -1702 1958 2661 -289
1729 -289 -3114 -1812 1709 3026 183 -3593 -3362 863 4519 3462 -1144 -3927 -2131 1619 3361
1744 3361 1881 483 226 365 -125 -1574 -688 2306 5485 4719 -1184 -5796 -4390 2243 8041 6921
1760F921o983n685M91N079M284O22k249k477j264j422k17J851M547K905k220p077
1776b894n491K055Q189O565j394p721o498J43N693M929R33k580k619j592j716
1791c998k57K843M654K767k574p198m289J880P304O071j255o787o473L40N454
1806a518M727K99k466k406n51q08m60J164L314K253j211m766m385J135N843M580
1822D744p27n941m059J382M407K335j356k850P4J361O56j953j225J357L021Q22
1838B048k157l059j81L085K135n53l230j273K282K795K0l304k515J897M261K017
1854D268k555m571q33K855L554L09j861j187j51N26p45r07J137L671J507k865
1870B152n077k570L652O703L099m109o682k847K849N215K698j234k043k008j204
$$ plain form
1760 6921 -62 -5747 -5256 -177 4107 4729 2480 3 -1261 -2683 -2900 -1049 3498 6403 4183 -2894
1776 -2894 -8385 -6330 1859 8424 7030 -691 -7189 -7046 -1353 3576 4509 1929 -690 -2282 -3998
1791 -3998 -4255 -1412 3242 6009 3435 -3763 -8052 -6172 1132 7203 5948 -839 -7312 -6972 -1518
1806 -1518 3209 3508 1042 -1364 -1915 -2723 -3183 -2019 1295 3548 2337 -2429 -6814 -5679 164 4744
1822 4744 4017 -1924 -5983 -4601 -194 2141 785 -2065 -1991 -630 26 -1927 -3152 -1795 1226 2048
1838 2048 -109 -3168 -3349 -264 1871 1318 -1912 -3185 -903 1892 1912 -1392 -3907 -2010 2251 4268
1854 4268 1713 -2858 -3691 -836 2718 3027 1166 -21 -172 354 -391 -1298 -161 3510 5017 2152
1870 2152 -2925 -5495 -1843 4860 7959 3850 -2832 -5679 -2830 2385 5083 3849 1806 -202 -1406
1885a406q37J047L283L154J258m583o220k431M874Q120L108m215p502m013K783
$$ plain form
1885 -1406 -2243 -1196 2087 5241 6499 1916 -4304 -6735 -1861 6259 9367 5152 -2350 -6363 -3580
$$ [...]
8191h0
##END NTUPLES=NMR FID
##END=
