##TITLE=1H_SA_33.131
 CDCl3, 8 sc, 
 23.8.2019
##JCAMPDX= 6.0         $$ Bruker NMR JCAMP-DX V2.0
##DATA TYPE= NMR FID
##DATA CLASS= NTUPLES
##ORIGIN= UXNMR, Bruker Analytische Messtechnik GmbH
##OWNER= root
$$ XWIN-NMR		Version 3.5
$$ Fri Aug 23 16:17:24 2019 Russian Standard Time (UT+4h)  she@DPX200
##.OBSERVE FREQUENCY= 200.13155
##.OBSERVE NUCLEUS= ^1H
##.DELAY= (6, 6)
##.ACQUISITION MODE= SIMULTANEOUS
##.ACQUISITION SCHEME= undefined
##.AVERAGES= 8
##.DIGITISER RES= 18
##SPECTROMETER/DATA SYSTEM= spect
##.PULSE SEQUENCE= zg30
##.SOLVENT NAME= CDCl3
##.SHIFT REFERENCE= (INTERNAL, CDCl3, 0, 15.7039)
##AUDIT TRAIL= $$ (NUMBER, WHEN, WHO, WHERE, WHAT)
$$ ##TITLE= Audit trail, XWIN-NMR		Version 3.5
$$ ##JCAMPDX= 5.01
$$ ##ORIGIN= Bruker BioSpin GmbH
$$ ##OWNER= she
$$ F:/spectra/data/she/nmr/H-F/1/audita.txt
$$ ##AUDIT TRAIL=  $$ (NUMBER, WHEN, WHO, WHERE, WHAT)
(   1,<2019-08-23 16:15:36.31 +0400>,<she>,<DPX200>,
      <created by zg, POWCHK disabled, PULCHK disabled
       configuration hash MD5:
       00 E9 B6 7A A2 85 ED C7 34 08 36 98 17 FE 4E 26
       data hash MD5: 16K
       2D 18 B0 A8 53 0C 89 12 18 5C B3 B5 4C A8 9D 4B>)
$$ ##END=
$$ 
$$ hash MD5
$$ EA 58 8E AC 99 54 29 2B 89 CB CE 1C 57 D8 84 78
##$RELAX= 
##$RELAX= 
##$RELAX= 
##$RELAX= 
##$RELAX= 
##$RELAX= 
$$ Bruker specific parameters
$$ --------------------------
##$DU= <F:/spectra>
##$EXPNO= 1
##$NAME= <H-F>
##$PROCNO= 1
##$TYPE= <nmr>
##$USER= <she>
##$AMP= (0..31)
100 100 100 100 100 100 100 100 100 100 100 100 100 100 100 100 100 100 
100 100 100 100 100 100 100 100 100 100 100 100 100 100 
##$AQSEQ= 0
##$AQ_mod= 1
##$AUNM= <au_zg>
##$AUTOPOS= <>
##$BF1= 200.13
##$BF2= 200.13
##$BF3= 200.13
##$BF4= 200.13
##$BF5= 200.13
##$BF6= 200.13
##$BF7= 200.13
##$BF8= 200.13
##$BYTORDA= 1
##$CFDGTYP= 0
##$CFRGTYP= 5
##$CHEMSTR= <none>
##$CNST= (0..31)
1 1 145 1 1 1 1 1 1 1 1 1 1 1 1 1 1 1 1 1 1 1 1 1 1 1 1 1 1 1 1 1 
##$CPDPRG= <>
##$CPDPRG1= <>
##$CPDPRG2= <>
##$CPDPRG3= <>
##$CPDPRG4= <mlev>
##$CPDPRG5= <mlev>
##$CPDPRG6= <mlev>
##$CPDPRG7= <mlev>
##$CPDPRG8= <mlev>
##$CPDPRGB= <>
##$CPDPRGT= <>
##$D= (0..31)
0 1.2 0 0 0 0 0 0 0 0 0 0.03 0 0 0 0 0 0 0 0 0 0 0 0 0 0 0 0 0 0 0 0 
##$DATE= 1566562535
##$DBL= (0..7)
120 120 120 120 120 120 120 120 
##$DBP= (0..7)
150 150 150 150 150 150 150 150 
##$DBP07= 0
##$DBPNAM0= <>
##$DBPNAM1= <>
##$DBPNAM2= <>
##$DBPNAM3= <>
##$DBPNAM4= <>
##$DBPNAM5= <>
##$DBPNAM6= <>
##$DBPNAM7= <>
##$DBPOAL= (0..7)
0.5 0.5 0.5 0.5 0.5 0.5 0.5 0.5 
##$DBPOFFS= (0..7)
0 0 0 0 0 0 0 0 
##$DE= 6
##$DECBNUC= <off>
##$DECIM= 24
##$DECNUC= <off>
##$DECSTAT= 4
##$DIGMOD= 1
##$DIGTYP= 9
##$DL= (0..7)
0 120 120 120 120 120 120 120 
##$DP= (0..7)
150 150 150 150 150 150 150 150 
##$DP07= 0
##$DPNAME0= <>
##$DPNAME1= <>
##$DPNAME2= <>
##$DPNAME3= <>
##$DPNAME4= <>
##$DPNAME5= <>
##$DPNAME6= <>
##$DPNAME7= <>
##$DPOAL= (0..7)
0.5 0.5 0.5 0.5 0.5 0.5 0.5 0.5 
##$DPOFFS= (0..7)
0 0 0 0 0 0 0 0 
##$DQDMODE= 0
##$DR= 18
##$DS= 0
##$DSLIST= <SSSSSSSSSSSSSSS>
##$DSPFIRM= 0
$$ [...]
##$SUBNAM2= <"">
##$SUBNAM3= <"">
##$SUBNAM4= <"">
##$SUBNAM5= <"">
##$SUBNAM6= <"">
##$SUBNAM7= <"">
##$SUBNAM8= <"">
##$SUBNAM9= <"">
##$SW= 24.9336996594482
##$SWIBOX= (0..15)
0 0 2 0 0 0 0 0 0 0 0 0 0 0 0 0 
##$SW_h= 4990.01996007984
##$TD= 16384
##$TD0= 1
##$TE= 0
##$TE2= 300
##$TE3= 300
##$TEG= 300
##$TL= (0..7)
0 120 120 120 120 120 120 120 
##$TP= (0..7)
150 150 150 150 150 150 150 150 
##$TP07= 0
##$TPNAME0= <>
##$TPNAME1= <>
##$TPNAME2= <>
##$TPNAME3= <>
##$TPNAME4= <>
##$TPNAME5= <>
##$TPNAME6= <>
##$TPNAME7= <>
##$TPOAL= (0..7)
0.5 0.5 0.5 0.5 0.5 0.5 0.5 0.5 
##$TPOFFS= (0..7)
0 0 0 0 0 0 0 0 
##$TUNHIN= 0
##$TUNHOUT= 0
##$TUNXOUT= 0
##$USERA1= <user>
##$USERA2= <user>
##$USERA3= <user>
##$USERA4= <user>
##$USERA5= <user>
##$V9= 5
##$VALIST= <valist>
##$VCLIST= <CCCCCCCCCCCCCCC>
##$VD= 0
##$VDLIST= <DDDDDDDDDDDDDDD>
##$VPLIST= <PPPPPPPPPPPPPPP>
##$VTLIST= <TTTTTTTTTTTTTTT>
##$WBST= 1024
##$WBSW= 4
##$XGAIN= (0..3)
0 0 0 0 
##$XL= 0
##$YL= 0
##$YMAX_a= 98607
##$YMIN_a= -112060
##$ZGOPTNS= <>
##$ZL1= 120
##$ZL2= 120
##$ZL3= 120
##$ZL4= 120
##$ABSF1= 10
##$ABSF2= 0
##$ABSG= 5
##$ABSL= 3
##$ALPHA= 0
##$AQORDER= 0
##$ASSFAC= 0
##$ASSFACI= 0
##$ASSFACX= 0
##$ASSWID= 0
##$AUNMP= <proc_1d>
##$AZFE= 0.1
##$AZFW= 0.1
##$BCFW= 1
##$BC_mod= 2
##$BYTORDP= 1
##$COROFFS= 0
##$CY= 11.3945322036743
##$DATMOD= 1
##$DC= 2
##$DFILT= <>
##$DTYPP= 0
##$F1P= 20.1720416913024
##$F2P= 0.152960286110954
##$FCOR= 0.5
##$FTSIZE= 0
##$FT_mod= 4
##$GAMMA= 1
##$GB= 0.15
##$INTBC= 1
##$INTSCL= 1
##$ISEN= 128
##$LB= 0.24
##$LEV0= 0
##$LPBIN= 0
##$MAXI= 10000
##$MC2= 0
##$MEAN= 0
##$ME_mod= 0
##$MI= 1.114404
##$NCOEF= 0
##$NC_proc= 0
##$NLEV= 6
##$NOISF1= 3.799351
##$NOISF2= 2.8
##$NSP= 1
##$NTH_PI= 0
##$NZP= 0
##$OFFSET= 15.70392
##$PC= 1
##$PHC0= -9209.011
##$PHC1= 6.400962
##$PH_mod= 1
##$PKNL= yes
##$PPARMOD= 0
##$PSCAL= 0
##$PSIGN= 0
##$REVERSE= no
##$SF= 200.130013532006
##$SI= 16384
##$SIGF1= 3
##$SIGF2= 2
##$SINO= 400
##$SIOLD= 16384
##$SREGLST= <1H.CDCl3>
##$SSB= 0
##$STSI= 0
##$STSR= 0
##$SW_p= 3612.71676300578
##$SYMM= 0
##$S_DEV= 0
##$TDeff= 0
##$TDoff= 0
##$TI= <>
##$TILT= no
##$TM1= 0
##$TM2= 0
##$TOPLEV= 0
##$USERP1= <user>
##$USERP2= <user>
##$USERP3= <user>
##$USERP4= <user>
##$USERP5= <user>
##$WDW= 1
##$XDIM= 8192
##$YMAX_p= 0
##$YMIN_p= 0
$$ End of Bruker specific parameters
$$ ---------------------------------
##NTUPLES= NMR FID
##VAR_NAME=  TIME,          FID/REAL,        FID/IMAG
##SYMBOL=    X,             R,               I
##VAR_TYPE=  INDEPENDENT,   DEPENDENT,       DEPENDENT
##VAR_FORM=  AFFN,          ASDF,            ASDF
##VAR_DIM=   8192,          8192,            8192
##UNITS=     SECONDS,       ARBITRARY UNITS, ARBITRARY UNITS
##FACTOR=    0.0002004,     1,               1
##FIRST=     0,             0,               0
##LAST=      1.6414764,     0,               0
##MIN=       0,             -112060,         0
##MAX=       1.6414764,     98607,           0
$$ Real data points
##PAGE= N=1
##DATA TABLE= (X++(R..R)), XYDATA
0 0 0 0 0 0 0 0 0 0 7 -8 8 -8 8 -16 16 -17 24 -27 32 -40 47 -54 62 -71 81 -93 106 -120 136 -156 175 -196
32 -196 220 -246 276 -307 341 -379 420 -466 518 -574 633 -701 779 -861 958 -1068 1193 -1338
50 -1338 1510 -1715 1966 -2283 2698 -3264 4089 -5409 7872 -14116 67057 86992 -13343 4773
64 4773 52738 98607 85054 63881 35193 20571 14896 35195 55100 64342 49120 23731 -9812
77 -9812 -20272 11125 64774 70586 11962 -49301 -39075 20795 55134 30314 -7058 -17338 -7477
90 -7477 -2117 2226 12239 18027 9894 -6502 -19771 -20751 -3566 22978 27439 -7185 -47199 -40225
104 -40225 6151 27141 -6226 -44435 -37599 -7571 -5952 -30339 -41082 -26096 -12842 -20283 -36487
117 -36487 -42635 -36955 -24967 -15683 -21746 -39390 -42193 -21236 -9809 -28753 -47331 -26594 7935
130 7935 2312 -40112 -59202 -26865 13840 14049 -16726 -40927 -40001 -21680 -1818 5038 -8384
143 -8384 -26139 -30037 -23022 -22226 -21454 -4288 14763 -1042 -47831 -64806 -19455 37327 36454 -15214
157 -15214 -52519 -40666 -2678 23895 25538 9924 -11030 -22107 -12394 7601 22796 29997 27123
170 27123 6311 -26010 -30895 12948 62936 55477 -5706 -49754 -29154 22208 45051 27655
182 27655 -1417 -18964 -23320 -12485 7476 20249 15675 671 -16574 -30325 -27048 4419 40320
195 40320 32839 -20572 -57079 -28557 27374 42555 10303 -20237 -19702 -4901 3544 7622 11265
208 11265 10667 1546 -9122 -14116 -10186 5410 22023 17396 -14712 -38130 -19505 18892 24684
221 24684 -8623 -32619 -18627 5486 3842 -14669 -19047 -6412 1717 -3890 -13721 -18395 -12915
234 -12915 -617 6312 -3678 -19207 -17535 568 6405 -11459 -23363 -5218 17143 4209 -30255
247 -30255 -36896 -5463 21484 11246 -19212 -35419 -27048 -7542 6423 4997 -11238 -26187 -24208
260 -24208 -13329 -8980 -8409 2304 10621 -8530 -40357 -38298 5807 41820 25439 -21410 -42319
273 -42319 -19948 15100 31762 23981 2260 -17217 -16931 1541 18766 23040 19833 13158 -3599
286 -3599 -23079 -16393 24666 54927 31766 -23061 -44041 -9679 34268 41973 16721 -9351 -18027
299 -18027 -10242 6676 21551 23740 13618 705 -8858 -12164 -1595 25345 43498 23406 -20076
312 -20076 -34328 932 42996 42981 8149 -15666 -8820 8402 17478 18529 16709 9431 1881 -816
326 -816 581 5152 15703 25568 16254 -9799 -21775 1704 33219 28966 -4278 -19410 -101
339 -101 20669 14668 -2114 -3711 7070 12890 6886 -1813 -4859 706 10861 13689 1953 -11183
353 -11183 -6430 9585 10028 -7328 -13206 4128 16881 -302 -25248 -21906 6787 22194 6280
366 6280 -19143 -27421 -14942 3901 13889 6070 -13267 -22727 -14102 -691 552 -1757 3769 6613
380 6613 -10735 -31766 -21279 17825 37147 9823 -30106 -37558 -8668 21777 27460 10054 -12637
393 -12637 -23868 -15127 5707 17911 13888 4225 -3255 -14379 -22281 -7782 25529 37963 6205
406 6205 -36456 -39163 102 33187 28246 -494 -22473 -24085 -9543 9676 18672 10386 -5059
419 -5059 -13369 -14231 -11833 -1174 17848 24353 115 -33354 -32987 5306 35532 22369 -12633 -26364
433 -26364 -12007 6049 12962 9278 2824 -2825 -5608 -4235 -1029 3056 10392 14589 3607 -16327
447 -16327 -18428 6575 27560 15063 -13510 -19823 697 15769 7364 -7411 -7103 2371 5613
460 5613 622 -6017 -7834 -3072 6265 8110 -3998 -14950 -8133 7002 6429 -9047 -12353 3940
474 3940 11734 -5474 -23173 -13047 12257 18587 -111 -20802 -22149 -5989 10613 14425 1041
487 1041 -16379 -19710 -6474 5609 4014 -984 1454 1016 -13607 -23359 -6220 23661 27453 -2144
501 -2144 -30454 -24846 5085 26801 23875 3598 -16005 -18434 -1774 18547 22260 10921 911
514 911 -3220 -7367 -7747 7031 30292 30271 -2820 -32720 -21948 16809 38140 22055 -7977 -23019
528 -23019 -14996 4160 18684 18838 5310 -8369 -10691 -5299 328 9307 21294 19602 -4481 -26203
542 -26203 -14012 22221 38899 18022 -11657 -16470 1617 18527 21571 14913 5891 -38 1271
555 1271 7342 10148 9952 13555 15399 4478 -10271 -6579 16062 28485 11484 -12541 -11928 8931
569 8931 19209 8373 -3786 -2006 6632 9237 4629 -1210 -1764 4465 12030 10306 -1141 -7925
583 -7925 862 12895 8654 -4472 -4548 8400 10287 -5310 -15701 -3326 14768 13291 -6258 -20971
597 -20971 -16248 -590 11734 9708 -6584 -21793 -19584 -2437 7197 1428 -6374 -5187 -4968 -14241
611 -14241 -18142 302 21603 16027 -13455 -31026 -16285 12759 25945 14396 -8347 -21695
623 -21695 -15816 4492 18590 13778 -1189 -9935 -9957 -9521 -6933 6432 19583 9517 -20439 -36170
637 -36170 -15932 16667 24719 2971 -22696 -28600 -14719 4709 14880 7858 -8747 -17939 -12541
650 -12541 -3220 2028 6661 11829 5745 -13643 -24370 -6542 23073 27771 2230 -21924 -18536
663 -18536 2365 15670 13227 1778 -7729 -9462 -4243 1882 2637 705 1818 1790 -7687 -16545 -9033
678 -9033 10933 15375 -4148 -21067 -13562 5443 10500 -1135 -10226 -6836 854 2489 -1577 -6257
692 -6257 -7274 -1332 5635 2324 -9704 -14207 -3682 6106 -2 -12518 -11623 -1074 -1114 -14490 -19990
707 -19990 -6439 5860 81 -17401 -26121 -17102 -1262 6555 -415 -15993 -25093 -15832 1375
720 1375 7212 -1489 -8558 -6869 -5616 -10456 -7492 8470 20147 7354 -17204 -22923 -3007 19848
734 19848 23487 6959 -12708 -19508 -7324 12961 21275 9281 -7848 -12354 -6391 -1839 1686
747 1686 10688 15757 2623 -20495 -24372 446 25998 23318 -1185 -20620 -18038 964 18715
760 18715 20824 6904 -7676 -9998 -103 8762 10552 11780 12549 4773 -10717 -12939 7345 27649
774 27649 22066 -3757 -18884 -8942 10315 18197 11677 -223 -7676 -5928 2190 7851 5919 1833
788 1833 2970 3205 -3097 -7868 1338 15994 15511 -2566 -13965 -3082 13726 14732 1958 -4993
802 -4993 -345 6257 7073 2629 -2030 -1703 4002 8188 2602 -7881 -9184 2280 9004 643 -9789
817 -9789 -6554 2908 454 -9249 -9730 2252 9234 520 -12857 -14518 -3162 9247 12884 3391
831 3391 -11164 -14653 -1165 14677 14625 2479 -4245 -626 2669 -175 3084 14209 18375 3709
845 3709 -14519 -12486 7631 24012 19363 337 -15756 -14232 2055 18521 17927 2119 -11205
858 -11205 -10279 -999 4109 5871 10912 10165 -3844 -18997 -13299 10881 26285 14791 -8921 -20054
872 -20054 -10582 8595 19940 15851 -958 -13344 -10435 2839 10751 8106 4603 3093 -3741 -12760
886 -12760 -9326 9029 21337 9426 -13541 -20198 -5864 11713 15226 4774 -6896 -10900 -4446
899 -4446 5335 8401 3653 -520 1572 1674 -3513 -5185 5030 15016 8951 -7343 -12339 1133 12971
914 12971 9779 -2480 -6817 -1396 4201 3521 -878 -4625 -3931 1165 4613 -2043 -10608 -8799 1917
929 1917 6309 -3020 -11060 -6430 1318 -940 -8476 -7241 3048 5789 -3600 -13101 -10947 428 9870
944 9870 8689 -3486 -14557 -12592 2159 13547 8399 -5328 -10011 -4025 -589 -1794 1650 8694
958 8694 6847 -7925 -18477 -9892 8687 16824 6870 -10329 -19426 -13084 4234 16271 9983 -7978
972 -7978 -17097 -9903 1298 4824 3989 4466 1161 -9959 -17701 -7530 12522 19122 3611 -16521
986 -16521 -20653 -6449 11172 16289 5785 -10815 -16875 -7785 5424 8779 3115 -1432 -2527 -6832
1000 -6832 -10971 -3752 12109 16378 992 -16381 -14828 2475 15245 12973 1128 -8284 -8070 324
1014 324 9889 10315 2924 -1550 1652 3452 -374 -854 6982 12936 4926 -8185 -8294 4657 13267
1029 13267 7242 -3689 -5320 224 5112 4590 -292 -3721 -1699 4157 5352 -2042 -8600 -3996 6548
1044 6548 7409 -2636 -8071 -1958 4264 933 -4556 -1715 5927 5138 -4062 -9922 -4764 5566 10972
1059 10972 6087 -5048 -12553 -6571 8297 14730 5600 -7692 -8944 -453 3917 2659 3219 7274
1073 7274 3175 -8371 -12682 -1393 13413 15340 2503 -12577 -15919 -4332 12168 17242 4725
1086 4725 -11749 -15165 -3255 7185 6837 2876 1262 -2555 -10505 -11954 446 14980 13042 -4385
1100 -4385 -18372 -14603 850 13600 12891 -202 -13686 -14790 -1573 9867 8608 243 -3959
1113 -3959 -3608 -5080 -5439 1777 12366 10960 -3561 -15509 -8856 7489 15200 8691 -3470 -10189
1127 -10189 -5979 4848 10962 6749 -1546 -3824 664 2664 -659 -467 6385 8796 -64 -9268 -5199
1142 -5199 6661 10802 2666 -5928 -5359 1009 4506 2705 -2155 -3693 -1600 3553 3518 -4007 -8372
1157 -8372 -2500 6337 4634 -5256 -9039 -2261 3383 -152 -4932 -1658 3246 1226 -5935 -8111 -2586
1172 -2586 5729 7872 1420 -9187 -12133 -2382 10453 11681 -843 -10812 -7883 1649 4812 2176
1186 2176 2472 3008 -1847 -9506 -8859 2529 12237 8929 -4935 -14976 -12332 549 12302 11595 -3361
1201 -3361 -16207 -14018 -317 7705 4115 -2122 -4317 -6666 -10119 -7724 3544 11958 5098 -10587
1215 -10587 -18119 -9922 5640 13351 7415 -7172 -16716 -10753 3612 11150 5030 -4578 -6633 -3686
1229 -3686 -3564 -2700 4013 10260 4550 -8772 -13676 -3582 10288 12825 3560 -6964 -9317 -2188
1243 -2188 7637 11091 4455 -3396 -3295 2901 4527 1506 2086 7040 7562 -378 -6292 -249 9660 10811
1259 10811 2149 -4364 -2220 4135 7184 3948 -573 -2552 1887 6340 4458 -2749 -5195 2272 9094
1274 9094 5016 -3961 -5115 2461 6208 2196 -972 2255 5189 2368 -2820 -2466 3831 9074 7971
1289 7971 979 -6453 -5897 4351 13970 10424 -2583 -9429 -3234 6557 7574 3673 1250 813 -2878
1304 -2878 -7081 -3782 6023 10267 3437 -7965 -13677 -7660 4885 12501 6071 -9169 -17303 -8740
1318 -8740 4712 8369 1061 -5684 -6573 -7061 -7856 -3354 5116 8095 -1705 -13829 -15565 -4168 7938
1333 7938 9547 267 -12286 -16340 -7287 6260 9253 -242 -9312 -8810 -4105 -1969 -871 3414 5028
1348 5028 -1381 -10566 -10699 710 10916 9134 -1610 -9097 -7537 1282 9627 9206 174 -5743 -2231
1363 -2231 4243 4732 920 1061 5319 4553 -2793 -5088 1764 9343 6805 -1690 -5302 -1218 3758 4943
1379 4943 1357 -2319 -2382 1921 5248 2294 -3795 -4244 3891 8088 2758 -4620 -3443 3700 6349 2190
1395 2190 -698 1891 4206 1285 -1764 -66 5247 8247 5501 -1279 -6527 -2811 7861 13637 6137
1410 6137 -6600 -8722 763 9066 7180 1037 -302 -546 -3098 -3868 1301 8138 7861 -849 -9210
1425 -9210 -9309 -911 9147 11212 1652 -11416 -13554 -1844 9451 8507 -1073 -7073 -6375 -4234 -2956
1440 -2956 1310 5919 4299 -5399 -12949 -9922 1064 9454 6607 -3850 -13879 -12464 -392 9892
1454 9892 7222 -4104 -10793 -6579 -683 372 342 3062 2776 -4379 -10076 -6602 4410 10245 4179
1469 4179 -5688 -10197 -5492 3634 8334 4387 -4682 -8341 -2759 3370 2571 -1957 -1626 951 -617
1484 -617 -5501 -5974 665 5365 1698 -5476 -7057 -2223 1848 2184 -1057 -4841 -4453 396 3025 -419
1500 -419 -5800 -3991 3477 5945 -1031 -6790 -3257 3737 4772 159 -1906 768 1954 1 -1183
1515 -1183 1181 5111 5872 2386 -3069 -4588 668 9790 11363 2011 -7878 -5449 4597 10562 6894
1530 6894 372 -852 240 55 804 5206 8851 5916 -2020 -6821 -3828 5175 12340 9959 -1400
1545 -1400 -11212 -7865 5232 13546 7522 -3569 -6684 -3030 130 1738 4505 6675 1855 -6565
1559 -6565 -9483 -2800 6940 10637 4491 -6431 -11666 -6276 5662 11907 5308 -6214 -9280 -2451
1573 -2451 3647 3537 2369 2464 590 -4668 -6727 -1405 7173 8252 677 -7021 -8463 -2303 6203 8280
1589 8280 1192 -6951 -7721 -354 4597 1874 -2804 -1923 522 -1068 -4937 -3852 2135 4349 -724
1604 -724 -6392 -5737 -582 2798 1358 -2703 -4601 -2923 1378 2417 -1935 -5659 -2684 4106 4065 -2947
1620 -2947 -6929 -2054 4146 3693 -883 -2598 -539 671 -596 -866 1613 3088 2760 -624 -4076 -3953
1636 -3953 2589 9054 7197 -3123 -9365 -3651 6950 9354 2541 -3195 -3109 -1323 -200 1197 4359
1651 4359 5117 307 -5832 -7086 -1727 5938 8761 3030 -7087 -12474 -5213 6780 10628 1778 -8147
1666 -8147 -8918 -2627 1614 2373 3004 1873 -2574 -7645 -6862 624 7410 7069 -636 -8811 -10318 -1771
1682 -1771 9276 10623 490 -9478 -7756 1241 6286 4161 1083 849 -685 -3995 -3627 2944 8126
1697 8126 6049 -1559 -6916 -4834 2418 8209 6773 -950 -7159 -4573 3563 6315 1932 -2443 -1188
1712 -1188 1219 111 -2501 -849 3336 3647 -1302 -4851 -3036 1246 3725 1712 -2486 -4029 -1322
1727 -1322 2683 2896 -2330 -4818 -154 5125 2749 -4069 -5790 51 4994 3037 -1740 -2713 -438
1742 -438 422 81 25 1638 2201 624 -1886 -4002 -1761 3654 7289 3135 -6120 -8652 -1062 7789
1758 7789 7079 -599 -6270 -4089 -480 1153 2068 2910 1389 -3144 -6073 -4625 735 5777 6432 -746
1774 -746 -9552 -10382 -269 9296 7951 -2681 -10160 -6550 473 3756 2958 1824 -136 -3743 -6242
1789 -6242 -2613 4052 7758 4667 -3130 -8433 -5895 3388 10974 7904 -2682 -8874 -4247 4710 7520
1804 7520 3922 363 -665 -1115 -1679 47 4938 6940 3087 -3164 -5683 -1790 4835 8004 4727
1819 4727 -3500 -7317 -1883 5569 6042 -138 -3712 -1225 1551 -7 -2300 -201 3054 1920 -3014
1834 -3014 -4862 -1708 1925 3075 -59 -3322 -3707 -622 2506 1393 -3004 -4172 646 4123 499
1849 499 -5133 -4654 1445 4649 1561 -2791 -3191 -402 1035 1004 411 673 801 -65 -1853 -2934 -172
1866 -172 4876 5908 -76 -7253 -6708 2407 8621 4874 -3371 -6676 -2923 1242 2763 2344 1562 -1180
1882 -1180 -4078 -4886 -1748 2795 5314 2702 -4238 -9549 -6369 3473 9641 4513 -6416 -10288 -4627
1897 -4627 2773 4708 2212 -955 -3007 -5120 -4605 347 5078 5101 601 -5516 -7476 -2881 5949 9744
1913 9744 3333 -7015 -9549 -1634 6541 6439 856 -3061 -2404 -1715 -1689 864 4188 3782 -688 -5563
1929 -5563 -5344 -126 5181 5746 353 -6048 -6575 -317 6055 4261 -2676 -4257 -1021 1545 -24 -1381
1945 -1381 399 2047 419 -3099 -3329 -355 2295 2350 -457 -2973 -2440 1068 3483 1136 -2913 -2649
1961 -2649 2494 4589 621 -4106 -1910 4033 5567 1556 -1936 -1007 1581 3052 3042 2468 1881 1694
1977 1694 917 323 425 2804 6142 5479 -871 -5721 -1958 6382 9092 3172 -3972 -4720 -241 3649
1993 3649 4066 2693 470 -1925 -3183 -1847 1474 4458 4556 703 -5048 -7720 -2040 7018 9582 1394
2009 1394 -7966 -8085 529 6485 5598 1216 -1861 -2987 -3143 -681 3755 5774 3939 -1956 -5754 -5100
2025 -5100 1405 7275 7525 -593 -8517 -7001 1952 7788 5097 -1493 -4283 -2509 -733 457 2282
2040 2282 3837 1521 -2382 -4805 -2707 1624 5316 4124 -1691 -6700 -4926 2366 6218 2102 -4082
2055 -4082 -4923 -575 1596 -358 -1696 -373 1004 -1425 -3578 -2952 -304 1698 782 -2224 -3598 -2678
2071 -2678 897 2295 -550 -3704 -2285 2106 2741 -1712 -4404 -726 3889 3203 -361 -3178 -1494
2086 -1494 1509 2419 1917 1050 -13 -15 199 -156 137 1808 3857 2153 -4038 -5953 -803 6651 6416
2103 6416 -1486 -7114 -4985 825 3867 2396 -5 -2567 -3512 -2833 -564 2565 3491 2309 -2538 -5824
2119 -5824 -5117 1154 7957 6168 -2072 -8691 -5163 3234 7222 4248 -643 -3467 -3213 -1582 1643
2134 1643 4428 3875 699 -3123 -4744 -2339 3420 7469 4904 -3105 -8266 -3787 5351 8326 3042
2149 3042 -3609 -4049 -804 1732 2513 3164 2804 77 -2785 -3121 43 3783 5117 1958 -3524 -6103
2165 -6103 -2390 3971 5683 -503 -5723 -4511 240 1297 -887 -2233 -1045 -1030 -2639 -3542 -2339 -98
2181 -98 348 -653 -3094 -3934 -2416 999 1484 -1754 -3908 -2038 2281 1852 -2714 -4036 -673 3771
2197 3771 2568 -2112 -3919 -1566 1184 2009 905 -1109 -1735 -1323 -515 -688 -354 975 1582 -957 -4939
2214 -4939 -5045 912 6179 3222 -4294 -7440 -3439 2433 4041 1788 -1450 -3761 -3329 -1451 2020
2229 2020 3338 2470 35 -2757 -4629 -2407 3853 7935 3965 -4995 -8040 -1802 6138 7439 2175
2244 2175 -2952 -3701 -1998 989 3783 4302 2465 -941 -3495 -2707 848 5537 6779 2370 -4925 -6236
2260 -6236 256 8052 7580 705 -4206 -2838 899 3344 3723 2761 1124 -1274 -2302 -1069 1457 3775
2276 3775 3493 -371 -4641 -5075 -293 4815 3763 -2837 -6756 -3351 1083 1608 -1535 -2709 -1446 -1033
2292 -1033 -2150 -2877 -1836 165 210 -1027 -2962 -2821 -865 1380 1298 -2115 -3188 -705 2536 980
2308 980 -3010 -3061 502 3333 807 -3138 -3437 -688 1563 1318 -305 -2069 -2462 -1259 62 233 -177
2325 -177 539 500 -2063 -4855 -2816 2936 5668 974 -5448 -6249 -677 4536 4088 499 -2917 -3677 -1853
2342 -1853 951 2809 2558 1003 -1236 -2761 -3380 309 5574 6126 480 -6379 -5684 1544 7831 6007
2358 6007 -59 -3903 -3235 142 3367 4696 3513 626 -1687 -1811 386 3587 6358 5865 427 -4563
2374 -4563 -3634 3897 9216 6429 -734 -4279 -1283 3696 5033 3709 1884 236 -1251 -1106 1019
2389 1019 3011 4001 2399 -1149 -4040 -2471 2407 5787 2887 -3145 -4821 -477 3116 2501 -269
2404 -269 -1123 -116 556 -613 -544 575 1354 994 17 -1287 -1284 781 2751 1651 -1570 -2424 694 3091
2422 3091 711 -2515 -1831 2075 3584 -85 -3186 -2282 861 2470 1474 -778 -2367 -2084 -535 1153
2438 1153 540 -90 -80 -411 -2179 -3379 -901 3733 3899 -1362 -6477 -4864 1276 4426 2556 -1767
2454 -1767 -4310 -4112 -1144 1697 2144 437 -1829 -3379 -3260 -2321 1060 4495 3309 -2842 -7687 -4824
2470 -4824 3402 7084 3146 -3006 -5049 -2371 1334 4247 3841 1190 -1669 -2522 -1165 1149 4136
2485 4136 5309 2880 -2189 -5025 -1354 5433 7643 2713 -3852 -4602 193 4048 4409 2253 -224
2500 -224 -1262 -1502 167 1704 3002 2324 217 -2062 -3270 -1133 3763 5032 850 -3798 -3675 931
2516 931 4299 2321 -1079 -1457 56 759 153 63 474 1285 1024 -325 -1149 -555 1189 2581 821 -2015
2534 -2015 -1660 1269 2478 -72 -2699 -868 2618 2325 -1243 -3137 -1535 1073 2319 751 -1299
2549 -1299 -2900 -1926 -58 1132 -202 -1410 -1625 -1377 -2956 -3460 -502 2764 974 -4741 -7461 -4029
2565 -4029 2072 3045 -140 -4525 -5877 -3557 91 1945 831 -2027 -3672 -3713 -2964 -840 1507 3055
2581 3055 264 -5425 -6994 -1713 4745 5730 -333 -5397 -5793 -1889 2771 3560 1554 -1761 -3687 -2707
2597 -2707 34 1820 3237 2191 -15 -3732 -4321 549 6268 6221 -229 -5160 -3631 1377 5039 3590
2613 3590 854 -1462 -1756 -672 1330 2506 2200 1164 -625 -2362 -2338 670 4234 3488 -1462 -4812
2629 -4812 -2398 2425 3851 860 -2134 -1380 70 928 566 86 652 977 530 -52 -655 28 1860
2646 1860 2638 516 -1879 -861 2227 2545 -232 -1675 347 2707 1942 -1721 -2914 -721 2307 2065
2662 2065 -54 -2617 -3235 -1412 879 796 -1261 -2091 -1646 -1865 -2382 -1978 774 2215 -116 -4880 -5524
2679 -5524 -1133 3417 3061 -1261 -4717 -4232 -1325 2363 2988 612 -2289 -3546 -2249 -16 872 2013
2695 2013 1901 -1274 -5239 -4755 1043 5582 4314 -1927 -6123 -3341 1373 4887 4017 605 -2147 -2706
2711 -2706 27 2505 3812 3395 2113 -94 -2685 -1333 4120 7526 4827 -1437 -4300 -764 4623
2726 4623 6004 3125 -132 -1606 -747 1358 2737 3022 1612 550 -936 -1386 -783 1896 4239 2556
2742 2556 -2216 -3951 -539 4127 4227 461 -1620 -908 1435 2044 1256 945 1016 1415 1479 857 -23 1326
2760 1326 2795 2411 378 -1164 207 2617 1713 -1250 -1709 588 1907 22 -2612 -2953 -619 1371
2776 1371 662 -1915 -3462 -3241 -992 543 59 -2081 -3470 -2338 -1385 -2362 -1750 129 882 -2074 -5944
2793 -5944 -4204 -14 3046 1144 -3672 -5853 -4151 -663 1729 985 -2590 -4751 -4181 -2196 -779
2808 -779 -453 298 -666 -3730 -5945 -3786 1304 4405 1101 -4533 -6237 -2568 2372 4074 2133 -1373
2824 -1373 -3693 -2153 1088 3390 3402 2143 39 -1131 -1598 308 4872 6097 2235 -3321 -4020 727
2840 727 5102 5058 1247 -2093 -2377 -142 2192 3204 2047 117 -503 -491 -325 827 3770 4422 1733
2857 1733 -2022 -2198 2656 5868 4323 664 -783 1020 3197 3325 2648 2143 1776 1956 1958 1363 1011 1755
2875 1755 3034 2651 392 -609 843 2848 1710 -635 -933 1484 2475 555 -1932 -1300 1223 2572
2891 2572 1234 -1178 -2442 -1276 1175 2410 1029 -1526 -1804 -567 557 -188 451 1579 1013 -2149
2907 -2149 -4007 -1892 2400 3114 -239 -4035 -4726 -2210 1263 2433 276 -3152 -4643 -2767 -232
2922 -232 1230 560 -186 -1178 -3430 -3736 -440 3737 4311 -372 -4826 -4204 344 4507 4403 713 -2801
2939 -2801 -3239 -503 2632 3639 1481 221 -1151 -2080 -1590 999 3857 3673 -1139 -5146 -3562 1524
2955 1524 4169 2069 -1915 -3970 -2540 -227 1992 1645 10 -1834 -1639 -998 -206 489 2161 2116 -434
2972 -434 -3189 -1684 2237 4239 1706 -1894 -2410 237 1931 1794 499 -393 -391 364 504 -49 -487 189
2990 189 1572 440 -1381 -1742 453 1769 359 -1621 -950 1093 1356 -588 -2088 -600 1589 2164
3006 2164 366 -1679 -2109 -446 2094 2219 39 -2150 -1883 -196 542 -47 -208 569 -856 -3012 -3206
3023 -3206 -525 2597 1925 -2002 -4850 -4171 -559 2168 2431 -1018 -3611 -3808 -950 1400 1408 230 -786
3040 -786 -1591 -2708 -1734 1093 4061 2575 -2394 -4860 -2513 2027 4454 2295 -1400 -3976 -3227 143
3056 143 2821 2068 -334 -2087 -2311 -2037 -1076 756 2160 849 -3612 -5381 -2890 1820 3264 49
3072 49 -3849 -4448 -2276 777 1851 717 -1322 -2489 -1692 -843 -166 346 1469 694 -1849 -3279 -1116
3089 -1116 2535 2947 -160 -2649 -2077 404 1843 898 -239 -560 -412 464 534 200 -267 693 1888 846
3107 846 -903 -813 1413 2142 842 -892 153 1866 1659 -413 -960 509 2147 1917 127 -1357 -1058
3124 -1058 573 2633 1946 -708 -2374 -1199 928 1482 206 430 335 -355 -2533 -1714 1444 3172 1411
3141 1411 -2067 -3777 -1762 1963 3544 2268 -1411 -3388 -1941 1267 3124 1885 -7 -896 -1355
3156 -1355 -1443 251 2698 3851 1202 -3151 -3778 -282 4274 4989 1459 -2603 -3614 -1407 2393 3936
3172 3936 1797 -1079 -2155 -1341 -376 811 2012 2576 -269 -3264 -3764 145 3792 3637 -797 -3357
3188 -3357 -3229 291 2527 2680 360 -1826 -1539 -602 890 1171 1249 1117 200 -1566 -1801 1083 3733
3205 3733 2608 -534 -2167 -705 1848 2996 1459 136 -318 447 1481 1593 675 519 1510 2119 809
3222 809 -534 201 2113 2149 416 -922 326 1792 936 -667 -713 962 2020 1414 -553 -1643 -849
3239 -849 1385 2425 1047 -1496 -2447 -554 1337 1207 -306 -525 -509 -1278 -1760 -681 1761 2138 -222
3256 -222 -3289 -3558 -770 2231 2752 -130 -3167 -4227 -1529 1935 2326 167 -1695 -2238 -1629 -1095 -71
3273 -71 2363 2145 -1012 -4491 -3408 851 3676 2828 -1229 -4059 -3761 -515 2702 2544 -386 -2997
3289 -2997 -3077 -1210 81 802 1100 308 -1853 -4148 -3009 569 3160 1158 -2682 -4219 -2657 554
3305 554 2417 1369 -1352 -3066 -1993 243 1297 1062 788 619 -375 -1259 -787 1814 3530 1851 -1385
3322 -1385 -1841 415 2722 2940 733 -529 -488 698 1567 1078 363 375 1333 1563 370 -832 109 1925
3340 1925 1591 263 -385 644 1646 686 -405 27 1394 1915 822 -817 -1056 102 2091 2733 266
3357 266 -1919 -1846 350 2015 1181 -865 -956 -551 -982 -1044 -16 1446 1113 -1816 -3089 -2259 568 2471
3375 2471 1817 -1171 -3729 -3263 281 2826 1719 -509 -2319 -1759 -455 405 1320 2041 950 -1902
3391 -1902 -3613 -1448 1924 3800 1634 -2130 -4061 -2414 1301 3229 1536 -1921 -3579 -2373 -145
3406 -145 496 766 252 -815 -3088 -3677 -1383 2257 2928 -235 -3491 -3721 -877 2189 2918 1192 -1606
3423 -1606 -2351 -367 1509 1818 1209 538 257 -149 -485 435 2952 3184 978 -1395 -1426 1159 2967 2279
3441 2279 363 -760 -305 1323 2067 1643 407 376 1502 1728 619 -165 973 2336 1659 102 -131
3458 -131 1332 1794 1049 26 597 1709 1512 548 -428 -390 833 2056 1877 -397 -2383 -1413 1099 2026
3476 2026 392 -1325 -1532 -1152 -870 -665 -101 1041 -199 -2523 -3193 -1442 1281 2139 617 -2302 -3771
3493 -3771 -2031 1552 3205 1277 -2129 -2914 -1092 3 774 1341 1156 -776 -2910 -3471 -553 2700
3509 2700 2115 -898 -3936 -4197 -1647 1611 2234 -617 -3803 -4319 -2271 -1 353 -455 -1102 -1721 -2997
3526 -2997 -2561 66 2338 1773 -1485 -3811 -2710 1 2664 2191 -256 -2549 -2425 655 2337 1368
3542 1368 472 -462 -455 -469 -634 431 2466 1960 -504 -1895 -664 1594 2358 1332 -156 -1048 -167 1511
3560 1511 1918 785 -113 425 1654 1346 111 48 1190 2036 1435 -290 -85 1008 1621 616 -179 377
3578 377 962 600 -392 -1140 -784 655 1424 605 -1781 -2925 -1127 1227 1332 -565 -2359 -1683 -728 -325
3596 -325 -63 622 898 -691 -2215 -2114 514 2215 2295 94 -2361 -2442 -132 2825 2951 234 -2443
3613 -2443 -2152 -15 1445 1298 1111 17 -1465 -2626 -1796 807 2483 1323 -1987 -3861 -3039 161
3629 161 2635 1976 -1191 -4060 -2813 81 1611 1272 -441 -1213 -1291 -1945 -731 1594 2628 1272 -2012
3646 -2012 -3034 -1198 2007 3019 1619 -1424 -3014 -1415 1276 2264 972 -678 -949 -317 -94 -47
3662 -47 829 2002 799 -957 -1826 164 2237 2389 855 -804 -826 703 2028 2037 550 -97 409 1775
3680 1775 1392 73 60 1545 1873 727 -303 -26 1058 1201 17 -301 307 877 317 -560 -847 76
3698 76 1281 1668 111 -1468 -1480 446 2548 2022 -406 -1440 -101 983 935 1081 1228 989 -243 -845
3716 -845 70 2089 2967 2063 -186 -1639 -1322 1637 3847 2727 -721 -2488 -1008 1322 1931 1638 235
3733 235 -492 -1157 -1610 -179 2161 2511 219 -2690 -3215 -1153 1841 2982 897 -2138 -3766 -1791
3749 -1791 1301 2057 393 -1287 -1900 -1663 -1498 -194 1046 1198 -752 -3230 -3076 -623 1939 2021 -366
3766 -366 -2840 -3437 -1346 1440 1404 -662 -2224 -1465 -444 -115 -359 236 998 -445 -1818 -1812 218 1791
3784 1791 1106 -292 -1632 -939 723 1470 600 -602 -1063 44 831 127 -957 -476 746 665 -365
3801 -365 -1056 -400 425 377 -404 -460 -262 180 -363 -996 -899 -142 756 1114 -603 -1884 -1436 1310 2510 836
3821 836 -1640 -1646 44 1000 1185 535 689 187 -808 -762 386 2005 2236 873 -1203 -2089 -369 2242
3839 2242 3222 1045 -2222 -2679 -341 1908 2323 752 -560 -1072 -1487 -735 760 1704 1620 -848 -2992
3856 -2992 -2497 -78 2489 2425 -276 -3302 -3316 -509 1922 1745 -625 -1976 -1783 -1070 -808 153 1224
3873 1224 533 -1432 -3320 -2235 492 2148 979 -1152 -2949 -2507 282 2379 1473 -789 -2084 -902
3889 -902 45 559 495 585 394 -600 -1538 -814 1148 1782 1039 -701 -1334 -371 989 1724 660 -749 -807
3908 -807 474 1176 457 -774 -215 1100 1537 -124 -749 112 997 841 258 -24 159 564 224 -347 388
3927 388 1029 1299 728 -354 -1264 166 1971 2423 281 -1332 -1030 710 1721 1564 919 141 -39 -311
3945 -311 -9 1062 2290 1773 256 -1385 -1324 941 2992 3324 63 -2756 -1771 907 2600 1734 119
3962 119 -1106 -1203 -1167 -100 860 1694 308 -2097 -2931 -1783 664 1908 1128 -1964 -3856 -2576 453
3979 453 1927 344 -1618 -2664 -2047 -973 -105 463 623 -435 -2351 -2677 -772 1103 1937 172 -2071
3996 -2071 -3112 -1796 1117 1847 393 -2091 -2374 -902 579 314 -503 -137 -63 -1081 -1709 -358 1169
4013 1169 1137 128 -1176 -1462 -236 1228 1244 207 -1202 -376 840 936 71 -598 178 1130 622 -430
4031 -430 -398 105 903 607 -273 -301 226 412 -8 -84 -126 368 972 512 -823 -1168 734 2085 1974 -446
4051 -446 -1296 -254 1310 1765 1147 219 90 424 451 959 1829 2203 969 -356 -765 -331 2153 3258
4069 3258 1909 -684 -2597 -521 2059 2614 1149 -798 -1267 -934 -106 641 1600 1105 -641 -2183 -1904
4086 -1904 -357 1566 2110 381 -2082 -3324 -1025 1972 2604 237 -2238 -2284 -994 183 700 715 87
4103 87 -799 -1852 -1555 279 1447 1281 -526 -2322 -2445 -416 1814 1721 -239 -2447 -1881 -229 938
4120 938 385 -227 -184 -415 -1135 -679 202 1155 970 -394 -1415 -1073 525 867 832 -393 -1216 -725 848
4139 848 1010 -366 -1048 -332 650 236 -815 -1255 -176 623 -61 -622 -627 -355 -376 -266 -353 -258 145 679 -464
4160 -464 -1133 -660 707 2392 1070 -1086 -1540 107 1793 1977 744 -143 -505 -116 632 1298 1858 1378
4178 1378 359 -645 -657 661 2119 2463 786 -1763 -2210 3 2465 2423 -164 -1444 -1238 -62 940
4195 940 1356 1622 575 -870 -1264 -790 781 2058 1707 -346 -2360 -2265 630 2759 2133 -480 -2163
4212 -2163 -1381 273 1155 1043 374 -272 -1160 -1597 -543 1332 1450 491 -1265 -2010 -1528 880 2479 1337
4230 1337 -785 -2016 -759 954 1593 343 -84 -471 -217 -313 -48 945 1282 699 -444 -994 -664 868
4248 868 1148 453 -1462 -1549 -358 660 543 -993 -1264 -324 230 -538 -1475 -1144 -152 328 -394 -787 -976
4267 -976 -585 -530 -344 -323 -329 -184 48 -432 -1206 -499 1253 1611 192 -1502 -1582 686 1898 1088 -338 -1244
4287 -1244 -873 -278 416 861 814 138 -901 -1310 -932 359 1599 1237 -952 -2540 -1997 1033 2580 1151
4305 1151 -939 -1992 -1267 161 879 1321 228 -474 -1704 -1505 -194 966 1463 617 -1481 -2546 -1540
4322 -1540 1466 2650 601 -1619 -2732 -1009 1019 1572 686 -442 -997 -1078 -1141 328 1604 1651 62
4339 62 -1357 -1688 -348 1693 2390 425 -1242 -1622 434 2168 1477 289 -310 -1 -132 58 570 894
4357 894 1019 -13 -579 -819 129 710 847 -89 -1121 -1252 50 976 380 -902 -921 -13 468 -374 -966
4376 -966 -560 358 681 -111 -609 -346 -527 247 496 450 41 224 167 -488 -520 -54 1623 1255 -243 -1775
4396 -1775 -708 1253 2032 1008 -300 -1120 -538 377 1074 1130 217 -359 -190 -572 211 1352 1691 766
4414 766 -1125 -2198 -868 1803 2458 728 -1605 -1933 -636 1375 1593 862 -42 -1024 -1510 -730 512
4431 512 1698 1273 -11 -1833 -2288 -492 2058 2176 -28 -2124 -2443 -406 1390 1595 429 -339 -1030
4448 -1030 -707 -130 1666 1447 789 -192 -1048 -743 450 2124 1852 45 -1830 -1118 752 1956 1019
4465 1019 -236 -966 -249 -145 251 445 752 524 -431 -828 -616 345 1061 548 -471 -1552 -886 566
4483 566 440 -62 -999 -576 158 505 -552 -1102 -186 512 129 -219 -756 -540 68 335 153 -195 -144 188
4503 188 -16 -422 -666 250 1308 760 -1020 -1633 -254 1573 1993 152 -1371 -1176 -308 761 1224 431
4521 431 -280 -629 -633 -290 676 1313 1008 153 -1808 -2166 62 2236 1724 -809 -2714 -1485 -125 1271
4539 1271 1259 259 -1076 -1686 -1391 -8 591 959 -93 -1431 -2244 -1509 131 1862 1156 -1260 -2679
4556 -2679 -2091 860 1791 935 -555 -1404 -1385 -383 592 1117 990 258 -812 -1315 -520 711 2041 834
4574 834 -966 -2066 -650 1422 1645 668 -769 -819 -221 358 321 267 389 -52 -377 -605 -103 232 649
4593 649 264 -718 -1056 -300 972 1004 -461 -1247 -556 547 384 -498 -694 -135 657 440 -177 -533 -122
4612 -122 287 291 607 -168 -162 388 28 90 -94 866 1466 427 -656 -812 811 2085 1274 65 -814 -396
4632 -396 408 1418 1293 394 -434 -579 -292 467 832 1399 853 -352 -1383 -1070 1272 2346 1344 -1199
4650 -1199 -2453 -995 767 2051 1310 -346 -1328 -1184 -210 664 1048 645 -375 -1324 -1545 -708 1549
4667 1549 2096 649 -1387 -2420 -255 1486 1676 517 -1114 -1205 -532 445 1079 1252 450 -763 -1350
4684 -1350 -871 135 1469 1280 456 -1334 -1752 27 1583 1500 -95 -1591 -1219 -194 443 308 -11
4701 -11 -182 -365 -849 -842 -325 308 383 -435 -1441 -1141 -209 521 77 -856 -1175 -378 330 44 -655 -983 -451
4722 -451 282 -303 -871 -672 -174 452 384 12 -240 -424 -164 22 -268 229 559 683 -94 -922 -244 1230
4742 1230 1701 866 -806 -1226 -222 921 1327 783 26 -984 -513 189 722 851 771 85 -794 -1241 -140
4761 -140 1745 2510 321 -1654 -2110 -56 1574 1560 335 -817 -1538 -612 601 1335 1276 -161 -710 -1266
4779 -1266 -1052 483 1763 1755 224 -1674 -1438 645 2165 1818 208 -1167 -1024 -5 996 1078 775
4796 775 208 -743 -406 397 1254 1453 1132 -255 -1763 -923 963 2086 1230 -463 -1469 -546 743 804
4814 804 302 -369 -482 -818 -499 -100 210 129 55 -655 -813 -976 -21 801 137 -935 -1080 -460 218 -175
4834 -175 -1010 -567 -38 155 -214 -881 -926 -175 447 353 -464 -758 -704 212 130 -28 -342 376 252 -463 -801
4855 -801 77 1164 1478 -118 -1006 -927 216 1274 1311 369 -687 -1066 -502 305 1033 441 -312 -512 -1248
4874 -1248 -899 250 1437 1065 -291 -2383 -1507 485 1597 1075 -373 -1273 -1808 -521 984 1266 530
4891 530 -796 -774 -896 -286 733 1704 1026 -788 -1821 -845 1462 2529 1080 -772 -1297 -505 868
4908 868 1617 1340 370 -321 -543 -9 642 1331 1383 590 -668 -1198 -171 1277 1967 723 -971 -1007 138
4927 138 747 1007 294 -119 -570 -509 -22 54 158 226 -83 -292 -844 -451 597 544 -174 -1172 -441 484 272
4948 272 -123 -750 -177 24 230 100 -761 -445 71 320 252 -250 -330 -493 -209 120 -288 -38 315 -151 -602
4969 -602 -938 28 869 551 -622 -1311 -1114 244 980 215 -698 -1554 -1547 -404 607 92 -240 -754 -1004
4988 -1004 -1496 -734 378 1203 -102 -1631 -2486 -1369 692 1441 484 -1401 -2119 -1065 236 721 729 -606
5006 -606 -1063 -1364 -673 223 1238 1226 161 -1236 -1579 -68 1852 1870 332 -1119 -1670 169 1430 1561
5024 1561 755 -66 -543 -479 441 1119 1312 1245 136 -811 -562 459 2013 1735 156 -996 -653 615
5042 615 1454 801 24 -576 -397 82 184 346 618 210 -65 -220 -256 23 647 942 -255 -928 -460 535
5062 535 647 -328 -542 19 541 435 -342 -196 -96 372 651 221 -2 -150 -68 618 614 115 26 136 14
5083 14 -594 -794 677 1051 314 -904 -1068 -275 721 1336 81 -878 -1268 -979 252 550 209 -606 -988
5102 -988 -1164 -710 -94 664 1061 -545 -2156 -1688 -135 1074 1114 -209 -1494 -1780 -513 621 757 342
5120 342 -756 -1477 -1130 -61 441 1141 578 -446 -1483 -1145 918 1848 1351 -280 -1674 -984 505
5137 505 1857 1280 288 -684 -771 141 784 1316 901 414 -772 -644 -371 1023 1819 899 -653 -1339 -319
5156 -319 1271 1445 589 -254 -539 -183 125 535 235 283 75 121 203 -97 233 833 424 -257 -897 -104 802
5177 802 581 -158 -432 222 789 515 53 -63 244 761 699 494 -250 -173 471 756 623 545 500 117 163 -132
5199 -132 351 552 1111 73 -937 -767 369 1090 802 85 -1320 -1195 -282 1014 961 -117 -790 -1093
5217 -1093 -603 -471 106 780 439 -1001 -2000 -983 387 1635 598 -952 -2245 -1427 -7 736 993
5234 993 -220 -1334 -1407 -452 308 750 335 -321 -1363 -1455 -435 1020 1655 481 -1244 -1739 -935 739
5252 739 1621 618 -817 -998 -694 10 934 694 200 -509 -542 -982 -199 1115 1135 -282 -1329 -1271 29
5271 29 1064 894 -55 -750 -1073 -349 217 204 122 -179 -481 -309 -301 -93 92 487 -97 -518 -500 273 808 615
5293 615 -405 -56 117 329 384 174 -241 163 780 905 671 -146 71 659 902 570 -202 -103 194 68
5313 68 5 273 969 835 -273 -823 -350 655 1377 552 -554 -881 -538 469 922 391 -576 -1032 -1217
5332 -1217 -467 27 463 418 -295 -1462 -1514 -305 1046 1471 166 -1453 -1794 -636 980 1177 797 -904
5350 -904 -1403 -573 182 795 808 108 -575 -1150 -874 -10 1352 1079 -199 -1575 -1470 240 1106 975 156
5369 156 -796 -965 -410 404 1139 463 -578 -618 -847 -511 172 657 642 -627 -1446 -820 312 1081 488 -632
5389 -632 -1230 -666 17 524 290 197 -670 -356 -34 -256 -217 473 179 -130 -739 -504 437 792 -21 -677 -240
5410 -240 -81 581 314 -168 -87 464 553 425 4 -451 36 709 749 92 -365 0 157 223 -144 152 485
5431 485 73 -843 -869 -156 795 650 -15 -1205 -1457 -402 857 998 223 -1381 -1303 -681 132 260 401
5450 401 315 -510 -1303 -1194 432 1084 524 -519 -1606 -1061 39 1152 1197 29 -1358 -1246 -304 650
5468 650 759 521 202 -648 -923 -440 576 1346 709 -496 -1442 -783 873 1581 922 -242 -813 -767 300
5487 300 1159 915 -95 -266 -619 5 -216 678 614 203 -885 -1439 -521 786 1100 225 -962 -1195 -489
5506 -489 330 535 231 -189 -462 13 -223 133 -213 346 446 -188 -553 45 887 674 260 -215 251 634
5526 634 777 531 38 260 617 514 331 -125 -72 58 989 830 174 -315 209 510 494 149 690 216 -230
5547 -230 -903 -551 244 885 457 -124 -1123 -951 369 695 735 -185 -919 -804 173 449 790 77 175 -840
5567 -840 -1065 -11 847 1118 491 -677 -1475 -388 633 1232 870 -766 -1458 -830 466 1104 557 -184
5585 -184 -375 -930 -886 125 875 1200 25 -1154 -1463 -250 1260 1629 226 -892 -1242 -515 788 898
5603 898 444 -509 -831 -505 -490 144 640 387 -248 -1275 -1302 -163 783 515 -225 -1078 -890 -139 587 383
5623 383 -528 -749 -680 -25 241 149 82 288 182 -48 -336 586 775 609 188 -300 211 722 641 144 -135
5644 -135 269 582 502 311 -394 -255 266 772 533 -222 -425 -138 49 251 213 252 337 -289 -492 332 585
5665 585 693 454 -560 -1027 -446 583 896 538 -769 -813 -809 401 796 -147 -278 -347 -741 -629 -97 906
5685 906 698 -334 -1625 -1518 -398 963 1016 403 -1191 -1492 -472 599 831 375 -483 -844 -973 -79
5703 -79 406 839 1052 -864 -1324 -1232 267 1021 1080 78 -1531 -1040 -20 812 617 -144 -1148 -1032 -746
5722 -746 -37 22 188 -161 -738 -1393 -832 238 918 194 -958 -1177 -785 357 717 259 -229 -696 -182
5741 -182 184 138 361 271 536 383 33 -8 552 792 791 -21 -350 58 675 394 157 -20 -7 507 1004 -24
5763 -24 -526 -298 461 845 389 -711 -420 176 466 392 -52 -20 405 -346 -272 403 434 585 -329 -771 -558
5784 -558 -110 754 1228 99 -1034 -1175 -104 623 493 137 -353 -668 -629 -479 684 987 471 -449 -1228
5803 -1228 -806 264 1013 939 -66 -1265 -1085 100 1531 1149 351 -751 -381 -150 343 779 721 113
5821 113 -708 -1215 -83 924 1256 659 -888 -1493 -574 589 1090 476 -547 -1040 -799 -130 267 173 106
5840 106 -178 -726 -1242 -565 610 762 -92 -652 -817 -152 485 788 44 -475 -459 49 448 488 -1 -189
5860 -189 223 -136 -174 -229 125 791 152 -192 -710 238 457 -135 132 -382 391 245 353 -226 -482 -47 393
5881 393 721 -10 -654 -309 42 629 354 -88 300 -407 -510 -249 32 397 149 -514 -890 -1043 351 788
5901 788 725 -538 -1154 -943 186 504 621 -407 -486 -685 -407 249 537 740 -116 -956 -917 -389 690 1312
5921 1312 278 -819 -1123 -582 530 1366 322 -477 -781 -558 102 603 516 386 -368 -1180 -829 6 809
5940 809 833 22 -1189 -1024 -469 693 862 104 -957 -1261 -335 356 341 -113 -317 -445 -801 -909 -25 535
5960 535 547 -309 -797 -449 -282 495 374 116 -571 -737 13 723 707 45 58 161 168 -151 90 300 588 155
5982 155 -187 261 635 652 243 228 247 91 586 413 -181 124 432 721 605 47 -374 -232 693 502 98
6003 98 -143 57 120 -20 -24 307 571 159 -304 -400 -103 955 1049 295 -548 -984 -272 1067 1242 316 -471
6024 -471 -656 -291 34 722 384 555 -451 -636 -426 403 1205 1051 190 -952 -862 109 1253 1214 92
6043 92 -802 -814 -109 572 570 321 123 -615 -937 -559 369 1023 561 -673 -1189 -967 191 872 521 -620
6063 -620 -956 -1007 -347 552 99 -167 -275 -1076 -807 -231 274 602 -65 -808 -1063 -642 215 656 337 -453
6083 -453 -971 -115 452 672 86 -389 -84 -84 28 27 289 125 542 -52 -366 354 527 338 334 -37 227 211
6105 211 519 5 -252 -100 290 600 407 -188 -187 169 892 1087 -47 -46 37 -126 -159 328 525 401 167 -319
6127 -319 -103 400 738 814 491 -998 -737 138 1253 807 -65 -590 -497 34 463 525 603 72 -475 -413 93
6148 93 740 981 396 -618 -918 -534 469 1322 838 -191 -959 -580 149 655 378 239 -246 -951 -783
6167 -783 -414 616 599 -227 -1100 -1300 -864 460 389 93 -1013 -1468 -824 148 514 -67 -602 -691 -986 -922
6187 -922 -195 239 171 -497 -1335 -1206 -548 435 447 -351 -670 -674 -136 599 419 -283 -356 -325 36 -66 -15 -357
6209 -357 179 -75 -333 -452 135 608 316 11 -150 -340 332 208 -33 -185 -119 228 226 31 -293 -552 403
6230 403 784 193 -30 -485 30 282 413 186 63 381 -183 -357 -268 438 626 639 -410 -787 -283 738
6250 738 747 495 -230 -665 -98 564 707 663 415 -223 -553 -112 389 1063 1324 214 -312 -426 164 1102 1304
6271 1304 717 -490 -777 -96 768 1177 265 -45 -472 -538 -221 220 990 608 -645 -1074 -873 -156 711
6290 711 606 -89 -1171 -1143 -139 904 292 -248 -787 -632 -515 -311 198 409 -104 -554 -942 -585 193
6309 193 626 272 -227 -993 -626 194 57 82 -24 -373 -547 -51 84 -367 -28 53 72 -79 -115 47 316
6330 316 188 10 -244 87 440 403 115 -386 139 475 656 44 -326 7 658 628 409 -49 -76 247 394
6351 394 414 282 96 -238 -443 -293 108 696 454 407 -562 -688 280 923 934 425 -633 -652 211 810 919
6372 919 660 216 -28 12 474 714 1223 1042 -128 -389 -428 755 1216 1303 -69 -672 -606 195 922 767
6392 767 190 -613 -644 -202 151 496 434 -197 -566 -711 -684 225 673 32 -681 -1225 -865 124 815 527 -825
6413 -825 -692 -720 -544 61 398 -40 -236 -769 -848 -270 -62 389 -159 -715 -1043 -516 285 335 -257 -709 -756
6434 -756 -267 142 -41 -263 -101 -160 -134 -573 -413 -187 -50 -6 -183 -186 14 -70 -45 -355 -161 -616 -72 -114 -505
6457 -505 -510 -269 265 11 -264 -719 -451 -414 176 -255 -175 -672 -672 -327 -160 324 -36 34 -225 -712 -717 144 831
6480 831 484 -197 -834 -592 426 1230 605 168 -425 -198 23 390 845 769 463 -226 -273 203 1080 1223
6500 1223 717 -173 -622 -348 600 1241 465 -61 -411 -52 84 435 915 249 -98 -409 -406 105 550 1033
6520 1033 392 -560 -654 -282 734 1043 237 -172 -683 -356 318 461 310 -211 -217 -360 -197 387 324 308 -70
6541 -70 -581 -306 123 609 632 -31 -301 -273 1 294 6 107 -166 -84 286 -101 75 -60 -21 33 -50 -225
6563 -225 -93 -25 -269 -239 -192 188 -54 -16 -492 -384 41 239 246 -306 -511 -143 3 3 -31 -250 -293 -346 -353 -56
6587 -56 608 153 -45 -231 -658 -205 412 680 267 -730 -962 -95 878 1096 298 -81 -263 -299 136 685 592
6608 592 261 -58 -466 -275 9 1036 644 130 -737 -991 9 1182 817 22 -612 -594 -482 297 852
6627 852 319 120 -649 -488 -398 362 614 541 -302 -719 -694 -16 1017 460 -429 -787 -554 -240 516 100 157
6648 157 -46 -508 -402 111 269 397 278 -287 -305 -199 449 779 82 -106 -499 -131 424 202 -356 -254
6668 -254 -202 -34 -175 -330 -185 103 42 -10 -182 -199 -106 -174 -87 58 -99 -35 -148 -251 -557 -345 94 306 -109
6691 -109 -597 -572 -93 201 334 25 -577 -275 -193 -7 268 566 180 42 -182 -254 108 540 687 95 -752
6712 -752 -769 245 767 811 134 -510 -350 -234 508 899 368 216 -200 -881 -159 494 842 626 -391 -818
6732 -818 -547 705 1186 500 -478 -660 -639 157 610 434 532 -479 -800 -381 120 382 418 64 -872 -1208
6752 -1208 -235 491 739 168 -461 -789 -306 100 113 17 -296 -275 -444 -378 18 518 405 -102 -297 -383 -230
6773 -230 337 265 -45 -380 -479 17 267 335 48 -146 -96 281 -203 -224 34 36 42 4 -175 147 -77 -87 -51 -162
6797 -162 -120 -18 203 -379 -528 -138 484 363 -204 -429 -601 270 289 422 -73 -65 -381 460 95 475 308
6818 308 100 18 313 -9 188 831 423 77 -513 -205 493 1138 635 -236 -433 -235 317 968 646 417
6838 417 -136 -644 -356 333 895 917 256 -352 -1032 -131 708 881 268 -527 -685 -68 228 474 105 17 -340
6859 -340 -613 -267 291 519 487 -285 -422 -578 98 630 796 -127 -566 -473 -228 197 533 30 -374 -268 -328
6880 -328 -77 94 254 20 -282 -344 -309 -138 591 335 -186 -641 -371 373 245 260 -270 -192 140 -88 -49 -126
6902 -126 -72 108 -62 -40 -185 -251 -68 41 26 -206 -161 -157 -574 -535 -332 -171 -29 209 -443 -490 -215 -45 335
6925 335 -116 -6 -318 -611 -24 369 205 167 -37 -268 -28 3 559 680 511 -511 -779 161 764 364
6945 364 536 -538 -366 16 616 971 147 198 -444 -304 -228 299 698 366 -212 -645 -606 271 1097 506 -201
6966 -201 -347 -982 -81 498 822 218 -264 -396 -382 369 375 269 112 -299 -673 -452 173 524 120 -351 -902
6987 -902 -891 256 423 144 -251 -462 -564 -226 299 276 198 -8 -178 -505 103 166 313 300 -586 -382 -273
7008 -273 31 33 -344 -370 -322 278 82 41 45 27 287 41 -187 -240 -164 -148 -139 -444 -457 -326 -105 -144 -428 -488 -166
7033 -166 120 -227 -559 -343 -259 457 247 -165 -430 -127 -265 407 428 347 70 -168 -227 103 801 507 630
7054 630 9 -544 -291 551 991 954 65 -267 -319 285 890 434 -7 -463 -454 39 142 595 619 332 -394 -414
7076 -414 -142 638 913 679 -289 -843 -171 689 854 443 -114 -258 -338 -275 261 403 282 -69 -542 -248 -134
7097 -134 583 544 255 -576 -772 -68 473 686 201 -161 -272 31 150 626 359 209 -131 115 276 145
7117 145 519 640 196 -401 -359 -107 376 479 -9 -182 -254 288 121 -30 -568 -284 6 -74 -208 -473 -200
7138 -200 -192 -372 -539 -309 -198 -261 22 -109 -48 -145 -104 -189 -284 -396 -68 446 67 -334 -499 -172 -118 366 202
7161 202 138 -351 -216 -93 40 193 553 276 -595 -481 -378 334 602 324 -317 -855 -400 253 480 354
7181 354 97 -506 -483 -197 473 195 149 80 -584 -338 -15 597 338 298 -860 -810 -142 614 537 -303 -230 -605
7203 -605 -262 257 594 256 507 -235 -562 -218 160 1093 519 -74 -557 -610 310 892 640 245 -154 -135 214
7224 214 438 493 201 204 26 -44 138 699 152 403 -44 -310 -307 299 95 230 -235 -281 -136 184 133 -385 -78
7247 -78 -229 -55 -47 -161 -357 -148 -421 -122 -265 -1 -283 109 -184 -437 -59 376 368 -450 -558 -294 184 257
7269 257 -15 -547 -431 -311 290 430 295 -233 -344 -414 160 430 341 93 -261 -360 -630 94 321 561 7
7290 7 -561 -533 79 641 698 269 -294 -541 -264 -194 561 225 259 -267 -536 -299 156 703 284 -576 -598 -435
7312 -435 450 643 811 -102 -731 -479 -57 384 318 312 -384 -313 -282 195 417 637 379 -213 -442 120 1032 808
7334 808 125 -154 -333 -70 220 15 473 338 -244 -159 -251 -169 206 469 -146 -329 -242 -334 419 375 305 -319
7356 -319 -506 50 -81 -319 -159 -232 -93 -4 -317 -244 -69 58 -85 -122 -207 86 -261 -237 -253 -25 -138 37
7378 37 -227 50 -317 -41 -14 218 -189 -346 -666 -101 404 309 -176 -411 -334 375 210 252 296 68 35 -386
7400 -386 -99 216 590 378 -300 -699 -252 34 817 271 -283 -488 -325 -75 -56 425 209 -101 -290 -301 -178
7421 -178 520 531 135 -431 -678 -292 374 816 323 -353 -642 -155 383 587 428 105 23 -440 -72 -239 820
7442 820 508 316 -259 -442 -259 285 530 0 -379 -319 -115 372 289 184 171 -240 -87 219 390 359 -354
7463 -354 30 -124 -215 32 209 554 -151 -638 -465 340 81 -248 -227 -163 -123 -27 -104 -313 -384 -104 -1 -122
7485 -122 -249 -249 20 -228 -114 -53 -89 134 -246 -178 -374 -161 369 2 -257 -422 106 91 593 133 13 -449
7507 -449 -52 -44 497 235 51 225 -295 -196 111 273 667 48 -474 -645 -518 256 789 178 -230 -922 -468
7528 -468 180 229 158 -54 -375 -488 68 16 716 502 -360 -452 -788 153 508 777 19 -682 -528 -43 511
7549 511 437 362 -176 -307 -194 456 238 364 155 -170 -175 -468 464 784 558 -1 -438 -194 327 696 524
7570 524 153 -98 -254 -156 188 357 -7 59 -110 -46 -116 411 446 15 -272 -285 -117 91 228 157 -216 -260 -183
7593 -183 5 -65 -278 -201 76 127 249 -112 1 67 -49 224 -177 76 -203 166 -439 233 -133 298 163
7614 163 -486 -31 -53 108 343 32 -602 -458 -255 434 399 359 78 48 -450 -392 -37 -128 63 -209 -251 -276 149
7637 149 385 883 -61 -698 -452 -175 182 325 -181 -270 -428 -419 -163 183 211 -117 -655 -735 -306 63 519 104
7659 104 -212 -645 -623 39 283 518 -42 -418 -288 -255 -95 448 544 256 -364 -112 -192 318 333 225 -201 -308
7681 -308 -48 615 716 415 -253 -297 -312 54 384 111 -224 -7 -365 -205 -213 66 305 -82 -108 -147 -90 129
7703 129 281 -300 -146 -394 -400 102 13 -96 11 222 287 -199 -397 -369 143 103 86 81 282 264 76 47 -110 413
7727 413 68 185 -392 7 118 581 359 -301 -578 -422 47 542 227 -66 -93 -383 -143 88 88 289 421
7748 421 -357 -640 -269 204 476 354 -156 -615 -556 207 195 348 -516 -693 -420 -175 131 87 158 289 -608
7769 -608 -431 -251 163 593 9 -392 -768 -330 483 491 277 -227 -418 -195 -102 516 236 231 -337 -452 -23 279
7791 279 413 369 116 -429 -207 148 317 256 34 -158 -352 -22 -4 -40 173 -483 -424 -30 33 -126 262 178
7813 178 -188 -374 -271 298 310 -92 -191 -309 83 110 -53 -111 -259 -53 208 -106 157 68 103 345 463 44
7835 44 -103 185 240 141 58 265 244 135 -249 -301 93 130 20 286 -193 -401 72 357 491 570 103 -223 115
7858 115 -148 58 39 383 -63 -422 -409 75 749 524 -30 -542 -628 -362 373 483 190 -448 -510 -262 20
7879 20 194 173 -7 -426 -680 -383 159 911 871 -474 -552 -672 -147 259 390 26 -440 -553 -159 522 -75
7900 -75 231 -75 -213 -180 144 353 564 268 -164 -546 -275 310 230 83 -352 2 -440 223 85 353 -97
7921 -97 -288 -188 -137 -35 -186 161 -15 -94 -284 12 270 423 48 -243 -45 75 66 -6 -22 -31 -215 -88 -88 -400
7945 -400 -52 20 330 32 224 115 -269 -21 50 172 99 16 145 211 -171 -69 210 400 244 -178 -314 305
7967 305 312 575 23 -121 -539 -110 -53 -128 156 -82 -306 -311 -241 119 398 135 -75 -685 -116 -20 518 249 -226
7990 -226 -372 -417 -84 40 105 -20 -379 -329 -502 -336 527 906 199 -233 -335 -200 257 485 452 -73 -356
8011 -356 -67 486 509 373 19 -173 -224 -161 83 608 302 31 -462 -452 262 306 210 15 -51 -167 -56 114
8033 114 330 338 -235 -254 -195 88 -74 95 86 128 -174 -425 -152 266 409 -267 -181 -330 138 -207 -138 -178 -60
8056 -60 -148 170 50 -243 14 60 147 -146 -352 -139 48 361 1 340 89 181 -7 -36 -71 382 278 -46
8078 -46 -274 -432 -270 -144 562 511 -118 -223 -62 36 226 140 72 12 -221 -338 130 0 368 110 -624 -417
8100 -417 -394 288 267 186 -333 -305 -146 16 477 228 120 -171 -450 -75 6 465 269 -59 -630 -606 -217 303
8122 303 528 99 -717 -554 -116 359 345 331 -233 -454 19 -83 271 238 387 23 -513 35 267 370 206
8143 206 -211 55 -183 -253 117 -12 90 -195 -466 -134 165 144 139 39 -141 -193 -358 124 -141 82 -260 -447
8165 -447 -27 -99 64 -168 113 -45 -316 216 136 -283 -130 70 31 -23 -271 -170 7 171 156 15 -28 -67
8187 -67 106 -207 -280 260
8191B60
$$ Imaginary data points
##PAGE= N=2
##DATA TABLE= (X++(I..I)), XYDATA
0 0 0 0 0 0 0 0 0 0 0 0 0 0 -7 8 -8 8 -8 10 -15 16 -17 21 -23 29 -32 37 -42 48 -53 61 -68 76 -86 95 -108
35 -108 119 -133 146 -163 180 -200 221 -245 272 -301 334 -371 413 -463 521 -589 670 -772 904
54 904 -1076 1313 -1674 2266 -3434 6604 -31975 -112060 -63249 8487 35945 981 -34549 -51116
68 -51116 -46031 -32116 -6566 8735 2548 -22324 -44231 -55525 -42344 -4378 29698 10880 -52835
81 -52835 -91139 -53079 14213 30099 -15626 -57035 -53317 -27657 -15451 -13937 -9385 -9410 -20283
94 -20283 -31737 -32004 -19243 1736 18653 11026 -21728 -43422 -18010 30476 40017 -1105 -32547
107 -32547 -12371 22587 21964 -4830 -12554 6530 18018 4553 -12376 -13452 -2643 7161 7414
120 7414 -4371 -19560 -19228 -446 6510 -13316 -28262 -7161 19057 4423 -35877 -40737 1231
133 1231 34569 18213 -20341 -34634 -16536 9295 22537 17265 -1646 -17209 -13361 812 6258
146 6258 5042 12481 17322 -4777 -39818 -38827 11862 50222 22635 -39098 -62480 -29420 14020
159 14020 24469 4065 -22843 -39381 -37024 -18000 2189 8539 566 -13055 -30383 -43778 -29834
172 -29834 15091 44582 15206 -46372 -65914 -20061 35115 40040 2911 -28745 -32887 -18720
184 -18720 610 16779 18065 1690 -16805 -25445 -23509 -8669 18429 34395 9267 -39979 -54391
197 -54391 -7930 44447 39945 -7455 -34267 -18121 8554 17998 15683 13885 10500 2715 -1725
210 -1725 2844 14408 27284 33665 21228 -5752 -14770 13457 47396 40055 1151 -16517 6697
223 6697 31468 23670 1403 -1815 12519 17987 7326 -3354 -3498 4634 13477 13618 804 -11690
237 -11690 -5679 12120 15002 -2701 -11265 7504 24312 7902 -20848 -15817 20627 38684 16211
250 16211 -15891 -19710 1772 23435 27164 14648 -3682 -12340 -3501 11192 14263 9371 10974
263 10974 10613 -7451 -27181 -13571 28017 45178 10179 -36246 -39309 -1059 32042 31249 6849
276 6849 -17386 -25186 -11922 11536 23575 16396 3165 -5362 -14291 -18054 -849 32344 42877
289 42877 5466 -41704 -40304 9201 46588 33497 -5639 -28547 -22083 -1525 15423 20750 11725
302 11725 -4224 -15759 -15578 -6958 6817 24361 26200 -1936 -35300 -30114 15146 47157 28489
315 28489 -13435 -27878 -6523 17873 22566 15325 8235 1577 -2027 663 7490 12897 17826 18489
329 18489 5725 -13980 -14716 12758 35089 19784 -15418 -23408 3251 22416 10132 -9572 -8865
342 -8865 4325 7367 -1348 -9239 -7638 -39 6430 4272 -7139 -16113 -7889 8058 5890 -10775
356 -10775 -14152 3598 11697 -6703 -25714 -13938 14831 21081 -3585 -26989 -23363 -2142 14621
369 14621 13367 -3001 -20435 -21662 -6236 7476 5045 -3102 -3451 -3116 -16055 -26211 -8622 23783
383 23783 26691 -10483 -43782 -33018 6163 28543 16506 -11224 -30119 -27082 -7867 11820
395 11820 14997 526 -14119 -18579 -18841 -15974 949 22976 18745 -18294 -48352 -31182 15074
408 15074 36100 13228 -22873 -35077 -20095 2782 17119 14845 -1238 -16470 -17630 -8479 595
421 595 9204 18236 13546 -11678 -32233 -16310 24214 40889 13079 -22659 -24779 1986 21927
434 21927 20631 8910 120 -2147 -4 5037 9960 13053 14904 13264 1838 -10203 -3813 20656
448 20656 32716 12021 -14594 -12246 13632 25800 11130 -5244 -1944 9917 11454 3749 -1777
461 -1777 -423 5731 11179 8660 -3134 -9809 130 13385 9747 -5793 -7293 8027 13457 -3656
475 -3656 -15949 -508 22179 19935 -4560 -19691 -9623 11529 22839 15425 -2439 -14843 -9559
488 -9559 7870 17432 10444 -66 -461 -428 -8825 -11511 6382 26294 17032 -16796 -34963 -15658
502 -15658 17530 27020 8212 -16829 -28001 -18055 3649 17710 10886 -7246 -17316 -14593 -9484
515 -9484 -4387 7792 19154 8792 -22883 -37844 -12431 26386 32975 2355 -27541 -28371 -7043
528 -7043 13989 19549 8481 -8810 -18210 -12240 -558 6301 9785 11433 3339 -17119 -25887 -3667
542 -3667 28505 30969 -226 -26162 -17885 9198 23773 17769 4481 -3201 -3512 3144 11575 13417
556 13417 11379 10669 9591 1356 -6245 2561 22477 26311 4002 -16205 -7973 15351 20832 4054
570 4054 -8935 -4070 6353 6608 -1006 -6114 -3827 2206 6028 1384 -9059 -11661 -653 9489
584 9489 2781 -9798 -8293 4722 6206 -8083 -13463 2055 16603 8407 -12721 -19733 -6675
597 -6675 10652 14872 3564 -13153 -21996 -12094 5736 10081 -2759 -14187 -13050 -10588 -15071 -14817
611 -14817 -577 10314 -4427 -32535 -38710 -13668 12356 12083 -10616 -32261 -33854 -16714 3777
624 3777 9706 -4276 -21661 -25190 -17492 -10210 -5961 1973 5092 -10252 -33822 -35030 -6730 19831
638 19831 12919 -17523 -37883 -30134 -7364 8058 7240 -8367 -24581 -26801 -14603 -1785 902
651 902 -906 -2510 -9908 -22059 -21941 903 24042 17166 -12620 -28354 -11407 14780 22717 11151
665 11151 -2938 -7260 -2223 7213 13187 11493 6822 6074 5794 28 -3480 6527 21263 18227 -3182
680 -3182 -15047 -1245 18227 17791 1604 -6629 555 9747 9236 4247 1042 3479 9819 13687 9085
695 9085 -122 -11 12817 20981 12952 1657 5654 17291 16820 5192 3224 17123 25605 14357
709 14357 -2301 -3701 10734 23986 23022 9015 -5657 -7095 6723 20900 19588 4760 -4431
722 -4431 -204 4087 2088 4216 15229 18012 1075 -18426 -14148 11242 27922 18219 -4850 -18780
736 -18780 -14001 5015 20890 19045 -289 -16078 -13779 -1168 4918 4849 5421 3137 -11059 -26523
750 -26523 -20649 6156 21933 5442 -23742 -34601 -19143 3348 12550 3403 -14892 -25708 -19395
763 -19395 -4473 4270 1497 -3136 -4883 -10724 -18075 -11936 8679 21096 6446 -18780 -23751 -3939
777 -3939 15987 16596 2309 -10180 -11801 -4054 5423 8319 3135 -3080 -2769 -1806 -5059 -6339 2638
792 2638 12409 6283 -11345 -16708 -923 15194 10631 -4427 -8286 116 8120 7380 2444 548
806 548 3407 9373 11883 5998 -1053 1780 14071 18406 8170 -805 4888 14228 12063 2342 3632
821 3632 14702 17453 5680 -5229 -1496 12036 19878 14711 1565 -8867 -5405 10299 21459
834 21459 14413 -1558 -6385 1516 7397 5688 6483 13112 11945 -3024 -14785 -4973 16645 24205
848 24205 9769 -11780 -19102 -7899 10770 19015 8878 -10726 -20023 -11758 1546 4536 1157
861 1157 -1097 -5144 -16768 -23646 -11639 9830 14362 -5682 -27921 -28221 -9219 8947 11137 -2010
875 -2010 -18532 -23735 -12193 3548 7836 166 -6688 -8409 -10105 -12522 -5256 10332 14247 -3334
889 -3334 -22789 -20514 863 15084 9530 -6992 -16649 -13494 -3355 5191 4018 -4362 -8679 -6249
903 -6249 -4635 -6747 -6936 2004 7444 -1572 -15771 -14342 2399 11995 3504 -9299 -10134 -1016 5175
918 5175 3013 -1943 -3795 -782 4168 4910 -1422 -6761 -2657 7948 9083 -1197 -8202 -1590 6923
933 6923 3550 -3887 -1756 7384 7220 -3441 -9847 -2830 9109 13341 5656 -6807 -11611 -3806 11973
948 11973 17366 6029 -8084 -8360 1998 7500 5265 5076 8194 3652 -8300 -12177 1403 17022
962 17022 16458 -421 -15919 -16001 -1863 13477 16505 2030 -15315 -17934 -4152 8144 7452 888
976 888 -2445 -5671 -11832 -12469 763 15991 13366 -7138 -22163 -15210 4992 18009 13616 -2907
990 -2907 -15851 -13291 1754 13871 11549 788 -5144 -3781 -3473 -3009 4563 14906 11748 -5912
1004 -5912 -17716 -8252 11120 18312 7294 -7268 -12288 -5571 5230 10956 6785 -3004 -6565 -1498
1018 -1498 2119 -358 -672 5161 7637 -1219 -10980 -6576 7262 12264 2454 -8608 -6660 1897 6338
1033 6338 3070 -2153 -3820 -246 4650 3611 -2947 -6638 -428 8575 6649 -3944 -7464 408 7045
1048 7045 2800 -3093 279 6582 4494 -4359 -6456 1603 10754 10037 1804 -7873 -8991 946 13953
1063 13953 14183 -75 -11114 -7628 4585 8181 4451 1766 2439 -1380 -8957 -8195 5011 15172
1077 15172 9026 -7584 -17229 -11496 3992 15077 10924 -5832 -18547 -13575 2198 10958 5174
1090 5174 -3343 -5585 -6620 -9381 -6562 5579 13837 5146 -13263 -19656 -7620 9884 15473 5910
1104 5910 -9241 -16997 -9698 5778 13647 6419 -5320 -8585 -3844 -1737 -97 4756 9960 4082
1118 4082 -10056 -15067 -3169 12833 13807 1045 -11134 -11872 -2603 7560 9355 1013 -6956 -6860
1132 -6860 -831 1930 -1288 -1417 3189 3390 -5217 -10952 -4111 7548 7908 -2740 -9769 -5504 2837
1147 2837 4790 689 -3374 -3589 -254 3970 2548 -3611 -5816 1802 8708 4424 -5378 -6171 2301
1162 2301 7368 2711 -2463 511 4889 2555 -3657 -3214 4075 9113 6934 -1552 -8483 -5863 5181
1177 5181 13872 9187 -5114 -11569 -3457 7544 8492 2189 -254 225 -2530 -6754 -2979 7917 12200
1192 12200 2653 -10758 -14180 -4827 8385 13867 5354 -10354 -17461 -7658 7433 11102 1832 -6873
1206 -6873 -8109 -5898 -5234 -1281 7039 9444 -1657 -15179 -15221 -845 12849 12547 652 -12567
1220 -12567 -14439 -2543 11494 13263 2048 -8435 -7211 -119 2253 2881 6405 7801 630 -10545
1234 -10545 -9561 3892 14673 10038 -3283 -11049 -7525 2648 9897 7860 -1180 -7979 -4695 2661
1248 2661 4223 160 -605 3323 2553 -3788 -6578 1159 9635 6937 -2908 -6851 -1170 5870 6664 2091
1264 2091 -2374 -1186 3203 6294 3618 -2691 -2132 5289 9878 3689 -4748 -3483 5405 7970 2598
1279 2598 -1122 1959 4736 1487 -2362 -343 6004 8422 4315 -3251 -6422 -1534 8547 13371 5153
1294 5153 -7646 -9905 676 10257 8201 678 -2182 -1291 -2542 -3621 1117 8108 7536 -2353 -11827
1309 -11827 -10974 -303 10042 10415 -1525 -14711 -15422 -2146 10230 8176 -4032 -10284 -7868 -4147
1323 -4147 -2810 1080 6155 4206 -6726 -14424 -9417 4867 13090 7197 -5486 -13763 -10395 2644
1337 2644 12617 9273 -3832 -11081 -6518 1842 3565 2172 2579 1828 -4568 -10771 -6206 5155 10703
1352 10703 2881 -8934 -12635 -6191 3562 8020 2097 -7579 -10659 -4439 2729 2179 -2983 -3238 237
1367 237 -351 -6218 -6340 1362 6612 1828 -6771 -7664 -1172 4512 3113 -1352 -4380 -2732 1283 3221
1383 3221 -269 -4941 -3005 4009 5964 -432 -7097 -3220 4680 5826 390 -2737 539 3135 857
1398 857 -1366 1086 5821 6446 1469 -3539 -4589 2041 10869 11251 1047 -9114 -6598 5758 12276
1413 12276 6431 -1755 -2905 -639 -373 -121 4529 8181 4296 -4890 -9357 -4148 5858 11524 7135
1428 7135 -4384 -12654 -8201 5776 13730 7443 -5267 -8547 -3313 1762 3281 4805 6250 2012
1442 2012 -6384 -9140 -1176 9658 12402 4473 -6993 -11511 -3953 8555 14061 5376 -7135 -9964
1456 -9964 -2176 5104 4680 1479 1216 -136 -5749 -8144 -1684 7417 7855 -1053 -10948 -9735 -1809 6035
1472 6035 6819 -755 -8975 -9205 -982 4415 1598 -4009 -3649 -523 -1629 -5258 -4200 1905 4790 -1204
1488 -1204 -8016 -6547 318 3601 1574 -2632 -5106 -2912 1659 3238 -1121 -5012 -1576 5034 5059
1503 5059 -2184 -6187 -784 6215 5535 -785 -2297 1143 2826 944 31 2790 5172 3757 -312
1518 -312 -3696 -1856 3990 9417 7197 -3278 -9086 -3178 8006 10707 2873 -4298 -4212 -910 961
1533 961 1638 4283 4678 -260 -6759 -7247 -688 7149 9841 2580 -8136 -12076 -3489 9809 12491
1548 12491 1660 -8949 -8675 -591 4742 4136 3643 3037 -1541 -7516 -6244 2751 10309 8075 -1644
1563 -1644 -9542 -8943 436 10479 10836 -290 -9913 -8273 1288 7095 4416 -84 -1189 -2067 -4676
1578 -4676 -4005 2175 7566 4748 -4424 -9336 -6218 2032 7619 5251 -3576 -9437 -6153 2423 5685
1593 5685 709 -4510 -3421 -53 -904 -3872 -2116 3012 3196 -2672 -6735 -3755 2394 4208 744
1608 744 -3375 -4103 -795 2594 2389 -2118 -4321 -428 5401 3100 -3785 -5634 882 6142 3634 -2241
1624 -2241 -3248 161 1870 695 -330 1318 2271 652 -2395 -4231 -1635 3631 7132 2076 -7530
1639 -7530 -9535 -1111 8561 6941 -2668 -8014 -4865 -672 1000 1461 2151 890 -4010 -7234 -5103
1654 -5103 1748 6758 5308 -2253 -10174 -9494 745 10941 8740 -3174 -10623 -6566 2422 6230
1668 6230 4447 1749 -10 -3605 -4981 -1116 6459 9709 4940 -3807 -8214 -4377 5540 12503 8286
1683 8286 -3346 -9678 -3597 7010 9427 3708 -903 -1390 -818 -1448 221 5436 7511 2554 -5111
1698 -5111 -6864 -949 6205 7924 3069 -4786 -7655 -2138 5953 6348 -150 -4556 -1980 1223 439
1713 439 -2100 -417 3070 2073 -2888 -5177 -1381 3114 3565 -44 -3061 -3481 -165 3364 2037 -2517
1729 -2517 -3949 976 4821 906 -4998 -4733 1994 5916 1567 -3680 -3233 -118 1549 181 -93 153
1745 153 636 -1212 -3317 -3311 15 3641 4270 -1788 -8895 -7140 2122 8576 3758 -5742 -8418 -3466
1761 -3466 1629 2786 1264 388 -1931 -4673 -5394 -1492 3913 5468 2082 -4981 -9647 -5500 5160
1776 5160 11208 5057 -6830 -10148 -2603 5874 6776 2796 -53 -1656 -2954 -2689 2129 7502 7199
1791 7199 1107 -5533 -6489 -202 8241 10655 3567 -6493 -8829 -683 8722 8090 1446 -3192 -2296
1806 -2296 -670 -20 1810 4822 4144 -886 -5968 -4684 940 5915 5948 -129 -7401 -7166 130 6699
1822 6699 4299 -3063 -6151 -1868 1858 27 -2198 -205 2331 178 -3613 -4214 30 3722 2209
1837 2209 -1388 -3514 -2312 1381 3283 1199 -2756 -2589 1801 4296 38 -4461 -2485 3456 4935
1852 4935 78 -3929 -2685 963 2188 625 -67 -44 -360 -1291 -1970 -1567 1086 3738 2750 -3405 -7900
1869 -7900 -4075 5067 8115 722 -7368 -7415 -478 3698 2961 741 -1087 -3100 -4217 -2767 1219 4504
1885 4504 3979 -638 -6084 -6803 -1113 7727 9295 337 -8516 -8374 1246 8322 5977 785 -2371 -2807
1901 -2807 -2078 373 4593 6758 3882 -1818 -5397 -3538 3087 9259 8606 -428 -8322 -6103 4077
1916 4077 10219 5971 -1775 -4439 -1358 1248 1494 2858 4260 2082 -2838 -4978 -2041 3445 6299
1931 6299 3625 -2805 -6808 -3871 3528 7145 2705 -4268 -4612 -11 3192 630 -586 475 1830
1946 1830 139 -2689 -1546 2015 3565 2042 -1255 -2622 -687 2222 3588 648 -2478 -1683 3225
1961 3225 3868 -761 -4393 -926 4053 3892 -1403 -4646 -1834 1326 1980 40 -827 -1164 -1183 -1514 -1515 -629
1979 -629 1007 2414 -114 -5013 -7005 -1804 5668 5092 -3351 -9030 -5881 1100 3826 2350 -1534
1994 -1534 -3450 -4467 -3584 -893 1864 3196 673 -3500 -6735 -5322 1699 7698 5752 -3756 -10264
2009 -10264 -5360 4507 8713 3957 -2450 -3830 -2297 184 2602 4803 5242 1187 -3397 -3918 -154
2024 -154 5880 9227 5454 -3479 -7485 -2483 7318 10009 3642 -3811 -4401 -313 2755 2997 2968 2452
2040 2452 -585 -3233 -3320 671 4354 4986 1532 -3509 -6069 -1208 5689 6777 477 -5317 -3542 1941
2056 1941 3882 946 -868 613 1781 -432 -1889 -247 2708 2905 488 -1968 -2462 -90 2656
2071 2656 2286 -1092 -3567 -1523 2314 1740 -2916 -4661 -640 3330 1153 -3753 -5373 -2146 856
2086 856 792 -1129 -2399 -3039 -2802 -1741 -1818 -1441 -585 -175 -2532 -6475 -6137 -164 4890 1738 -6801 -10106
2104 -10106 -4470 1895 2857 -960 -4329 -5711 -4609 -2603 -105 1119 199 -2054 -5229 -6303 -3374
2119 -3374 2770 6363 1614 -7238 -9766 -2050 6213 7194 1006 -4096 -4396 -1110 1830 4264 4460 2286
2135 2286 -1593 -3514 -2388 2216 6447 6706 1358 -5682 -6591 529 8283 7866 -292 -6354 -4088 1345
2151 1345 3827 2753 1930 489 -1831 -2593 -986 2323 4971 3766 -404 -4433 -3432 2040 7072
2166 7072 5583 -1026 -4734 -1270 4327 4752 1401 -189 1023 1718 522 -380 1479 3131 2482 668
2182 668 -1273 -1122 1199 3638 2755 -991 -2192 567 3588 2183 -2325 -2477 1880 4800 1893 -2608
2198 -2608 -2857 790 3437 2283 465 -1379 -1470 -571 761 785 544 868 315 -2128 -4675 -2344 3015
2215 3015 5299 -103 -6909 -7074 -1093 4124 3085 -1670 -4989 -4895 -3124 11 1784 1556 -844 -3394
2231 -3394 -4487 -3728 -319 4633 5077 -652 -7637 -6927 1787 8131 5715 -2043 -6109 -3757 211 3259
2247 3259 3760 2051 -1057 -3501 -3892 -1389 2666 4732 2984 -2890 -7766 -5564 2057 7203 3614
2262 3614 -4762 -7627 -3596 1607 3116 1839 -506 -2003 -3242 -2370 151 2536 3045 929 -1995
2277 -1995 -3989 -2421 3137 6317 2654 -3487 -5076 -123 4664 3905 42 -1571 706 1574 555
2292 555 -26 1451 2382 2092 359 -689 110 2462 3978 2454 -480 -927 2118 4306 2446 -1027
2308 -1027 -270 4070 5318 1526 -1655 -532 2891 4670 3067 613 -664 -133 1587 2304 1974 1108
2324 1108 601 622 -1178 -2120 51 4542 4654 -1131 -6156 -4429 2821 6013 2513 -2059 -4468 -2677
2340 -2677 532 3003 2930 1280 -1033 -2728 -2266 -524 2785 5333 3550 -2887 -6906 -3199 5048 8106
2356 8106 2991 -3926 -5791 -2267 2421 3928 2956 170 -3028 -4208 -2330 742 3086 2929 147
2371 147 -4903 -7031 -2725 4274 6541 771 -6265 -7181 -1218 3385 3229 -125 -2331 -3089 -2454 -1029
2387 -1029 1586 2002 1556 -983 -3542 -3802 -889 3592 4724 -42 -5146 -4467 1008 4400 1602 -1600
2403 -1600 -2174 -184 763 206 -166 923 1689 700 -207 -735 -81 2091 2926 1497 -1238 -1181 2156 3540
2421 3540 864 -1943 -350 3150 3198 -448 -2974 -796 2499 3125 1228 -1442 -2209 -937 1050 1570
2437 1570 617 -876 -999 -1078 -1807 -2141 195 3434 1869 -3551 -6410 -2212 3390 4663 511 -4095
2453 -4095 -4690 -1889 1537 3154 2051 -656 -3221 -2696 -1405 717 2633 3561 710 -4706 -6330 -1056
2469 -1056 5844 6290 -7 -6140 -5648 -485 3665 3503 1073 -2270 -4065 -3278 -354 1924 2423 1345
2485 1345 -1954 -5495 -5286 143 5589 4573 -2335 -7621 -5134 900 4079 2185 -1799 -3373 -3290 -1836
2501 -1836 -16 1568 1357 -455 -2007 -3325 -2805 544 3894 2949 -1889 -5822 -2899 2667 4704 871
2517 871 -2567 -1971 339 1382 523 28 641 786 238 -603 -972 -56 2036 1864 -214 -2419 -1106 1733
2535 1733 2145 -742 -2505 -355 2555 1512 -2103 -2873 -649 2248 1805 -556 -2670 -2708 -796 957
2551 957 1332 -587 -2003 -1568 -1373 -1831 -1369 902 2431 -187 -5201 -5292 -518 4404 3273 -1837 -5374
2568 -5374 -4431 -251 2768 2854 273 -2282 -3242 -1539 421 1841 2441 1840 -890 -4841 -3634 2420
2584 2420 7085 4216 -2616 -6043 -3177 2202 5464 3423 -148 -3186 -3400 -666 2244 3347 1845
2599 1845 -7 -2330 -3875 -2454 2424 6192 2982 -3646 -6635 -2249 4218 5271 1945 -2110 -3025
2614 -3025 -1174 1248 2761 2831 1701 394 -906 -1001 596 3431 4978 2702 -1983 -3258 828 5478
2630 5478 4846 582 -1622 -77 1877 2645 1520 1132 1543 1427 1075 525 538 1081 2317 2528 302 -1138
2648 -1138 299 3049 2779 -140 -1318 1275 3299 1793 -1434 -1780 1337 3302 1951 -861 -2324
2663 -2324 -1683 667 2234 1239 -1416 -2470 -1221 -400 -1053 -527 929 1318 -1758 -5238 -3675 1540
2679 1540 4462 1456 -3881 -5613 -2974 1236 3557 1950 -1459 -3762 -2554 -41 1851 2096 1736
2694 1736 196 -2170 -3976 -1822 3651 6063 1444 -4946 -6192 -1432 3393 4230 774 -3136 -5035
2709 -5035 -3403 65 1941 1268 -496 -2460 -3824 -3754 -1207 2950 4073 -484 -5872 -5614 -105 4850
2725 4850 3713 -457 -3221 -3055 -393 2178 2830 1774 84 -1221 -1031 -645 977 2851 3545 600
2741 600 -3370 -3006 1275 4876 3228 -1254 -2798 -375 2179 2268 859 196 523 719 983 315 464
2758 464 1550 2236 1881 56 -734 1353 3098 2082 -462 -511 2094 2804 572 -1807 -991 1461 3061
2775 3061 889 -1257 -2443 -1044 1056 1889 90 -2164 -2847 -923 -69 -452 -438 635 281 -2178 -3978
2792 -3978 -1594 3185 4066 551 -3790 -3854 -213 3666 4157 1212 -1962 -2767 -375 1975 2861 2207 981
2809 981 -356 -2405 -2701 367 4681 4576 -1173 -5711 -4593 793 4608 3570 -977 -4192 -4220 -1276
2825 -1276 1985 2818 469 -1545 -2415 -2405 -1405 990 3842 2902 -1499 -5345 -3174 2355 5766 2855
2841 2855 -1968 -3537 -1971 1262 2680 2263 344 -1631 -1384 -788 -67 985 2236 1536 -1310 -3887
2857 -3887 -2214 2512 4017 1299 -2753 -2867 398 2388 1913 445 -267 402 827 996 750 376 1307
2874 1307 1877 1318 -178 -540 1237 2907 1278 -1457 -935 1663 1881 -549 -2257 -1080 1628 1914
2890 1914 -188 -2394 -2480 -577 1522 1682 -674 -2508 -1870 238 1006 535 56 743 173 -2130 -2259
2907 -2259 831 4314 3360 -660 -3644 -2178 2056 4315 3587 -2 -3008 -2596 519 2900 2603 360
2923 360 -854 -1885 -2731 -1793 1386 3890 1891 -3292 -6139 -3416 1794 4185 1213 -3366 -5498 -3747
2939 -3747 188 2262 1457 -1467 -3255 -3110 -2429 -1004 967 2196 81 -4084 -6019 -2537 2613 3142
2955 3142 -867 -4743 -5171 -2224 850 1510 -423 -2616 -3562 -2749 -1207 -452 41 178 -919 -2751 -3612
2972 -3612 -1541 2350 2939 -712 -3336 -2507 929 2371 1270 -476 -1053 -158 883 1036 663 7 775
2989 775 1488 388 -1136 -350 1488 2380 124 -1594 -644 1207 963 -813 -1839 -189 1713 1339 -213
3006 -213 -2280 -1488 824 2574 2083 -577 -2041 -576 1745 2292 1000 751 1206 508 -668 -206 2434
3023 2434 4657 2477 -1355 -2877 -486 3260 4611 2141 -1395 -3234 -1311 2175 3404 1679 -583
3038 -583 -1092 -1301 -1402 -62 2347 3274 354 -4207 -4810 -398 3966 3929 40 -3678 -4262 -1423 2095
3055 2095 3259 759 -2423 -3639 -2469 -989 258 1219 1282 -1248 -4617 -4632 -574 3501 2437 -2236
3071 -2236 -5279 -4132 -378 2090 1217 -760 -3066 -2729 -1152 556 440 789 343 -450 -2205 -2440 691
3088 691 3607 2677 -1177 -2925 -823 2617 3198 1324 -535 -590 423 1119 1099 204 270 1219 1241 364 -767
3107 -767 20 2046 2118 366 -1177 121 1807 1440 -202 -615 1058 2626 1743 -390 -922 193 2532
3124 2532 3181 1683 -567 -688 1290 3507 2568 1205 679 1253 672 57 1232 3507 4162 1286 -2117
3141 -2117 -1742 1847 4776 4410 1255 -1635 -2238 617 4010 4157 1678 -693 -1010 -139 414 1751 3067
3158 3067 2712 -678 -3591 -2818 1668 4568 3148 -1610 -4163 -3030 474 2987 2799 -641 -3300 -3036
3174 -3036 -1191 351 651 622 7 -2163 -4477 -2986 1266 3580 821 -3468 -4742 -2457 1232 2373
3190 2373 702 -1880 -3400 -2639 18 906 451 -253 -497 -1288 -2242 -1606 1129 2707 698 -2572 -3190
3207 -3190 -898 2032 1861 -160 -1637 -1339 -137 1076 668 -804 -654 91 597 -273 -1535 -726 1360
3224 1360 794 -1229 -1943 -271 752 228 -951 -1341 548 1067 -97 -1632 -1568 -30 1463 1902 -361
3241 -361 -2561 -2046 571 2400 1200 -637 -1129 -149 34 -197 1407 2166 2065 -782 -2539 -1354 1855
3258 1855 4078 2463 -1112 -3184 -2101 1118 3638 2445 -995 -2326 -1731 -467 370 1137 1320 553
3274 553 -2934 -4300 -1657 1981 3359 331 -3599 -4742 -2359 1490 3152 1016 -2588 -4190 -2316
3289 -2316 -135 1072 666 -210 -883 -3074 -3477 -1147 2522 2959 -869 -3922 -4444 -807 2147 2032 -277
3306 -277 -2758 -3251 -1155 928 1335 40 -934 -753 -1083 -1358 -282 1784 2652 293 -2335 -1712 1068
3323 1068 2944 1987 -201 -1327 -225 1012 1857 986 -85 -237 960 1201 -37 -939 465 1798
3339 1798 989 -611 -1128 216 1272 174 -925 -535 1361 1310 381 -823 -876 992 2453 2007 350
3356 350 -1670 -237 2563 3439 2102 66 213 1171 1405 1396 2116 2905 1505 -467 -1309 526 3442 4022
3374 4022 1693 -1462 -2619 -426 2762 3837 1190 -1535 -2499 -595 966 1507 1314 906 -668 -2338
3390 -2338 -2229 359 3370 2534 -549 -3929 -3526 -333 3300 3268 -97 -3204 -3744 -1064 1160 1465 76
3407 76 -812 -1771 -3304 -2570 -252 2340 1137 -2074 -4996 -3424 254 2193 891 -1802 -3644 -3340
3423 -3340 -256 1227 449 -918 -1734 -1382 -951 -916 -317 1848 1062 -1271 -2625 -1393 1131 1967 492
3440 492 -1654 -1991 -848 688 566 -321 -1413 -959 -174 -270 -1358 -1680 -473 530 -702 -2139 -1863
3457 -1863 -193 155 -796 -1764 -521 530 114 -664 -1341 -113 1240 1925 872 -875 -1649 394 2806
3474 2806 2865 774 -987 -559 551 1453 1251 1751 1920 367 -1283 -1092 1069 3038 2841 -115 -2356
3491 -2356 -1946 680 3503 3214 -144 -2462 -1931 1032 2298 2297 1401 559 -580 -1999 -839 2545 4134
3508 4134 2164 -1354 -3076 -1479 1849 3987 2798 -699 -3241 -2374 976 2741 1919 -450 -1394 -1423
3524 -1423 -1748 -657 1315 2383 52 -2758 -3443 -1322 1777 3039 966 -1900 -3087 -1434 1685
3539 1685 2592 672 -1054 -1156 -236 290 21 479 1723 536 -1521 -2403 -475 1943 1678 -786 -2375
3556 -2375 -2328 -333 511 142 -1155 -2084 -1053 -681 -647 -1671 -1563 -487 90 -896 -2108 -1583 -302 88
3574 88 -684 -1225 -285 377 -72 -810 -916 -108 1358 1562 -37 -1526 -1743 802 2957 1907 -898 -1651
3592 -1651 -141 956 1130 755 1140 747 -561 -1379 -333 1988 3079 1711 -764 -2292 -500 2302
3608 2302 4297 2746 -215 -1972 -300 2093 3415 2362 875 506 -598 -436 1284 3180 3545 1045
3624 1045 -1848 -2208 225 3393 3911 1647 -2057 -3147 -826 2408 3031 1023 -886 -1217 -949 -409
3640 -409 787 2286 2222 -247 -2487 -2149 951 3439 2916 427 -1670 -2042 275 2751 2397 434 -1135
3657 -1135 -866 244 706 561 640 852 -152 -2182 -2013 222 1491 706 -1064 -2684 -1602 -174 461
3674 461 -312 -1587 -1958 -780 384 -484 -1137 -1287 56 435 -846 -1796 -969 474 520 -757 -895 154
3692 154 642 -86 -726 -715 -215 1069 1099 -919 -1416 -1032 1134 2015 568 -1553 -2102 -308 831 668
3710 668 467 395 -144 -1235 -619 458 1702 2210 311 -1765 -2195 59 2378 3059 805 -2058 -2683
3727 -2683 -90 2762 2333 745 -902 -1106 -1274 -457 696 2068 1346 -983 -3146 -2545 526 2637
3743 2637 2118 -707 -3303 -3269 -120 1974 1629 -695 -2050 -1757 -705 297 1179 1687 774 -1288 -2433
3760 -2433 -1469 1572 2755 1568 -1083 -2858 -1451 1099 2915 1769 -1210 -2054 -707 577 518 245
3776 245 79 259 -1043 -2003 -1136 351 1493 -176 -1842 -2085 -944 372 751 -642 -1819 -1571 -395
3793 -395 463 -276 -1270 -910 302 -227 -581 -1380 -470 253 -26 -733 -908 -424 257 -206 -765 -518 -22 730
3813 730 493 -1075 -1798 -156 2074 1946 15 -2074 -1500 626 1715 942 306 148 -366 -503 -451 1529
3831 1529 2261 1506 -533 -1951 -1350 827 2892 2630 -557 -2758 -1964 885 2958 1826 -444 -1019
3847 -1019 -1183 -662 115 1815 1877 553 -1763 -2762 -765 1523 2762 1457 -1543 -3123 -1855 1640
3863 1640 3211 1423 -1148 -2249 -712 684 1102 1257 1418 91 -1280 -1982 435 2808 2274 961
3879 961 -1893 -2271 -218 2214 2821 588 -1422 -1590 99 1523 1103 379 244 185 -898 -1178 195
3896 195 1188 1452 -562 -1618 -1004 -277 1385 555 -675 -1661 -1152 224 663 -315 -1308 -428 739 364
3914 364 -1033 -1410 115 808 208 -688 -469 195 234 3 92 -232 825 960 470 -999 -1007 702 2174
3933 2174 1684 -353 -1608 -381 1441 1945 818 -12 -106 -584 -195 686 1106 1363 591 -1153 -1561 -551
3951 -551 1967 2687 1543 -1988 -2976 -1054 2194 2588 949 -1413 -1997 -568 155 962 1517 857 -690
3968 -690 -2219 -1746 -200 2267 2101 -81 -2638 -2825 -502 2506 2779 163 -2309 -2143 -177 1062
3984 1062 1210 1048 193 -841 -1701 -595 1177 2432 1518 -878 -2002 -1589 448 2770 2343 -182 -2168
4001 -2168 -1737 799 1561 866 -33 -545 -233 -884 -1392 85 1028 361 -1344 -2138 -1482 36 568 -102
4019 -102 -1309 -2131 -993 305 306 -952 -1380 -678 466 159 -1265 -1337 218 655 -155 -510 -787 -35 341
4038 341 60 -64 216 364 154 14 -947 -333 900 1990 713 -1420 -1944 -62 2106 1844 268 -969
4056 -969 -613 -120 539 1199 1256 1072 -21 -917 -687 747 2431 2617 847 -1965 -1799 986 2877 2793
4074 2793 376 -1834 -944 168 1455 1500 1359 427 -1010 -1419 -653 1328 2555 1603 -748 -2552 -1926
4091 -1926 847 3360 2641 -389 -2596 -1269 919 2214 1672 1059 73 -853 -870 182 2068 2349 936
4108 936 -1072 -1514 -747 1863 2648 1145 -1071 -2352 -871 961 1415 67 -876 -899 -778 -1000 -694 168
4126 168 397 -390 -1505 -1917 -939 99 580 -398 -1786 -2063 -808 496 -33 -1145 -1520 -183 289 -137
4144 -137 -1341 -1039 11 289 -270 -751 -719 -59 -155 -283 -518 -240 49 99 -717 -1293 -379 1149 1306 -77
4164 -77 -1786 -1623 777 1627 1030 -462 -1179 -622 274 753 1280 1187 72 -750 -1329 -1 988 2196 1296
4183 1296 -617 -1991 -1770 1041 2707 1355 -1147 -2353 -930 707 1031 1182 529 -245 -1575 -1390
4199 -1390 371 1925 1978 648 -1572 -2335 -441 2121 3260 1191 -1155 -2131 -129 1927 2375 1268
4215 1268 349 -659 -802 -46 1601 1917 1851 251 -1192 -1364 188 1606 2177 693 -1920 -1991 -88
4232 -88 1783 1280 -381 -1641 -674 -601 -341 -164 13 467 -771 -1488 -1176 -229 767 416 -669 -1565 -1294
4251 -1294 81 763 -287 -1124 -1148 22 573 -669 -1380 -849 322 114 -826 -1062 -627 -420 -384 -388 -392 -570
4271 -570 -267 -289 -907 -802 -227 891 572 -750 -2084 -1034 1138 1888 585 -1030 -1348 -369 459 1086
4289 1086 841 332 -541 -714 -1091 -131 1227 1366 215 -1592 -2534 -757 2021 2235 395 -2243 -2199 -446
4307 -446 1240 1210 763 -361 -996 -1311 -305 1256 2084 1381 14 -1583 -1338 737 2928 3126 523
4324 523 -1576 -1582 934 3019 2587 708 -372 -511 -90 718 1839 2203 1162 -135 -981 -612 1083 2365
4342 2365 2175 -87 -1666 -1391 1430 2465 1394 -590 -1181 -164 438 558 691 774 283 -418 -1001 -192
4360 -192 994 1024 827 -530 -1055 -795 511 1309 -225 -1084 -826 539 495 -426 -757 -394 509 615 -673
4379 -673 -1297 -594 193 102 18 -131 -276 102 -326 -320 -313 232 1223 480 -1103 -1672 -186 1420 1387 60 -1384
4400 -1384 -1414 -240 493 698 400 -981 -1248 -1523 -461 361 489 737 -854 -2169 -2198 -296 1826 1380
4418 1380 -928 -2771 -2129 19 1224 1041 -440 -1193 -1694 -852 62 1230 1246 364 -1091 -1761 -808 1465
4436 1465 2723 1654 -919 -2543 -1037 1419 2426 1333 -264 -1285 -628 -93 1062 1471 1401 24
4452 24 -1195 -996 -185 1365 2110 1102 -803 -1850 -550 1910 2139 734 -1078 -1060 -209 483 444 392
4470 392 340 -281 -684 -867 -11 678 856 113 -958 -1485 -487 1313 701 -280 -1301 -605 807 547 -712
4489 -712 -447 39 471 409 -402 -578 -425 122 565 168 -246 275 -26 217 83 -155 505 965 182 -1086
4509 -1086 -1607 390 1788 831 -760 -1849 -1379 442 1212 475 -232 -1273 -1173 -749 -230 460 602 -70
4527 -70 -1267 -2348 -1177 790 2222 401 -1903 -2584 -967 1336 1476 508 -866 -1516 -1299 -279 996
4544 996 1060 933 -78 -1510 -1182 62 1688 2395 771 -1420 -2308 36 2197 2357 737 -929 -1099
4561 -1099 -27 1144 1517 1580 876 -623 -580 -662 669 1733 1594 271 -1751 -1600 490 1976 1891 -271
4579 -271 -1392 -899 825 972 420 175 -6 -465 -702 -316 61 543 67 -190 -900 -607 89 1013 901
4598 901 -571 -812 -177 740 748 -642 -648 48 752 355 -499 -487 -72 878 901 133 -153 -39 113 302 -247
4619 -247 332 735 488 -240 -1424 -695 1033 1739 509 -1306 -1724 -297 729 1190 476 -826 -1402 -879
4637 -879 -414 443 592 311 -436 -1262 -1501 -348 969 1753 105 -2191 -1925 -112 1296 1436 -143 -1006
4655 -1006 -1722 -616 731 1419 739 203 -834 -1465 -696 779 2317 1693 -144 -1979 -1258 1007 2915
4672 2915 1835 -314 -1400 -1095 583 1232 1355 790 -384 -695 -760 67 1063 1361 973 -791 -1676 -1128
4690 -1128 926 2236 800 -687 -1676 -729 814 804 35 -186 -335 -506 -514 -203 395 594 529 -247 -799
4709 -799 -656 513 1092 143 -785 -919 207 733 465 -496 -540 535 856 70 -445 -151 285 619 572 275
4729 275 -431 -356 256 187 25 208 284 449 -419 -937 -311 1118 1239 -233 -1484 -1192 137 999 781 -34
4749 -34 -1305 -1175 -579 111 558 83 -372 -760 -1259 -1321 198 1137 955 -1010 -2482 -1690 716 1748 927
4768 927 -788 -1639 -1083 165 811 1073 495 -575 -1191 -634 373 1304 1797 991 -1057 -2076 -583 1438
4786 1438 2427 1016 -1068 -1726 -561 814 1332 1259 -7 -791 -1129 -237 423 799 1405 152 -1279 -1683
4804 -1683 -527 1330 1616 294 -1412 -1128 83 909 683 -246 -580 -262 -303 184 611 331 228 -206
4822 -206 -423 -749 -11 726 924 182 -677 -631 232 915 124 -283 -235 509 580 354 -322 197 338 1148 783
4843 783 175 -224 266 198 652 9 -188 224 343 -351 -551 249 1314 558 -753 -1340 -840 737 1482
4862 1482 519 -760 -1291 -936 -57 831 549 -76 -759 -874 -899 -360 794 1236 140 -1391 -2245 -820
4880 -820 1509 1794 498 -1230 -1800 -637 648 1089 817 -129 -1264 -1091 -492 487 1097 1282 4 -1609
4898 -1609 -1498 -106 1738 1944 108 -1604 -1344 -95 1135 1487 613 -558 -1246 -844 71 676 918
4915 918 240 -704 -1369 -1187 79 1246 928 -687 -1857 -1401 30 897 528 -522 -877 -745 -317 -66
4933 -66 259 59 121 -422 -613 -754 -152 849 615 -154 -750 -336 725 1104 -175 -460 -22 698 496 -73
4953 -73 -242 422 639 559 150 -320 -593 161 693 257 159 -248 -80 -112 -674 -338 814 1206 427 -1473 -1078
4974 -1078 0 961 1076 118 -1289 -1306 -460 490 801 631 40 -998 -860 -458 534 1077 629 -258 -1499
4993 -1499 -1436 449 1771 1751 28 -1515 -1254 338 1745 1384 500 -653 -1011 -403 419 1361 1521 616
5011 616 -465 -1044 -927 734 2356 1705 -807 -1640 -739 984 1550 1412 -57 -1044 -1192 -460 739 1099
5029 1099 447 364 -617 -1249 -481 761 1447 545 -1216 -1524 -717 874 1408 163 -714 -955 -672 254 313
5048 313 9 244 40 -784 -344 -89 556 560 180 -373 -479 78 964 871 -288 -522 112 604 761 -201 -207
5069 -207 126 439 488 252 12 -487 347 723 742 9 4 396 -43 -339 -146 896 934 -291 -1158 -649 504
5090 504 1253 834 -187 -1176 -954 -15 1214 534 21 -780 -708 -347 287 740 1152 807 -477 -1253 -498
5109 -498 1194 1701 843 -1100 -1541 -585 794 1651 997 89 -1124 -667 218 1011 1203 1022 -108 -495
5127 -495 -1123 -32 1623 1782 528 -1427 -1480 -574 989 1474 496 -930 -1330 -819 50 728 415 -381
5145 -381 -681 -819 -976 -41 800 1015 -261 -1492 -1519 -63 1039 615 -630 -1199 -1027 -144 -121 228 -109
5164 -109 -523 -170 -231 -494 -29 481 753 71 -911 -852 153 720 26 -203 -558 459 574 64 -449 -66
5184 -66 296 725 407 188 -468 36 371 683 342 -378 -84 50 -137 -434 -23 425 162 -296 -1169 -610
5204 -610 585 1150 348 -937 -1544 -373 374 1085 615 -536 -857 -904 -15 698 466 594 -169 -1006 -1026
5223 -1026 -252 1374 1354 399 -1464 -1250 -78 1568 1510 525 -861 -1019 -422 693 1134 1181 315 -583 -1129
5242 -1129 -631 570 1586 1302 -583 -1814 -1322 -46 1346 1286 -226 -922 -1304 -205 714 874 248
5259 248 -586 -669 -686 -335 229 1174 336 -817 -1464 -893 571 1235 389 -647 -1224 -551 193 616 334 -167
5279 -167 -515 -226 -63 -3 271 385 325 -82 -720 -422 598 1078 423 -359 -264 472 578 130 -187 -9 655
5300 655 699 183 -89 -639 51 760 877 195 -484 61 88 -68 -117 115 245 -63 -936 -1004 34 803 472
5321 472 -444 -1400 -1446 -169 629 651 199 -933 -974 -669 240 480 225 269 -677 -1175 -1008 575 1303 820
5341 820 -327 -1714 -884 344 1448 1000 -73 -1573 -1264 -91 734 884 155 -520 -696 -699 -446 755
5359 755 1663 688 -954 -1758 -1112 1024 1757 415 -910 -1476 -947 105 812 329 -23 -906 -1180 -552
5377 -552 -57 408 373 -129 -890 -1416 -309 776 1354 -178 -1010 -1040 -156 623 958 290 80 -357 113 503
5397 503 407 101 256 696 -187 -397 -41 829 1073 43 -202 -18 626 629 -144 -217 366 674 781 426 -174
5418 -174 -264 529 994 442 205 -169 1 415 472 256 703 384 92 -408 -281 742 1221 520 -584 -1158
5438 -1158 -430 470 1358 850 -323 -888 -651 311 830 935 301 -68 -370 -212 165 786 1617 736 -868
5457 -868 -1370 -406 1428 1595 859 -370 -1063 -445 680 1129 931 140 -618 -996 -376 22 1219 949 -43
5476 -43 -1417 -1413 -294 785 1104 -215 -1618 -1568 -676 638 876 -38 -818 -1032 -746 -232 266 156 413
5495 413 -620 -1174 -1243 -66 1060 330 -821 -1125 -660 96 807 380 -113 -620 -425 359 210 34 -62
5514 -62 330 205 -409 -465 391 515 303 -171 -402 -278 376 522 -84 136 90 646 586 234 -306 -2 353
5535 353 609 499 -164 -475 377 569 679 -140 -176 134 -302 -377 -74 738 869 245 -1068 -683 -49 864
5555 864 1226 458 -521 -1002 -235 416 1022 538 -16 -116 -387 -127 717 1290 1245 -137 -831 -675 248 1523
5575 1523 1502 226 -861 -1414 -129 1178 1137 180 -717 -1049 -706 -218 384 974 266 -658 -1716 -1241 343
5594 343 1370 691 -847 -1618 -1592 -185 747 746 -518 -1026 -884 -470 78 56 52 -386 -1100 -1354 -684 357
5614 357 613 307 -909 -1216 -470 541 503 -58 -442 -739 -569 147 264 -212 -198 47 -202 -401 -374 7
5634 7 380 105 -317 -464 25 573 156 -387 -408 50 546 402 -99 -570 -36 226 424 102 -819 -648 127
5655 127 157 153 32 213 -289 -595 -491 111 658 307 -328 -813 -661 -57 1264 1128 56 -971 -960 268
5675 268 1254 885 604 -515 -542 -133 114 858 1408 768 -486 -538 144 1111 1655 1258 -116 -838 -470 452
5695 452 1446 1282 44 -881 -327 22 447 814 694 225 -926 -1076 -113 1086 1246 433 -728 -1013 -698
5714 -698 534 1303 801 -799 -999 -401 246 723 46 -94 -433 -765 -788 -179 235 523 -335 -1031 -1129 -99
5734 -99 430 380 -26 -561 -712 -153 114 38 -256 -350 -116 -172 -75 -296 -51 329 -96 -484 -362 -33 420 -231
5756 -231 -163 -348 -31 204 -143 -560 -621 -383 117 -32 -317 -990 -494 172 403 -224 -352 -802 -506 -307 -302
5777 -302 98 292 203 -497 -903 -394 448 1140 601 -191 -739 -232 727 1606 797 -318 -218 -329 381 851
5797 851 847 960 250 -549 -199 319 1610 1791 870 -535 -1069 324 1131 1636 818 -452 -679 -92 724
5816 724 1127 1052 750 -15 -743 -406 597 1253 1228 167 -1011 -995 281 1081 992 -187 -618 -1243 -287 361
5836 361 413 47 -304 -447 -733 -707 186 559 122 -384 -1147 -997 89 613 451 -616 -831 -726 -69 185
5856 185 81 -441 -287 -166 -461 -290 -111 409 71 -251 -469 -519 172 -131 -261 -818 -782 -264 -252 -287 -892
5877 -892 -615 90 139 -372 -825 -823 -729 36 89 -353 -693 -711 -336 -435 -323 -254 300 -302 -824 -709 -140 695 1004
5900 1004 375 -566 -907 -219 980 1015 251 -357 -292 -3 272 1053 820 672 299 -866 -445 784 1352
5919 1352 1135 105 -831 -830 637 1515 1349 347 -777 -673 425 786 1118 596 287 -448 -521 -75 758
5938 758 1169 512 -460 -851 -684 707 1129 667 -181 -1394 -389 67 966 733 -47 -547 -141 -669 -26
5957 -26 726 717 183 -547 -977 -117 834 582 229 -447 -733 -464 530 836 -21 -231 -156 -165 84 9 289 442
5979 442 41 -292 -185 -221 281 61 -192 -376 -438 125 27 411 -429 -476 8 344 79 -421 -752 176 440
6000 440 -68 -388 -583 -159 -132 -15 314 328 265 -409 -371 -62 403 989 458 -186 -860 -651 383 1532 964
6021 964 -175 -758 -397 45 764 734 788 33 -468 -437 -182 865 1273 285 -514 -1020 -119 601 1202 623
6041 623 -361 -1160 -699 404 596 404 -79 -336 -1036 -473 1 565 587 52 -1141 -1111 -99 856 774 221
6061 221 -754 -1141 -490 484 823 -31 -443 -568 -321 -429 156 342 421 -276 -825 -686 -15 498 500 -355 -696
6082 -696 -801 64 468 670 11 -582 -160 82 19 -243 188 80 -239 -351 -505 77 159 291 -423 -590 -258
6103 -258 195 -31 -403 -389 -559 315 -16 -412 -611 -525 48 353 -30 -599 -804 26 -249 -130 191 167 65
6124 65 -226 -456 -121 151 782 364 -598 -613 -519 543 1104 492 -836 -847 326 401 751 414 259 -231 -410
6145 -410 -458 -36 859 824 68 -626 -1068 65 789 1300 283 -1118 -1222 -239 697 974 368 -457 -601 -712
6165 -712 65 260 684 445 -747 -1461 -911 392 1074 777 -540 -1140 -801 -136 753 679 -380 -549 -380
6184 -380 -195 -57 251 251 86 -340 -655 -326 79 1240 524 -149 -526 -96 390 940 578 59 -321 228
6204 228 341 284 143 216 314 271 -109 -218 -36 579 139 -245 -48 -356 -76 -8 -481 -492 -459 163 31 -218
6226 -218 -421 -606 31 343 -304 -706 -398 -231 375 276 140 186 35 -113 18 439 731 952 367 -386 -427
6247 -427 181 1160 924 422 -625 -870 355 1093 485 868 73 -454 -529 100 797 1064 443 -253 -907 -162
6267 -162 413 1185 871 89 -1118 -450 512 1010 755 -57 -467 -443 -224 522 585 615 133 -569 -620 -383 664
6288 664 1204 889 -560 -1228 -446 528 898 528 -522 -501 -321 176 625 574 128 89 -373 -259 364 701
6308 701 645 346 -213 -219 -8 649 845 117 -443 -182 -76 418 240 107 188 29 -152 85 -495 -157 82
6329 82 -166 -167 -682 -402 -34 -36 -498 -495 -68 -150 39 -640 -1055 100 445 -9 -588 -782 -618 253 168 151 50
6352 50 -185 -444 -677 64 126 244 381 -461 -839 -789 364 643 604 -553 -998 -591 178 893 757 -220 -774
6373 -774 -487 -180 124 526 483 -4 -799 -890 -238 550 896 244 -568 -931 -611 798 940 361 -531 -797
6393 -797 -190 -99 468 602 383 -192 -711 -767 177 931 1039 111 -747 -830 -208 750 916 172 -400 -670 -72
6414 -72 564 594 510 123 201 -462 -159 423 830 796 -221 -318 -322 503 562 503 76 -528 -317 564 182 78 -230
6437 -230 -174 163 -313 -551 -226 -242 -10 -549 -486 -449 -459 -75 -193 -410 -426 -146 -247 -483 -477 -225 -299 393 112
6460 112 -479 -699 -104 272 20 -84 -282 -337 -630 -164 -68 81 294 -166 -506 -550 -343 693 864 87 -669
6481 -669 -1153 -107 824 856 206 -267 -726 -433 59 739 908 634 -109 -544 -10 58 997 869 505 -523
6501 -523 -426 316 897 1018 435 -543 -642 -305 579 623 629 163 -553 -251 -237 561 914 545 190 -843 -429 509
6523 509 1190 919 113 -455 -35 568 678 634 402 11 -47 -283 462 715 1066 322 -203 -282 -61 260 824
6544 824 351 -385 -423 -215 392 159 5 -385 -207 -114 -64 -343 -282 -16 35 -300 -667 -348 -196 -313 -260 -329
6566 -329 -377 -217 -38 -534 -631 -892 10 71 -293 -490 -720 -86 -38 93 -46 -113 -368 -220 -256 156 280 -14
6588 -14 -260 -251 -605 237 642 568 -111 -735 -754 70 780 531 -44 -653 -703 -1 290 574 161 -104 -616 -746
6610 -746 -271 354 654 624 -498 -1041 -693 610 1094 421 -271 -1047 -410 -173 239 460 184 -304 -673 -595
6630 -595 463 669 759 252 -476 -831 -13 786 1035 398 -174 -797 -197 770 818 554 84 -72 -9 134 274
6651 274 848 443 204 -381 -395 218 549 496 157 -633 -666 256 639 118 -305 -139 -246 -101 -220 -314 -248 204
6673 204 74 -118 -488 -117 -57 -263 -144 -14 -470 288 4 -210 -561 -263 -29 158 -215 -305 -294 372 559
6694 559 335 -508 -345 -161 -223 57 -53 198 -427 -286 -306 -239 190 820 395 -494 -677 -77 419 863 -44
6715 -44 -289 -640 -320 39 563 595 -103 -355 -274 -349 173 758 573 118 -555 -747 -146 869 1018 207 -615
6736 -615 -850 15 257 831 470 -174 -295 -208 -64 627 882 417 -83 -502 -92 -8 1115 993 64 -578
6756 -578 -432 428 739 681 212 119 -184 211 476 846 801 608 -19 -114 287 413 748 718 224 -390 -155 183
6778 183 458 391 -297 -306 -249 26 90 -95 -163 133 -17 -110 -450 -172 243 86 -104 -401 -314 0 96 -141 -290
6801 -290 309 144 -35 168 -393 -69 318 421 93 -422 -613 -261 232 259 -1 110 -511 -545 -145 154 246
6822 246 250 -156 -749 -588 -253 460 788 -89 -732 -829 -264 335 628 394 -743 -683 -547 -271 251 625 -5
6843 -5 -567 -872 -544 -20 648 460 -3 -1172 -1125 34 493 289 61 -383 -728 -507 315 351 417 209 -159
6864 -159 -552 -261 675 779 577 2 -884 -272 670 1184 513 -167 -90 -103 236 593 556 544 -85 -282 -211 126
6886 126 369 320 -111 -483 -518 -225 94 466 -114 -211 -150 -135 -81 -180 28 -313 -28 -312 -383 -774 -329 63 -13
6909 -13 -195 -152 -152 343 56 -220 -1 257 278 -265 -272 -451 -138 430 14 -226 -257 -512 -339 99 313 173 -346
6932 -346 -323 -301 -29 375 409 381 -346 -838 -279 313 875 353 -443 -1117 -434 32 513 420 -64 -600 -876 -198
6954 -198 191 296 -10 -341 -682 -956 -185 510 944 221 -669 -655 -392 73 759 58 -323 -420 -628 59 333
6975 333 734 487 -193 -590 -519 142 549 772 604 -176 -362 428 964 904 519 127 -103 113 305 535 732
6996 732 327 0 -377 137 210 391 367 -83 244 -229 -59 663 376 159 -470 42 49 141 300 65 151 57
7018 57 389 17 -109 136 398 -47 54 -106 294 144 172 -15 -35 290 526 -269 -371 -373 359 737 -87 -17
7040 -17 119 -172 165 524 307 -229 -111 -293 -65 54 404 164 -48 -475 -425 1 429 711 -9 -794 -887
7061 -887 -267 330 554 41 -415 -645 -629 -115 -178 48 -102 -562 -937 -858 -141 205 266 -232 -1102 -991 -15
7082 -15 271 249 145 -324 -701 -268 5 402 263 -176 -294 -806 -166 158 362 465 35 -852 -620 462
7102 462 889 233 -195 -664 -67 47 327 473 24 23 -226 -282 244 -23 468 261 -621 -711 -5 486 492 457
7124 457 -101 -313 -88 379 536 -100 -40 78 7 -165 -130 -148 179 160 260 -1 -321 11 21 7 108 329
7146 329 576 251 -350 -166 -40 440 278 254 -258 -350 9 606 296 -75 -274 88 -162 156 321 198 208
7167 208 -148 -473 -302 141 444 201 -67 -838 -646 -34 514 231 -361 -479 -590 -355 -25 93 -79 -168
7187 -168 -412 -670 -481 391 589 219 -677 -906 -537 156 864 292 -14 -458 -424 -160 358 562 60 122 -164
7208 -164 -124 18 349 642 256 -349 -732 -60 650 741 307 -536 -620 -106 238 622 35 -15 -508 -368 -388 -6
7230 -6 185 270 -58 -695 -569 26 246 523 1 -359 -302 76 142 -86 163 -394 106 46 109 -454 -159 144
7252 144 74 74 -181 208 48 135 -58 -143 500 -137 43 -268 -202 472 396 312 -55 -283 -346 168 562 277 -93
7275 -93 -10 -476 23 288 341 -125 155 -115 -382 -117 34 401 269 -570 -364 -240 218 373 307 -215 -775
7296 -775 -767 183 556 168 154 -192 -569 -326 162 359 602 141 -245 -477 -219 615 619 396 -331 -737 -265 343
7318 343 773 300 -58 -423 -464 43 353 525 474 -112 -440 1 214 679 850 -108 -514 -412 -159 236 646
7339 646 20 -182 -153 -374 115 176 275 -172 -137 -127 -474 174 433 224 -313 -624 -154 8 427 -8 -116 -120
7361 -120 84 73 -285 -277 -19 -178 232 124 -122 8 160 88 35 -52 34 243 -351 -254 -163 275 380 92 -116
7384 -116 -514 -147 243 138 368 -174 -661 333 104 508 157 -82 -446 -212 -108 114 300 -5 -315 -886
7404 -886 -858 -294 284 534 -67 -754 -678 -459 185 569 248 -358 -681 -402 -111 157 120 177 166 -540 -575 96
7426 96 745 502 -441 -820 -648 -172 565 382 -237 -283 -253 -316 429 141 420 198 -339 -523 25 379 532
7447 532 425 84 -386 -108 521 655 310 74 -136 45 84 264 -169 281 98 -90 -66 119 64 393 179
7468 179 -251 -223 246 217 146 7 -124 -280 -173 276 185 11 -94 20 68 277 70 163 102 355 -24 6 213
7491 213 33 -10 -109 -28 354 345 12 10 -241 88 417 576 2 -141 -536 29 400 8 108 -202 -92 -392
7513 -392 -21 123 299 -74 -351 -346 -508 12 458 489 -268 -856 -482 -243 486 139 -16 -344 -591 -361 -92
7534 -92 19 345 115 -611 -864 -593 388 562 272 -161 -433 -326 210 762 572 119 -511 -315 -80 269
7554 269 355 36 -162 -177 -420 -59 409 174 191 -438 -570 -433 259 559 -13 70 -389 -192 157 279 17
7575 17 104 -170 -153 16 -153 420 94 -107 -530 -427 -37 383 222 -65 -153 3 63 239 -158 -181 160 -126
7597 -126 82 -74 -333 40 178 63 85 286 156 324 21 71 -31 482 293 -158 -252 -13 179 210 330
7618 330 70 -417 -335 90 454 162 -63 -302 -309 -89 -258 118 485 -206 -232 -453 -308 547 343 342 -382 -630
7640 -630 -352 171 748 191 -255 -452 -238 -272 350 495 375 -337 -499 -264 -106 684 336 70 -288 -672
7660 -672 -339 526 866 106 -168 -475 -508 184 216 488 51 -438 -484 -257 308 541 180 -88 -640 -470 271
7681 271 490 148 80 -742 -565 37 68 275 83 9 -277 -254 -21 5 98 160 -286 -251 -728 90 267 13 7
7704 7 -65 -230 -47 224 148 118 184 403 85 246 28 49 482 320 -174 -84 370 388 0 235 204 191 148 114
7728 114 98 -157 506 371 386 -157 -100 -368 117 43 -135 184 -274 -155 163 -12 109 98 25 -386 -319 219
7750 219 554 271 93 -649 -407 27 544 689 355 -290 -499 -100 69 769 263 139 -284 -140 -468 414
7770 414 863 537 -75 -645 -471 254 495 541 25 -340 -365 76 317 246 -168 -588 -476 -389 230 245 352 -18
7792 -18 -241 -603 -421 69 451 139 -411 -677 -143 24 119 257 -193 -484 -305 -182 -215 127 174 53 -231
7813 -231 -286 -63 51 318 -22 -157 -169 75 221 211 -56 -184 209 204 50 -192 9 59 282 434 230 -50
7835 -50 354 384 559 119 127 401 -195 -8 5 68 172 183 -418 -417 -248 191 610 358 -105 -411 -446 -157 387
7858 387 -80 72 -11 -324 -652 -16 217 525 489 -370 -472 -106 333 471 398 -243 -100 -358 -48 659 844
7879 844 220 -155 -262 -76 145 496 647 -43 -701 -293 -312 418 1026 440 -122 -449 -108 -223 432 281
7899 281 149 -432 -112 -178 146 352 399 -228 -610 -320 -73 584 171 -17 -341 -504 -213 39 57 -229 -471
7920 -471 -345 -170 118 134 -8 -94 -371 -264 -252 -236 219 146 -20 -392 90 295 383 34 -316 184 -95 408
7942 408 167 41 -49 127 -197 99 -136 -128 -93 -25 34 301 121 234 82 6 -381 190 345 188 -1 -541
7964 -541 36 393 491 422 -257 -434 -333 -113 -25 236 -79 -332 -85 -503 12 214 439 -209 -166 -400 54
7985 54 429 472 150 -197 -450 -211 314 431 193 196 -80 -193 35 206 500 422 -220 -428 -643 24 345 428
8007 428 160 -493 -326 -294 421 489 -23 -275 -579 -468 -153 136 283 313 -91 -405 -508 -159 367 73 -141
8028 -141 -665 -402 49 214 165 -160 -221 -202 37 169 -137 30 -48 -202 -305 -229 181 114 70 -21 -311 -100 153
8051 153 431 243 -54 -91 -116 116 159 1 94 34 218 -90 13 -126 91 55 -35 334 142 90 -205 105 201
8074 201 407 228 171 -72 -581 -239 319 180 -100 -211 -344 -210 94 322 10 -66 -284 -243 -5 -177 129
8095 129 183 -185 -352 -316 282 708 607 -6 -422 -553 -30 86 485 116 -133 -250 -446 145 550 708 330
8116 330 -282 -313 -440 254 516 597 -308 -522 -340 177 534 351 14 -513 -106 -179 58 118 -34 27 -315 -544
8138 -544 -402 112 206 153 -582 -686 -251 -124 364 161 -70 -230 -89 -49 143 -247 173 -152 -341 -192 34
8159 34 174 46 -286 -182 -87 1 92 39 -167 -137 107 -84 205 81 -264 -101 355 196 37 -31 -400 36
8181 36 -209 14 44 436 32 159 15 -60 256 362
8191C62
##END NTUPLES=NMR FID
##END=
