##TITLE=1H_SA_32.155
 CDCl3, 8 sc, 
 19.11.2019
##JCAMPDX= 6.0         $$ Bruker NMR JCAMP-DX V2.0
##DATA TYPE= NMR FID
##DATA CLASS= NTUPLES
##ORIGIN= UXNMR, Bruker Analytische Messtechnik GmbH
##OWNER= root
$$ XWIN-NMR		Version 3.5
$$ Tue Nov 19 16:16:08 2019 Russian Standard Time (UT+4h)  she@DPX200
##.OBSERVE FREQUENCY= 200.1315
##.OBSERVE NUCLEUS= ^1H
##.DELAY= (6, 6)
##.ACQUISITION MODE= SIMULTANEOUS
##.ACQUISITION SCHEME= undefined
##.AVERAGES= 8
##.DIGITISER RES= 18
##SPECTROMETER/DATA SYSTEM= spect
##.PULSE SEQUENCE= zg30
##.SOLVENT NAME= CDCl3
##.SHIFT REFERENCE= (INTERNAL, CDCl3, 0, 15.7039)
##AUDIT TRAIL= $$ (NUMBER, WHEN, WHO, WHERE, WHAT)
$$ ##TITLE= Audit trail, XWIN-NMR		Version 3.5
$$ ##JCAMPDX= 5.01
$$ ##ORIGIN= Bruker BioSpin GmbH
$$ ##OWNER= she
$$ F:/spectra/data/she/nmr/H-F/1/audita.txt
$$ ##AUDIT TRAIL=  $$ (NUMBER, WHEN, WHO, WHERE, WHAT)
(   1,<2019-11-19 16:14:36.76 +0400>,<she>,<DPX200>,
      <created by zg, POWCHK disabled, PULCHK disabled
       configuration hash MD5:
       00 E9 B6 7A A2 85 ED C7 34 08 36 98 17 FE 4E 26
       data hash MD5: 16K
       9F 12 2D 7F 90 5E 5F 32 B8 8C 61 44 CB D3 03 35>)
$$ ##END=
$$ 
$$ hash MD5
$$ AA EA F7 D7 9E DB 50 F7 2A DB 78 D1 6A 18 C3 DC
##$RELAX= 
##$RELAX= 
##$RELAX= 
##$RELAX= 
##$RELAX= 
##$RELAX= 
$$ Bruker specific parameters
$$ --------------------------
##$DU= <F:/spectra>
##$EXPNO= 1
##$NAME= <H-F>
##$PROCNO= 1
##$TYPE= <nmr>
##$USER= <she>
##$AMP= (0..31)
100 100 100 100 100 100 100 100 100 100 100 100 100 100 100 100 100 100 
100 100 100 100 100 100 100 100 100 100 100 100 100 100 
##$AQSEQ= 0
##$AQ_mod= 1
##$AUNM= <au_zg>
##$AUTOPOS= <>
##$BF1= 200.13
##$BF2= 200.13
##$BF3= 200.13
##$BF4= 200.13
##$BF5= 200.13
##$BF6= 200.13
##$BF7= 200.13
##$BF8= 200.13
##$BYTORDA= 1
##$CFDGTYP= 0
##$CFRGTYP= 5
##$CHEMSTR= <none>
##$CNST= (0..31)
1 1 145 1 1 1 1 1 1 1 1 1 1 1 1 1 1 1 1 1 1 1 1 1 1 1 1 1 1 1 1 1 
##$CPDPRG= <>
##$CPDPRG1= <>
##$CPDPRG2= <>
##$CPDPRG3= <>
##$CPDPRG4= <mlev>
##$CPDPRG5= <mlev>
##$CPDPRG6= <mlev>
##$CPDPRG7= <mlev>
##$CPDPRG8= <mlev>
##$CPDPRGB= <>
##$CPDPRGT= <>
##$D= (0..31)
0 1.2 0 0 0 0 0 0 0 0.06 0 0.03 0 0 0 0 0.0002 0 0 0 0 0 0 0 0 0 0 0 0 
0 0 0 
##$DATE= 1574165676
##$DBL= (0..7)
120 120 120 120 120 120 120 120 
##$DBP= (0..7)
150 150 150 150 150 150 150 150 
##$DBP07= 0
##$DBPNAM0= <>
##$DBPNAM1= <>
##$DBPNAM2= <>
##$DBPNAM3= <>
##$DBPNAM4= <>
##$DBPNAM5= <>
##$DBPNAM6= <>
##$DBPNAM7= <>
##$DBPOAL= (0..7)
0.5 0.5 0.5 0.5 0.5 0.5 0.5 0.5 
##$DBPOFFS= (0..7)
0 0 0 0 0 0 0 0 
##$DE= 6
##$DECBNUC= <off>
##$DECIM= 24
##$DECNUC= <off>
##$DECSTAT= 4
##$DIGMOD= 1
##$DIGTYP= 9
##$DL= (0..7)
0 120 120 120 120 120 120 120 
##$DP= (0..7)
150 150 150 150 150 150 150 150 
##$DP07= 0
##$DPNAME0= <>
##$DPNAME1= <>
##$DPNAME2= <>
##$DPNAME3= <>
##$DPNAME4= <>
##$DPNAME5= <>
##$DPNAME6= <>
##$DPNAME7= <>
##$DPOAL= (0..7)
0.5 0.5 0.5 0.5 0.5 0.5 0.5 0.5 
##$DPOFFS= (0..7)
0 0 0 0 0 0 0 0 
##$DQDMODE= 0
##$DR= 18
##$DS= 0
##$DSLIST= <SSSSSSSSSSSSSSS>
$$ [...]
##$SUBNAM2= <"">
##$SUBNAM3= <"">
##$SUBNAM4= <"">
##$SUBNAM5= <"">
##$SUBNAM6= <"">
##$SUBNAM7= <"">
##$SUBNAM8= <"">
##$SUBNAM9= <"">
##$SW= 24.9337058887773
##$SWIBOX= (0..15)
0 0 2 0 0 0 0 0 0 0 0 0 0 0 0 0 
##$SW_h= 4990.01996007984
##$TD= 16384
##$TD0= 1
##$TE= 0
##$TE2= 300
##$TE3= 300
##$TEG= 300
##$TL= (0..7)
0 120 120 120 120 120 120 120 
##$TP= (0..7)
150 150 150 150 150 150 150 150 
##$TP07= 0
##$TPNAME0= <>
##$TPNAME1= <>
##$TPNAME2= <>
##$TPNAME3= <>
##$TPNAME4= <>
##$TPNAME5= <>
##$TPNAME6= <>
##$TPNAME7= <>
##$TPOAL= (0..7)
0.5 0.5 0.5 0.5 0.5 0.5 0.5 0.5 
##$TPOFFS= (0..7)
0 0 0 0 0 0 0 0 
##$TUNHIN= 0
##$TUNHOUT= 0
##$TUNXOUT= 0
##$USERA1= <user>
##$USERA2= <user>
##$USERA3= <user>
##$USERA4= <user>
##$USERA5= <user>
##$V9= 5
##$VALIST= <valist>
##$VCLIST= <CCCCCCCCCCCCCCC>
##$VD= 0
##$VDLIST= <DDDDDDDDDDDDDDD>
##$VPLIST= <PPPPPPPPPPPPPPP>
##$VTLIST= <TTTTTTTTTTTTTTT>
##$WBST= 1024
##$WBSW= 4
##$XGAIN= (0..3)
0 0 0 0 
##$XL= 0
##$YL= 0
##$YMAX_a= 125667
##$YMIN_a= -64782
##$ZGOPTNS= <>
##$ZL1= 120
##$ZL2= 120
##$ZL3= 120
##$ZL4= 120
##$ABSF1= 10
##$ABSF2= 0
##$ABSG= 5
##$ABSL= 3
##$ALPHA= 0
##$AQORDER= 0
##$ASSFAC= 0
##$ASSFACI= 0
##$ASSFACX= 0
##$ASSWID= 0
##$AUNMP= <proc_1d>
##$AZFE= 0.1
##$AZFW= 0.1
##$BCFW= 1
##$BC_mod= 2
##$BYTORDP= 1
##$COROFFS= 0
##$CY= 11.3945322036743
##$DATMOD= 1
##$DC= 2
##$DFILT= <>
##$DTYPP= 0
##$F1P= 16.9975609425685
##$F2P= -3.02152046262296
##$FCOR= 0.5
##$FTSIZE= 0
##$FT_mod= 4
##$GAMMA= 1
##$GB= 0.15
##$INTBC= 1
##$INTSCL= 1
##$ISEN= 128
##$LB= 0.24
##$LEV0= 0
##$LPBIN= 0
##$MAXI= 10000
##$MC2= 0
##$MEAN= 0
##$ME_mod= 0
##$MI= 1.114404
##$NCOEF= 0
##$NC_proc= 0
##$NLEV= 6
##$NOISF1= 3.799351
##$NOISF2= 2.8
##$NSP= 1
##$NTH_PI= 0
##$NZP= 0
##$OFFSET= 15.70392
##$PC= 1
##$PHC0= -9790.171
##$PHC1= 17.20086
##$PH_mod= 1
##$PKNL= yes
##$PPARMOD= 0
##$PSCAL= 0
##$PSIGN= 0
##$REVERSE= no
##$SF= 200.130013532006
##$SI= 16384
##$SIGF1= 3
##$SIGF2= 2
##$SINO= 400
##$SIOLD= 16384
##$SREGLST= <1H.CDCl3>
##$SSB= 0
##$STSI= 0
##$STSR= 0
##$SW_p= 3612.71676300578
##$SYMM= 0
##$S_DEV= 0
##$TDeff= 0
##$TDoff= 0
##$TI= <>
##$TILT= no
##$TM1= 0
##$TM2= 0
##$TOPLEV= 0
##$USERP1= <user>
##$USERP2= <user>
##$USERP3= <user>
##$USERP4= <user>
##$USERP5= <user>
##$WDW= 1
##$XDIM= 8192
##$YMAX_p= 0
##$YMIN_p= 0
$$ End of Bruker specific parameters
$$ ---------------------------------
##NTUPLES= NMR FID
##VAR_NAME=  TIME,          FID/REAL,        FID/IMAG
##SYMBOL=    X,             R,               I
##VAR_TYPE=  INDEPENDENT,   DEPENDENT,       DEPENDENT
##VAR_FORM=  AFFN,          ASDF,            ASDF
##VAR_DIM=   8192,          8192,            8192
##UNITS=     SECONDS,       ARBITRARY UNITS, ARBITRARY UNITS
##FACTOR=    0.0002004,     1,               1
##FIRST=     0,             0,               0
##LAST=      1.6414764,     0,               0
##MIN=       0,             -64782,          0
##MAX=       1.6414764,     125667,          0
$$ Real data points
##PAGE= N=1
##DATA TABLE= (X++(R..R)), XYDATA
0 0 0 0 0 0 0 0 0 0 0 0 0 8 -8 8 -8 8 -12 16 -16 19 -24 26 -32 37 -40 47 -55 63 -71 79 -89 100 -113 125
34 125 -140 157 -173 195 -214 238 -265 293 -325 359 -398 442 -490 545 -610 684 -772 876 -1003
53 -1003 1164 -1373 1658 -2071 2729 -3949 7011 -34614 -36621 -8008 -45684 -64782 -48381 -6245
67 -6245 -1893 -27502 -49564 -32419 -5483 -2156 -30240 -50532 -42928 -18568 -14199 -37741 -62688
80 -62688 -54370 -24720 -12698 -36756 -59938 -46236 -8325 4916 -19625 -41428 -21163 17543
92 17543 24677 -4428 -22455 -1721 29751 28895 -876 -18041 -771 24188 21014 -6091 -22252
105 -22252 -8383 15049 15705 -7712 -25177 -12116 15465 19649 -5622 -24571 -9407 20989 23260
118 23260 -6422 -26671 -8394 22334 19242 -14032 -30488 -8301 18685 12141 -18111 -29640
130 -29640 -7922 16433 10910 -14815 -24288 -5260 17104 14311 -10006 -22693 -6470 17490 14978
143 14978 -12587 -27971 -10255 15952 11819 -17816 -31620 -8607 18864 13252 -16249 -24180 2661
156 2661 28177 20537 -5134 -9775 14669 36047 26592 1665 -4850 14669 31397 21696 -4306
169 -4306 -14787 1574 19371 10914 -16890 -28085 -8679 12651 4853 -21943 -29758 -5188 18395
182 18395 9662 -16959 -20471 6241 26941 14384 -11407 -14098 9148 24951 10240 -15115 -19210
195 -19210 901 14292 1323 -22806 -26922 -7212 9566 -143 -22997 -27020 -2991 17840 8480
208 8480 -14794 -16034 11045 31269 18932 -6053 -5628 21100 37217 20828 -3863 -2228 21044
221 21044 32948 16517 -6031 -4921 17306 28895 14210 -6632 -5286 16542 30499 17436
233 17436 -3965 -3238 19948 34500 19533 -3037 -2275 21745 34574 17231 -7036 -4013 20319
246 20319 29973 10552 -10763 -5767 17353 25633 8088 -11259 -5505 16713 25413 8754 -9188
259 -9188 -4269 16880 25584 10069 -9055 -4968 16964 25980 8871 -11289 -6270 17506 26154
272 26154 7656 -12019 -4715 20507 27617 8473 -9302 645 24062 29360 10141 -6218 3185
285 3185 24678 28530 9875 -6308 1442 21570 25183 7039 -10086 -3002 18650 23383 3853
298 3853 -13157 -4457 18192 22418 2680 -13994 -3440 19691 22161 1017 -14168 -2445 19006
311 19006 19542 -1370 -14845 -3945 15614 15642 -4073 -17427 -6314 12371 13303 -5385 -18362
324 -18362 -7522 12223 14223 -4731 -17641 -5713 14750 15982 -4105 -16938 -3553 17026
336 17026 15965 -4940 -16310 -2209 17373 14563 -5750 -15638 -1635 16191 13825 -5695 -14743
349 -14743 -1438 16050 13627 -5380 -15028 -1959 16292 13899 -6276 -16252 -2255 15537 12517
362 12517 -8874 -17875 -3307 14755 10052 -11585 -19834 -3423 13424 7481 -12607 -19432 -3310
375 -3310 12532 6317 -13168 -19020 -3628 11742 5725 -13401 -19709 -4578 10728 4994 -14626
388 -14626 -21221 -5239 10352 3712 -16570 -21910 -5304 10215 2791 -17051 -21650 -4022 10614
401 10614 1815 -17211 -20072 -2743 10365 1681 -16635 -19494 -2641 9933 1108 -16689 -19450
414 -19450 -3367 9562 1020 -17818 -20882 -3834 9365 2 -19006 -20624 -3058 9521 -598
427 -598 -19237 -19788 -1304 10521 -489 -18334 -17604 292 10611 -212 -17222 -16538 1214 11475
441 11475 -24 -16782 -15656 1227 11220 180 -16803 -16253 1860 12061 81 -17005 -15423
454 -15423 3181 12533 303 -16360 -14158 4753 13476 162 -16409 -12666 5348 12776 -405
467 -405 -15949 -12334 4938 11992 -1017 -16059 -12437 4418 11540 -1398 -16510 -12766 4711
480 4711 12002 -1559 -16442 -11866 6224 12391 -1418 -15547 -10549 7723 13200 -948 -15299
493 -15299 -8748 8388 13039 -1438 -14398 -8651 7857 12212 -2486 -15183 -9161 7511 10953
506 10953 -3043 -15759 -9316 7684 11267 -3359 -15993 -8838 8274 11275 -3747 -15714 -7872
519 -7872 8469 10933 -4997 -17123 -8978 7179 8399 -7806 -19265 -10975 4398 4616 -10839
532 -10839 -21718 -13127 2610 3072 -11862 -21909 -12454 3091 4589 -10127 -20257 -9816 6611
545 6611 7196 -8122 -17758 -7503 8417 8228 -8007 -17458 -6750 8023 6549 -9408 -17509 -6964
559 -6964 7495 5988 -8863 -16431 -5274 10078 8787 -5471 -12218 -308 14553 13764 -582
572 -582 -8021 4134 18900 16684 772 -6239 5392 19043 15259 -845 -7615 3542 16914
585 16914 12639 -3275 -9095 3108 16393 12360 -2802 -7242 5220 18744 15058 -5 -3911
598 -3911 8880 22151 18261 3193 -1773 11217 24292 18986 3589 -890 12395 24846 19374
611 19374 3922 650 13865 26202 20107 5211 2729 16822 27877 22282 7594 5542 19024
624 19024 30216 23906 9394 7518 21050 32068 25532 11012 8574 22505 33255 26554 11914
637 11914 10326 23980 34102 26194 11566 10160 23601 32412 23038 8118 6703 19711 27310
650 27310 17783 3150 2091 15060 22675 14189 252 801 14357 22978 15040 1849 3039 17110
664 17110 25559 17087 3696 4922 19068 26140 15557 1959 2455 15560 21509 10524 -3435
677 -3435 -2438 11279 16819 6671 -5897 -3674 11185 17944 8587 -2604 1264 16292 23226 13598
691 13598 2550 6238 20313 26179 15555 2746 5215 18097 22133 9957 -3210 -805 11756
704 11756 15207 2914 -9463 -5656 8021 11885 937 -9573 -4811 9350 13852 3271 -6955
717 -6955 -1905 11769 15768 3877 -6521 -2474 10493 13022 749 -10581 -5926 6474 9021
730 9021 -3254 -13499 -7769 5534 8067 -3516 -12490 -5905 8126 10420 -811 -9194 -2002 10797
744 10797 12822 1369 -7430 -1010 11842 12669 452 -8105 -1408 11475 12372 285 -7790 -306
758 -306 12984 13151 818 -6732 1268 13211 13069 380 -7567 -276 11667 10158 -3192 -10894
772 -10894 -3511 7437 5962 -7060 -14503 -6470 5575 4233 -8118 -14311 -5383 6856 5860 -5941
786 -5941 -12002 -3264 8535 6726 -6570 -12413 -3657 6320 3772 -9604 -16151 -7799 3016 -258
800 -258 -13266 -18147 -8302 2585 -27 -10855 -15016 -4531 6945 4921 -6079 -9622 983 11328
814 11328 8282 -3949 -8174 1324 10751 6346 -7100 -11647 -2149 6707 1776 -10846 -14564 -4334
828 -4334 5154 1020 -11317 -13543 -2526 7185 2846 -8431 -10774 77 9371 4166 -8166 -10701
842 -10701 -272 7467 1148 -11579 -14070 -4111 3860 -2134 -14469 -16408 -5093 3261 -2424 -13638
856 -13638 -13932 -2323 6226 974 -10057 -10315 1304 9087 2522 -8795 -9307 1492 8493 1947
870 1947 -9822 -10123 852 7663 885 -9779 -9641 1778 8839 2689 -7611 -6593 4912 12021
884 12021 4839 -5457 -4398 6360 12695 4933 -5875 -5664 4930 10334 1940 -9111 -8353 2173
898 2173 6928 -728 -11280 -9553 2008 7325 -378 -10132 -7654 3769 9092 1010 -8600 -6297
912 -6297 5065 9377 578 -9410 -6895 3582 7522 -1885 -11397 -8437 2609 6334 -2609 -11637
926 -11637 -7921 3707 7742 -778 -9209 -4765 6715 10724 1539 -6667 -2340 8717 11788 2332
940 2332 -6211 -1809 8809 11269 1488 -6472 -2298 8797 10549 1507 -6567 -1401 9488 11302
954 11302 1958 -5325 -675 10122 11625 2025 -5144 -299 10053 11006 1209 -6379 -1185 9143
968 9143 9795 409 -6404 -962 9643 10554 794 -5519 849 11653 11825 2348 -3914 2148 12319
983 12319 12341 2075 -4213 2048 11787 11048 997 -5288 1279 11206 10626 239 -4911 2297 12447
998 12447 11911 2228 -2671 4878 14970 14210 4158 -718 6862 15966 14241 3642 -1379 5793 14461
1013 14461 12199 1092 -3700 3865 11927 9524 -760 -5360 2547 11020 8741 -1118 -4789 3112
1027 3112 11905 9602 -422 -3772 4078 12765 9585 -658 -4268 3871 11535 7934 -2549 -5771
1041 -5771 1849 9013 5260 -4911 -7537 114 7757 4400 -5432 -7698 534 7895 4367 -5285 -7048
1056 -7048 1608 9187 5081 -4357 -6119 2581 9584 5087 -4603 -6215 2561 9293 4311 -5480 -6911
1071 -6911 1631 8376 3276 -6824 -7534 1355 7297 2128 -7327 -7500 1349 7350 2001 -7356 -7333 1868
1087 1868 7935 2455 -6441 -6154 2704 8596 2893 -6300 -5959 3585 8825 2499 -6237 -6115 2995 8022
1103 8022 1479 -7173 -6444 2845 7532 1461 -7391 -6101 3012 7643 1618 -6846 -5077 4304 9112
1118 9112 2505 -5445 -3960 5499 9786 2931 -5112 -3287 5763 9741 2248 -5417 -3529 5259 8798
1133 8798 1618 -6303 -4352 4782 8265 1037 -6562 -3979 4921 7850 772 -6467 -3456 5578 8394
1148 8394 1086 -6243 -3039 6257 8465 838 -6510 -3180 5578 7597 -524 -7374 -3624 5108 6734
1163 6734 -1620 -8300 -4556 4194 6024 -2368 -8703 -4785 4003 5115 -3001 -8905 -4875 3716 4883
1178 4883 -3446 -9422 -4745 3094 4328 -4075 -10234 -5232 2818 3268 -5064 -11019 -6132 1881 2332
1193 2332 -6247 -11412 -6943 1588 1437 -7047 -11998 -6806 1313 1436 -6786 -11695 -6429 1995 1362 -7301
1209 -7301 -11870 -6089 1787 1183 -7145 -11853 -6085 1768 985 -7673 -11925 -5949 1972 426 -7766
1224 -7766 -11675 -5296 2079 519 -7436 -11433 -4868 2749 896 -7339 -10950 -4190 3175 1354 -7007
1239 -7007 -10709 -3958 3124 998 -7770 -10724 -3924 2702 676 -7989 -10647 -3992 2758 338 -7989
1254 -7989 -10447 -3559 3143 655 -7416 -9934 -2851 3751 1167 -7037 -9234 -2240 4184 1128 -7008
1269 -7008 -9249 -1760 4456 710 -7276 -8553 -1670 4424 623 -7375 -8152 -990 4852 865 -7047
1284 -7047 -7679 -71 5321 1645 -6483 -6634 809 5882 1874 -5895 -6627 770 5562 1476 -6472 -7251
1300 -7251 419 4937 438 -7539 -7662 -180 4377 -371 -8029 -7794 -94 4368 -511 -7692 -7377 439
1316 439 4956 -169 -7403 -6863 902 4874 -158 -8009 -6822 859 4528 -1104 -8448 -6988 422
1331 422 3917 -1262 -8570 -6688 1263 4649 -1045 -7458 -5735 2479 5796 281 -6357 -4522 3454
1346 3454 6373 630 -5722 -4105 4038 6363 523 -6175 -3778 3560 5978 165 -6318 -3728 3645
1361 3645 6185 65 -5824 -3370 4428 6745 100 -5687 -3158 4589 6256 -120 -5902 -2907 4620
1376 4620 6032 -497 -6442 -2947 4441 5867 -422 -6018 -2344 4932 6387 -354 -5718 -2010 5783
1391 5783 6653 -154 -5399 -1592 6302 6410 -626 -5570 -1436 5634 6393 -806 -5485 -1462 6027 6357
1407 6357 -281 -5097 -321 7013 7157 268 -4413 136 7227 7413 -145 -4257 408 6543 6669 -1181
1423 -1181 -5293 -642 6098 5197 -2318 -5926 -1379 5036 4596 -2670 -5857 -1513 5528 4935 -2560 -5678
1439 -5678 -581 5928 4423 -2542 -6152 -1201 5031 3518 -3568 -6803 -1714 4027 2923 -4490 -7061
1454 -7061 -1852 4599 3182 -4341 -6159 -706 5449 3742 -3308 -5637 260 6076 4080 -3361 -5736
1469 -5736 302 6156 3441 -4039 -5841 82 5734 3275 -3889 -5609 605 6284 3555 -3481 -4560
1484 -4560 1929 7097 3735 -2958 -4205 1832 6801 3352 -3499 -4875 1108 5721 2212 -4891 -5719
1499 -5719 745 4903 1724 -4966 -5524 738 5589 1992 -4421 -4776 1985 6542 2557 -3664 -4191 2121
1515 2121 6316 2102 -4403 -4611 1572 5169 1019 -5638 -5806 459 4854 265 -5686 -5492 975 5345
1531 5345 1143 -4856 -4428 2463 5903 1791 -4412 -3686 2791 5971 1210 -5254 -4736 2048 4908 -111
1547 -111 -6684 -5827 752 3425 -1715 -7552 -6511 339 2950 -2084 -7635 -6286 538 3157 -2367
1562 -2367 -7668 -6265 486 2708 -2616 -8145 -6378 148 2239 -3446 -8958 -6886 -311 1783 -3903
1577 -3903 -9233 -7103 -432 1592 -4049 -9265 -6814 -132 1330 -4139 -8910 -6797 374 1128 -4269
1592 -4269 -8560 -6354 171 1700 -3919 -8213 -5524 911 2156 -3205 -7540 -4514 1704 2827 -2934
1607 -2934 -7342 -4346 1813 2438 -3541 -8151 -5032 1271 1591 -4360 -8516 -4692 1737 2082 -4148 -8028
1623 -8028 -3748 2484 2717 -2995 -6572 -2624 3936 3452 -2390 -5650 -1468 3949 3571 -2810 -6158 -2459
1639 -2459 3371 2780 -3516 -6637 -3026 3067 2124 -3563 -6601 -1987 3919 2962 -2390 -5284 -768 4968
1655 4968 4374 -1758 -4506 145 5324 4513 -1727 -4805 11 5178 4022 -2665 -4919 -757 4578
1670 4578 2455 -3340 -5768 -742 4173 2338 -3681 -5632 -577 4687 2730 -3418 -5268 -28 4787
1685 4787 2737 -3337 -5077 -225 4564 2598 -4027 -5531 -600 3856 1361 -4663 -5937 -1035 3341
1700 3341 709 -5237 -6439 -1002 3198 536 -5588 -6378 -1088 3468 657 -5250 -5781 -103 3841
1715 3841 794 -4844 -5264 161 4003 986 -4892 -5126 772 3873 690 -5074 -5251 471 3714 601
1731 601 -5416 -5292 357 3705 6 -5654 -4699 764 3889 568 -4971 -4101 1157 4542 1017 -4210
1747 -4210 -3396 2128 5134 1624 -3850 -3042 2434 5522 1536 -3974 -3252 2378 5002 667 -3978 -3189
1763 -3189 2688 4893 723 -3944 -2479 3131 5402 1356 -3415 -1780 4050 6364 2050 -2594 -898
1778 -898 4390 6334 2099 -2531 -906 4671 6446 1799 -3166 -1096 4546 6191 1348 -3148 -1051
1793 -1051 4500 6011 1196 -2923 -816 4814 5840 1088 -3177 -728 5162 6055 1263 -2546 -229
1808 -229 5341 6174 1054 -2975 -501 4852 5277 641 -3382 -616 4648 4867 -17 -3461 -1138 4382
1824 4382 4714 -161 -3806 -842 4272 4619 -397 -3723 -922 4304 4746 -744 -4215 -694 4755 4499
1840 4499 -1029 -3888 -706 3993 3901 -1338 -4325 -537 4231 3742 -1173 -4364 -945 3851 3477 -1634
1856 -1634 -4516 -862 4473 3585 -1814 -3949 -276 4412 3733 -1647 -4149 153 4838 3700 -1633
1871 -1633 -3993 -52 4590 3525 -1901 -3831 199 4700 3368 -2043 -3867 486 4612 3236 -1933
1886 -1933 -3462 618 4942 3291 -2149 -3506 878 5274 3526 -1857 -3364 1073 5197 3310 -1896
1901 -1896 -2974 1400 5445 3373 -1997 -2925 2048 5402 3253 -1940 -3042 1930 5456 3061 -2008
1916 -2008 -2802 1727 5123 2986 -2028 -2638 1707 5219 2476 -2170 -3067 1711 5388 2244 -2188 -3321
1932 -3321 1820 5201 2018 -2645 -3147 1785 4742 1807 -3131 -2985 2036 4737 1406 -3206 -3112 1664
1948 1664 4402 1676 -3493 -3093 1799 4317 1183 -3665 -3418 1718 4200 779 -4141 -3204 1818 4105
1964 4105 612 -4029 -3191 1624 3663 122 -4366 -3308 1657 3581 21 -4512 -3270 1383 3387
1979 3387 -110 -4485 -3065 1732 3334 -242 -4509 -3342 1640 3672 -360 -4261 -2998 1628 3335
1994 3335 -167 -4421 -3048 1871 3643 -602 -4266 -2524 2308 3581 -338 -4390 -2475 2203 3298
2009 3298 -608 -4122 -2124 2653 3708 -383 -4134 -1974 2872 3582 -570 -4088 -2075 2872 3723
2024 3723 -840 -3832 -1590 3033 3617 -779 -3933 -1538 2930 3442 -689 -4133 -1811 2954 3291 -1319
2040 -1319 -4122 -1290 2834 3029 -1083 -3990 -1171 2925 3164 -1185 -3823 -1275 3264 2872 -1319 -3849
2056 -3849 -1654 2822 2637 -1692 -4119 -1396 2734 2498 -1704 -4247 -1229 3041 2551 -2249 -4012 -994
2072 -994 2821 2181 -2200 -4301 -1161 2959 2159 -2203 -4473 -1189 2699 2042 -2786 -4624 -1014 2718
2088 2718 1576 -3002 -4490 -759 2872 1563 -2660 -4441 -720 3046 1768 -2372 -4059 -763 3296
2103 3296 1971 -2551 -3909 -114 3712 2123 -2511 -3568 56 3841 2270 -2711 -3291 227 3561
2118 3561 2121 -2074 -3044 766 4460 2356 -1987 -2783 1361 4594 2757 -1684 -2195 1672 4826 2907
2134 2907 -1664 -1753 2314 5253 3185 -1248 -1767 2380 5370 3095 -908 -1134 3125 5551 3068 -744
2150 -744 -1052 3250 6002 3503 -780 -637 3329 5973 3285 -615 -351 3538 5869 3490 -674 -267
2166 -267 3847 6067 3488 -452 -131 3982 6416 3483 -709 61 3997 5789 2992 -665 -286 3787
2182 3787 5777 2874 -931 -298 3701 5307 2309 -1429 -404 3639 5315 2466 -1237 -266 3666
2197 3666 5412 2068 -1166 -264 3485 4797 1596 -2235 -1162 3342 4499 1046 -2425 -1385 2662
2212 2662 4106 642 -2430 -1251 2777 3970 639 -2686 -1445 2547 3441 76 -2649 -1518 2448
2227 2448 3318 137 -3156 -1726 2130 3082 -326 -3791 -1726 2122 2721 -781 -3524 -1743 2214 3106
2243 3106 -620 -3255 -1220 2761 2934 -677 -3021 -1430 2583 2863 -810 -3562 -1784 2408 2613 -1149
2259 -1149 -3608 -999 2537 2797 -959 -3274 -797 3006 3016 -976 -2962 -133 3482 3139 -695 -2686
2275 -2686 -298 3329 2864 -761 -3107 -262 3161 2830 -1181 -3090 20 3467 3040 -674 -2186 284
2291 284 3673 3559 -250 -2138 725 4083 3276 -630 -2091 473 3979 3132 -913 -2209 388 3721
2307 3721 2769 -1031 -2536 480 3914 2846 -918 -2105 1230 4143 3065 -713 -2033 1199 4189
2322 4189 2906 -1158 -2373 723 3541 1885 -1427 -2628 915 3310 1781 -1727 -2394 717 3652
2337 3652 2141 -1783 -2139 990 3555 1926 -1817 -2162 855 3526 1747 -1911 -2716 748 3251 1557
2353 1557 -2340 -2695 722 3176 1190 -2473 -2666 708 3288 1150 -2040 -2321 1030 3388 1125 -1912
2369 -1912 -2082 1058 3453 1144 -2400 -2416 1045 2909 1027 -2253 -2214 1421 3281 1194 -2081 -2005 1682
2386 1682 3618 1218 -2017 -1197 1962 3693 1535 -1919 -1253 2204 3669 1249 -1998 -1434 2213 3622
2402 3622 1122 -2006 -1495 2496 3661 1205 -2229 -877 2599 3824 1409 -1609 -555 2917 4123
2417 4123 1316 -1623 -605 2921 3992 1120 -1857 -1064 2739 3679 1047 -1924 -1094 2694 3597 466
2433 466 -1900 -306 3161 3454 1122 -1938 -766 2882 3697 664 -2489 -769 2711 3154 252 -2572
2449 -2572 -920 2546 2737 8 -2803 -1002 2092 2764 -309 -2764 -1141 2233 2453 -238 -2545 -998
2465 -998 2360 2293 -896 -2977 -1167 2086 1832 -1287 -3459 -1671 1963 1732 -1136 -3170 -1755 1585
2481 1585 1773 -1502 -3436 -1620 1707 1506 -1924 -3437 -1412 1539 1381 -1900 -3529 -1305 1590 1283
2497 1283 -2095 -3767 -1584 1744 966 -1950 -3646 -1206 1873 1289 -1727 -3254 -1101 1881 1470 -2003
2513 -2003 -3118 -670 1849 1358 -1837 -3122 -392 2079 1066 -1980 -2929 -283 2258 1493 -2074 -2856
2529 -2856 2 2680 1717 -1624 -2778 170 2658 1612 -1536 -2497 290 2821 1474 -1788 -2279 701
2545 701 2864 1871 -1277 -1984 728 3176 1491 -1591 -1886 676 3160 1668 -1740 -1652 765 3108
2561 3108 1700 -1472 -1633 1067 3307 1496 -1584 -1656 1043 3003 1548 -1806 -1802 1381 3532 1330
2577 1330 -1698 -1405 872 3231 1240 -1700 -1613 1049 3077 1197 -1877 -1943 1197 3038 941 -2199
2593 -2199 -1774 976 2475 543 -1930 -1917 1220 2559 587 -2008 -1754 1184 2575 408 -2242 -1973
2609 -1973 1286 2529 173 -2341 -1866 1036 2472 277 -2257 -1980 1250 2372 -84 -2256 -2092 797
2625 797 2402 -288 -2410 -2043 1230 2317 -242 -2573 -1589 1352 2336 66 -2537 -1498 1531 2576
2641 2576 -76 -2464 -1216 1769 2516 161 -2613 -1277 2003 2528 -8 -2365 -1268 1661 2296 -133
2657 -133 -2501 -845 2135 2381 -175 -2314 -1095 2081 2567 -410 -1887 -401 2526 2441 77 -2144
2673 -2144 -520 2361 2413 -353 -2115 -380 1977 2327 -188 -2335 -744 2268 2146 -279 -2292 -490
2689 -490 2537 1945 -667 -2245 -687 2284 2084 -685 -2276 -882 1962 1999 -954 -2448 -689 1655
2705 1655 1766 -1167 -2721 -1087 1696 1314 -1617 -2573 -625 1757 1131 -1446 -2862 -843 1444 1234
2721 1234 -1769 -3192 -977 1290 872 -2096 -3211 -1077 1333 364 -2468 -3395 -1330 1170 201 -2637
2737 -2637 -3371 -1221 1028 183 -2687 -3583 -1297 1151 64 -2823 -3513 -1037 924 187 -2710 -3364
2753 -3364 -1216 1151 -184 -2720 -3594 -1163 1030 -50 -2717 -3418 -1080 913 -32 -2886 -3187 -650
2769 -650 1117 -178 -2833 -3151 -644 1282 61 -2760 -3029 -490 1847 169 -2833 -2630 -200 1382
2785 1382 166 -2362 -2688 -52 1673 369 -1767 -2018 518 1996 504 -2055 -1916 498 2066 716
2801 716 -2022 -1690 713 2466 706 -1629 -1548 896 2262 451 -1913 -1706 1230 2481 451 -1819
2817 -1819 -1422 1013 2362 611 -1823 -1280 1395 2483 406 -1741 -1517 1117 2302 395 -2138 -1320
2833 -1320 1189 2118 178 -2256 -1363 1064 2375 279 -2004 -1262 1619 2208 86 -1956 -1259 1391
2849 1391 2176 119 -2208 -1236 1100 1912 -321 -2424 -1770 1059 1672 -486 -2305 -1270 1214 1490
2865 1490 -370 -2093 -1345 1212 1951 -623 -2245 -1362 1084 1487 -848 -2704 -1705 924 933 -1039 -3243
2882 -3243 -2084 638 745 -1482 -2975 -1758 490 1195 -1141 -2865 -1377 1349 1290 -1303 -2422 -1211
2898 -1211 1088 991 -1264 -2974 -1437 728 837 -1611 -3092 -1128 807 761 -1326 -2926 -1317 1021
2914 1021 1160 -1256 -2093 -523 1647 1472 -823 -2243 -549 1941 1282 -1198 -2211 -630 1255 904
2930 904 -1553 -2708 -1033 1247 798 -1465 -2826 -1027 1112 684 -1128 -2306 -609 1579 905 -1470
2946 -1470 -2412 -520 1125 877 -1743 -2541 -743 1011 239 -2307 -2751 -975 1016 211 -1910 -2712 -725
2963 -725 1025 299 -1892 -2855 -448 1404 487 -1969 -2504 -159 1291 335 -2331 -2736 -988 939 -348
2980 -348 -2451 -3118 -743 823 -185 -2525 -2552 -605 1133 39 -2417 -2126 -545 1125 -150 -2889
2996 -2889 -2613 -572 546 -610 -3026 -3014 -1189 293 -864 -3110 -2764 -1215 488 -401 -2941 -2487
3012 -2487 -268 1075 -246 -2051 -2006 -176 1208 -288 -2350 -2562 -52 875 -726 -2691 -2688 -335 1038
3029 1038 -759 -2831 -2258 -213 1060 -349 -2373 -1178 1015 1759 187 -1410 -1173 904 2017 532
3045 532 -1432 -1139 985 1974 119 -1843 -1175 1116 1647 57 -1727 -1237 1124 1855 272 -1208 -347
3062 -347 1747 2602 834 -930 -265 1546 2706 407 -1275 -501 1471 2052 54 -1695 -1056 1488
3078 1488 2007 31 -1568 -702 1876 2302 515 -1096 -357 1964 2541 713 -992 -144 2046 1980 212
3095 212 -968 -200 1579 1858 -326 -1760 -809 1538 1530 -377 -1749 -635 1654 1620 -189 -1200 -167
3112 -167 1947 1826 -82 -1534 -328 1678 1623 -853 -1987 -759 1055 1252 -982 -2467 -1071 941
3128 941 636 -1234 -2066 -563 1336 896 -1161 -2088 -515 1397 996 -942 -2192 -526 1337 532 -1424
3145 -1424 -2439 -892 1004 578 -1551 -2704 -829 1036 206 -1567 -2232 -886 875 713 -1299 -1854
3161 -1854 -569 1502 970 -1032 -1905 -308 1418 604 -1384 -2012 -340 1483 595 -1456 -1940 -476
3177 -476 1732 685 -1034 -1624 134 1774 1249 -1193 -1683 285 1565 910 -1142 -1562 -48 1681
3193 1681 454 -1297 -1651 -232 1146 473 -1503 -1584 144 1563 810 -974 -1389 785 1842 990 -1174
3210 -1174 -1476 560 1820 618 -1369 -1381 554 1646 300 -1656 -1675 182 1449 459 -1548 -1558 387
3227 387 1664 890 -1260 -1295 780 1904 381 -1233 -878 572 1883 569 -1228 -1451 459 1553
3243 1553 194 -1649 -1285 350 1056 -64 -2125 -1409 655 1323 -112 -1763 -1302 605 1223 -139
3259 -139 -1355 -1282 798 1468 134 -1598 -1473 856 1504 -51 -1553 -1235 667 1073 -266 -2097 -1165
3276 -1165 483 1066 -429 -1801 -1320 636 1402 -374 -1839 -736 685 1150 -313 -1744 -635 973
3292 973 1352 54 -1318 -567 1202 1549 261 -1333 -1204 1228 1216 -282 -1694 -948 1220 1156 -163
3309 -163 -1529 -726 1199 1218 -353 -1729 -397 1377 1923 189 -1060 -324 1619 1650 -82 -1398 111
3326 111 1639 1789 -320 -1504 -64 1320 1627 -466 -1427 -458 1324 1206 -416 -1475 96 1113
3342 1113 1431 -423 -1479 -451 1660 1302 -494 -1387 -501 1614 1265 -741 -1405 -37 1272 1020 -1014
3359 -1014 -1518 -509 1388 460 -792 -1715 -503 1238 622 -1054 -1848 -507 1206 483 -1216 -1887 -473
3376 -473 821 676 -1139 -1768 -180 1166 751 -1254 -1655 -72 1203 498 -1130 -1642 -434 1427 581
3393 581 -1098 -1848 -474 1293 470 -1144 -1750 -122 833 305 -1451 -1794 80 1232 530 -881 -1421
3410 -1421 -99 1095 472 -1126 -948 297 1346 551 -979 -1388 166 1538 106 -1339 -1227 46
3426 46 1154 21 -1147 -1241 166 1436 439 -773 -959 1079 1661 871 -690 -624 1420 2278 1309 -344
3444 -344 -394 1237 2210 1353 -652 -446 1374 2234 888 -424 -507 1270 2073 1066 -426 -409 1728 2256
3462 2256 1115 -64 -244 1726 2158 854 -418 -84 1455 2372 748 -218 -31 1388 2271 708 -460
3479 -460 -300 1396 1742 714 -503 -116 1205 1856 616 -889 -260 1309 1925 619 -860 -70 1472
3496 1472 1959 636 -604 -289 1709 2050 924 -666 201 1599 2126 900 -370 362 1622 2073 876
3513 876 -269 351 1645 2053 646 -640 193 1641 1961 810 -695 261 1392 1654 268 -968 11
3530 11 1203 1758 46 -997 -220 1770 1734 -32 -945 -234 1405 1124 -155 -1090 -119 1419 1327 -250
3548 -250 -1218 -222 1187 1125 -490 -1132 -440 1455 1536 -379 -582 232 1584 1529 484 -701 330 1776
3566 1776 1407 269 -180 484 2285 1575 377 -342 766 1812 1567 17 -456 261 1855 1983 108
3583 108 -460 542 1865 1511 135 -676 331 1700 1249 -98 -890 492 1811 1059 -562 -901 323
3600 323 990 677 -570 -1137 -39 860 843 -1030 -1306 0 1346 710 -1004 -1223 120 1066 350 -706
3618 -706 -1245 -17 1087 416 -882 -1259 -60 1106 375 -1048 -975 -146 916 277 -1062 -1033 -5 1121
3636 1121 868 -734 -1176 310 997 671 -795 -689 670 1155 628 -1054 -1286 40 1051 -96 -1255
3653 -1255 -1309 -192 699 -151 -1579 -1425 -54 758 -225 -1320 -1587 232 454 116 -1406 -1441 -78 424
3671 424 -605 -1849 -1450 -137 472 -541 -1867 -1340 -121 794 -300 -1353 -1106 274 1169 153 -1000
3688 -1000 -533 715 1337 389 -700 -451 717 1221 123 -866 -496 846 1009 25 -937 -542 904 1247
3706 1247 266 -690 -213 1562 1517 441 -656 -218 1497 1878 429 -619 -244 914 1430 -67 -1129
3723 -1129 -380 789 707 -347 -1423 -1084 411 447 -280 -1274 -509 536 869 34 -1009 -388 1027 998
3741 998 -152 -1268 -813 868 935 -328 -1329 -518 530 828 -747 -1314 -451 811 852 -260 -1180 -141
3759 -141 1209 1198 -20 -693 314 1342 1221 154 -330 -1 1077 874 -234 -1016 -270 721 697 -460
3777 -460 -978 -186 807 467 -655 -1285 -308 1116 607 -677 -1420 -171 896 863 -696 -1154 -121 661
3795 661 202 -1187 -1260 -588 723 481 -662 -1270 -249 931 656 -304 -759 18 1114 791 -358 -743
3813 -743 198 1009 785 -208 -824 310 1176 885 -615 -858 468 1315 1020 -79 -660 624 1800 1304
3831 1304 255 69 702 1832 1081 -217 -253 870 1599 903 -346 -950 271 653 379 -1093 -877 318
3849 318 901 695 -775 -820 217 1287 872 -710 -510 754 1288 717 -393 -476 407 1039 561 -785
3867 -785 -888 193 619 206 -1362 -1041 84 823 -188 -764 -889 519 1014 269 -181 -634 612 1220
3885 1220 525 -733 -424 631 1290 187 -744 -769 408 1070 -168 -1252 -1075 350 643 -21 -1027
3902 -1027 -872 201 649 -34 -937 -828 187 582 -71 -1260 -644 363 801 -176 -1292 -989 341 661
3920 661 -251 -1071 -1009 277 704 -383 -1377 -718 549 843 -228 -1455 -744 327 997 -32 -987 -293
3938 -293 314 750 -123 -1008 -373 671 1052 184 -356 127 1027 1412 297 -467 -130 862 1202 108 -440
3957 -440 -111 860 1374 -423 -715 -285 572 842 -116 -616 -222 867 928 290 -733 248 1007 1095 -36
3976 -36 -504 210 1563 1164 -25 -555 153 1220 1010 -290 -789 -354 725 888 -303 -1339 -229 876
3994 876 374 -493 -771 -328 960 756 -458 -922 -5 741 663 -316 -1122 -216 689 455 -412 -939 -114 579
4014 579 429 -538 -1113 -455 527 325 -891 -1341 -586 213 86 -807 -1311 -390 656 -82 -983 -1104 -257
4033 -257 386 189 -947 -1092 -426 422 255 -1117 -1097 -210 510 -14 -1031 -1378 -826 486 9 -1256 -1570
4052 -1570 -739 378 -81 -1167 -1364 -500 400 -179 -1352 -1066 -132 873 3 -888 -1330 -163 298 -252
4070 -252 -1268 -1100 -188 527 -98 -1007 -1421 -564 352 -200 -1063 -1184 -240 462 -233 -1230 -1165 -150 182 -143
4090 -143 -794 -779 124 598 -121 -815 -587 110 753 55 -895 -665 91 753 350 -1091 -628 138 639 169
4110 169 -760 -681 424 719 -246 -884 -429 265 814 168 -1151 -855 395 341 -624 -1175 -1031 -59 349 -451
4130 -451 -1207 -871 268 250 -334 -1157 -802 -5 202 -639 -1387 -1279 -78 162 -876 -1685 -1381 -74 -107
4149 -107 -652 -1068 -926 -103 292 -767 -1229 -702 198 331 -516 -1303 -588 349 418 -397 -1312 -617 260 127
4169 127 -481 -1208 -909 447 83 -589 -1272 -651 471 244 -453 -1204 -591 330 712 -363 -996 -538 552
4188 552 402 -536 -932 -718 97 384 -543 -1039 -1173 229 107 -698 -1188 -497 420 297 -897 -1309 -233
4207 -233 660 319 -893 -987 -327 673 712 -598 -813 -218 505 562 -350 -649 -20 750 518 196 -530 40
4227 40 1302 992 -240 -327 422 1341 1076 -18 -409 431 1115 780 -347 -569 170 944 1047 -78 -270
4246 -270 227 912 466 -95 -545 281 847 364 -490 -716 61 367 151 -284 -627 36 874 92 -934 -1194
4266 -1194 -244 544 75 -1005 -1009 -206 658 31 -826 -840 -277 618 -208 -902 -1039 -283 693 80 -601 -914
4286 -914 186 350 211 -283 -534 174 494 164 -876 -568 269 797 179 -468 -671 285 583 85 -813
4305 -813 -571 136 772 -1 -895 -785 315 624 31 -886 -815 39 422 -166 -906 -926 -176 328 -462 -1093
4325 -1093 -1057 -164 225 -410 -1090 -838 153 263 -335 -860 -552 103 372 -174 -1035 -464 49 650 -328 -997
4345 -997 -402 221 544 -145 -715 -566 453 599 -87 -465 -75 519 1021 227 -304 135 864 842 240 -537
4365 -537 -68 959 882 409 -360 -241 373 733 -101 -747 -164 242 280 -288 -721 -458 79 475 -534 -1050
4385 -1050 -612 339 25 -378 -1368 -562 113 124 -632 -1510 -841 -158 -110 -1084 -1238 -721 135 150 -773 -1461 -226
4406 -226 21 -56 -558 -947 -316 136 273 -687 -921 -431 287 275 -738 -900 -356 197 340 -607 -692 -278 516
4427 516 195 -513 -756 -399 627 96 -322 -945 -234 252 138 -745 -1246 -86 136 -224 -1009 -1193 -906
4446 -906 154 130 -849 -1178 -580 62 -88 -906 -1081 -360 454 82 -967 -774 -234 535 143 -784 -960 -242
4466 -242 296 -39 -552 -469 359 764 215 -611 -594 405 595 559 -155 -387 431 981 626 236 -74 563 1146
4487 1146 695 94 -15 520 888 469 -465 -241 44 558 275 -607 -305 248 999 684 -669 -322 78
4506 78 855 510 -338 -331 171 884 121 -523 -718 -4 454 180 -543 -612 -83 669 -25 -1000 -852 -177 537
4527 537 336 -683 -746 72 272 33 -676 -202 394 532 116 -741 -727 564 556 137 -699 -414 392 599 -155
4548 -155 -654 -244 316 828 524 -614 -317 402 644 -456 -749 -432 230 324 41 -839 -675 318 604 -335
4568 -335 -524 -721 62 203 -156 -771 -368 345 729 -102 -530 -80 622 568 -22 -415 -389 331 540 -120 -426
4589 -426 -169 398 501 -315 -461 -169 447 689 130 -61 65 905 903 232 96 350 928 1222 421 -170 517
4610 517 1067 792 359 -107 259 1118 1045 -17 -278 117 967 919 109 -173 258 801 915 -56 -73 428 907
4631 907 1095 218 34 49 750 767 -21 -335 77 574 602 -98 -716 4 692 806 -109 -488 191 508 627
4652 627 -11 -230 231 417 820 -180 -280 377 506 672 -347 -524 -130 681 348 -179 -452 292 796
4671 796 667 -32 -262 -2 233 217 -340 -848 349 580 418 -425 -647 -172 414 427 -282 -222 210 403 -100
4692 -100 -577 -391 239 289 299 -469 -518 -85 176 154 -371 -456 148 393 -134 -670 -380 263 500 71 -523 -249
4714 -249 -19 537 236 -433 -419 542 660 315 -209 -511 447 519 225 -424 -397 416 696 159 -168 -162 697 825
4736 825 301 -254 -283 642 770 183 -369 -159 608 970 489 -34 -17 548 588 477 -181 -273 336 784 162
4757 162 -272 -12 847 812 282 -45 -250 363 777 293 -56 -258 555 803 323 -270 -144 622 752 23
4777 23 -126 -55 518 626 126 -365 197 398 633 249 -415 -50 433 360 -46 -426 146 133 343 153 -589
4798 -589 -362 207 423 -155 -671 -229 301 517 -472 -328 -325 415 545 -44 -438 -126 443 352 -161 -718 -244
4819 -244 296 478 -281 -527 -158 436 126 -2 -640 -78 766 673 -291 -516 -111 571 465 -189 -206 -128 495
4840 495 404 -189 -475 -316 365 139 -192 -430 77 633 210 -190 -400 108 538 455 -101 -390 256 356 577
4861 577 157 -479 14 445 390 -437 -294 76 563 497 -148 -235 -112 448 620 -115 -181 118 907 603 -102
4882 -102 51 566 1004 708 -92 -176 410 675 1005 -151 -369 247 787 498 -127 -173 485 829 504 68
4902 68 -212 209 747 700 51 -137 350 1108 307 -16 -273 386 562 230 -308 -571 253 463 309 -688 -343
4923 -343 184 776 153 -422 -379 85 340 296 -339 -594 125 657 -208 -274 -282 -11 463 315 -181 -126 -1 463
4945 463 243 -207 -318 214 864 369 -226 -50 538 717 247 6 -177 460 583 198 -71 144 426 688
4965 688 297 -234 37 357 612 464 88 -305 377 743 360 -163 10 693 799 316 -22 -80 194 563
4985 563 70 -37 -25 519 455 -122 -3 -32 350 643 406 -5 213 591 779 370 -276 393 747 995 594
5006 594 -82 448 1211 1171 343 367 136 676 976 222 73 111 1054 1092 483 100 202 762 876 293 3
5027 3 407 988 801 271 14 242 658 413 200 -11 -19 539 550 -89 -157 193 401 352 -117 37 -99 539
5049 539 520 -58 -523 -243 426 402 -118 -346 360 386 364 -213 -260 -191 441 439 -178 -584 -3 446 518 -67 -105
5072 -105 154 563 307 -472 -167 166 564 526 273 -59 223 773 730 97 82 43 550 363 33 40 165 541
5094 541 333 -173 -295 50 415 438 -389 -450 420 315 216 -117 -282 87 617 171 -175 -78 145 560 176
5115 176 16 -110 189 577 144 -94 -390 265 445 289 71 -445 420 606 602 -217 -116 276 761 493 140
5136 140 49 462 1059 426 167 -51 569 610 392 241 129 280 668 647 -52 -237 191 602 350 103 46
5157 46 350 338 629 -373 -180 336 415 459 -90 -182 212 172 167 -534 -391 28 287 -65 -577 -508 333 -46 -272
5180 -272 -444 -576 -172 428 -140 -458 -225 -64 416 -370 -579 -320 -204 363 -289 -784 -397 -22 417 -139
5200 -139 -515 -408 213 180 74 -299 -155 297 407 -143 -493 -211 136 524 147 -312 -278 305 238 -258 -466
5221 -466 -358 170 394 -20 -416 -282 337 301 -184 -355 -163 271 330 -474 -364 -62 77 263 -106 -85 66
5242 66 172 221 -58 -313 -67 374 164 -160 -440 135 353 455 -19 -419 198 499 423 -18 16 430 338 430
5264 430 75 -85 117 143 540 -94 -17 320 531 659 -15 -38 127 834 713 -68 45 196 558 440 -35
5285 -35 121 313 434 483 278 -320 -168 -73 221 80 -134 -68 296 -29 -324 -205 128 396 451 -218 -86 2
5307 2 498 141 -392 -216 -37 208 346 -459 -369 -111 83 140 -176 -358 3 334 -2 -475 -276 167 239 371
5329 371 -208 -102 231 274 29 -194 -489 -120 76 -168 -214 -239 133 362 -135 -270 -233 104 351 63 -367
5350 -367 -253 285 136 -124 -352 46 -65 173 -45 -398 -480 -119 182 56 -307 -249 -79 353 369 -412 -446
5371 -446 204 232 80 -312 -114 218 422 239 -80 -331 -20 332 107 -201 -140 365 319 216 -134 -197 118
5392 118 297 -44 -394 -149 205 261 288 -311 -282 168 271 47 -502 -61 261 238 13 -168 -242 331 42 -206
5414 -206 -241 -467 69 105 -387 -215 -63 -11 134 -84 -519 -104 -248 8 -55 -568 -349 -75 51 -281 -498
5435 -498 -180 129 -18 -338 -548 -452 -175 295 -461 -314 -273 42 -35 -63 -326 -604 -250 -177 -434 -517 -502 132
5457 132 -161 -312 -331 -353 96 101 -417 -789 -400 -140 -48 -480 -635 -74 449 -105 -290 -665 -153 -11 125 -478
5479 -478 -547 -41 -70 173 72 -626 -420 -132 70 68 -309 -67 274 279 -161 -311 -261 467 -154 -400 -328 -186 355
5502 355 241 -78 -28 153 511 27 -26 26 -145 492 374 -226 -112 -3 -75 -47 -48 -274 -244 273 131 -252 -252
5525 -252 -247 130 316 -19 24 -132 532 438 -260 -84 190 134 97 -103 -42 64 553 340 26 -261 240 588
5547 588 100 -559 -269 -117 484 7 47 -281 46 440 -41 -465 -146 376 172 182 -572 -404 -201 258 -286
5568 -286 -217 -252 -76 -139 -316 -551 -460 -235 -5 -18 -536 -463 -6 397 -116 -378 -374 -215 -59 -176 -347 -434 -334
5591 -334 22 -362 -515 -673 -33 7 -18 -514 -500 19 109 -208 -363 -561 -54 -168 -85 -565 -386 -359 105 -20
5613 -20 -445 -263 -19 351 117 -296 -328 29 149 67 -485 -175 59 104 -26 -288 -312 -6 220 -230 -399 -267
5635 -267 -99 -92 58 -84 -418 186 321 -246 -587 -155 212 171 -417 -310 -410 -105 455 -118 -142 112 -2
5656 -2 21 -4 -265 -319 277 -7 13 -413 -192 205 -43 -57 -190 -183 83 24 -363 -454 -18 36 -34 -267 -519 19
5680 19 121 245 -419 -177 -48 -298 92 -265 -127 -349 279 -68 -162 -464 -270 -62 67 -560 -447 -175 -97
5701 -97 -254 -403 -548 -357 -31 66 -331 -364 -368 -52 -1 -253 -308 -226 -94 -55 -196 -384 -20 -44 -57 -593 -415 -265
5725 -265 50 56 -580 -296 -272 -72 76 -423 -598 -314 491 -114 -386 -443 17 10 -63 -374 -230 -88 -56 11 -330
5748 -330 -355 180 -21 77 -135 -224 -12 -122 -63 -268 -247 147 -112 151 -39 -60 -265 12 -38 -345 27 -201
5770 -201 401 -157 -87 -109 -221 113 -181 -345 -290 -102 -278 -152 -178 -381 -171 108 -279 -69 -327 157 34
5791 34 -99 -210 -518 116 177 -123 -10 -346 54 -212 -253 -293 -326 -146 444 -120 -293 -362 24 34 -45 -249 -516
5814 -516 -118 -290 -147 -447 -391 -108 -108 -228 -493 -606 -79 -109 -356 -249 -512 -327 -115 -448 -613 -430 -257
5835 -257 -4 -365 -539 -296 -248 -179 -304 -421 -555 -130 -285 -326 -693 -382 -184 -382 -419 -402 -399 -540 -144 -237 -477
5858 -477 -206 94 -123 -18 -555 -518 -192 38 76 -513 -80 -25 -183 -204 -481 -409 -267 -28 277 -671 -221 -5
5880 -5 175 -34 -447 -126 -265 -115 -593 -442 -218 -75 22 36 -350 -253 0 264 24 57 -179 -103 350 33
5902 33 -428 -51 95 64 -211 -171 -139 284 207 -416 37 142 130 110 -242 52 295 300 -29 -285 -170 -191 242
5925 242 242 -68 -376 242 239 72 16 -96 166 -25 154 165 -153 -11 237 172 -175 -363 56 468 78 -156
5947 -156 178 78 67 357 -74 -343 -137 253 145 -95 -94 -31 442 173 -278 -185 142 276 57 -228 -182 -146
5969 -146 163 23 -23 118 -141 -6 91 -150 -45 70 79 -153 37 -287 14 102 255 -211 -212 182 262 380 -131
5992 -131 -181 201 356 82 73 -155 220 319 1 -151 -175 447 450 -54 -76 12 326 270 143 -97 -344 171 234 -63
6016 -63 403 -112 7 412 182 68 48 -39 537 113 151 -224 257 -158 -179 -113 -37 210 356 159 6 328
6038 328 356 184 156 -110 115 146 405 -14 -44 -75 47 342 3 97 61 215 224 83 -318 -23 25 169 210 -342
6062 -342 11 174 218 -145 -201 -215 52 123 -223 -252 -39 274 139 -242 -190 44 -156 94 -198 -312 -170 5
6084 5 54 -579 -425 -182 4 -125 -33 -393 -270 -260 166 -249 -293 -226 -67 -90 -128 -202 -171 -56 -16 -280 -261 -463
6108 -463 -292 216 -332 -162 -307 3 -199 -127 -184 -438 80 -109 -197 -201 148 1 -222 -2 -254 -132 -21 -277
6130 -277 -173 -318 48 77 237 -137 -235 -104 145 -75 49 -254 -23 28 319 16 -19 -185 105 -123 -253
6151 -253 -48 130 316 -155 -100 -152 247 -51 177 86 155 281 440 244 -6 85 178 241 153 -106 -27 208 215 185
6175 185 339 192 -99 146 372 -253 -23 -36 492 275 120 79 57 273 -8 173 36 -30 -169 145 113 -307
6197 -307 112 452 105 217 -34 -31 169 115 -94 14 9 77 -301 -141 -99 116 203 116 -158 36 266 -155 -256
6220 -256 -211 -121 73 229 82 -64 -211 291 -135 -229 -339 -23 9 218 29 -192 -107 -106 94 199 -223 -35
6242 -35 113 180 232 -202 94 46 -313 180 -97 -172 99 17 -45 -192 -227 219 216 85 -126 241 -64 262 -58
6265 -58 -161 109 289 280 -120 -21 245 131 330 -171 -78 362 76 227 125 -143 -245 309 221 293 -202 212
6287 212 280 256 115 154 -14 -106 39 298 330 8 159 41 -49 108 36 124 561 -28 -170 99 35 197 200 -111
6311 -111 24 96 35 219 -8 57 311 672 69 -15 -22 366 169 148 -10 44 91 52 -139 -301 6 272 168
6334 168 -4 211 -88 449 31 46 210 -120 347 110 12 -69 -171 223 148 195 -254 73 177 12 198 -233
6356 -233 -163 193 48 6 180 -66 104 -52 223 -277 -16 309 136 161 -198 274 -6 174 -86 15 119
6377 119 468 103 182 144 380 338 50 24 288 172 421 425 -142 77 267 248 219 128 -163 156 366 177 27
6400 27 -205 431 318 304 19 -186 -41 233 492 416 286 424 243 298 -120 5 494 124 162 48 171 163
6422 163 272 409 -96 74 409 554 321 72 202 469 365 330 28 210 328 479 184 265 51 379 133
6443 133 191 66 30 283 372 -50 -11 -63 307 251 407 -81 -68 -6 72 187 192 218 300 510 -155 119 61 -101 -335
6468 -335 4 32 -341 109 69 -122 -135 -590 68 264 79 -133 -154 -35 69 -30 -9 -105 192 -19 -14 -241 -142
6491 -142 -38 -32 215 -150 -244 177 182 -217 -110 -231 -119 -263 -235 -69 22 152 77 179 78 14 43 -270 -207 -81
6515 -81 -240 70 -32 11 -27 222 -199 56 -262 -326 -128 -55 97 83 58 204 351 30 -34 -234 -320 28 141
6538 141 -312 -139 -76 58 -267 355 61 86 185 177 333 -434 -42 204 477 193 263 182 99 307 -164 -248 -283
6561 -283 91 -81 -294 -71 187 -12 55 28 -67 -65 -14 22 -364 17 -274 -5 304 -93 -141 -41 -310 79 81
6584 81 -14 206 158 209 62 -216 145 -169 304 -56 66 29 120 -16 -234 -110 42 12 -132 38 -215 -154 -69
6607 -69 -248 -307 173 -71 -6 -192 -179 -391 -192 36 95 -458 -15 -20 -280 -47 -253 82 96 124 122 -138 -174 105
6631 105 98 173 -4 -198 69 -32 3 -311 -174 186 182 -86 -123 -46 90 107 74 276 171 227 75 52 -191 -36
6655 -36 543 75 -87 111 173 140 134 200 -64 8 -48 89 273 33 14 226 449 461 234 425 305 372 168 -82
6679 -82 -161 159 151 170 44 148 188 -38 157 329 85 127 168 -67 -46 583 75 190 479 245 43 49 338 449
6703 449 45 -60 104 194 120 98 29 84 420 104 158 -143 24 432 170 -140 9 329 -79 456 -96 -73
6725 -73 36 122 -3 -204 -274 -37 -114 -102 -33 -32 18 -220 -122 29 -359 -68 105 -284 -178 -182 -132 -24 -70 -317 -295
6750 -295 129 -59 -259 -303 -308 70 18 66 -401 -108 326 33 -109 -108 -194 -24 37 -33 -485 86 -97 -72 -15 -171
6774 -171 -62 -30 471 -272 15 176 147 59 -22 -16 4 381 -183 152 -159 163 113 16 -140 -469 -58 29 -40 -79
6798 -79 6 -61 142 -40 182 -181 179 324 -132 56 246 202 9 37 -128 87 170 83 112 121 174 256 116 -101
6822 -101 35 -111 -38 -100 12 -65 -148 -68 41 0 9 146 83 181 -1 121 -149 398 259 86 -171 -349 83
6845 83 -52 20 -58 -131 51 -43 -149 263 -105 -155 56 138 -106 -337 -199 -197 12 -114 -26 -104 -109 -136 -273 -100 -26
6870 -26 64 -201 -228 197 -57 24 36 -151 -61 99 1 -492 -137 -206 -158 -207 -340 -140 -203 -230 127 -133 -196 -380
6894 -380 -222 127 -278 -39 -289 -419 11 -165 61 29 -285 -48 -154 8 -146 -243 389 68 -285 -107 181
6915 181 110 17 -70 91 79 -201 70 -32 -227 62 94 -310 -412 -40 111 -91 -49 -141 -249 -176 304 -82 -158
6938 -158 152 24 69 72 -307 -179 208 -253 159 44 -206 -10 -48 -107 -370 -36 37 -160 27 -54 6 100 84
6961 84 -184 31 -224 123 -93 -7 -55 -296 116 187 -357 -466 -215 137 -371 184 -282 -96 2 273 165 -245
6983 -245 32 193 67 -221 -50 -195 51 -285 -29 -142 247 86 -228 -441 -242 134 -217 -34 -119 -169 165
7004 165 -79 -285 -140 -220 -333 -147 85 -147 -125 -115 -265 -237 -139 -274 -16 -204 -54 -13 -75 42 -334 -178
7026 -178 -390 -29 -204 120 -65 -16 -101 -270 122 -192 123 98 -152 255 -329 -266 -122 -165 9 -14 105 -168
7048 -168 139 105 -45 62 54 -100 89 -41 -47 98 106 263 -95 -117 130 255 78 105 -63 -66 78 361 -222 -17
7072 -17 324 107 37 -69 -80 108 310 335 218 -64 -16 -9 -9 -51 -128 196 33 91 11 -296 12 13 -78 66 44 -66
7098 -66 -15 -234 -55 -45 -119 17 262 306 -160 117 194 -91 -305 102 346 131 63 -99 27 -23 43 -49 -245
7121 -245 -145 4 97 155 -102 167 43 -288 -183 -114 72 39 -168 70 -184 -325 -22 -44 -16 -77 149 -73
7143 -73 -366 167 -53 -101 110 62 80 -97 -171 -33 111 -107 -96 35 -320 -48 149 20 87 35 -12 -113 -220
7166 -220 -109 -153 -32 108 -115 -58 69 -140 73 -23 -261 -98 349 99 96 63 226 159 -80 141 63 181 234
7189 234 167 4 74 36 -191 172 236 -94 -301 288 431 46 180 -19 144 142 -253 72 -32 -15 66 44 112
7212 112 206 157 249 -291 52 89 153 -368 186 -296 56 -151 -227 182 -362 71 -60 70 -171 104 -69 164
7234 164 -109 -65 -143 -168 40 -201 -110 -202 74 -211 -93 -305 -188 -55 -299 23 -217 44 -30 26 -115 -343
7256 -343 -318 -231 143 -14 -43 -92 60 -108 43 -73 -276 162 -108 17 -40 -7 45 172 -49 -151 -462 49
7278 49 -263 213 3 -5 -189 -147 -31 -193 -39 -207 -155 95 71 -128 -41 -152 249 -396 -180 -220 -76 -171 -157
7301 -157 -104 -219 -77 -121 -194 -23 222 -197 -404 -162 -319 27 132 69 -57 -61 164 -134 -137 -18 -416 -149 -126
7324 -126 -92 24 -108 67 96 -152 260 -2 64 10 171 26 273 206 -76 158 -103 -63 188 -27 -10 81 -39
7347 -39 90 26 -189 4 300 -165 119 113 81 -85 339 -47 -204 -57 1 -81 111 -134 -134 -131 -177 133 -423 29
7371 29 -25 161 -227 -152 -334 -220 43 4 -84 -282 11 -224 -210 -385 -10 51 -312 -203 -181 -266 14 -40 -8 70
7395 70 -140 -21 16 37 -108 -158 20 89 107 -91 -204 -125 267 248 -35 -180 -318 72 43 77 -225 -42 163
7418 163 -158 -202 -24 -166 100 272 38 -214 124 62 25 -263 72 255 417 197 -359 -372 -139 76 127 -316
7440 -316 7 183 239 -70 -172 411 -26 35 -98 21 -56 365 86 155 143 76 -3 164 55 -112 -103 -122 141
7463 141 49 -19 -30 82 -147 216 -261 -104 158 175 182 -282 -47 -199 -50 245 244 269 196 69 -16 -237 134 44
7487 44 306 199 -79 138 420 101 67 29 -16 252 -102 243 316 247 109 309 230 125 -53 52 -293 71
7509 71 -238 -289 197 66 -50 -377 84 -152 -38 -117 -268 -245 127 99 -121 196 41 -197 -45 -182 -374 103
7531 103 -26 -202 -33 49 76 99 0 -225 -302 -29 -161 30 -133 -96 73 332 -38 -49 187 -71 1 -83 -9
7554 -9 -50 -107 -155 254 -211 29 -85 1 115 223 29 154 155 408 251 -132 197 -117 28 -77 34 -108 -20
7577 -20 44 124 -123 -57 -23 8 -210 220 15 27 50 -170 36 90 154 3 -29 -180 -28 117 417 -103 -41 133
7601 133 -303 66 -162 25 259 -83 -56 150 -5 133 -94 -84 39 308 -165 151 43 -306 249 -62 83
7622 83 -284 36 -248 303 -174 -75 -348 119 -389 44 7 -39 21 197 164 30 15 -46 68 25 -240 -88 -61
7645 -61 -357 75 346 -220 -12 -7 -128 -54 -70 -238 -182 340 392 -281 -38 64 357 73 180 238 98 -65 -114
7668 -114 39 -150 -19 84 -167 24 103 56 95 7 -26 145 165 157 240 41 -121 -35 213 54 177 -138 -35
7691 -35 188 -48 145 89 -73 -70 -151 259 279 19 -18 143 248 -253 -161 71 172 74 73 -10 39 190 39 -162
7715 -162 -109 465 -211 9 69 223 305 104 87 -179 121 -21 42 -83 -155 142 -160 -3 -262 131 200 28
7737 28 117 236 -26 48 231 -255 -61 60 -376 98 -51 73 101 -68 -8 7 -218 -167 261 88 -109 36
7759 36 -144 219 -49 -330 -283 154 -35 26 30 30 -175 329 -150 10 153 -20 61 77 202 151 -275 33 180
7782 180 -15 -226 271 326 276 14 -269 -288 97 165 182 -118 44 69 -126 232 -69 1 -271 -140 -258 -89
7804 -89 -125 -272 198 -162 -181 -26 49 -100 218 -87 -150 43 248 -22 -222 40 102 -74 -85 131 214 -33 406
7827 406 98 -4 183 47 21 -82 -111 -7 138 -69 -226 -88 195 69 -237 -77 226 -226 -22 101 51
7848 51 143 -49 104 112 209 165 15 -378 80 254 -2 -76 0 -72 155 146 228 -75 -76 192 -3 -303 -109 206 -18
7873 -18 31 59 221 139 17 -24 210 50 240 -1 -47 82 99 -24 197 49 -70 180 -183 -360 -34 285
7895 285 372 -57 -245 26 -89 27 90 -172 48 113 141 -107 -24 -107 238 113 136 26 -41 134 4 -145 -219
7918 -219 -216 46 -208 -273 -166 -103 -79 -37 238 236 36 -205 -73 -80 88 47 -291 -288 -13 -24 94 198 -90 -114 22
7943 22 -175 -16 -11 126 175 -131 124 -56 73 -76 -239 291 414 236 87 37 34 1 120 -123 67 120 -88
7966 -88 -132 277 32 127 -116 70 54 147 227 286 139 -251 -59 53 -93 10 -12 29 22 160 -164 82 -55 228
7990 228 128 -204 0 -140 117 32 96 -151 104 36 -268 -101 -390 -226 94 24 -125 154 155 34 65 -160
8012 -160 19 -51 -330 -21 15 -222 86 34 111 -37 -153 135 2 -196 -31 241 -208 -132 -29 82 -17 55
8034 55 59 -390 -161 5 -212 405 229 165 96 -78 39 5 44 -36 425 4 -90 42 -74 -65 104 -342 -269 56
8058 56 -63 -65 52 -30 -116 -31 -176 -304 -145 65 287 148 -69 -28 -75 16 114 133 142 59 39 -183 17 -111 -82
8083 -82 -135 -74 110 72 -86 -48 31 -58 75 84 -52 101 -141 -92 111 136 19 153 72 86 -121 223 26 174
8107 174 -30 170 -69 -89 257 -105 -170 -21 365 338 165 -82 86 -147 186 -42 197 182 35 28 201 -80
8129 -80 199 55 -122 19 -63 -67 24 -202 110 43 193 63 135 153 132 -150 -72 -8 -61 85 -40 185 -65 -58 204
8154 204 29 -20 -153 -194 150 281 58 -260 -41 -70 268 214 -159 -54 -5 142 -71 -125 -133 -8 171 -140 207
8177 207 160 267 -15 -26 -136 30 -137 160 -40 125 110 126 -104 -160
8191a60
$$ Imaginary data points
##PAGE= N=2
##DATA TABLE= (X++(I..I)), XYDATA
0 0 0 0 0 0 0 0 0 0 0 -1 8 -8 8 -8 16 -16 17 -24 25 -32 36 -41 49 -57 65 -73 84 -95 109 -122 139 -155 173
33 173 -193 217 -242 266 -296 329 -365 405 -449 495 -549 611 -675 753 -837 935 -1049 1184
51 1184 -1347 1546 -1799 2131 -2585 3252 -4332 6389 -11738 56321 125667 66085 54841 71784
65 71784 108167 93827 59058 37331 58554 77142 68295 33249 19446 33484 57232 52461 27746
78 27746 11131 29859 59003 63055 35276 19776 40464 74640 74828 42975 24851 48086 79003
91 79003 71187 33728 18300 42592 66989 53487 19397 9173 32905 53687 42717 15054
103 15054 8322 30507 52347 46150 22064 13409 33841 58066 53440 25570 13239 34257 59055
116 59055 51350 18471 5002 29085 53977 40938 6253 -2679 24737 46109 30036 -1223
128 -1223 -5589 20374 37584 21750 -6584 -10503 10988 26009 12059 -14888 -22130 -2588 14598
141 14598 3005 -25548 -33407 -10359 10692 -900 -29962 -34552 -6258 16643 2602 -26244
153 -26244 -26426 3691 22231 4092 -23046 -21262 4579 17446 -1144 -26498 -26307 -4064 7682
166 7682 -8604 -31178 -32159 -9566 5954 -6027 -28621 -27582 -1352 17832 5517 -17951 -15467
179 -15467 12560 30017 13027 -12996 -10142 16752 28376 6417 -19594 -16842 6767 14509 -7084
192 -7084 -30729 -26742 -3943 4402 -13469 -33269 -28265 -4594 7541 -6983 -26987 -22087 3456
205 3456 17162 527 -22295 -17707 8561 19699 -1322 -25679 -19332 6529 13806 -9443 -31186
218 -31186 -22547 2782 8674 -12145 -29867 -19502 5199 11656 -6301 -22055 -12218 11502 19404
231 19404 2178 -15095 -7708 16466 24010 4302 -15188 -7067 17418 23145 1091 -18475 -8246
244 -8246 16643 20471 -2547 -19086 -6475 17039 18763 -2733 -17773 -5666 16095 17393 -3552
257 -3552 -18062 -7261 13045 14193 -5934 -21255 -11676 9633 12234 -8976 -24384 -12893 10349
270 10349 11956 -9933 -24287 -10785 13581 13543 -9479 -22106 -6608 14994 12947 -9130 -20820
283 -20820 -6058 13689 11791 -9974 -20507 -6235 13360 11667 -8221 -18868 -4634 16308
295 16308 15581 -4759 -15838 -255 20988 19095 -2873 -13517 2587 23602 19405 -3885 -13752
308 -13752 3416 21756 15496 -6590 -14723 1747 18510 12573 -8081 -15596 748 17082 11958
321 11958 -8077 -15130 386 17970 13279 -7529 -15743 906 18568 12259 -9390 -16758 394
334 394 17780 10130 -11772 -17734 998 16866 8177 -12593 -16112 1762 16716 8452 -11079
347 -11079 -14462 3005 17324 8968 -10038 -13315 3650 17993 10095 -9850 -14056 3982 18662
360 18662 9710 -10897 -14153 4851 19365 8942 -11800 -13265 6528 19672 7798 -11533 -11819
373 -11819 7229 18919 7308 -11132 -11863 6569 18075 6307 -11895 -12433 5580 16805 5795
386 5795 -12763 -13306 5078 17182 5500 -13303 -12629 6889 18037 5599 -12733 -11084 8933
399 8933 18948 5340 -12303 -9233 10185 18864 5331 -11320 -7948 10505 18509 5463 -10799
412 -10799 -7309 10517 18732 5992 -10200 -6867 11879 20615 6375 -9998 -5747 14137 21513
425 21513 6942 -8758 -3733 15622 22257 6752 -8415 -2261 16709 21932 6728 -7815 -1556
438 -1556 16511 21520 6564 -7691 -1559 16716 21559 6537 -7104 -948 17392 22496 7262
451 7262 -7137 388 18901 23019 6993 -6781 1016 19738 23065 5941 -7103 1772 19528
464 19528 21577 4913 -7594 1015 18011 19719 4012 -8451 255 17132 18562 2697 -9027
477 -9027 -586 15968 17932 1756 -10184 -1289 16110 16692 -18 -11150 -1657 15010 14935 -2078
491 -2078 -13057 -2657 13363 12496 -4531 -14106 -3471 11902 10790 -5596 -14463 -3527 12426
504 12426 11205 -4944 -13433 -2224 13136 11923 -3963 -12650 -952 14971 12916 -4193 -12461
517 -12461 -564 14739 11719 -5800 -13283 -888 13642 9459 -7507 -13915 -1196 12751 8662
530 8662 -7408 -13418 -463 13583 9555 -6445 -11665 1050 15074 10935 -5352 -11309 1700
543 1700 14944 9498 -7619 -13170 -238 12554 6338 -10685 -15919 -2462 10353 4072 -12434
556 -12434 -15529 -1632 11052 5387 -9648 -12363 2046 14808 8955 -6031 -8108 5665 17711
569 17711 11382 -4237 -7519 6640 17722 9807 -6271 -8938 4969 15549 7705 -8070 -9725
582 -9725 5023 15376 7357 -7225 -8364 7064 17023 9016 -5166 -5546 8715 18480 9679 -5179
596 -5179 -6046 7546 16524 6682 -8695 -9540 4166 12194 2546 -13235 -13896 820 8798 -1455
610 -1455 -16658 -16062 -1195 7091 -3560 -17997 -16563 -1518 5962 -4558 -18435 -16440 -2039
623 -2039 5125 -5235 -18892 -16796 -1877 5067 -5716 -18607 -15881 -1168 6305 -4692 -18334
636 -18334 -15506 -533 5311 -6369 -19472 -16380 -2167 2859 -8895 -21815 -17750 -3282 1550
649 1550 -10339 -21600 -17102 -2330 2608 -8260 -19592 -14395 208 4884 -6891 -17908 -13477
662 -13477 633 3831 -9168 -21285 -17255 -3877 -1870 -15196 -27401 -22750 -9139 -6796 -19831
675 -19831 -30612 -23619 -8765 -5861 -17317 -26156 -18221 -2824 328 -11145 -20114 -12168 2099
688 2099 4394 -8124 -17918 -11117 2142 2593 -10805 -20697 -14161 -688 -71 -13532 -22136 -14249
702 -14249 318 1478 -10662 -17883 -8172 6603 7753 -4248 -10407 -1279 11968 12267 -606 -8189
716 -8189 3 12133 10803 -3177 -11346 -3761 8093 6169 -7868 -15327 -6568 5256 4033 -8980
730 -8980 -15459 -5525 6900 5629 -7188 -12802 -3294 9131 6600 -6181 -12613 -3031 8055 5391
744 5391 -8070 -13719 -4228 7240 4418 -8656 -13666 -3376 8368 5421 -6884 -11517 -696
757 -696 11033 7958 -5263 -9403 1402 12000 7864 -5414 -9637 977 11485 6585 -6429
770 -6429 -10314 1146 11611 6517 -5801 -8197 3660 13444 9329 -3351 -5832 5454 15017 9397
784 9397 -3605 -6925 3411 11880 5285 -8232 -11689 -1272 6897 -347 -13201 -15226 -3976 4754
798 4754 -1089 -13143 -13572 -1532 7139 2103 -9425 -9456 2318 10233 3955 -7766 -9061 1965
812 1965 9013 1856 -10938 -11830 -948 5822 -1722 -13404 -13598 -1282 6201 -1195 -11902 -10445
826 -10445 2473 10133 3697 -6823 -5162 7341 14153 6447 -4865 -3728 7737 13370 4182 -7677
840 -7677 -6728 4332 9618 -195 -11132 -9672 2219 7781 -1045 -11253 -9011 3241 8885 540
854 540 -9949 -6746 4908 9573 558 -10395 -8018 3271 6929 -2884 -13314 -10813 455 4024
868 4024 -5678 -15232 -11944 141 3968 -4684 -13480 -9204 2612 6824 -2050 -10654 -6651 5316
882 5316 8271 -1502 -10452 -6239 4982 6902 -2925 -11945 -7572 3932 5929 -3940 -11790 -6889 4812
897 4812 7456 -1804 -9442 -4249 7456 9968 54 -7708 -2487 8728 9888 -252 -8943 -3715
911 -3715 6978 7215 -3693 -12046 -6502 4129 4880 -6041 -13081 -6531 4301 4787 -5361 -11358
925 -11358 -4694 6245 6784 -3329 -9870 -3145 7667 7328 -3503 -10060 -3180 7177 6422 -4319
939 -4319 -10563 -3502 6822 6185 -4611 -9941 -1871 8183 7454 -2927 -7636 -2 10405 8942
953 8942 -1393 -6445 1532 10909 8945 -1587 -5865 1439 10679 8510 -1886 -6382 1613 10763
967 10763 8496 -1860 -5644 1847 11269 8793 -1907 -5563 2356 10963 7762 -2884 -7239 770
981 770 9062 5235 -5948 -9242 -622 7088 3249 -7238 -10196 -1171 7215 3713 -7008 -8840 221
996 221 8662 4361 -5551 -7961 1229 8861 4485 -6472 -8546 111 7125 2227 -8472 -10329 -1560
1011 -1560 5142 373 -10050 -11118 -1689 5405 380 -9127 -9541 -252 7036 2026 -7287 -8153 1677
1026 1677 8165 2671 -7173 -7943 1315 6744 966 -9292 -9902 -719 4814 -1678 -11449 -11616 -2315
1041 -2315 3709 -2425 -11501 -11184 -1242 4304 -2099 -10761 -9878 -159 5530 -689 -9609 -8585 1243
1056 1243 6095 -630 -9294 -8449 944 5687 -1004 -9968 -8475 1086 5328 -1858 -10577 -8458 1393
1071 1393 5426 -1415 -9995 -7370 2808 6680 -473 -8715 -5950 4058 7706 371 -7412 -4289
1085 -4289 5474 8872 1108 -6995 -3848 5845 8681 716 -6845 -4117 5585 8031 -77 -7958 -4271
1100 -4271 5219 7542 -976 -7640 -3901 5517 7955 -550 -7516 -3032 6476 8406 121 -6411 -2291
1115 -2291 6804 8187 232 -6309 -2084 6407 7620 -698 -7362 -2953 5792 6931 -1898 -8253 -3416
1130 -3416 5356 5722 -2345 -8434 -3641 5292 5808 -2554 -8426 -3057 6077 6204 -2695 -7875 -2735 5661
1146 5661 5682 -3236 -8301 -3007 5626 4919 -3937 -9336 -3724 4613 4117 -5283 -9766 -3984 4501 3518
1162 3518 -5247 -9758 -3592 4767 3634 -5407 -9534 -3073 4975 3564 -5252 -9002 -2630 5355 3852
1177 3852 -5262 -9035 -2427 5528 3503 -5308 -9331 -2292 4991 3075 -6015 -9042 -1993 5200 2972
1192 2972 -5830 -8662 -1603 5522 3180 -5264 -7894 -662 6190 3387 -5289 -7461 -341 6080 3341
1207 3341 -5083 -7340 -228 6636 3379 -5326 -7175 194 6628 3276 -5272 -6904 768 7394 3348
1222 3348 -5037 -5860 1618 8062 3879 -3967 -5133 2418 8464 4323 -3897 -4443 3289 8793 4360
1237 4360 -3821 -4622 3485 8803 4105 -3813 -4428 3792 8813 4123 -4097 -4438 3997 8927 4170 -3839
1253 -3839 -3840 4290 9076 3950 -4336 -4041 4217 8827 2925 -4693 -4256 3905 7527 2360 -5301 -4876
1269 -4876 2974 7330 1373 -5993 -5034 2787 6768 1280 -5915 -5161 3281 7031 1312 -5697 -4199
1284 -4199 3719 7636 1547 -5554 -3736 4022 7409 1068 -5940 -3769 3819 6588 530 -6388 -4145
1299 -4145 3811 6811 525 -6149 -3579 4527 6933 583 -5574 -2981 5442 7879 893 -5639 -2446
1314 -2446 5642 7581 786 -5756 -2539 4829 6727 -382 -6457 -3402 4396 5986 -1454 -6967 -3571
1329 -3571 4085 5870 -1276 -6866 -2829 5050 6296 -853 -6030 -2155 5704 6550 -405 -5857 -2163
1344 -2163 6027 6439 -1210 -6027 -1753 5734 6061 -1193 -6420 -1490 5764 6252 -793 -5337 -412 6460
1360 6460 6723 -332 -4639 50 7348 6949 -435 -4645 166 7101 6669 -829 -4884 83 6653 5995
1376 5995 -1562 -5061 15 6913 5881 -1940 -5281 -20 6786 5322 -2263 -6133 -600 6208 4508
1391 4508 -3404 -6736 -1386 5238 3485 -4230 -7161 -1616 5116 2947 -4081 -6950 -1214 5418 2972
1406 2972 -4057 -6567 -382 5378 3547 -4025 -6783 -514 5408 3273 -4526 -6702 -432 4617 2493
1421 2493 -4895 -7053 -344 5606 2390 -4501 -6056 620 5933 3390 -3689 -5040 1056 6606 3449
1436 3449 -4201 -5288 804 5817 2469 -4599 -6034 318 5258 1585 -5881 -6448 267 5091 1416
1451 1416 -5270 -5871 707 5361 1896 -5137 -5433 1368 5628 1528 -5124 -5595 1156 5462 1204 -5968
1467 -5968 -5811 813 5282 741 -5869 -5946 1418 5799 1154 -5255 -4356 2545 6375 1989 -3994 -3711
1483 -3711 3116 6557 1751 -4792 -3788 3096 5996 811 -5604 -4454 2461 5827 792 -5662 -4025
1498 -4025 2819 5777 1334 -4593 -3228 3321 6303 1059 -5138 -3311 3475 5565 172 -5985 -4604
1513 -4604 1859 4099 -1523 -7573 -6048 1122 3158 -2497 -8394 -5765 1022 3040 -2024 -7278 -4610
1528 -4610 2138 4467 -1518 -6959 -4182 2253 4269 -1928 -7480 -4747 1542 3022 -3113 -8384 -5384
1543 -5384 1527 2185 -3188 -8402 -4722 1920 3127 -3252 -7234 -3971 2866 3962 -2063 -6469 -3147
1558 -3147 3429 4013 -2367 -6399 -2908 3359 3870 -2835 -6662 -2904 3280 3313 -3270 -6743 -3002 3511
1574 3511 3340 -3027 -6354 -2282 3518 3732 -2533 -6185 -2036 4191 3560 -2596 -5916 -1546 4642 4286
1590 4286 -2166 -5393 -855 5134 4567 -1854 -4604 70 6058 4973 -1109 -3986 413 6264 4582
1605 4582 -1295 -4497 233 6135 4495 -2015 -4404 749 6137 4701 -1619 -3743 1402 7187 5469
1620 5469 -880 -2543 2392 7925 5910 -697 -2339 2529 7727 5289 -1082 -3518 1525 6294 3912
1635 3912 -2771 -4685 1104 5794 3378 -3026 -4403 899 5640 3491 -2539 -3700 2296 6498 3895
1650 3895 -2484 -3412 2264 6499 3703 -2712 -3849 1722 5489 2383 -3927 -4942 591 4684 1150
1665 1150 -4579 -5298 177 4351 1290 -4624 -4552 1037 4972 1838 -4280 -3882 1951 5730 2274 -3575
1681 -3575 -3678 2110 5678 1414 -4288 -4112 1453 4680 858 -5015 -4774 1449 4519 416 -5050 -4729
1697 -4729 1380 4617 570 -5121 -3952 2133 5046 855 -4655 -3246 2326 5511 725 -4032 -3209
1712 -3209 3074 5596 1168 -3957 -2789 3180 5620 693 -4184 -2763 3136 5397 660 -4274 -2505
1727 -2505 3435 5402 716 -3905 -1878 4080 6157 1246 -3393 -1258 4954 6660 1764 -2411 -651
1742 -651 5188 6930 2217 -2332 -230 5581 6550 1588 -2983 -683 5208 6228 879 -3204 -826
1757 -826 4687 5501 602 -3181 -694 5121 5805 920 -2804 14 5560 5729 827 -2889 33 5655
1773 5655 5851 482 -3387 -284 5172 5368 -266 -4172 -837 4164 4252 -1148 -4502 -930 4200 4036
1789 4036 -1346 -4783 -1201 4447 4231 -1560 -4560 -853 4341 3720 -1838 -4579 -1110 4313 3449 -2147
1805 -2147 -4891 -1163 4105 2978 -2649 -5358 -1735 3441 2469 -3332 -5582 -1655 3203 1957 -3132
1820 -3132 -5343 -1658 3113 2447 -3234 -5168 -1388 3507 2267 -3158 -5190 -935 3482 1811 -3560
1835 -3560 -5121 -1269 3494 1475 -4035 -5439 -844 3183 1435 -3746 -5515 -639 3488 1748 -3824
1850 -3824 -5039 -297 4042 1711 -3836 -4597 93 3983 1853 -3759 -4369 357 4030 1695 -3552
1865 -3552 -4522 451 3946 1547 -3624 -3956 743 4123 1416 -3731 -4195 670 4590 1248 -3909 -3792
1881 -3792 1308 4204 1719 -3532 -3562 1449 4973 1415 -3367 -3562 1121 4199 1468 -3610 -3489 1549
1897 1549 4404 1270 -3556 -3429 1373 4332 986 -4010 -3577 1556 4108 702 -4144 -3240 1742 4109
1913 4109 325 -4108 -3448 1393 3715 358 -4207 -3158 1763 3788 305 -4161 -3474 1669 3653
1928 3653 -114 -3995 -3272 1927 3542 -453 -4415 -3299 1969 3838 -382 -4531 -3092 1964 3677
1943 3677 -300 -4280 -2770 2183 3941 -431 -4554 -2551 2323 3988 -236 -4246 -2105 2793 3794
1958 3794 -267 -4150 -2136 2968 3933 -373 -4074 -1829 3187 4211 -395 -4013 -1502 3501 4056
1973 4056 -288 -3627 -1491 3432 4263 -314 -3867 -1074 3686 4117 -352 -3574 -746 3820 4366 -95
1989 -95 -3170 -686 4056 4229 -284 -3490 -457 4282 4150 -443 -3010 1 4354 3981 -440 -2917
2005 -2917 -109 4382 4272 -434 -3238 257 4320 3934 -696 -3179 162 4550 3918 -1021 -3228 -115
2021 -115 4195 3935 -1136 -3365 229 4287 3554 -1554 -3524 380 4161 3276 -1465 -3560 258 4119
2037 4119 3288 -1733 -3654 56 4062 2977 -1828 -3548 451 3839 2360 -1800 -4128 8 3478
2052 3478 2085 -2728 -3791 -68 3339 2241 -2390 -3964 -184 3333 2006 -3051 -3989 501 3269
2067 3269 1915 -3135 -3773 331 3741 1773 -2703 -3708 -85 3683 1555 -2776 -3655 485 4038
2082 4038 1577 -2886 -3263 584 3904 1747 -2670 -3075 1394 4426 1853 -2556 -2745 1643 4359 1848
2098 1848 -2672 -2580 1786 4230 1737 -2604 -2286 1717 4382 1987 -2348 -2382 2159 4622 1727 -2135
2114 -2135 -1896 2252 4758 1904 -2136 -2034 2698 4925 1945 -2104 -1493 2503 4845 1954 -1793 -1525
2130 -1525 2771 4593 1627 -2033 -1421 2963 4720 1598 -2226 -1388 2966 4817 1469 -2441 -1220
2145 -1220 3246 4388 1331 -2528 -1310 2957 4408 749 -2681 -1688 2690 3788 734 -3185 -1312
2160 -1312 2353 3705 492 -3027 -1768 2491 4056 249 -3203 -1865 2595 3257 -305 -3903 -2055
2175 -2055 2070 2964 -855 -3769 -2152 1992 2609 -969 -3954 -2219 1693 2323 -1523 -4075 -2159 1940
2191 1940 2667 -1192 -4053 -2104 2251 1992 -1594 -4392 -2273 1788 2011 -2158 -4489 -1842 1653 2013
2207 2013 -1804 -4395 -1836 1785 2149 -1901 -3952 -1747 2380 2345 -1548 -3924 -1411 2311 1952 -1708
2223 -1708 -3897 -1820 2256 1851 -1909 -3971 -1353 2443 2007 -1820 -3905 -782 2730 2712 -1623 -3119
2239 -3119 -151 3034 2487 -1451 -3174 -230 3464 2330 -1467 -3110 -251 3049 2404 -1646 -3322
2254 -3322 -201 3358 2425 -1695 -2719 250 3793 2348 -1148 -2649 433 3946 2548 -1408 -2657
2269 -2657 232 3701 2387 -1867 -2707 285 3371 1935 -2164 -2837 497 3275 1727 -1887 -3236
2284 -3236 311 3591 1905 -2184 -2848 545 3185 1543 -2597 -3341 365 2981 977 -2739 -3514 -210
2300 -210 2410 484 -3330 -3614 -221 2195 313 -3408 -3354 118 2505 403 -3185 -3656 -3 2495
2316 2495 166 -3491 -3664 -436 2029 -551 -3953 -4130 -444 1825 -637 -4431 -3881 -300 1746 -638
2332 -638 -4256 -3225 111 1923 -722 -3968 -3606 129 2086 -737 -4313 -3813 135 1726 -884 -4595
2348 -4595 -4029 84 1385 -1246 -4071 -3527 305 1858 -730 -3869 -3144 507 2190 -962 -3870 -2859
2364 -2859 766 2022 -880 -3689 -2884 1009 1893 -956 -3752 -2507 1210 2020 -853 -3597 -2172 1536
2380 1536 2689 -273 -2764 -1692 1826 2828 41 -2966 -1530 1984 2438 -521 -3240 -1476 1708
2395 1708 2327 -582 -3018 -1543 2263 2869 -262 -2761 -933 2370 2918 -92 -2537 -1001 2838 2783
2411 2783 -326 -2828 -801 2494 2813 -702 -2887 -1036 2649 2546 -794 -2880 -1098 2133 2440 -931
2427 -931 -2879 -765 2602 2593 -839 -3014 -727 2775 2692 -885 -2872 -729 2599 2065 -1182 -2968 -549
2444 -549 2371 1784 -1545 -3336 -692 2386 1930 -1546 -2703 -576 2583 2094 -1294 -2866 -480 2613
2460 2613 2151 -1360 -3047 -299 2778 2213 -1496 -3011 -105 2548 1722 -1525 -2586 -69 2962 1645
2476 1645 -1465 -2556 359 3206 2180 -1246 -2432 338 3163 1914 -1793 -2298 504 3201 2046
2491 2046 -1533 -2282 801 3355 1586 -1363 -2080 1023 3653 1819 -1254 -1534 1380 3686 2292 -1304
2507 -1304 -1613 1395 3501 2222 -1313 -1606 1366 3827 1618 -1480 -1610 1274 3588 2092 -1340 -1356
2523 -1356 1690 3691 2026 -1508 -1485 1445 3426 1366 -1304 -1338 1610 3116 1580 -1699 -1704 1160 3041
2540 3041 898 -2094 -1788 1359 2760 731 -1908 -1740 1465 2812 625 -2258 -1882 764 2880 359
2556 359 -2379 -2174 844 1954 266 -2789 -2188 858 2180 -215 -3226 -2302 728 1760 -331 -3035
2572 -3035 -2516 465 1549 -796 -3665 -2640 429 1427 -1024 -3624 -2755 533 1536 -1260 -3513 -2884
2588 -2884 224 1324 -1346 -3983 -2475 475 1172 -1619 -3821 -2636 618 1237 -1371 -3717 -2474
2603 -2474 544 1428 -1498 -3906 -2452 706 1307 -1443 -3545 -2166 821 1188 -1514 -3716 -2106 776
2619 776 1393 -1176 -3347 -1922 1407 1443 -1288 -3897 -1845 1363 1365 -1286 -3277 -1260 1220 1660 -1110
2636 -1110 -2871 -1392 1772 1598 -1321 -3078 -985 1612 1534 -1340 -3194 -1124 1555 1566 -1327 -2924
2652 -2924 -789 2149 1599 -1217 -2804 -724 1765 1630 -1196 -2693 -560 2058 1373 -1450 -2797 -315
2668 -315 2280 1430 -1392 -3067 -722 1637 1199 -1764 -2532 -716 1923 1185 -1793 -2970 -517 1980
2684 1980 1133 -1920 -2780 -452 1959 971 -1873 -2784 -195 2045 972 -2040 -3099 -591 1571 899
2700 899 -2233 -2985 -635 1448 423 -2161 -3149 -536 1825 276 -2499 -2937 -494 1234 331 -2416
2716 -2416 -3019 -147 1710 267 -2407 -2869 -255 1405 254 -2971 -2784 -215 1566 189 -2644 -2505
2732 -2505 76 1802 553 -2152 -2468 402 2069 580 -2369 -1878 720 2524 385 -1967 -1995 661
2748 661 2370 483 -2105 -1670 926 2520 802 -1798 -1669 1185 2652 978 -1629 -1567 1532 2716
2764 2716 795 -1544 -1227 1579 2804 679 -1466 -1397 1669 2612 869 -1370 -920 1680 2612 505
2780 505 -1386 -647 1546 2732 712 -1407 -755 1850 2861 497 -1350 -633 1824 3280 739 -1701
2796 -1701 -787 1771 2509 524 -1346 -715 1953 2868 521 -1567 -555 2054 2665 283 -1631 -567
2812 -567 2014 2459 427 -1700 -696 1868 2379 295 -1986 -654 1900 2460 -95 -1962 -1010 1536
2828 1536 2095 -360 -2292 -923 1584 1878 -267 -1976 -744 1795 1983 -544 -2124 -913 1905 1644
2844 1644 -623 -2278 -634 1804 1735 -823 -2306 -716 1853 1800 -852 -2039 -185 2320 2015 -266
2860 -266 -1675 0 2405 2505 65 -1390 238 2530 2263 -69 -1459 -23 2456 2058 -352 -1479
2876 -1479 280 2587 1922 -112 -1171 556 2736 2381 -111 -1078 1147 3385 2644 269 -819 1108
2892 1108 3343 2752 -88 -1092 792 2915 2229 -166 -1130 980 2846 2093 -250 -785 1053 3332
2908 3332 2504 192 -257 1813 3968 2846 229 -40 1989 3854 2554 220 -588 1541 3557 2409
2924 2409 -274 -857 1121 3128 2162 -349 -516 1502 3524 2302 -206 -407 1999 3707 2318 342
2940 342 -25 1900 3403 2086 -388 -829 1544 2940 1659 -848 -730 972 2681 1085 -1057 -1083
2956 -1083 1230 2525 903 -1148 -1339 1661 2810 1175 -1332 -1076 1257 2467 467 -1266 -1610 694
2972 694 2060 217 -2021 -1789 921 1959 351 -1747 -894 1193 2313 1045 -1386 -877 1534 2211
2988 2211 522 -1471 -1214 711 1821 359 -1694 -1450 1034 1645 159 -1899 -1317 1234 1869 305
3004 305 -1644 -632 1480 2287 372 -1577 -708 1721 2305 366 -1654 -1037 1168 1634 -518 -2083
3020 -2083 -1425 607 1536 -567 -1853 -1224 1149 1741 -322 -1501 -662 1253 1992 -110 -1793 -155
3036 -155 1680 1933 -124 -1872 -683 1330 1728 -756 -2494 -924 1158 991 -993 -2121 -962 1397
3052 1397 1652 -545 -1845 -803 1515 1603 -489 -1569 -433 1538 1619 -700 -1821 -670 1037 750
3068 750 -1207 -2548 -1404 808 469 -1476 -2841 -1526 710 419 -1114 -2467 -882 1178 921 -1195
3084 -1195 -2374 -955 850 94 -1654 -2869 -1591 291 100 -2498 -3317 -1701 339 208 -2523 -2907
3100 -2907 -1416 712 205 -1790 -2673 -906 934 464 -1552 -2282 -765 1046 164 -1929 -2586 -958
3116 -958 1210 194 -1792 -2642 -852 731 490 -1714 -2183 -360 1716 648 -1156 -1792 156 1649
3132 1649 924 -1002 -1700 475 1486 691 -1359 -2079 -39 1442 675 -1510 -1935 145 1787 771
3148 771 -1414 -1401 565 2372 977 -832 -811 1140 2516 1288 -404 -722 1096 2265 1351 -720 -902
3165 -902 1288 2371 1061 -498 -584 1346 2648 1397 -460 -314 1786 3156 1680 -356 -101 2209
3181 2209 3178 1652 -480 135 1667 2821 1354 -386 -634 1608 2608 1344 -774 -163 1895 2673
3197 2673 1350 -229 213 1845 2945 1287 -158 -45 1822 2604 1101 -705 -136 1585 2086 776
3213 776 -964 -473 1348 2107 467 -1033 -534 1704 2525 818 -845 -132 1722 2247 860 -535 1
3230 1 1800 2465 472 -897 -198 1526 2145 63 -1357 -616 1333 1494 -193 -1336 -503 1667 1809
3247 1809 371 -1397 -85 1819 2057 264 -1044 -163 1564 1807 387 -936 -367 1721 2104 -80
3263 -80 -1285 -146 1569 1801 -60 -1308 -175 1615 1302 -360 -1377 -152 1500 1808 -138 -1305
3279 -1305 174 2035 1621 176 -833 158 2069 1634 -127 -1020 138 1967 1615 -167 -1191 178
3295 178 1823 1371 -448 -1258 -74 1482 1040 -688 -1311 112 1331 940 -496 -1325 131 1683 1579
3312 1579 -402 -982 737 1952 1318 -390 -1453 102 1504 1146 -766 -1572 -138 1640 1069 -1174
3328 -1174 -1825 -443 1211 728 -1196 -1770 -2 1371 754 -1066 -1472 281 1543 580 -1072 -1434 334
3345 334 1341 797 -978 -1713 -281 1304 270 -1445 -1833 -231 1122 470 -1212 -1742 -49 870 489
3362 489 -1420 -1809 -197 1202 -25 -1480 -1738 -270 995 167 -1292 -1659 41 1205 -88 -1745
3378 -1745 -1685 -216 1275 358 -1381 -1275 231 1265 75 -1377 -1563 218 1212 102 -1374 -1546 319
3395 319 1025 52 -1211 -1365 475 1557 589 -1426 -856 492 1951 567 -1074 -596 753 1771 285
3412 285 -1215 -789 571 1265 23 -1340 -896 537 1176 -25 -1425 -911 775 1310 288 -1323 -1033
3429 -1033 875 1476 -51 -1626 -943 932 1352 -104 -1369 -1117 655 713 -324 -1584 -1187 265 696
3446 696 -451 -1789 -932 642 772 -213 -1609 -1123 666 1097 -395 -1671 -507 632 1046 -436 -1540
3463 -1540 -927 504 889 -655 -1868 -1382 594 495 -1042 -2133 -1326 358 246 -984 -1984 -1224 134
3480 134 195 -1170 -2180 -982 421 235 -1344 -2604 -1450 94 98 -1303 -2507 -1344 9 -165 -2057
3497 -2057 -2670 -1660 59 -302 -1860 -2449 -1604 -505 -177 -1797 -2544 -1367 213 -125 -1570 -2486 -1321
3514 -1321 152 85 -1626 -2300 -983 384 464 -1478 -2161 -704 532 240 -1078 -1769 -315 698 298
3531 298 -1006 -1685 -279 1025 658 -832 -1504 -203 943 657 -1361 -1308 -479 679 654 -1080 -1682 -564
3549 -564 944 689 -1239 -1650 -328 702 271 -983 -1614 -191 799 703 -1157 -1595 -341 483 82 -980
3567 -980 -1423 126 722 245 -1161 -1343 -6 706 504 -1067 -1158 8 1220 520 -584 -1136 359 1475
3585 1475 705 -764 -733 460 1540 693 -671 -723 514 1441 438 -627 -783 599 1172 522 -727
3602 -727 -1061 609 1610 442 -592 -727 298 1262 373 -1074 -939 278 1199 89 -983 -1168 97
3619 97 891 105 -1387 -1136 193 815 -96 -1200 -839 94 1059 308 -1182 -1143 621 1276 339 -1043 -792
3638 -792 742 1416 458 -989 -800 650 1150 363 -689 -436 1088 1286 570 -767 -399 1579 1968 621
3656 621 -425 134 1560 1821 442 -212 -9 1334 1750 477 -666 -368 1047 1346 168 -971 -129
3673 -129 934 1267 129 -904 -84 1353 1194 15 -934 -235 1109 1253 -153 -1094 -656 568 1068
3690 1068 -520 -1309 -1056 616 702 -352 -1268 -707 545 724 -527 -1125 -294 1093 931 18 -1082 -111
3708 -111 1356 1308 61 -1010 -438 938 677 -206 -1223 -466 644 559 -684 -1215 -503 807 812 -965
3726 -965 -1345 -714 957 199 -741 -1199 -246 637 338 -514 -1738 -781 202 -67 -1181 -2290 -1286 -318
3744 -318 -259 -1714 -2365 -1446 -414 -533 -1486 -2032 -883 195 -306 -1237 -1775 -777 898 -64 -906 -1473 -694
3763 -694 447 -342 -1268 -1700 -613 273 -227 -1597 -1594 -626 316 119 -893 -1259 -235 1075 353 -980
3781 -980 -1266 -16 1122 356 -977 -1149 -138 964 303 -1152 -1238 -402 758 135 -868 -906 49 851
3799 851 117 -822 -1260 -105 751 -99 -1133 -1210 121 607 74 -982 -1566 -392 491 -235 -1443 -1437 -168
3818 -168 682 -175 -1317 -857 368 1022 257 -645 -933 503 1163 587 -703 -830 279 1274 56 -1139
3836 -1139 -855 -68 721 -19 -1172 -839 513 955 150 -691 -866 730 1367 493 -697 -263 891 1048
3854 1048 223 -778 -501 571 659 -356 -1005 -1229 -27 432 -611 -1698 -1454 92 348 -500 -1274 -986
3872 -986 139 646 -256 -1073 -529 752 1076 -72 -791 -528 431 438 -306 -1224 -1143 199 416 -450 -1272 -886
3892 -886 168 499 -137 -1132 -508 872 919 184 -910 -60 726 983 53 -576 10 1247 864 169 -289
3911 -289 187 1158 1239 -261 -737 -100 1045 1013 101 -691 -28 1194 1168 -11 -786 106 894 1197 -129
3930 -129 -811 163 1428 1073 -43 -614 18 1281 940 -7 -636 361 1457 1260 280 -576 -9 1140
3948 1140 1145 -69 -662 250 1264 1301 -253 -604 50 1062 768 -242 -393 -95 1337 1039 -95 -327
3966 -327 404 1342 1045 -270 -582 267 1567 887 -323 -917 378 1094 552 -497 -875 -121 853 160
3984 160 -904 -930 29 926 399 -896 -781 141 749 310 -852 -649 551 812 487 -645 -437 63 1130
4003 1130 111 -769 -1026 59 890 -33 -610 -1012 -119 300 134 -1024 -920 382 784 356 -1147 -740
4021 -740 37 770 216 -747 -467 436 964 502 -531 -732 424 1205 434 -659 -483 456 946 220 -682
4040 -682 -857 411 997 280 -384 -453 639 913 225 -945 -447 894 1265 719 -297 -8 1008 1750
4058 1750 645 -248 -21 1218 1520 682 -198 149 696 1315 320 -249 -155 1073 1166 419 -380 -227 960
4077 960 1324 576 -196 153 1244 1272 397 -336 24 1031 1098 575 -642 -211 918 719 185 -426 -517 673
4097 673 735 -70 -872 -466 572 1119 58 -661 -243 880 1217 53 -953 -248 595 691 105 -744 -69
4116 -69 850 720 -432 -1032 -334 581 766 -328 -710 -331 656 695 -256 -902 -136 658 664 -134 -597 -493 329
4137 329 625 -182 -1215 -307 488 262 -525 -1442 -383 487 422 -561 -912 -413 367 364 -855 -1144 -361 158
4157 158 51 -760 -911 -476 132 353 -681 -1129 -650 213 288 -593 -1083 -309 624 366 -482 -882 -155 1129
4177 1129 720 -473 -284 143 891 729 -235 -781 226 1167 768 8 -609 269 966 805 -474 -494 269
4196 269 746 409 -201 -740 94 684 874 -219 -592 113 855 449 -530 -663 -120 558 267 -874 -1255
4215 -1255 -284 672 311 -845 -729 60 758 23 -694 -833 -65 638 12 -734 -642 158 374 136 -865
4234 -865 -567 206 706 204 -712 -709 -72 748 338 -392 -794 394 850 412 -201 -331 344 867 448 -325
4254 -325 -272 276 1116 133 -759 -431 518 684 -108 -459 -725 206 524 26 -916 -655 264 340 83 -1025
4274 -1025 -671 241 748 154 -859 -783 389 488 170 -797 -670 125 613 -336 -822 -743 68 475 -141 -961
4294 -961 -180 496 698 159 -173 -284 799 1077 481 -121 335 1111 1168 641 -7 359 1188 1326 436 -14
4314 -14 303 1196 1325 505 72 358 1216 1475 390 -111 470 1240 1351 649 100 323 861 1158 288 -70
4334 -70 309 1018 870 337 -457 173 1014 701 -137 -365 5 707 849 110 -652 -22 731 836 16 -492
4354 -492 50 930 969 -138 -516 216 1215 938 -107 -250 -21 920 1062 127 -346 106 1204 1075 294
4373 294 -319 451 1144 697 -220 -127 422 985 851 116 80 249 1070 937 -233 -269 475 670 815 -348
4393 -348 -919 94 635 304 -528 -790 -203 473 130 -341 -876 -159 483 37 -556 -678 16 224 95 -808
4413 -808 -841 -4 396 71 -683 -792 132 606 113 -479 -525 290 939 497 -114 -308 378 1008 665 165 55
4434 55 333 1020 606 105 -158 615 1118 805 -121 -43 553 1348 615 62 134 582 1258 496 30 -54 293
4455 293 1076 619 -543 -101 378 839 209 -477 -414 -52 671 3 -809 -541 119 593 10 -533 -295 199
4475 199 654 73 -417 -243 530 499 148 -493 -484 136 856 -21 -582 -545 -189 104 -49 -702 -659 156 411 -174
4497 -174 -555 -429 256 919 325 -573 9 500 744 -61 -530 -329 26 576 -228 -660 -788 193 206 -365
4517 -365 -919 -589 -405 169 -486 -1043 -883 274 -113 -519 -1365 -767 -440 323 -339 -1023 -881 -254 222 -719
4537 -719 -951 -847 -231 47 -475 -1054 -710 9 65 -433 -905 -390 300 461 -309 -716 -468 462 388 -157 -518
4558 -518 204 646 434 -149 -569 98 528 582 -174 -334 -11 796 558 210 -269 -28 742 730 -80 -237 34
4579 34 569 732 -278 -468 86 542 380 -250 -288 -125 536 517 -347 -661 176 531 451 -225 -615 122 791
4600 791 269 -138 -409 176 692 295 -311 -335 -2 418 220 -343 -612 91 796 384 -321 -354 248 541 374
4621 374 -371 -105 125 860 430 -279 -480 -148 641 149 -418 -569 -66 399 -107 -591 -707 -338 323 -118
4641 -118 -651 -704 -25 456 -8 -652 -884 -291 276 140 -959 -798 1 351 -72 -912 -943 -188 374 -284
4661 -284 -826 -791 -76 188 -219 -762 -732 238 192 328 -831 -1079 108 359 -54 -487 -616 330 622 -169
4681 -169 -354 -291 165 586 129 -467 -373 176 385 181 -304 -303 191 807 421 -281 -268 310 568 53 -455 -59
4703 -59 301 753 154 -337 -147 623 515 329 -205 -597 612 815 84 -251 -152 547 771 276 -417 -114
4723 -114 717 712 431 -150 -149 381 554 350 -412 -198 592 783 434 -297 -199 816 404 257 -411 -193 675
4744 675 274 169 -478 261 229 476 93 -485 -513 373 713 -180 -779 -224 528 486 -87 -451 -413 251 491
4765 491 -254 -633 -217 487 264 -152 -1005 -182 386 405 -63 -615 -249 300 92 -158 -438 -345 554 220 -190
4786 -190 -389 -527 451 305 -346 -455 -167 462 438 -516 -469 -111 214 253 -167 -579 -102 626 391 -291 -602
4807 -602 -245 572 110 -402 -529 -185 318 521 -597 -415 -26 209 374 -737 -493 -66 410 292 -165
4826 -165 -584 -102 774 238 -90 -268 8 573 156 -460 -596 307 500 387 -35 -241 404 931 532 -98
4846 -98 -101 259 982 481 -85 -146 446 521 239 -121 55 335 820 485 35 -208 315 534 390 -302 10 -58
4868 -58 35 346 -432 -506 -30 443 -1 -558 -270 3 386 115 -308 -747 71 378 119 -530 -928 -119 169
4889 169 -85 -671 -778 -141 500 110 -358 -189 61 460 32 -375 -209 500 717 -9 -305 -668 -65 154
4909 154 -61 -381 -437 431 369 -142 -836 -530 -208 473 -17 -587 -153 48 307 -178 -591 -297 370 131 -226
4930 -226 -558 -577 123 253 -59 -767 -470 115 178 -18 -851 -578 143 226 -406 -739 -510 265 405 -122 -455
4951 -455 -149 307 425 29 -562 -559 483 258 -52 -450 -401 485 456 285 -503 -155 718 380 411 -339 -223
4972 -223 511 850 139 -264 203 510 300 -49 -393 -459 414 448 -84 -522 -347 480 564 -125 -363 -83 556
4993 556 275 -4 -511 -194 208 351 -209 -746 -374 439 367 -188 -580 -502 -77 78 -681 -364 -186 341 78
5014 78 -473 -455 101 338 24 -4 -473 -122 471 343 -521 -231 -145 286 212 -212 -677 9 274 104 -136 -362
5036 -362 -18 603 36 -235 -130 222 11 240 -280 -443 261 576 194 -319 -236 -121 -12 -120 -380 -552
5056 -552 -330 257 74 -653 -654 -40 49 -116 -231 -492 12 336 32 -683 -639 212 532 -38 -379 -364 -172 395
5078 395 601 -158 -25 109 243 214 -197 -51 545 646 342 -275 64 486 517 460 61 281 345 628 314
5099 314 -152 155 284 811 340 -528 13 632 792 191 -318 -187 420 683 237 36 -341 316 679 160
5119 160 -125 -98 33 382 117 -555 -249 287 349 45 -511 -349 17 48 -241 -356 -527 273 211 47 -428
5140 -428 -476 163 117 -178 -573 -521 67 128 2 -414 -299 407 -162 108 -373 -412 180 187 18 -311 -349 319 294
5163 294 -330 -451 -205 220 198 -159 -592 -482 18 400 -520 -692 -35 -140 16 -260 -632 -771 19 144
5183 144 -419 -699 -251 -200 76 -241 -788 -382 -470 144 -408 -333 -415 200 -167 -161 -759 -472 -31 -15 -291 -584
5205 -584 -58 288 -7 -354 -275 96 321 236 -278 -678 13 190 188 62 -73 230 316 411 191 -300 117 633
5227 633 266 2 -284 -4 569 144 -118 -279 267 451 139 -9 -182 83 280 417 -175 -253 -272 143 124
5248 124 -202 -49 -73 107 191 -290 -413 8 -16 -35 -411 -441 -149 152 122 -581 -373 -80 62 -19 -43 -507 -52
5271 -52 118 188 -35 -269 99 228 496 -346 -630 129 219 -178 -238 -402 246 388 299 -473 -534 -59 379 487
5293 487 -296 -145 -15 173 -140 -277 -199 155 55 -14 -283 -483 -46 343 -139 -218 43 -107 200 -82 -673
5314 -673 -24 65 280 0 -493 5 154 483 -314 -293 -261 -82 210 -54 -405 -275 133 286 15 -301 -233
5335 -233 -66 421 119 85 -118 53 311 354 -26 -4 428 468 164 -7 -151 158 508 248 -240 168 247 483
5357 483 184 3 45 230 256 -59 -308 -242 444 527 -132 -239 19 163 237 289 -77 -246 182 321 70 -196
5379 -196 54 213 307 360 -495 57 400 366 12 -276 2 241 410 30 -731 -15 192 113 283 -355 -488
5400 -488 330 188 -60 -686 -129 336 34 -230 -384 -372 121 431 -212 -448 -174 88 114 -377 -180 -419 367
5421 367 128 -545 -552 -30 -135 106 -171 -672 -257 55 108 -496 -239 -250 196 265 -261 -27 -437 197 141 -511
5443 -511 -530 -179 435 60 -325 -227 -187 374 -63 -242 -279 -64 284 39 -54 -191 -333 309 -128 -121 -331 -351 131
5466 131 376 -81 -361 384 82 58 -107 -129 35 378 93 -151 -443 52 595 164 -152 -230 -4 294 173
5487 173 -326 -74 218 311 355 -188 -115 12 623 127 -116 -345 -16 122 267 60 95 -49 320 384 -210 -95
5509 -95 -13 216 394 -50 -197 138 145 15 -100 -190 -4 247 59 -322 -535 -243 337 -207 -297 -198 -36 83
5531 83 78 -436 -463 171 -115 136 -554 -463 -211 -125 -38 -135 -420 -148 199 -231 -594 -244 -69 121 -242 -308 -430
5554 -430 -306 54 46 -648 -323 -152 4 -156 -624 -323 -178 138 -34 -204 -507 -129 184 -312 -354 -114 -23
5575 -23 9 -18 -550 -307 99 90 -209 -479 -68 -226 160 9 -219 -347 127 257 -3 -322 -272 -35 -33 -142 -324
5598 -324 -533 208 65 -176 -333 -138 14 439 98 -441 -292 145 499 122 -45 412 633 280 143 -27
5618 -27 -131 298 485 222 -3 73 237 426 41 -211 281 158 278 -58 -234 162 239 597 239 -411 -20
5639 -20 316 275 185 81 -32 400 -6 -65 -380 130 198 54 -163 -262 -252 -31 116 -107 -535 -162 215 -156
5661 -156 -425 -287 -248 253 -338 48 -260 -124 89 257 61 -351 -179 317 208 -196 -196 -211 25 138 -403
5682 -403 -273 -56 122 -66 11 -255 -53 208 -7 33 -294 -67 239 152 -451 -198 -84 265 149 -361 -342
5703 -342 20 337 -20 -393 -242 120 -94 248 -161 6 -323 166 -110 -23 -139 213 402 134 -60 -304
5723 -304 60 257 217 -663 11 -13 -84 48 -81 -50 21 324 227 -19 -60 254 313 90 -337 -149 72 239 -49
5746 -49 -61 151 465 412 -44 -229 261 362 166 309 -187 130 188 409 163 35 125 213 191 142 -100 45 -65
5769 -65 299 326 -81 211 243 -38 -85 -199 -128 111 390 -190 -238 -86 177 372 55 -325 -176 -9 209 -72
5791 -72 -321 -99 75 23 75 -3 -9 -93 135 16 -252 -63 -31 23 -182 -158 83 26 205 -278 -417 -231 3 104
5815 104 7 -356 26 137 240 -51 -222 -250 -85 100 -213 -285 -195 -50 229 98 -422 -325 150 309 -88 -420
5837 -420 -87 -3 -23 -224 58 -221 101 501 -217 112 19 216 242 88 -57 -8 212 143 -208 -271 149 164 198
5860 198 165 -134 294 169 174 1 -47 35 233 378 209 74 104 120 243 149 -43 18 212 580 43 -228 7
5883 7 545 129 27 -72 54 10 627 -216 -178 66 217 -75 -102 9 251 268 133 140 -155 208 423 20 -292
5906 -292 -159 107 144 449 -151 -357 -37 204 351 -107 -206 -162 245 16 -54 -254 -304 -64 85 -303 112 -42
5928 -42 260 132 -309 80 -204 278 33 -141 -573 -31 328 8 -356 -128 186 -246 -48 -265 -200 199 279
5949 279 -95 -83 -142 0 37 110 -378 11 103 36 -138 -99 -111 14 21 246 -175 92 33 78 76 -135 -255 349 77
5974 77 -33 -116 -318 401 182 141 116 -29 281 -7 -161 68 -244 207 405 243 -13 -80 215 102 142 -127
5996 -127 -214 204 454 -24 -34 35 412 455 -148 -234 -130 44 304 -166 -2 262 92 250 201 -128 -112 37
6018 37 208 56 -145 9 199 388 37 -7 21 -30 65 75 340 72 204 73 8 -150 13 -30 131 133 112 -191
6042 -191 263 231 187 -150 96 393 -58 89 -274 153 172 266 -201 -411 -372 157 20 121 -54 -53 -44 133 159
6065 159 -1 187 -33 -34 49 -94 34 162 403 -236 -7 -168 133 -41 -7 -50 343 167 347 119 -57 -115
6087 -115 -130 130 -209 -213 240 312 101 -69 -353 283 311 75 51 -214 -60 374 139 220 99 -116 115 383
6109 383 48 -3 279 364 53 -285 53 99 290 231 -42 174 349 459 247 55 228 202 532 266 252 25
6131 25 331 440 41 95 103 282 123 258 -160 -92 383 371 345 125 67 91 490 133 212 65 91 414 249 -46
6155 -46 54 231 119 75 53 216 178 83 133 28 -165 27 274 -92 -202 -161 152 278 52 59 -179 -96 368
6178 368 108 -61 26 25 163 -237 41 -207 -127 -70 31 -367 -339 -111 36 124 -167 -296 -54 66 39 -73 -40
6201 -40 -132 349 140 -465 -198 -50 -105 50 -340 -398 -29 296 -156 -199 -38 145 155 -481 -239 -287 -178 419
6223 419 149 -184 -395 326 174 -62 -136 16 84 46 58 -66 25 285 564 -143 50 -167 228 160 286 -15
6245 -15 -207 215 127 -250 -82 -28 273 71 -253 -6 -48 126 170 228 -197 97 249 147 76 160 144 116 285
6268 285 62 -171 36 247 -12 -142 -246 -116 -73 248 95 -243 143 213 37 11 -145 88 301 183 -103
6289 -103 -50 298 -16 244 -21 -112 -124 164 -54 40 146 -164 333 195 1 -115 -85 8 10 -93 -368 -121 329
6312 329 146 -218 -30 -279 -310 73 -223 -178 -124 -24 16 -287 -200 -95 14 -99 -243 -127 119 -226 -158 30
6334 30 -172 -76 222 38 -386 110 91 -166 -148 -106 -140 148 -33 70 -168 -142 -123 631 -88 -162 53 249 343
6357 343 436 -4 183 87 30 75 -261 121 154 244 -28 53 113 183 48 288 89 61 67 321 98 145 188 244 -57
6382 -57 166 215 58 -104 276 -109 -247 -37 296 402 -100 -109 -129 159 28 322 -186 252 17 235 49 21
6404 21 161 -16 160 -258 -197 -110 139 250 186 18 -137 -62 28 134 38 9 3 -102 -203 121 -144 323 -41
6427 -41 -93 -284 7 85 -50 -124 -167 6 37 -7 -95 -360 -106 99 -11 -89 -260 -259 -211 -273 -228 -144 -153 56 248 -157
6453 -157 -265 101 2 45 -150 -74 4 47 192 -319 -200 -210 -68 -129 -110 -98 -75 198 -200 -82 -157 -11 25 406
6477 406 213 -87 -502 99 126 61 -72 158 110 -71 -199 -158 189 64 -26 -61 70 132 23 233 -114 83
6499 83 -49 307 225 -58 -148 -177 402 57 -426 120 535 98 163 257 113 148 109 311 9 7 -39 216 140 -240
6523 -240 -54 290 354 -131 156 74 170 52 343 349 -136 168 178 260 -54 -260 -82 348 12 6 -50 -202 -128 346
6547 346 -203 -149 -112 91 27 -125 180 165 -84 -117 79 -60 -415 103 68 -306 -138 -110 365 23 -161 -245 -182
6570 -182 -5 12 -170 -46 -201 -33 -345 -273 -279 -35 74 14 6 -55 -217 -33 351 -278 -64 -18 -153 -4 -279
6593 -279 -219 -322 166 -82 -297 -103 -124 65 -79 57 -180 137 -171 -32 73 57 18 147 -168 21 -207
6614 -207 -81 487 -179 -145 361 85 29 -386 -55 92 192 -124 71 -35 -338 47 59 -313 -164 -155 3 208
6636 208 -97 -188 -50 64 53 18 -140 133 151 3 310 123 44 29 237 -58 -176 -132 73 -110 -67 -196 -250
6659 -250 -177 56 -221 -245 101 -119 103 -260 82 -187 -91 -124 134 59 62 2 -204 -40 -260 -249 2 -33 -15 -189
6683 -189 -437 -299 114 -90 -101 -229 157 -272 -224 -249 -353 173 126 -26 -332 -221 -454 -104 -284 -51 -151
6704 -151 -309 -294 -77 -7 -136 -9 -180 -96 -232 -388 82 -124 -50 -249 34 -329 -176 -66 -220 -74 28
6725 28 -8 -108 -165 247 217 55 -5 112 -242 246 55 -311 80 -60 89 137 116 -365 -25 290 -20 -87 191
6748 191 -154 341 -132 -171 -25 93 176 108 -58 39 -11 192 118 66 -72 194 113 208 313 264 -33 52 106 33
6772 33 175 214 340 159 147 238 328 104 50 -135 83 199 -62 -111 -2 12 79 14 443 -250 -130 150 173 -32
6796 -32 79 84 -127 208 333 95 -34 6 167 203 26 225 171 -67 15 -127 -53 175 209 5 -17 -31 -6 216
6820 216 79 -191 -257 398 69 40 255 30 170 10 -32 -135 -223 -127 219 292 -175 -72 -207 202 116 -80
6842 -80 46 60 -81 -144 -155 -316 165 -280 -31 -196 -177 175 -290 -197 -411 92 -59 -84 88 -180 -335 -426 172
6865 172 -104 -326 -267 105 -267 -32 -110 -295 132 -200 -258 -303 -302 -187 -100 -77 12 -167 -439 22 -172 173 -92
6888 -92 145 98 -6 13 103 177 420 160 -265 -153 35 226 -114 -165 -106 -257 -72 -166 -165 39 478 27 -184
6911 -184 -260 31 169 -123 103 -198 192 267 -142 -124 -84 -12 140 -213 -92 211 -150 -54 7 -305 87 -67
6933 -67 19 55 -231 71 108 -73 148 26 13 -256 -41 48 -116 -151 31 216 232 17 -274 -105 -73 191 -148
6956 -148 -221 112 39 -265 -237 -86 -373 -272 -149 59 -32 -46 -46 -200 -228 11 97 -92 69 -55 -408 185 292
6979 292 -106 -194 -191 -203 197 -228 159 -6 -80 -158 -41 -185 -351 -157 -96 -89 -154 -103 131 211 -23 39 -271 115
7003 115 -5 -61 146 350 -83 149 -18 117 -249 23 309 67 -272 -267 -7 145 146 -278 -122 69 78 17 -57
7026 -57 15 24 34 346 275 -164 -220 -30 54 100 260 -19 194 -389 -243 91 99 46 226 130 -289 55 -27 207 59
7051 59 -33 -24 153 -227 24 17 107 7 -139 -26 -134 141 173 -100 37 -259 -231 -96 106 -120 -44 96 100 -128
7075 -128 -102 -106 -52 17 -158 140 -266 -109 221 -29 -357 -88 -9 -242 24 -180 -242 -289 -271 -297 -91 -189 66 -175
7099 -175 -67 -185 -235 5 -69 -246 -45 11 364 -65 -208 -67 -164 -37 99 -37 -277 -375 63 225 -142 -70
7121 -70 95 66 -140 121 -254 121 233 183 -90 -76 29 38 -307 -138 96 59 143 -37 -39 -148 -90 -50 104 -43
7145 -43 24 -52 -79 341 288 54 172 292 -86 167 -95 75 225 85 208 -238 143 -31 3 -156 -62 36 23
7168 23 5 -76 -44 170 99 212 -41 -120 -3 75 148 65 -190 -96 48 55 -118 -65 228 99 -202 56 69 223 65
7193 65 82 279 -221 418 252 7 107 -85 203 252 127 -7 -28 57 -59 -146 176 -355 208 -120 -113 172 -1
7216 -1 246 167 123 41 24 -12 -176 -63 -32 -288 -26 -89 -37 -350 -303 48 -423 -54 153 266 2 -280 -60 -315
7240 -315 -87 -94 3 374 -165 250 23 -22 -204 7 162 108 160 -62 -134 13 -29 -109 -122 -48 130 4 115 -156
7264 -156 67 108 189 -7 -6 204 -123 77 -76 -257 -72 144 -102 50 135 158 166 274 -44 45 -111 -145 -77 15
7288 15 -69 -83 -25 188 -52 206 -7 133 -10 107 -12 -72 -135 230 4 -57 -69 188 498 -43 108 46 -158
7311 -158 211 -89 144 -181 -252 164 55 120 -4 -171 -60 -88 -184 -273 -84 47 -125 101 -54 57 -42 -15
7333 -15 -75 -425 -183 -406 -120 41 -2 -56 17 -145 -149 44 -119 -184 68 -418 -277 28 -229 73 93 -372 -108
7356 -108 -54 -287 -242 -24 -68 -66 -261 -369 -336 25 27 -19 -194 39 -40 1 -26 -371 -143 118 -96 -81 -139 -239 28
7381 28 -48 -1 -143 -257 -303 -45 -28 -42 -210 -114 103 -87 -154 66 -291 75 157 -345 -195 -152 176 123 78 -218
7405 -218 -54 21 95 -332 -60 144 92 -141 -168 66 4 -82 -30 -146 -172 76 88 136 -430 -80 -185 -55 -273
7428 -273 43 -75 -68 59 368 -216 120 -247 60 139 6 9 81 173 285 105 -191 -34 63 -124 200 47 -119
7451 -119 421 -205 -108 -83 72 -192 49 50 -214 -87 212 65 291 113 -213 270 85 -25 -201 -254 -12 33
7473 33 -200 9 66 11 274 132 249 -96 -81 -239 -42 -72 -168 16 81 -35 -227 1 178 -79 126 43 86
7496 86 153 269 -31 340 196 -144 -117 98 -272 -266 437 -224 -270 -128 97 6 -15 -23 17 12 -8 365 233 21 -46
7521 -46 -111 278 -55 30 -209 42 135 146 -15 204 163 -7 15 26 -55 238 82 -38 232 32 308 -58 93
7544 93 159 -5 122 162 83 -101 -109 108 12 -315 173 156 -28 -186 76 20 227 362 -138 -50 85 9 45 231
7568 231 -391 39 380 4 52 142 126 -29 37 520 -142 -159 216 113 -228 -138 349 125 -137 -99 -214 107
7590 107 -31 150 -151 11 124 -83 7 -151 -58 -4 60 66 -153 -46 184 192 91 39 -254 51 -84 -523 -34
7613 -34 -311 -144 -125 151 -61 -104 -219 78 -72 -115 -95 167 224 -24 271 88 247 -8 -197 -117 -105 10 88
7636 88 205 -52 13 75 -98 158 -167 160 49 1 -32 -29 -259 69 17 -78 134 -23 234 416 189 29 -2
7659 -2 38 -185 -13 -65 158 91 -321 190 15 -125 159 287 -60 267 66 102 193 134 -96 280 -36 172 176
7682 176 315 298 52 385 255 41 35 -286 87 91 -85 112 83 31 19 79 82 74 202 143 179 277 -157 -198 1 -178
7708 -178 -171 -86 -167 -158 -229 -71 -175 -100 -393 19 75 -7 148 85 -55 -3 129 303 -35 203 63 -32 -60 -127 36
7733 36 -164 -16 -349 6 -5 -246 -54 -157 248 -111 5 -43 36 -148 -81 -29 262 -133 -161 -97 39 -122 -145
7756 -145 -38 -229 -33 -212 33 -403 -63 -201 73 -66 -406 95 217 290 339 72 107 -44 -10 175 -5
7777 -5 52 -277 -228 83 34 -270 196 33 69 -50 -259 -208 -251 430 -26 -5 25 -120 45 -114 17 43 86 -79
7801 -79 -180 244 225 358 -195 183 29 256 65 59 -231 -164 134 -100 157 212 -46 202 94 202 -55 119
7823 119 61 -45 64 86 64 25 263 21 138 246 215 -328 99 -166 43 174 121 93 71 -1 98 -246 -196 -166
7847 -166 -15 150 84 271 -16 27 310 129 64 88 -217 101 50 -258 276 261 -84 -202 -303 -13 167 -17
7869 -17 -107 55 -13 200 17 266 -240 79 -89 -58 -48 -65 -436 56 124 -292 -139 -85 -102 223 -95 -234 -2
7892 -2 130 5 24 -55 -217 -9 -2 75 -121 21 68 -53 -8 120 -183 -32 10 229 182 44 -46 -34 153 119 -20
7917 -20 64 35 240 -79 -69 272 1 105 -74 10 154 -17 88 123 -223 94 -47 -217 126 238 36 281
7939 281 156 338 -20 165 -14 143 90 246 -159 184 218 49 -135 -128 102 -20 -116 44 78 83 -197 -83 8
7962 8 -65 -58 -140 365 -202 -78 174 80 34 0 130 13 100 -5 -31 -151 63 136 -317 155 283 -74 136 -144
7986 -144 33 160 81 -55 261 258 -76 85 54 -49 165 211 6 -160 -2 207 92 90 139 -218 -36 42 145
8009 145 -15 -54 -188 62 -152 -81 52 -318 65 113 -13 -294 -59 -88 -136 -113 -84 -73 27 -206 224 -49 -5
8032 -5 80 346 200 -61 266 -104 14 -15 -59 -261 68 101 196 132 -220 23 -113 85 -190 80 182 194 228
8055 228 -27 -17 32 -78 -76 -5 196 24 -6 -194 138 231 -160 40 70 -273 6 -111 -147 -101 399 225 -126
8078 -126 33 -194 -73 -29 -45 151 15 119 -24 3 -68 -154 135 -34 31 148 70 30 -137 284 100 133 1
8101 1 59 -20 -150 229 194 -12 141 -285 226 119 -50 -35 -128 62 -81 20 61 214 -185 137 181 -31 159
8124 159 -75 -38 -81 55 -130 -338 144 -47 73 154 -109 28 -43 -79 -272 216 67 -19 157 51 95 -29
8146 -29 131 -4 20 -139 -82 -142 151 200 256 -65 73 -129 -5 -99 -79 -204 300 49 -11 70 67 -96 61 -146
8170 -146 -212 -10 307 -16 43 -5 133 51 228 -124 -190 283 76 85 20 110 45 52 -117 62 -140
8191a40
##END NTUPLES=NMR FID
##END=
