##TITLE=1H_SA_32.130
 CDCl3, 8 sc, 
 21.8.2019
##JCAMPDX= 6.0         $$ Bruker NMR JCAMP-DX V2.0
##DATA TYPE= NMR FID
##DATA CLASS= NTUPLES
##ORIGIN= UXNMR, Bruker Analytische Messtechnik GmbH
##OWNER= root
$$ XWIN-NMR		Version 3.5
$$ Wed Aug 21 15:09:50 2019 Russian Standard Time (UT+4h)  she@DPX200
##.OBSERVE FREQUENCY= 200.13155
##.OBSERVE NUCLEUS= ^1H
##.DELAY= (6, 6)
##.ACQUISITION MODE= SIMULTANEOUS
##.ACQUISITION SCHEME= undefined
##.AVERAGES= 8
##.DIGITISER RES= 18
##SPECTROMETER/DATA SYSTEM= spect
##.PULSE SEQUENCE= zg30
##.SOLVENT NAME= CDCl3
##.SHIFT REFERENCE= (INTERNAL, CDCl3, 0, 15.7039)
##AUDIT TRAIL= $$ (NUMBER, WHEN, WHO, WHERE, WHAT)
$$ ##TITLE= Audit trail, XWIN-NMR		Version 3.5
$$ ##JCAMPDX= 5.01
$$ ##ORIGIN= Bruker BioSpin GmbH
$$ ##OWNER= she
$$ F:/spectra/data/she/nmr/H-F/1/audita.txt
$$ ##AUDIT TRAIL=  $$ (NUMBER, WHEN, WHO, WHERE, WHAT)
(   1,<2019-08-21 15:08:26.04 +0400>,<she>,<DPX200>,
      <created by zg, POWCHK disabled, PULCHK disabled
       configuration hash MD5:
       00 E9 B6 7A A2 85 ED C7 34 08 36 98 17 FE 4E 26
       data hash MD5: 16K
       4F 56 C7 CA 4F 17 89 8F E1 3D 0A C3 B2 79 CA 4B>)
$$ ##END=
$$ 
$$ hash MD5
$$ 47 F3 3D 9C D3 5D 5A F7 6A 2C 32 45 44 4C 79 13
##$RELAX= 
##$RELAX= 
##$RELAX= 
##$RELAX= 
##$RELAX= 
##$RELAX= 
$$ Bruker specific parameters
$$ --------------------------
##$DU= <F:/spectra>
##$EXPNO= 1
##$NAME= <H-F>
##$PROCNO= 1
##$TYPE= <nmr>
##$USER= <she>
##$AMP= (0..31)
100 100 100 100 100 100 100 100 100 100 100 100 100 100 100 100 100 100 
100 100 100 100 100 100 100 100 100 100 100 100 100 100 
##$AQSEQ= 0
##$AQ_mod= 1
##$AUNM= <au_zg>
##$AUTOPOS= <>
##$BF1= 200.13
##$BF2= 200.13
##$BF3= 200.13
##$BF4= 200.13
##$BF5= 200.13
##$BF6= 200.13
##$BF7= 200.13
##$BF8= 200.13
##$BYTORDA= 1
##$CFDGTYP= 0
##$CFRGTYP= 5
##$CHEMSTR= <none>
##$CNST= (0..31)
1 1 145 1 1 1 1 1 1 1 1 1 1 1 1 1 1 1 1 1 1 1 1 1 1 1 1 1 1 1 1 1 
##$CPDPRG= <>
##$CPDPRG1= <>
##$CPDPRG2= <>
##$CPDPRG3= <>
##$CPDPRG4= <mlev>
##$CPDPRG5= <mlev>
##$CPDPRG6= <mlev>
##$CPDPRG7= <mlev>
##$CPDPRG8= <mlev>
##$CPDPRGB= <>
##$CPDPRGT= <>
##$D= (0..31)
0 1.2 0 0 0 0 0 0 0 0 0 0.03 0 0 0 0 0 0 0 0 0 0 0 0 0 0 0 0 0 0 0 0 
##$DATE= 1566385705
##$DBL= (0..7)
120 120 120 120 120 120 120 120 
##$DBP= (0..7)
150 150 150 150 150 150 150 150 
##$DBP07= 0
##$DBPNAM0= <>
##$DBPNAM1= <>
##$DBPNAM2= <>
##$DBPNAM3= <>
##$DBPNAM4= <>
##$DBPNAM5= <>
##$DBPNAM6= <>
##$DBPNAM7= <>
##$DBPOAL= (0..7)
0.5 0.5 0.5 0.5 0.5 0.5 0.5 0.5 
##$DBPOFFS= (0..7)
0 0 0 0 0 0 0 0 
##$DE= 6
##$DECBNUC= <off>
##$DECIM= 24
##$DECNUC= <off>
##$DECSTAT= 4
##$DIGMOD= 1
##$DIGTYP= 9
##$DL= (0..7)
0 120 120 120 120 120 120 120 
##$DP= (0..7)
150 150 150 150 150 150 150 150 
##$DP07= 0
##$DPNAME0= <>
##$DPNAME1= <>
##$DPNAME2= <>
##$DPNAME3= <>
##$DPNAME4= <>
##$DPNAME5= <>
##$DPNAME6= <>
##$DPNAME7= <>
##$DPOAL= (0..7)
0.5 0.5 0.5 0.5 0.5 0.5 0.5 0.5 
##$DPOFFS= (0..7)
0 0 0 0 0 0 0 0 
##$DQDMODE= 0
##$DR= 18
##$DS= 0
##$DSLIST= <SSSSSSSSSSSSSSS>
##$DSPFIRM= 0
$$ [...]
##$SUBNAM2= <"">
##$SUBNAM3= <"">
##$SUBNAM4= <"">
##$SUBNAM5= <"">
##$SUBNAM6= <"">
##$SUBNAM7= <"">
##$SUBNAM8= <"">
##$SUBNAM9= <"">
##$SW= 24.9336996594482
##$SWIBOX= (0..15)
0 0 2 0 0 0 0 0 0 0 0 0 0 0 0 0 
##$SW_h= 4990.01996007984
##$TD= 16384
##$TD0= 1
##$TE= 0
##$TE2= 300
##$TE3= 300
##$TEG= 300
##$TL= (0..7)
0 120 120 120 120 120 120 120 
##$TP= (0..7)
150 150 150 150 150 150 150 150 
##$TP07= 0
##$TPNAME0= <>
##$TPNAME1= <>
##$TPNAME2= <>
##$TPNAME3= <>
##$TPNAME4= <>
##$TPNAME5= <>
##$TPNAME6= <>
##$TPNAME7= <>
##$TPOAL= (0..7)
0.5 0.5 0.5 0.5 0.5 0.5 0.5 0.5 
##$TPOFFS= (0..7)
0 0 0 0 0 0 0 0 
##$TUNHIN= 0
##$TUNHOUT= 0
##$TUNXOUT= 0
##$USERA1= <user>
##$USERA2= <user>
##$USERA3= <user>
##$USERA4= <user>
##$USERA5= <user>
##$V9= 5
##$VALIST= <valist>
##$VCLIST= <CCCCCCCCCCCCCCC>
##$VD= 0
##$VDLIST= <DDDDDDDDDDDDDDD>
##$VPLIST= <PPPPPPPPPPPPPPP>
##$VTLIST= <TTTTTTTTTTTTTTT>
##$WBST= 1024
##$WBSW= 4
##$XGAIN= (0..3)
0 0 0 0 
##$XL= 0
##$YL= 0
##$YMAX_a= 142548
##$YMIN_a= -133871
##$ZGOPTNS= <>
##$ZL1= 120
##$ZL2= 120
##$ZL3= 120
##$ZL4= 120
##$ABSF1= 10
##$ABSF2= 0
##$ABSG= 5
##$ABSL= 3
##$ALPHA= 0
##$AQORDER= 0
##$ASSFAC= 0
##$ASSFACI= 0
##$ASSFACX= 0
##$ASSWID= 0
##$AUNMP= <proc_1d>
##$AZFE= 0.1
##$AZFW= 0.1
##$BCFW= 1
##$BC_mod= 2
##$BYTORDP= 1
##$COROFFS= 0
##$CY= 11.3945322036743
##$DATMOD= 1
##$DC= 2
##$DFILT= <>
##$DTYPP= 0
##$F1P= 20.1720416913024
##$F2P= 0.152960286110954
##$FCOR= 0.5
##$FTSIZE= 0
##$FT_mod= 4
##$GAMMA= 1
##$GB= 0.15
##$INTBC= 1
##$INTSCL= 1
##$ISEN= 128
##$LB= 0.24
##$LEV0= 0
##$LPBIN= 0
##$MAXI= 10000
##$MC2= 0
##$MEAN= 0
##$ME_mod= 0
##$MI= 1.114404
##$NCOEF= 0
##$NC_proc= 0
##$NLEV= 6
##$NOISF1= 3.799351
##$NOISF2= 2.8
##$NSP= 1
##$NTH_PI= 0
##$NZP= 0
##$OFFSET= 15.70392
##$PC= 1
##$PHC0= -9215.79
##$PHC1= 19.00096
##$PH_mod= 1
##$PKNL= yes
##$PPARMOD= 0
##$PSCAL= 0
##$PSIGN= 0
##$REVERSE= no
##$SF= 200.130013532006
##$SI= 16384
##$SIGF1= 3
##$SIGF2= 2
##$SINO= 400
##$SIOLD= 16384
##$SREGLST= <1H.CDCl3>
##$SSB= 0
##$STSI= 0
##$STSR= 0
##$SW_p= 3612.71676300578
##$SYMM= 0
##$S_DEV= 0
##$TDeff= 0
##$TDoff= 0
##$TI= <>
##$TILT= no
##$TM1= 0
##$TM2= 0
##$TOPLEV= 0
##$USERP1= <user>
##$USERP2= <user>
##$USERP3= <user>
##$USERP4= <user>
##$USERP5= <user>
##$WDW= 1
##$XDIM= 8192
##$YMAX_p= 0
##$YMIN_p= 0
$$ End of Bruker specific parameters
$$ ---------------------------------
##NTUPLES= NMR FID
##VAR_NAME=  TIME,          FID/REAL,        FID/IMAG
##SYMBOL=    X,             R,               I
##VAR_TYPE=  INDEPENDENT,   DEPENDENT,       DEPENDENT
##VAR_FORM=  AFFN,          ASDF,            ASDF
##VAR_DIM=   8192,          8192,            8192
##UNITS=     SECONDS,       ARBITRARY UNITS, ARBITRARY UNITS
##FACTOR=    0.0002004,     1,               1
##FIRST=     0,             0,               0
##LAST=      1.6414764,     0,               0
##MIN=       0,             -133871,         0
##MAX=       1.6414764,     142548,          0
$$ Real data points
##PAGE= N=1
##DATA TABLE= (X++(R..R)), XYDATA
0@%%%%%%%jRj6J6j7K5l2M0m8N6o6P6r1J07j26J49j72J98k30K62k95L36l83M30
31B27m82N41o06O77p56Q43r37J039j152J277j414J566j734J921k130K364k633
48a389K938l287L699m189M784n525O476p753R568j2371J7336k8813J05697N5377
62A42548r2522M8666L4233j6774p6508j8720K7714L1477l3397m3687m212M2267
74D1085J9150k0592l8006R38L7214K4026m2281n3184Q253M7588p178o4068m0953
87h8008L1424M1493k3499o4755o725N8464K9685m2216l5817K6632M9939O949l6005
100e2439k3171K5328M0121m309m2148j7755K9590L3465r378m1796j2753M4423
112c0822M0505k5660m6421J4192N8995J7619m3657l3824L2352N3482p643n5765
$$ plain form
0 0 0 0 0 0 0 0 0 -1 8 -8 8 -9 16 -16 24 -24 32 -34 42 -49 58 -68 81 -91 107 -123 139 -156 180 -203 227
31 227 -255 286 -320 357 -399 444 -493 546 -606 671 -743 823 -911 1010 -1120 1244 -1389
48 -1389 1549 -1738 1961 -2228 2556 -2969 3507 -4246 5322 -7049 10287 -18526 87171 142548
62 142548 50026 98692 132925 116151 39643 20923 48637 80114 46717 3030 -1182 41085
74 41085 60235 39643 1637 2575 39789 63815 21534 -31650 -23397 24191 17013 -47055 -88008
87 -88008 -56584 -15091 -38590 -103345 -110070 -51606 -21921 -64137 -99954 -73322 -23383 -16434 -52439
100 -52439 -75610 -50282 -10161 -14470 -56618 -74373 -44783 -11318 -20696 -62492 -75245 -30822
112 -30822 9683 -15977 -62398 -48206 10789 28408 -15249 -49073 -16721 36761 29118 -26647
124b6647j2365M9193L0980k9862l7794Q104L8091J7245k5341l3481P541L9145
136B4809J0609l7571l4243J4586M1609J016n1192k9789M0658M5493k5346n3004
148e2365N739N4736K1039l8193l5517K2348M5912j006m6038k1887K6926K6646
160H340j3815l7200j5446K5633L2091j2474l9885j978M6929L0912k5531l4818
172c7242J6217N2121J3811m5185l0885L3353M1192j9669n0672q077L6847K2215
184B4026k6053l6151O783M3220J6556k7005k2324K0132L8513R310k8247k5073
196f313K0797L8919n307m8531j9258L5410K9539k6058m6794J399M7473J9333l8722
209A887l1869K9455M5294l715l6761j0944K9687K9463j2168l6433r338L0083K1089
$$ plain form
124 -26647 -39012 10181 41161 11299 -26495 -18391 19700 36945 11604 -21877 -14336 24809
136 24809 35418 -2153 -36396 -21810 19799 20815 -30377 -60166 -19508 25985 639 -52365
148 -52365 -46626 8110 29149 -9044 -44561 -22213 23699 22693 -23345 -45232 -18306 8340
160 8340 -5475 -42675 -58121 -32488 -397 -12871 -52756 -54734 -7805 23107 -2424 -37242
172 -37242 -21025 31096 44907 -278 -31163 2190 43382 23713 -26959 -35036 1811 24026
184 24026 -2027 -38178 -31395 11825 28381 1376 -20948 -816 37697 47007 18760 -6313
196 -6313 14484 53403 48096 -435 -19693 15717 45256 19198 -27596 -26197 21276 40609 1887
209 1887 -29982 -527 44767 41052 4291 -6653 23034 52497 40329 3896 -5442 24641 45730
222D5730k1602l5361k170L4024K0517k7799l7355J5136M8521N219m4381k0748
234b0269L5497L5723j6541m3465m940L9041K0124l1541l4809J2025L3518M824
246B9187k8017k3362J3252L2981L726l4354k0956K4880L1644j0252l8629j2054
258c1954L3033K6995k4603m1869O784M3901R494l7807k5236K4184L5578m558l6999
271b3057j3609L0551K6237j7877l3137j174K7811J6758j8490l0784K481L5648
283A358J5058k9883k7469J8909L8887J546l6742j8174L1283L4914j8115m1937
295c0365N12L9572J4484k9881k7620J2781L2603N505k8776j9923K0525L0453k682
308A7188k8481j2267K2943K8646q566l6355q153L5436K2406k8059l3638J0657
$$ plain form
222 45730 24128 -11233 -13403 20621 41138 13339 -24016 -8880 39641 44860 479 -20269
234 -20269 15228 50951 34410 -9055 -13995 25046 45170 13629 -21180 -9155 24363 29187
246 29187 1170 -22192 -8940 24041 27767 -6587 -27543 -2663 28981 18729 -19900 -31954
258 -31954 1079 28074 3471 -38398 -31614 12287 21781 -16026 -41262 -17078 18500 13942 -23057
271 -23057 -36666 -6115 20122 2245 -30892 -32066 -4255 12503 -5987 -36771 -34290 1358
283 1358 16416 -13467 -40936 -22027 16860 18406 -18336 -36510 -5227 29687 11572 -30365
295 -30365 -29853 9719 24203 -5678 -33298 -20517 12086 17591 -11185 -31108 -10583 19870 17188
308 17188 -11293 -23560 -617 28029 19463 -16892 -25045 10391 32797 4738 -28900 -18243
320a8243L6630O735l3890k3170K3883L4068q874l5701n611K9581J9674j5679k7570
333a8167j515K8273J6318k2557k7545Q516L0804O997k6786k2695J6526L3575q14
346B0930l6522j3650L2082K6510j9017l2874L040L3083J4567k6524k7256J5108
358a0523L3379j8k9467j3065J9889K4517l817k7137j1057K4587K4875j3779l1219
371a2835q46L0329J6329k2625k9981R308L6112N094l5345j8971K5893K7818j1735
384A8545l1037n291K6485J9152j8419k8409L875K7582Q373k2295k2009P042K6368
397I962O550k7721k2023J9113K8924p535l2385q570K6836K1995j7622l0717L435
410b9758L3453R753k7864k0414J5827K6109n44k5782j3755J9741K4545p392k7825
$$ plain form
320 -18243 18387 25122 -8768 -31938 -8055 26013 17139 -18562 -24173 5408 25082 9403 -18167
333 -18167 -19682 8591 24909 2352 -25193 -16677 14127 21124 -5662 -28357 -11831 21744 20930
346 20930 -15592 -29242 2840 29350 10333 -22541 -19501 13582 28149 1625 -25631 -10523
358 -10523 22856 22838 -6629 -19694 195 24712 20895 -6242 -17299 7288 32163 18384 -12835
371 -12835 -13681 16648 32977 10352 -19629 -10321 25791 30885 -4460 -23431 2462 30280 18545
384 18545 -12492 -17783 8702 27854 9435 -18974 -15099 12483 20856 -1439 -23448 -16406 9962
397 9962 16512 -11209 -33232 -14119 14805 7270 -25115 -33685 -6849 15146 -2476 -33193 -29758
410 -29758 3695 13448 -14416 -34830 -19003 7106 6562 -19220 -32975 -13234 11311 3919 -23906
423b3906l899K4435J8404j2568k4766P79K9479J5464k3107k4034J4907L1667O36
436B3491k8470j3721K2131K6814r927l0660k385K9166J5396k0033k2064O750K5296
449B1784Q446k0598k0000J1843K6684O05k6074j3701J7991K3159o623k9419q472
462a4375K7026J9692k0857k8576P436K9306N640k4890j8678J5080K5740l000k7260
475g716r282K0804J8232j0358k2954m146K1373J5960j5218k5216M000K6797Q058
488B0334k3021j9153J3896K6028m8k7722j1652K3751K1652j3548k5749J029K3971
501I768J1313j7511k1634O052K4587M361k3363j4866J3175K1479k287k2815j0791
514b2532J8521K1759r365k6504j822K5686J3472j8540k2873O340K6484N111k6241
$$ plain form
423 -23906 -27805 -3370 15034 2466 -22300 -21521 7958 23422 315 -23719 -8812 22855 23491
436 23491 -4979 -18700 3431 30245 20318 -10342 -12727 16439 31835 11802 -10262 -3512 21784
449 21784 30230 9632 -10368 1475 28159 28764 2690 -11011 6980 30139 23516 -5903 -14375
462 -14375 12651 32343 11486 -17090 -9654 19652 25292 402 -18276 -3196 22544 19544 -7716
475 -7716 -16998 3806 22038 11680 -11274 -15420 5953 21913 6695 -18521 -14521 12276 20334
488 20334 -2687 -21840 -7944 18084 18036 -9686 -21338 2413 24065 10517 -15232 -14203 9768
501 9768 21081 3570 -18064 -12012 12575 16936 -6427 -21293 -8118 13361 11074 -11741 -22532
514 -22532 -4011 17748 8383 -18121 -19943 5743 19215 675 -22198 -15858 10626 15737 -10504
527a0504j7143J7611K2706p245k4159n438J9813J7098r226k1963M44K3978J2510
540A8482j6092j8790O741K2870O999k1832j8561J3283K4835m795k7725p733K1888
553d30J6981j2888k2743K323K4651J1138j8743j7703J0587K1669J156j9996j3191
566a7189J1021J9102m124k4891r424J7736J5874j2714k2682j44K2259J1850j7513
579a0839k0122J0382K5488J623k2565j0897J6278J8846n555k2884n822J9923J4684
592H540j3595j9923L569K1113Q819j3928j5869Q768K3955N443j9673j1016J7187
605C390K1398l588k1415m986K1271J8142j3177k2017M578K4887O879j8590j4061
618B711J0345K0663J093k0249j0628J4985J8190p143j9949m837J6718J4126j0579
$$ plain form
527 -10504 -27647 -10036 12670 5425 -18734 -24172 -4359 12739 3513 -18450 -18006 5972 18482
540 18482 2390 -16400 -9659 13211 20210 -1622 -20183 -6900 17935 13140 -14585 -22318 -430
553 -430 16551 3663 -19080 -16757 7894 19032 289 -17414 -6827 14842 15998 -3998 -17189
566 -17189 -6168 12934 8810 -16081 -25505 -7769 8105 -4609 -27291 -27435 -5176 6674 -10839
579 -10839 -30961 -20579 4909 6532 -16033 -26930 -10652 8194 2639 -20245 -26067 -6144 8540
592 8540 -5055 -24978 -21409 -296 8523 -5405 -21274 -12506 11449 16892 -2781 -13797 3390
605 3390 24788 21200 -215 -5201 16070 34212 21035 -982 3596 28483 35362 16772 2711
618 2711 13056 33719 34812 14563 3935 18920 37110 29967 10018 5181 21899 36025 25446
631B5446k1315j91K2696Q138j9900j8141R665J9101j870k3009j2890J4022J5712
644A7464j0947k3404l392J7124R136j3344j6992J974J9550P878j6385j5156J0006
657a6488J9680o27j9664j1058J1958J6624p552k3570n020J9301J1428j4808j7230
670c7026N528K1758Q149j4975j1865J3854K1982j41j7670n527J5634J4259o582
683G378j8880m495J6889J1458j3445j8508M894J9995P287j4503j2750J2114K3030
696B0464J555j9378o515J8764J5279r257j9269j976J6476Q407j5297j8424M135
709e036J7571K284j5830j1478R085J8172J452j7500q622J6412J6154q475j9711
722e522k243J7184Q993j4320j8995L743J8574J731j7913j1297J1414J6121k213
$$ plain form
631 25446 4131 3940 26636 34774 14874 -3267 6398 25499 23629 620 -12270 1752 17464
644 17464 6517 -16887 -20279 -3155 5981 -7363 -24355 -22381 -2831 5047 -11338 -26494 -16488
657 -16488 3192 2565 -17099 -28157 -16199 425 -7127 -30697 -35717 -16416 -4988 -19796 -37026
670 -37026 -31498 -9740 -1591 -16566 -28431 -14577 7405 7264 -10406 -15933 -299 13960 7378
683 7378 -11502 -15997 892 12350 -1095 -19603 -14709 5286 12573 -1930 -14680 -2566 20464
696 20464 22019 2641 -3874 14890 30169 20912 1643 -333 16143 24550 9253 -9171 -5036
709 -5036 12535 14819 -1011 -12489 -3404 14768 16220 -1280 -9902 6510 22664 14189 -5522
722 -5522 -7765 9419 18412 4092 -14903 -11160 7414 9145 -8768 -20065 -8651 7470 5257
735E257j6455o536J4821J4460p654j7864l12J6599Q166j2147j5416L795J7818
748D532M842j6000j2824J2529J8074k806j7409n289J5073J3722q484j8779K41
761a2578J8289O589j4180j3470O361J6430L232j4266j0245J1276J7398j543j6733
774c440m938J4563J2480p839j8484k140J6869P498j5246j6236O544J7081J354
787H066j5658q858J2817J6578k678j6085k556J5037J0839q535j4868j280J4039
800F858O807j3589j5620M337J6135J747j5856r142J1990J6194j451j6101k789
813a0480J6434J2432r404j5051K272J4690N308j3839j3742N156J4902L06j5982
826f998q239J0783J4068k315j4357l418J4682J2595p783j5944J810J6105N220
$$ plain form
735 5257 -11198 -17734 -2913 11547 3893 -13971 -14283 2316 10482 -1665 -17081 -13286 4532
748 4532 9374 -6626 -19450 -6921 11153 8347 -9062 -14351 722 14444 5960 -12819 -12578
761 -12578 5711 12300 -1880 -15350 -8989 7441 10673 -3593 -13838 -2562 14836 13293 -3440
774 -3440 -8378 6185 18665 10826 -7658 -9798 7071 14569 -677 -16913 -10369 6712 8066
787 8066 -7592 -16450 -3633 12945 10267 -5818 -8374 6663 17502 8967 -5901 -7181 6858
800 6858 13665 76 -15544 -11207 4928 6675 -9181 -18323 -6333 9861 8410 -7691 -10480
813 -10480 5954 18386 8982 -6069 -3797 10893 16201 2362 -11380 -6224 8678 8984 -6998
826 -6998 -15237 -4454 9614 7299 -7058 -10476 4206 16801 9018 -6926 -5116 10989 16209
839A6209j3994j3808O013J4866q8j7073q842J2562J3269n174j4880j373J4465
852B152J0182q470j3683K084J5124N040j3348j2125N869J3840R72j5437r131J1655
866e276J4460m700j5440r66J5158R841q689j2878K798J5107M656j4101j0725P221
880c534J3101j267j3764o916J0142J2728l607j4645j871J5063R225q850j2584
893f779K656J4284M715j3317j1965O881J3832j871j5771o517J1037J0930m819
906C296j4036j219J4451Q587q834j2314M518J3674L639j1996j0443O705J3073
919I101j137j4996o660J1470J1244n379j3531j509J4729R138r450j2657N197J5111
933A0671K430j2871q069P743J1959j499j3759n754J1180J0304o191j2499r96J2425
$$ plain form
839 16209 2215 -11593 -5580 9286 9198 -7875 -16717 -4155 9114 3940 -10940 -12313 2152
852 2152 12334 3864 -9819 -7735 7389 12429 -919 -13044 -7175 6665 7637 -7800 -16931 -5276
866 -5276 9184 4484 -10956 -11922 3236 13077 4388 -8490 -5692 9415 14071 -30 -10755 -3534
880 -3534 9567 8300 -5464 -12380 -2238 10490 6883 -7762 -9633 5430 14655 5805 -6779
893 -6779 -4123 10161 14876 1559 -10406 -3525 10307 8436 -7335 -13852 -2815 8115 3296
906 3296 -10740 -11959 2492 11079 2245 -10069 -5551 8123 11762 -234 -10677 -3972 9101
919 9101 7964 -7032 -13692 -2222 9022 3643 -9888 -11397 3332 12470 3020 -9637 -4440 10671
933 10671 13101 230 -7839 -96 11863 10364 -3395 -9149 2031 12335 6144 -6355 -7351 5074
947E074P840q924j2108L066J4335K754j3485r580P868J2097k207j4080n688J0975
961b063J0056o752j3522N00J2464N737r255j0186K901J2534K775j2634r201P835
975h811J1440k508j3198m463J0614J0303n615j2742M10J4501O990r570r556N157
989g048J3167K727j1855q300Q757J1875l133j2995l191J0854Q710n224j1325J37
1003f844J3314P596q786j0040N689J3250K478j1342p844Q026J1778l128j4178
1016c1m272J1456P368p581j1606M29J1651N456r063j0267M916J2555J390j1038
1030A363o686O995J0427k062j2930m804J0178P982p490j2370P06J1131M990r950
1044b520j0157N038J2555P08j1552n485Q481J0290k997j1102l069J0552Q338p027
$$ plain form
947 5074 12914 3990 -8118 -5052 9283 12037 -1448 -11028 -3160 8937 6730 -7350 -13038 -2063
961 -2063 7993 1241 -12281 -11781 683 6420 -2835 -13021 -10120 2414 5189 -7445 -16646 -8811
975 -8811 2629 121 -13077 -17540 -6926 3377 -2238 -14980 -14570 -69 6921 -2649 -12205 -7048
989 -7048 6119 8846 -3009 -11309 -2552 9323 6190 -6805 -9996 858 9568 4344 -6981 -6844
1003 -6844 6470 14066 5280 -4760 929 14179 16657 5315 -2529 5497 17275 14147 -31
1016 -31 -4303 7153 14521 6940 -4666 -4237 7414 12870 3807 -6460 -1544 11011 12401 1363
1030 1363 -5323 1672 12099 10037 -2893 -7697 2481 10463 2973 -9397 -8691 2440 7430 -2520
1044 -2520 -12677 -7639 4916 5624 -5928 -11413 -2932 7358 4361 -6741 -9810 742 9080 2053
1058B053j1644J353J1504M010r157q873L804J2033J607j1934o528R157J0264l081
1072D568j1626k053J0876P991o329j1607J957J2418L901j0318q306N342J0213
1085G027K67j1152o338Q473R743l575j1721j986J0509P439o376j0505J562J2210
1099E577M496j0319q568O287J0830o08j0703n686Q039R458m499j1380j612R947
1113A259O188o587r410J777J0640M109q720q696N994J0764k97j0571m728P912
1127c66Q627l864j1423j978J0502N920p802r650K948J0212K728q982p150N531
1141d747J0752n19j0850m425R369Q421m499r968j329R787O650p856r698K839J0871
1156D798K540r351p407O079J0452j48j1072l961R161Q555m736r566K7R529N879
$$ plain form
1058 2053 -9591 -8238 3266 7276 -1881 -10754 -6950 5083 6690 -5244 -11772 -2615 7649 4568
1072 4568 -7058 -9111 1765 9756 3427 -8180 -6223 6195 10096 -222 -8528 -3186 7027
1085 7027 7294 -3858 -10196 -1723 8020 4445 -7276 -9262 1247 8686 2310 -8195 -6633 5577
1099 5577 10073 -246 -8814 -2527 8303 7695 -3008 -8694 -655 8803 4304 -7076 -8688 1259
1113 1259 7447 860 -8550 -6773 3867 7976 -744 -9440 -3446 7318 7021 -3550 -8278 -366
1127 -366 8261 4397 -7026 -9004 1498 7418 -384 -10034 -7086 3126 5854 -3128 -10278 -4747
1141 -4747 6005 5486 -5364 -9789 -420 8001 3502 -6466 -7795 1992 8642 786 -8912 -6073 4798
1156 4798 7338 -2013 -9420 -3341 7111 6963 -4109 -8070 1091 9646 4910 -4656 -4629 4900 10779
1171A0779p360q998L134J0408K022r485o430N903R338r35j0088m431Q720Q299
1185A0876m538j0770R3J0588M434p648q300L097J0104J743r986o299N794Q953
1199H141j925r783l886Q116P272m478j0088o07R837M538p298q109K888R719J954
1214F291r589o708O727Q949k742j0224k629Q530O586n065r599K5J0049M354p925
1229b970p476L744R534Q60q318n774O019R235j976j0342k393Q636O918m980r290
1244h573P00R611M722q088p757M592J0085N37q600m956O685Q636j540r859k105
1259e910Q902O501n719q821J139R274M110p465p195L514J0185J010r531m733O814
1274B075Q291k184r373k188Q168O281n870q786J191Q864K827p368p151L335Q236
$$ plain form
1171 10779 3419 -5579 -2445 7963 9985 500 -5930 -27 9311 8376 -1712 -6143 2577 10876
1185 10876 6338 -4432 -4339 6249 10683 3035 -5265 -2168 7936 9679 -307 -6606 -812 8141
1199 8141 6216 -3567 -7453 663 7935 3457 -6631 -7238 2599 7137 -161 -8270 -5382 4337 6291
1214 6291 -3298 -10006 -3279 5670 2928 -7296 -9925 -1395 5191 126 -9473 -9448 601 4955 -2970
1229 -2970 -10446 -6702 2832 3692 -4626 -10400 -4381 4854 2878 -7464 -9857 -1221 5697 717 -8573
1244 -8573 -7873 1738 6460 -1628 -9385 -4793 5292 5829 -2771 -7727 -1042 7594 6054 -3805 -5910
1259 -5910 2992 9493 3774 -5047 -3908 5366 9476 2011 -5184 -1670 8515 9525 -6 -4739 2075
1274 2075 10366 8182 -1191 -3379 4789 11070 5200 -3586 -2395 6469 9296 1928 -5223 -1888 6348
1289F348Q82r144m792O366P994l306q823j937Q478N620n340q818J037R479K347
1304F391q075o680M086Q348k68q817m559P423P667l390q921p46Q569N236n199
1319A065q157J709R572L052p933o364M676Q318n51q557m319O873P690l302r165
1334e393p44R130M798n725p545K115Q209K865p682o574N012P892r56q927l355
1349f880O238O395l091r000j178Q333N143o321p840K396Q383K374p973n915M412
1364d524Q263j184q437l245O623O490l351q124p46Q260M996o153o835K631Q558
1379C222J558p166n182M360P998n44q362l007P423O232l755p759M80P812N002
1394H312n610p682L237Q639J243p838n079N040P265j460p942l291P212N865m282
$$ plain form
1289 6348 7230 -1914 -6706 -340 7654 4348 -4475 -6412 2066 7686 2346 -6472 -5435 4044 6391
1304 6391 -1684 -8364 -4278 4070 3802 -5015 -9574 -2151 5516 2126 -6795 -7541 1028 6264 1065
1319 1065 -7092 -5383 4189 7241 -692 -7056 -2380 5938 5387 -3170 -7489 -616 7074 3772 -5393
1334 -5393 -6137 2993 7791 2066 -5479 -3364 4845 7710 28 -6546 -1534 6358 5402 -3525 -6880
1349 -6880 -642 5753 2662 -6338 -7516 817 5960 -361 -8201 -5805 2578 4952 -3021 -8936 -4524
1364 -4524 3739 2555 -5882 -9127 -2504 3986 635 -7489 -8235 25 5021 -1132 -7967 -5336 3222
1379 3222 4780 -2386 -7568 -3208 4790 4246 -4116 -7123 300 6532 2777 -4982 -4502 3310 8312
1394 8312 2702 -4980 -1743 6896 8139 301 -4778 262 7527 6067 -1875 -5166 2046 7911 3629
1409C629p789L44P721M132n507p188K439Q972J074q600m408N109O703j915q196
1424c480k677O622N692m383p690O81P833L411n732o386K917P943J382p306n024
1439f197N523P209k436p854k462O520N607m211p261L77Q341K937o241n617L619
1454b146P621M36p066m538M926P000k122q477j609O913M891m684p193N06P955
1469B413L607o317n853L362P745J86o911m317M922O755k114q059j701P090M989
1484E797n318o521J524P459L211o296n345L957P696L13p103l553N516O167k524
1499D980p434k013O723M988n025p292J438P487K594n953n447L930P271np155l420
1515d333N816N237k651p187k032O162M051m860p386R53P373J694o224n289L898
$$ plain form
1409 3629 -4160 -3816 3905 8037 2530 -4658 -2219 6753 7827 -773 -5181 -72 6631 4716 -3480
1424 -3480 -6157 465 6157 1774 -5916 -5235 2598 6009 277 -6109 -3192 4751 6133 -1173 -6197
1439 -6197 -674 6535 4099 -3755 -6217 303 5910 1699 -5562 -5185 3156 6093 -148 -5765 -2146
1454 -2146 5475 5911 -1155 -5693 -767 6233 4111 -4366 -5975 938 5829 1145 -6048 -5542 2413
1469 2413 6020 -297 -6150 -2788 4957 5143 -1768 -6085 -1163 5592 3478 -4581 -6282 808 5797
1484 5797 479 -6042 -4518 2941 6152 -144 -5489 -1532 6164 6477 -626 -4179 1337 7504 4980
1499 4980 -2454 -4467 2256 7244 2219 -5073 -3635 3852 6446 493 -4954 -1024 6247 6242 -913 -4333
1515 -4333 1483 6720 4069 -3118 -5150 1012 5063 203 -7183 -6230 1143 2837 -3387 -8676 -4778
1530d778P037j83p221l264N979O040l241p364p17O285M210n211o417J127P672
1545d6J657o346m689M527O635j40o631k938O385N924k423p075J36O889M011n076
1561H00n622J686P727J915o127m795M450O699n42o592k529O050N274k914p173
1576a693m52P378L268n011n528J876O745J573n981m630L940O385j314o663k656
1591b763N555M694l318p055n47O505K919n237o013K690O369J070o223m249M122
1606a481O437o68p109k360N775M727l594o766l4N920K978n283o147K640O889M57
1622B381n925l556M716N971j049o197k196O270M910l412o618Q73N913K618n378
1637f79n468J880O836O93o215l319M090O279j290o176j478N905M768l123o309
$$ plain form
1530 -4778 2259 2076 -5145 -8409 -2430 3610 369 -6995 -7712 -1427 2783 -2428 -8845 -7718 -46
1545 -46 1611 -4735 -9424 -4897 1738 1598 -5033 -7971 -1586 4338 1915 -5160 -5024 1865 5876 800
1561 800 -4822 -3136 4591 6506 379 -4416 34 6733 6191 -401 -2930 3120 8394 5480 -1693
1576 -1693 -2145 5233 8501 3490 -2038 -162 6583 8156 2175 -2455 1485 7870 6556 -107 -2763
1591 -2763 2792 7486 4168 -2887 -3434 3071 5990 753 -5260 -2570 3799 4869 -1354 -5603 -1481
1606 -1481 4956 4288 -2821 -5181 594 5321 1727 -5039 -5073 847 3825 -1458 -7605 -4965 1924 2381
1622 2381 -3544 -7100 -2384 3587 2538 -3659 -5855 415 5325 1913 -4705 -3832 2081 4699 -679
1637 -679 -6147 -4267 2569 3262 -2953 -6272 -2182 4097 2807 -3369 -4847 1058 5826 2703 -3606
1652c606O95O751K385n471n211K419O530K31o385l816M692N395j734o274j245
1667d644N579M356l439n786O84O866K343n159n152K991N986J38o374l741M718
1682f34N022j919o504j073N616L490l714n770J200N880K856n556m937L441N928
1697C326m3n694k989M191N545k385o270p11N868L311l906n467J046O127J962n401
1713a490m244L157O289l47n741k509N046M998k067n532p93N639L648l899n768
1728c613J157O115J462n410m378L167N783m15n934k286M886M632k132n712n12
1743c190O059K729l993n204J760N673J071n259l989K807N355l94o257k254M947
1758a39M309k635n416j91N510L137l936m920J769N750J335n414l880L297N081
$$ plain form
1652 -3606 -2911 3840 6225 754 -4457 -2038 4492 4723 -1662 -5478 -786 4609 2875 -3399 -4644
1667 -4644 935 5291 1852 -3934 -3250 3616 5959 800 -4352 -1361 4625 4763 -1611 -5352 -634
1682 -634 4388 2469 -4035 -5108 508 3998 284 -5486 -4286 1594 4450 -1106 -6043 -2602 3326
1697 3326 3283 -2411 -5400 -1209 4336 1951 -4319 -5030 838 4149 243 -5224 -4178 1949 3911 -1490
1713 -1490 -5734 -2577 3712 3365 -2376 -4885 161 5159 3092 -2440 -3233 2406 6054 2155 -3613
1728 -3613 -2456 3659 5121 -289 -4667 -1500 4283 3868 -2066 -4352 534 5166 3034 -2678 -3190
1743 -3190 2869 5598 1605 -3599 -1839 3834 4905 -354 -4343 -1536 3819 3425 -2832 -5086 -139
1758 -139 4170 1535 -3881 -4072 1438 4575 639 -4281 -2512 3238 4573 -841 -4721 -1424 3657
1773C657p21n707k208M555M088k698n426L12N516K523m059m657J823N901J268
1788D167n523l292L572M873q41n443j794M582M125l089n732N18N335K478m151
1803b15m504J969N880L18m773l011L208N510j349n155j396M798L670k768n214
1818c032J10N408K533m440m164K092N153N14m822k638L575M896j481n212j252
1833b760M954L356k802n145O8N636K070m409m510K464M765L91n087l056L739M468
1849D142j602n383j273M587L585l066n076Q09M775J898m191m139J930N233K63
1864B492n389k917M252M219j952m586j278M988L293l345m679J032N167J567l875
1879a011l344K294N294r1n319k123M196M422j758n268o89M990L233l523m624J362
$$ plain form
1773 3657 2936 -2771 -4979 -424 3664 966 -4460 -4148 1368 3891 -168 -4825 -3002 2899 4167
1788 4167 -1356 -4648 -1076 3797 2956 -2487 -4281 301 4426 1337 -4395 -3877 1458 3936 -215
1803 -215 -4719 -2750 3130 3448 -1325 -4336 -1128 4382 3033 -2122 -3518 1280 4950 2182 -3032
1818 -3032 -2922 2486 5019 579 -3585 -1493 3660 4174 -648 -3286 289 5185 3704 -1508 -2760
1833 -2760 2194 5550 2748 -2397 -2329 3307 5377 968 -3542 -1078 3687 4078 -1009 -4065 -326 4142
1849 4142 2540 -2843 -4116 471 4056 990 -4086 -3277 1498 3396 -795 -4934 -3004 2229 2492
1864 2492 -2897 -5814 -1562 2657 705 -3881 -5159 -171 3122 -223 -4902 -3870 1297 2864 -1011
1879 -1011 -4355 -2061 3233 3142 -2177 -4300 -104 4318 2560 -2708 -3397 1593 4826 1303 -3321 -1959
1895a959N180J624m558l436K546M435J26n156k145L740M211j892n309q1M020K661
1911D007l489m473R77M935J074m359l331K782M285o89m479k065L578M039k184
1926F08m742m92M477K405k883m274J148M828J659m667l240K853M654j58m989j455
1942d268L981L778j824m839K32M519K881l490m099J548M829R06l720l089K908
1957B53M477n57m793j491M135K998k028m359l58M963K303l779m069J769M617P03
1973D784m496k953K742M447j041m718j570M057L232k620m486J19L982K574l866
1988A87l747J425M658K56l947k832K811M395j304m516j545M125L467k589m366
2003c522N52L897K126l210l792J640M795K26m003k828L095M002j336m153j051
$$ plain form
1895 -1959 3221 4845 287 -3149 -603 3832 3958 -1198 -3343 397 4608 2716 -2593 -2674 1346 4007
1911 4007 518 -3955 -2978 1957 3031 -1328 -4659 -1877 2408 1719 -2760 -4825 -1247 2792 608
1926 608 -4134 -4626 -149 2256 -627 -4901 -3753 1075 2734 -1933 -5173 -2320 2334 2176 -2813 -4268
1942 -4268 -287 3491 1667 -3172 -2940 1579 4460 970 -3129 -1581 3248 4154 434 -2655 253
1957 253 4730 4173 -620 -2111 2024 5022 2994 -1365 -1723 3240 5543 1764 -2305 -536 4081 4784
1973 4784 288 -2665 77 4524 3483 -1235 -2805 1252 4484 1864 -2622 -2503 1479 4053 187
1988 187 -3560 -2135 2523 2779 -1168 -4000 -1189 3206 1902 -2614 -4159 -34 3433 844 -3522
2003 -3522 -2970 927 3053 -157 -3949 -2309 2486 2712 -1291 -4119 -1024 2978 1642 -2511 -3562
2018c562L734L022k125m619L19M628J554l826k797J530M208K85m104k274K763
2033a264L884j053m285q81L784L170k267m596N65M835J258l535l273K105M474
2048B921p3m080k351L346L596j338m286m38L953K554k230m116M71M621J540l605
2064D85l308K187M295m19l940j940K999L580j513m274r64M062K359k747l581K84
2080b435L946J658l768k998J840L913j19l930j890K781L544j694m256q33M058
2095a83J926k248l955J069L960J190l340k705J861L863r0l836j901L508L248j704
2111F63l787l86L904K283k359l694J181M004R91l167k342K068L582l13l612j320
2127b304L353L323j816m013R4L785K039k758l379J466L714J059l550k549K788
$$ plain form
2018 -3562 172 3194 1069 -3550 -3231 1397 2951 -875 -3672 -2142 2066 2351 -1753 -4027 -1264
2033 -1264 2620 1567 -2718 -3599 185 3355 1088 -3508 -2943 1892 3150 -385 -3658 -1553 2921
2048 2921 2848 -1232 -3583 -237 3359 2021 -2265 -2703 1250 3804 1574 -2542 -2071 2550 4090 485
2064 485 -2823 -636 3659 3240 -700 -2640 359 3939 2426 -1848 -2812 1250 3609 862 -2719 -2435
2080 -2435 1511 3169 -599 -3597 -1757 2156 2037 -1893 -3783 -1002 2542 848 -3408 -4241 -183
2095 -183 1743 -505 -4460 -3391 569 1759 -1581 -4286 -2425 1438 1348 -2488 -4389 -881 2367 663
2111 663 -3124 -3510 394 2677 318 -3376 -2195 1809 2800 -367 -2709 -641 2941 2628 -984 -2304
2127 -2304 1049 4372 2556 -1457 -1363 2422 4461 1703 -1676 -210 3504 4563 1013 -1536 1252
2142A252L412q32l652j646L329K949j680m078l44L889J539k872l123J036L631
2157B810Q78l784k451K695L288q83l944j268L384K629k216l630J65L427J575l014
2173c39l186J238L588O16l817k163K513L799j067l965q93L091K512j806l589L0
2189c438L341J516k599l253J673L872J54l371j918K054L652o32l547j075L691
2204A20K134j541l324J36L418J666k673l118J828L412N33l446j872K554L396j162
2220B061l148r14L626K069j845l508P05L202J321l007k421J104L369J22l388j668
2236b320K637K623j057l308q18L100K198k038l677O62L408R59k855k742J332L308
2252A412L9l354j730K682K903j433l181l58L009K069j840l045L53L375R73k947
$$ plain form
2142 1252 4664 3832 180 -1466 1863 4812 3132 -946 -1290 2599 4138 1266 -1857 -821 2810
2157 2810 3688 -96 -2547 148 3436 2553 -1391 -2659 725 3354 1138 -2492 -2327 1100 2675 -339
2173 -339 -3525 -2287 1301 1917 -1900 -4063 -1550 2249 1182 -2783 -3676 -585 1927 121 -3468 -3438
2189 -3438 -97 1419 -1180 -4433 -2760 1112 1266 -2105 -4023 -1969 1683 1051 -2496 -3571 120
2204 120 2254 713 -2611 -2475 943 2609 -64 -3182 -1354 2058 2591 -855 -2727 -173 3223 2061
2220 2061 -1087 -2001 1625 3694 1849 -1659 -954 2248 3569 562 -1859 -755 2614 2736 -652 -2320
2236 -2320 317 2940 1883 -1425 -2243 857 3055 1017 -2660 -1998 1410 2369 -486 -3228 -1896 1412
2252 1412 1451 -1903 -3633 -951 1952 519 -2662 -3020 -11 2058 218 -2827 -2474 901 1874 -1073
2268a073k554J697L379j31l072j412K434L329j597l370J94K675K122j668k862
2283a909M93K839J534l003k373J691L160k83l056j530K585K572r45l157l98L361
2299A581J806k371k950O48L107R06k905k499J734L036k33l231j320K490K571j324
2315A046k723p70L149K224k458k466M65L194M62k356k430J877K882k45l238j109
2331b496K787K438j173l023m09L459J556k007k707O23L364P20k908j681J545K803
2347B891l11l092j531K851K434j297l005O5K910J587k312k681P43L133M03k720
2363F8k200J811K624o60k673j483K510K598j563l132K75K998J299k465k209R26
2379a276K775N34l221j700K104K181l00k956j379K620K522j925k592nL035J494
$$ plain form
2268 -1073 -3627 -1930 1449 1318 -1754 -3166 -732 2597 1000 -2370 -2176 499 2621 953 -1909
2283 -1909 -1416 1423 2957 -46 -2419 -728 2432 2149 -907 -2437 148 2720 1775 -1382 -1780 1581
2299 1581 3387 1016 -1934 -1286 1821 2727 -178 -2677 -943 2093 1860 -1371 -2691 -201 2370 1046
2315 1046 -1677 -2447 702 2926 468 -1998 -1533 1661 2123 -233 -2663 -786 2096 1851 -1387 -2496
2331 -2496 291 2729 1556 -1467 -1876 1583 3139 1132 -1575 -952 2412 3132 224 -1457 88 2891
2347 2891 2580 -512 -2043 808 3242 1945 -1060 -995 1915 3502 1190 -1491 -748 2385 2788 68
2363 68 -2132 -321 2303 1643 -1030 -2513 -3 2595 1032 -2100 -1825 1173 2472 7 -2202 -1276
2379 -1276 1499 2033 -1188 -2888 -784 1397 1097 -1859 -3238 -618 1904 -21 -2613 -2618 417 1911
2395A911k354k195R44L100K23k762j868J894K294n11k975p88K562J970j503k739
2411b797n1L001J385k090k434J071L038J07k453j735K155K399p73k993q70K750
2427b90J858j627k648L23L007J252k226k019J293K755M43l030j197J520K994q66
2443A542k858m97K371K064j895k465P05K878O48j812k197J542K646j4l012j254
2459a608K038K547j097k451r16K449J917j720k532K59K709Q20k038j932J016K808
2475B269n6k605j587J906K107r44k587p04K324K010j784k537K53L329O31k505
2491d80j763J093K925j71k511j366K061K199q11k944J9K363J538j671k533Q07
2507a245K657N52j988j678J329K437p8k593p96J991J966j260k605j72K529J801
$$ plain form
2395 1911 -443 -2638 -1694 1406 1629 -1133 -3001 -1107 1187 676 -2299 -3087 -525 1445 -58 -2797
2411 -2797 -2848 153 1538 -552 -2986 -1915 1123 1230 -1223 -2958 -803 1596 823 -2170 -3040 -290
2427 -290 1568 -59 -2707 -2384 623 1875 -351 -2370 -1077 1678 2121 -909 -2106 -586 2408 1542
2443 1542 -1316 -1813 558 2622 727 -1738 -1033 1845 2493 681 -1516 26 2672 2658 -354 -1608
2459 -1608 430 2977 1880 -571 -1487 962 2879 1159 -1373 -1114 1595 2415 377 -1555 -539 2269
2475 2269 2213 -392 -1979 -73 2034 1090 -1497 -2201 123 2133 349 -2188 -1935 1394 2025 -480
2491 -480 -2243 -1150 1775 1604 -907 -2273 -212 1987 1176 -1768 -1749 614 2152 481 -2052 -1245
2507 -1245 1412 1964 -24 -1702 -373 2064 1986 -607 -1403 588 2554 1294 -1311 -1483 1046 2847
2523B847j942k210K88K752N68k250j495J319K640l85k593j160K156J876j022k554
2539a165j19K277J273j674k676J005K607L63k296j728J647K208n3k460j126K000
2555H3J711j158k310p7K384Q84j500k175N78K518M31k389j307J172K360k96k530
2572a621j098K024J976j032k757J2K582R87k110j769P13K444O66k726j553J937
2588a325K159m01k579r70K505J976j484k482M69K204J091j775j669Q70K343O31
2604A563k537j076J840K077p22k237o60K098J814j328j976L73K432J410k150j687
2620g66Q32K281M00k475j611J757K393p11k468n26K128J402j248j796l3J983J446
2637B988k292j951R31K389L9k169j422J209K141p42k036j061K313J374j345k048
$$ plain form
2523 2847 905 -1305 -1017 1735 2303 53 -1442 -123 2517 2132 -461 -1621 535 2411 1389 -1165
2539 -1165 -1284 993 2266 592 -2084 -1079 1528 1891 -405 -2133 -486 1722 1669 -791 -1917 83
2555 83 1794 636 -1674 -1751 633 1517 17 -2158 -1580 938 1369 -1020 -2327 -1155 1205 909 -1621
2572 -1621 -2719 -695 1281 249 -2508 -2496 86 1073 -1037 -2806 -2093 351 1017 -1709 -3262 -1325
2588 -1325 834 433 -2146 -3116 -611 1365 -119 -2601 -2132 72 1163 -612 -2281 -1411 932 1563
2604 1563 -974 -2050 -210 1867 1145 -1092 -1752 346 2160 832 -1144 -771 1661 3071 921 -766
2620 -766 66 2347 2747 272 -1339 418 2811 2100 -368 -894 1234 2636 1388 -408 -441 1542 2988
2637 2988 696 -1255 -324 2065 2104 -65 -1487 -278 1863 1121 -915 -1976 337 1711 366 -1682
2653a682l82K772O63j902j569O88K374K95k380j674K222J588n80k207o85K483
2669B4J300j344k051L68K188J366k113j895J288K362K77k369j108J698K030o11
2685A410k242l37J736J455j244j944L46K290N62j916j536J131K532l62k008j043
2701a170J749K180j009k624k25K032J163j323j900L41K367O22k102j462R07J985
2717A531J85k201r12J500J788p45k533q5J946J277j473j799J65K057O70k016j411
2734b056J236K058l2k656o75J683J894j192j962m8J613J362j851j626N90J950
2750B88O34j863j494J360J853r5k435n55J527J876o69k162m37K340P98j218j593
2767a845N86K215N99k004j413J224K027J4k263m76J788J671p82k209K09J862J052
$$ plain form
2653 -1682 -2064 708 1371 -531 -2100 -1412 962 1257 -1123 -2797 -575 1013 433 -1774 -2459 24
2669 24 1324 -20 -2071 -1703 485 1851 -262 -2157 -869 1493 1770 -599 -1707 -9 2021 1410
2685 1410 -832 -1169 567 2022 778 -1166 -820 1470 2032 116 -1420 -289 2243 1881 -127 -1170
2701 -1170 579 2759 1750 -874 -1099 933 2096 773 -1127 -786 1581 2203 101 -1361 -454 1531
2717 1531 1716 -485 -1397 103 1891 1146 -1387 -1472 474 1751 278 -1521 -1356 701 1371 -645 -2056
2734 -2056 -820 1238 1206 -1450 -2125 -442 1452 260 -1702 -1750 -137 1225 -626 -2252 -1662 288
2750 288 922 -941 -2435 -1075 778 683 -1752 -2307 -780 1096 427 -1735 -2172 168 966 -252 -1845
2767 -1845 -1259 956 1555 -449 -1862 -638 1389 1403 -860 -1336 452 2123 1341 -868 -659 1203 2255
2784B255j577j534K54K320N81j662j107O65J985k48k102q36J940J346o81k112
2800e13k72J946R21j497j963P98J901K69k225r63J282J352l13j978q45J608J592
2817A100j104k072L24J833O44j238j566M56K173p0j756j502J485J833n91j580
2833a631p55K062J350j162j949L26J866J063j372j539N25J865M88j754j516J370
2849g63J950j85k229k85J686J524j082j873M24J897P67j285j646R33J663K03j599
2866A00j278J038J608l90j943l34J558J373j245j611K63J381J437j612j577J138
2882i4J815R5j897j408J767J721p46k058n92K264P27j088j617K43J944J146j792
2899D30j313P43K158M12k237r65J370J703q31k113k6J582P49p52j863L99J686
$$ plain form
2784 2255 678 -856 -602 1718 2299 637 -470 195 2180 1932 -170 -1006 934 2280 1599 -513
2800 -513 -785 1161 2082 585 -1378 -580 1321 1590 -635 -1598 -316 1036 723 -1255 -2100 -492 1100
2817 1100 -4 -2076 -1752 81 725 -513 -2079 -1623 550 480 -1276 -2778 -1293 540 -51 -1631
2833 -1631 -2386 -324 1026 -136 -2085 -1759 107 1170 -202 -1741 -1216 649 1137 -617 -2133 -763
2849 -763 1187 1002 -1227 -1512 174 1698 616 -1257 -833 1064 1831 546 -1100 -167 1496 1699 100
2866 100 -1178 -140 1468 1078 -865 -1199 359 1732 487 -1124 -861 520 1957 345 -1232 -94
2882 -94 1721 1816 -81 -1489 278 1999 1253 -805 -1397 867 1594 506 -1111 -868 1076 2222 430
2899 430 -883 -140 2018 2430 193 -772 598 2301 1470 -643 -669 913 1662 910 -953 -554 1132
2916A132N90j253j194M32J782L84j940q45R83J180m87j816j18J183J337j050k169
2933a869N51J681N02j506j211N51K180K32j939j306J476J547r68j731m48J804
2949d54R34j169j615O21J818K67j259j235J297J595k52j346j491J494J748q10
2965A43j856k18J662R55j190j665Q11J729K58j009j242J280J229K45j943m93J392
2982H8J214j027j553r0J649Q73j488j373P37J348N41j430r29J269J713j05j650
2999b13n52J631Q79q90j316m64J736P52j170j596M73K040K14j291r33R09J701
3016A910k92j140r83J462J257p39j611m45J903L27j310j559O03J806L58j409j292
3033a154Q76J787m40j615n38J401J344p28j673k38J374R01j164k008R07J620K33
$$ plain form
2916 1132 1722 469 -725 -293 1489 1873 -67 -912 71 1251 764 -1052 -1170 13 1350 300 -1869
2933 -1869 -1318 363 865 -641 -1852 -1301 879 1111 -828 -2134 -658 889 -79 -1810 -2258 -454
2949 -454 480 -689 -2304 -1683 135 402 -857 -2092 -795 800 548 -798 -2289 -795 953 143
2965 143 -1713 -1931 -269 686 -504 -2169 -1358 371 629 -380 -1622 -342 887 1132 -811 -1304 88
2982 88 1302 275 -1278 -1368 281 1154 -334 -1707 -970 378 919 -511 -1440 -171 1542 1437 -213
2999 -213 -765 866 1745 855 -461 -925 811 1563 393 -1203 -730 1310 1524 233 -700 209 1910
3016 1910 1618 478 -505 957 2214 1475 -136 -581 1322 1649 339 -1220 -617 1189 1547 138 -1154
3033 -1154 -278 1509 1069 -546 -1084 317 1661 933 -740 -978 396 1297 133 -1875 -968 652 885
3050H85j793o67J466J283m57j646k93J502J234j078j317N6J349N05j349j107P13
3067g14J380L55j848k41N34J572j83j741o5J443Q51o71j231o57K107L16j572j251
3085a616P33J718j59j393r61J004J797n04j604j14J591M75n18j727M81J410Q19
3102A432j636j241M96J585k64j272o51J145J468l63j541k47J662P82j013j058
3118g16K94J348K72j451q62P42J454n77j036p30J316J208n36j580k80J368J168
3135A402j250j044Q6J224N79j559r94R26J187o2j759n74J025J347m98j468LJ272
3153a57Q52r64j178K79J261O58j477q69R32J171J7j713m97J228J184n5j420l70
3171a118J693R24o97j282J1J537M89j597q51R63J661l58j304p22J502R67k66j454
$$ plain form
3050 885 -908 -1575 -109 1174 717 -929 -1222 280 1514 436 -881 -825 524 1029 -320 -1427 -714
3067 -714 666 1021 -827 -1068 -534 1038 855 -886 -951 492 1343 672 -559 -1216 891 1207 -365 -1616
3085 -1616 -883 835 676 -717 -1678 -674 1123 619 -985 -1099 492 967 449 -1278 -797 613 1432
3102 1432 -204 -1445 -949 636 372 -900 -1551 -406 1062 699 -842 -1089 573 1355 342 -716
3118 -716 -422 926 1198 -253 -1115 -373 1081 504 -532 -1262 54 1262 726 -854 -1134 234 1402
3135 1402 152 -892 -806 418 997 -562 -1556 -630 557 495 -1264 -1838 -813 534 36 -1432 -1429 -157
3153 -157 695 -269 -1447 -1168 93 751 -726 -1595 -663 508 525 -1188 -1685 -457 727 672 -748 -1118
3171 -1118 575 1499 802 -480 -469 1068 1557 -40 -891 72 1733 1375 71 -651 851 1818 1552 98
3189I8J74J430O77q78j516N93J142K81j350j038P77J205l0j833j29R20J090q79
3207G34j451K58J096P26r80j248M96J157N32j698j042P89J299k68j549o24J007
3224g66J329o65j377r7J498N76j214o25N74J361o8j170r50P84J413l98j331l17
3242a443J239P95o31j219n3J470N06p99j283Q47J131J86j072n79R20J332m14j624
3260f91o5Q92J124n33j747K64J180P10q10j530M98J550k31r40q77J039J103l07
3278F29j526K8J066J215p67j644L2J615N04j140j232P03J250J07j376n42O91J273
3296H86k29j387j33R43Q36p83j038Q1J467N04j262j052N53J308J38j671m96Q91
3314d44J439p49j455L16J348N16p64j205K34J255L71q26r49N57J519j06j311n12
$$ plain form
3189 98 272 1702 2379 1501 -15 578 1720 2001 651 -387 390 1595 1565 -268 -397 523 1613 734
3207 734 -717 -459 637 1363 383 -865 -369 788 1320 -378 -1420 -631 668 400 -1149 -1773 -766
3224 -766 563 -102 -1479 -1576 -78 498 -716 -1341 -767 594 526 -644 -1594 -810 603 205 -1126 -1443
3242 -1443 -204 591 -40 -1259 -1312 158 664 -135 -1418 -571 560 746 -326 -905 15 1347 933 -691
3260 -691 -756 136 1260 727 -1020 -756 424 1134 324 -1206 -708 842 611 -329 -1206 -167 936 629
3278 629 -897 -869 197 1412 645 -999 -967 648 1152 12 -1220 -517 733 840 -536 -1078 -387 886
3296 886 657 -730 -863 80 916 133 -905 -824 643 1147 -115 -1167 -614 694 832 -839 -1335 -444
3314 -444 995 246 -1209 -893 455 971 207 -998 -764 491 862 36 -913 -356 1163 1057 -254 -766
3332g66Q36J101j33j539k9J009R22j136j037L67J249N95j271q87O82J264k32j326
3350c31m19J264P34l65j132l68J101Q63q72j344N04R64L09q96j152O06J295j00
3368F61j737j89J188R40l51j283j36J287N32j058r80K34J272O5j191q02Q72J013
3386C37l77q44n15Q96R60k70j405M96Q47Q83j100q48K06J443M1q51j023P42J245
3405H63l51j206n69Q85J363o52j128K09O76P39n56j067M23J053K79r12r02Q89
3423C6J034l65j309j96P75R85o47j277K08J269M24r35q15N70J384j0j318k61N77
3442A29J163m48j276m92J146Q74o51r65j40J350O11q77j064M53J307K2j158l94
3460d10R17Q22m55j073m27J252L51J21j901M79J034K94q12p86M16R27Q4r43n32
$$ plain form
3332 -766 70 1171 1038 -501 -530 479 1401 265 -772 -405 844 1439 168 -719 -37 1227 995 -331
3350 -331 -750 514 1248 883 -249 -617 484 1347 475 -869 -365 599 908 12 -1140 -534 761 661
3368 661 -1076 -1265 -77 863 512 -771 -907 380 912 -146 -1126 -892 380 445 -746 -1548 -676 337
3386 337 -40 -884 -1399 -503 457 187 -1218 -722 125 1008 -92 -940 -734 709 750 -101 -1124 -382 863
3405 863 512 -694 -1263 -378 985 333 -795 -586 90 829 273 -794 -371 682 961 49 -853 36
3423 36 1070 705 -604 -800 -25 960 313 -964 -756 513 937 2 -813 -243 1141 1131 -187 -448 129
3442 129 1292 844 -432 -924 222 1096 445 -520 -660 690 1301 424 -640 -187 1120 1142 -16 -410
3460 -410 507 1329 874 -199 -626 626 977 1098 -803 -324 710 1004 192 -594 -178 749 833 -110 -642
3479f42K53R52L97j744l94J352N16j109o75n0J284L71o74j270O06J209j72j218
3497a008l47N66Q23k38j032l36R24P65o69r60P3J251M09r44j010P46Q85R5r17
3516i24o06Q11J004o02n74J21N79L93j93r63K48J075K07q74o49M68R98K10j061
3535c32k24N41J152l71j095o0J010N46q66p10j04J268L70p29r26M97J009Q9q91
3554A74o32R40O32j71j192M2J037O26p81j254K46J188J86q70n19N08J058J98j375
3573D1o07J020P72m42r28q3J059J37k85q66k06J038M30j029o30M82P70L19j397
3592d05m12R73Q21l02j331P0R60O46m65j151J93J035j5r24l56K85Q93o7j384K48
3612f88O18M71j67q51n1J146L83r28p00j02J901n47j016l75N35Q95m1j245k62
$$ plain form
3479 -642 -389 563 960 -784 -1178 174 690 -419 -1094 -1144 140 511 -163 -1433 -827 382 210 -1008
3497 -1008 -1355 -789 34 -204 -1236 -1572 -648 117 -552 -1512 -1439 -188 221 -723 -1733 -987 -102 -7 -924
3516 -924 -1530 -719 285 -317 -891 -770 -191 202 9 -954 -706 369 576 -298 -947 -479 519 729 -332
3535 -332 -556 -15 1137 766 -329 -389 621 1167 301 -409 -513 755 1125 396 -530 -33 976 1065 174
3554 174 -458 482 1114 943 -249 -207 830 1456 675 -579 -333 855 1041 171 -348 160 1218 1416 41
3573 41 -566 454 1226 784 -144 -227 832 969 684 -182 -388 650 1080 51 -579 -97 673 992 -405
3592 -405 -817 156 977 675 -656 -586 374 1020 555 -596 -403 632 617 -307 -663 -378 515 448 -936 -688
3612 -688 -70 401 234 -617 -668 478 861 -67 -767 -869 1032 485 -531 -906 -371 524 483 -762 -1024
3631a024R13R32o55j125K24Q82O21j014o24J31J052M5q58k95J75R81k71j043q9
3650a042R68O18k52j226J59Q16O42r02q58O90P88K8j133k18L96J032l85j069l57
3669a305R41O02k34p85k54J335L72m92q79N14O49J42q00p05Q61O11m78j118O7
3688i56J055L36m16l81k87J054J51n94o20L59J043j35j258j93Q15L16J26j086
3706f71l4N72N27l10j023L23P98N08o08p24O50Q15K34j214m73M98N77J42j032
3725d45q2Q10P01n87q26K71J147J20p53k70K05J014Mj083l40P56P05o81m67k42
3745d3P61N31m95r74N62O52L95p83p44M80J129j81r93k26M81O54l58q50m80P69
3765B87J94k35q33J67P90L20q52n50O25L70M08j185j72Q17J35m01l49m11N72Q35
$$ plain form
3631 -1024 -111 821 166 -959 -735 147 768 -246 -870 -739 313 358 -500 -795 -620 361 90 -953 -1042
3650 -1042 -74 544 292 -934 -775 41 683 -219 -1077 -387 401 429 -704 -922 -526 506 121 -948 -1305
3669 -1305 -364 238 4 -781 -1035 300 672 180 -699 -185 464 606 -194 -899 -38 573 95 -1023 -956
3688 -956 99 435 19 -362 -649 405 556 -38 -658 -299 744 609 -649 -842 -27 289 415 -671
3706 -671 -705 -133 394 84 -939 -616 182 690 82 -642 8 823 1057 -157 -630 -132 445 587 -445
3725 -445 -527 283 984 397 -429 -158 989 1109 356 86 291 1305 1309 226 -114 642 1347 666 199 -43
3745 -43 718 1249 754 -220 342 994 1389 606 -138 342 1471 1290 297 71 552 1206 848 -2 -482 287
3765 287 481 246 -587 -420 370 690 -162 -712 -87 283 691 -494 -666 151 286 -115 -464 -875 -303 532
3785E32q12j259Q29R26K98j008o38O30N70J39n45o13O12M20q5j229M2R72N33r24
3805f10p32N77P93K92q09l48N14O87k2q59k93L50R91m23q63j21P28J14m90l65
3825h89M09L67K86k75p02M04R65j02o39j65M08P74n75q40P4Q99j08r33j18J10
3845f50J013J69p71m61L16J180k43o05m64P54L84q7q73P3L84M83o41q91R39N68
3865E77j21p27k93N88N94j07p71k07P82O44q46l77R3N26L02k74p88P9P86j32m44
3886a16o02N51O29m3n44j07O33M65m79m25j65J277k23r31j23L88Q61Pq36m57P43
3907E03M66j45p46n90Q18M43k09p19l9P13L8n27p73M94J024j94n10q37P73P18
3927G01K3j001l48P69N23n22p67k73J116J21o60m72j25O78M60n75q58R58N92j16
$$ plain form
3785 532 -280 -1539 -710 216 514 -494 -1132 -502 68 207 -338 -951 -339 81 -4 -1233 -1191 -219 314 -610
3805 -610 -1342 -765 28 320 -489 -837 -323 364 342 -517 -810 -460 531 108 -755 -876 -148 -34 -524 -889
3825 -889 -480 -113 173 -102 -804 -400 565 463 -176 -341 67 841 266 -574 -500 399 291 -642 -760 -650
3845 -650 363 532 -239 -700 -384 796 553 -52 -516 238 622 535 -338 -265 119 602 -39 -930 9 577
3865 577 456 -271 -564 24 618 511 -260 -467 315 959 113 -264 -171 355 657 383 -405 -326 460 328 -116
3886 -116 -718 -167 462 419 -125 -232 401 866 387 -38 -203 1074 851 -80 -203 185 1046 1053 217 -240 503
3907 503 969 824 78 -512 306 749 540 -179 -218 495 533 6 -767 -273 751 557 47 -790 -17 701
3927 701 724 -277 -625 144 667 145 -622 -895 221 342 -318 -790 -915 -237 223 -352 -1210 -252 340 224
3947B24o81k03R78M19q12n46O2J094j41r59m31O98N65m60k69l42M01P96k27m74
3967c08j40O44P86o90p89L09Q55P1q87n23O49M70j1m24n53K97J005n81o95P4N65
3988A24N07m20o14R6J013J16r29n98N15O70k48l81m27P05L96l81q39J44P39K42
4008D30p7r63J31P79L01o93l36O41O98m02n55K07K06O07l23o29n84J233j92l46
4028A33o08M06K74L13o42k52M56K96L5k66r33R18N45m60k10l33K87L41k90p03
4048f93K64L70R4k23m48J32P58l46m75j70M06M45j84o58R0N01K47m42m07J38K82
4069c19M08q19m92N91O65M9r41Q0P69M27m45n75lM80J82j84o67K66P99o6l50n91
4091g36L85Q77l97m70m6M05L87M2p46k28Q09J0m57m67O16M36k0n05k19L73N25
$$ plain form
3947 224 -457 -660 318 737 -75 -621 -559 535 394 -565 -996 -298 267 -193 -462 -804 -403 393 166 -308
3967 -308 -448 196 982 292 -497 -188 667 738 -149 -672 -23 447 436 12 -541 -244 761 180 -515 -441 124
3988 124 631 211 -403 -307 706 822 -107 -705 -190 480 232 -149 -576 129 525 144 -695 -551 188 430
4008 430 353 -610 -479 300 601 -92 -428 213 911 509 -46 161 367 974 651 22 -562 671 479 133
4028 133 -475 -69 205 518 -124 -376 80 376 411 145 -788 130 675 215 5 -328 -41 300 10 -693
4048 -693 -429 -59 35 -188 -636 -504 254 -92 -567 -737 -331 114 -70 -728 -638 -137 110 -332 -739 -601 -319
4069 -319 89 -730 -1222 -631 34 83 -858 -778 -9 418 -27 -602 -605 -125 57 -127 -794 -528 271 205 -145 -736
4091 -736 -351 526 129 -341 -387 18 405 447 -299 -527 282 292 -165 -632 -16 420 400 -105 -324 49 574
4112E74R5r67m8R11J62l48n55N0M85K94m08j50l00J000n3n05m08J70R12j12r20
4133a21K48K66O14m25l50j46M83L92p83m23J63O53R8o49l84N32N73o9j198K82
4153b44M99N86l29p78O7N93P3l78o80O84L41j30m19l80O35M59n48k36j76M20M19
4174D78k38p89K02P06km77l57J40O92K84j035l1M88L57n28k66R3Q49J78q33m25
4195e14K92N06M40j014K08l03M62M01r67q9L96O97l53m89l96N34P59p59k99J60
4215c28M53J5m42o34O08L75%o97J66J94L28q2m20n4J79Q54p72n5j91O55P9j88
4237D3n68P3P17j74r72K31N36K06j32n98M9O73L53n03p21M70L73K03n61p82N14
4258e70Q53j22q44j44Q04J7j77n08j53Q74K21n61o13M82O50K07p03l84K88L97
$$ plain form
4112 574 669 -298 -346 565 727 379 -176 -126 359 653 245 95 -205 795 742 237 -171 -1 911 799 -121
4133 -121 127 393 1007 582 232 86 569 961 178 -245 -82 571 669 20 -364 168 741 672 -526 -244
4153 -244 255 841 512 -266 -199 394 467 89 -591 93 434 304 -115 -495 140 599 51 -185 -361 59 478
4174 478 240 -549 -347 359 357 -120 -477 -337 355 639 -396 -427 61 418 -110 -376 -283 566 744 -89 -514
4195 -514 -222 284 724 -290 -82 -385 77 478 -489 -578 -182 515 162 -327 -723 -189 570 -189 -488 -328
4215 -328 125 140 -302 -936 -328 47 47 -650 -484 -290 38 -44 -464 -518 -339 515 -257 -312 -503 152 231 43
4237 43 -525 -452 265 91 -881 -650 -114 92 -40 -638 -589 84 437 -66 -787 -317 56 259 -302 -1084 -570
4258 -570 283 161 -683 -827 -23 -6 -183 -691 -844 30 251 -310 -923 -441 209 416 -287 -671 -383 14
4278A4N8m98k42R24J46J23q98r3O20M85p13k87M73P79j80n07l52L56K93N6l68
4299A89m1M11L69N6o56j90Q90J99q43j92P4Q40j19p66oM4O84n2p04NK94K74j55
4322F05k80k88R86l91j65m73K85O81n2q97j62K28P00k02n36n15P66J74m52l05
4342b93N4N11k6k65n82M61L65J80m99n75M62J29j57m06P8N65L13l90o98N47J63
4363f3Nj41l75J03Q62m09m00m36N55L77j66n67Q2L86M48m93q25M57L88J35m07
4384d84r1j66N39Lk94k24M33N67m47m26K05K66J7o4m60J35L80Q2j85k26j26R14
4406C48j44n31J08j27N99k01k50j16M40N28j64j062M24M21L5m08m46L76K67P7
4426A74l61m49O58N15j96m51k27N76J70k28m44K42J82K66p77M3k5N17Pn01l34
$$ plain form
4278 14 72 -426 -668 256 402 525 -373 -466 154 639 -74 -361 112 891 711 204 -148 208 501 557 189
4299 189 148 559 928 984 328 138 1028 1227 384 192 266 1106 987 221 215 259 943 891 187 192 486 760 605
4322 605 325 37 1023 632 467 -6 279 960 908 11 -151 77 777 575 39 -476 290 464 12 -293
4342 -293 -239 272 246 -19 -601 -140 225 405 -94 -669 -207 -78 -235 -641 -563 2 315 -75 -773 -226 -63
4363 -63 -58 -199 -574 -471 391 -18 -418 -854 -299 78 -88 -655 -573 -187 261 -232 -1057 -600 -212 -77 -484
4384 -484 -575 -741 -202 -199 -493 -717 -284 283 -164 -590 -385 -119 -102 -166 -626 -491 -111 -29 -214 -440 -566 348
4406 348 204 -327 -219 -346 253 52 -198 -314 126 654 490 -572 -148 273 308 -100 -546 -170 97 174
4426 174 -187 -636 22 537 341 -110 -337 239 409 181 -263 -21 161 427 -350 -307 -332 185 192 -309 -643
4447f43M53P09k54m85J54L96J88l58m63N05J67J23j95o21M4O76J29o21k02M28
4467A30L87Om75J16O20l4m52q8K46M53l46k49j55K09M05l10l15k57L52M12o03
4488E2j86k5P31Q8m02p52M57M23J70n88k99O1O50l0p87KJ37M68k82l30j27Q09
4510B40K5J7n01J99L06L72o51m09K13M44K82q73p6M58J09Jk02j91K82K74n13j96
4532c90J65K54M34p08r7J00L94p3k49m01N80Q5J1p37K95L09L41o13j00o4M93j44
4554a15l2m96L98J59M5o94k5Q97J53k80N3l47L48K12l80k16K29O62k90n46j28
4575c93N05J40j52l92K7K92J78m0o27J22O03J75n12m15M06P83j91k29m90R2M43
4596C25L8o28m39O55M61n06m17L01K24J92l39J9j67N17k32k25j94J87O46m26m39
$$ plain form
4447 -643 -190 519 265 -220 -66 330 518 160 -303 202 369 492 297 -324 -280 396 525 -96 -298 130
4467 130 517 523 48 164 784 750 298 210 456 909 563 314 159 368 773 463 148 -109 243 655 52
4488 52 -134 -159 572 660 258 -494 -37 386 556 -32 -331 -270 380 350 -437 -435 -298 170 -112 -442 -569 240
4510 240 265 282 -219 -20 286 658 7 -402 -189 255 537 -336 -412 46 155 156 -46 -237 45 319 -194 -390
4532 -390 -225 29 463 -245 -342 -242 152 79 -170 -571 9 94 105 -632 -337 -28 313 -300 -400 -464 29 -115
4554 -115 -147 -643 -245 -86 -41 -735 -760 137 290 10 63 -284 64 276 -104 -320 -91 571 281 -265 -393
4575 -393 112 252 100 -292 -265 27 205 165 -462 -340 263 438 -74 -489 -83 700 509 280 -210 -118 325
4596 325 363 -265 -704 -49 412 -94 -511 -210 14 206 -133 -114 -281 236 4 -221 -415 -228 418 -8 -447
4617d47K3K81K28k93q4o3L26L03m07m58L46N03K07p22j51M97M45k77o67L07K79
4638A76O0j63m26J22J10N74n88q8L8O12j14m05J06p6M75j14m54k09O10K16l91
4659G1m58M6M86K54j51n20K66N60m55j61l03M87L30m42l39m85O93N58l18m72J07
4680b46P12j20l77l46M93K84k43J0k02J59N04q8o78j28K97K11j3n27J01L40Q8
4701B31k03m97M62M61j0o50k25Q47j98o2m37j17N67L57p83j05q3M01L97p12J65
4722a94Q7L06Q5m20k90L22L95k74l45k06P84p7k39j74O4J38J31j01m15K02O22
4743D01m94j10J17j06Q19n53m22K40L17J09p4l85K03K91j56m92k32N04J08J39
4763B24m57n3J30K44j19j98r4L08M28l80k98J50K57K84o05p2J22M37j75n96K40
$$ plain form
4617 -447 -424 -143 85 -208 -292 -355 -29 274 -133 -591 -245 258 465 -257 -408 89 534 257 -410 -103 176
4638 176 236 73 -353 -231 -121 453 -135 -223 -185 427 313 -92 14 -62 413 299 -155 -364 246 462 71
4659 71 -387 -341 145 399 248 -272 -6 554 99 -62 -365 122 452 10 -329 -814 -121 437 119 -353 -246
4680 -246 466 346 -31 -377 116 400 157 167 -35 124 628 540 -138 -266 31 242 229 -298 -197 143 231
4701 231 28 -469 -7 454 444 -206 -431 416 218 156 -281 -398 169 526 -257 -362 -445 -44 353 -359 -194
4722 -194 -107 199 284 -136 -426 -104 291 17 -328 -534 250 173 -66 -240 -176 -38 93 -8 -423 -221 401
4743 401 -93 -203 -86 -192 627 74 -348 -108 209 318 244 -141 62 353 197 -295 -527 -23 85 224
4763 224 -233 -286 -156 88 -31 -229 -323 -15 413 33 -265 -115 142 426 -179 -251 -129 308 133 -463 -223
4784b23N47J7k71k63r1J40O89m40j74j59M04q0r6l38K61M42j59k37m85P56J2j90
4806F2n13M03M56k79J1m92N3M06L9m62J31J58O0K19o77L02L17k71k23n8J19K14
4828b5P2m12J26N7L50j29k27l33L95K55k31j69k14N99k72J79l35r5N2L79k06j0
4850a94K71K54l6l26j98K93M60n13k53L5NL43j20k23J61J21J59o92K18j49R59
4871E75j75n77L03K97M1l02l10o0L35P5J2o78L37K65J95l79l5K61J15k47n0K7
4893B5k54M85k6j42k27M87k0k24j84J74M35k65l52Q6J24M39O9n46k20L12n2J56
4915B80m2l82J41K09Mo16L51N07p1l22n37L23K48m6l41J7M35j68J60o04jO02p3
4938G4k36j40J40K11ol15m13K74J49J23k0n72O61L86n66l93J62J94Q4J38k95P9
$$ plain form
4784 -223 324 341 70 -193 -284 -144 545 105 -69 -228 176 96 0 -338 -77 365 206 -31 -516 240 252 62
4806 62 -451 -48 408 129 140 -352 -299 107 146 -316 -185 -27 33 252 -425 -123 194 -77 -300 -358 -239 -25
4828 -25 47 -365 -239 -182 168 39 -188 -521 -126 129 -102 -271 -485 114 -158 21 -314 -409 -357 22 -184 -194
4850 -194 77 331 295 -31 -229 64 524 11 -242 -207 -202 141 21 -202 -41 80 239 -453 -235 -384 575
4871 575 400 -177 126 423 464 162 -148 -208 127 202 214 -464 -127 138 333 -46 -81 180 295 48 -2 25
4893 25 -229 256 230 88 -139 348 328 104 -80 94 529 264 -88 -2 122 561 630 84 -136 176 124 280
4915 280 238 -144 -3 206 210 -406 -55 452 381 59 -478 -155 93 47 -294 -277 158 -10 150 -454 -455 147 74
4938 74 -162 -302 -162 49 43 -272 -685 -411 -262 -139 -159 -731 -70 316 -250 -643 -481 -287 -203 -65 -360 -281
4960b81P23l31k56l26N31L92m14q8q1K08L0k73M02o5j52J57m2m09K36K45N8k68
4982dl5L9M0L16q11M26J40L40j54l01q6K78K85n24o9k11P33l69j73J68O3L29n3
5005C67o33K54N4O7k33p6KN91m7m92m7J80J89l21j53l8K71M07l26n07J64L79j5
5028C7l98J85o1L14k87o8j11K35j06J39j76j87L25M79j71n42R4J79K35o4r6l49
5050c94K72R2k17R9q7K29K46l51k0m26O27k9l67O2K41M78o41j0J28M66n1o35M31
5073A43k30O23k13l02m54P56K43j37o13P8O72j74j45k51J29K40j67L29k07k97
5093B3L21j20j88p1L75j69j31k3m4O9L45k75j27q0M70q7l41j49OM01rm18k20M63
5117B1j7j60j90Q5L43M88o40N5j57K0K82o78K77j49M68N6j72j52O5K13J37o17
$$ plain form
4960 -281 442 111 -145 -471 60 452 38 -50 -131 77 107 -166 236 171 19 176 134 -275 -39 206 264 -4
4982 -4 -39 0 40 356 -455 -29 111 451 297 -4 -90 188 473 -51 -120 -331 402 33 -140 28 91 420 367
5005 367 -266 -12 42 109 -124 -200 -198 393 346 -146 -193 -13 176 -145 -298 -336 -65 342 16 -491 -327 52 37
5028 37 -361 -176 -237 77 -210 -278 -389 -154 -260 -121 -297 -484 -159 320 149 -393 -299 -120 115 51 -45 -394
5050 -394 -122 -30 -247 -148 -235 -6 240 -111 -131 -557 70 41 -326 -264 -23 455 -186 -196 -68 398 347 -288 143
5073 143 -87 536 323 21 -433 323 566 429 -184 -106 566 392 247 -4 125 365 198 527 320 23
5093 23 344 224 36 -35 340 171 40 17 -27 42 387 112 -15 -95 375 288 -53 -202 -196 205 196 -222 -442 21
5117 21 4 -156 -346 -261 82 570 -70 -15 -172 -152 130 -548 -271 -420 48 104 -68 -220 -155 58 195 -422
5139d22O0O58J0l46j98Q9N2K89k18J53k63R3L16j74l12k8O06k54q95N88J90J25
5161A19k25m5O2K31%k27l8J74J81j60R0j88J96K36k96j11p0K2L78k42l39K61K9
5184C8P9j20qj05N26l94m4l9K17O4j9j34l92N39j18L2j76k4J53J75j01m41J90
5207a02M22n34K22l84L47J01J7l14L4L69o6j66k73K70L2k06M2o2L77k76L35n69
5229c84j14O09l18K03j7Q6r5O80p60mj97L48N3j35j94L51J94k8l24o1N2O1%j75
5253a69R2K34P7j11l48n6N09M0k08m04J91L15m1m10j35M31J82K87m93J15q2j9
5275ck42l24M23J26L51k58m44R3M04Lj94o1L33M4N5n75p3N08N4k29j0k03K68K27
5299B73k82o5O7L73k57j21l87L46N92j52m18j95K70K55l87j42K66L41l03J19l32
$$ plain form
5139 -422 -362 296 306 -40 -238 -149 -97 192 -26 127 -136 -43 273 99 -213 -241 365 111 -784 -196 -6 119
5161 119 -106 -151 -89 142 142 -85 -123 51 232 72 162 -26 170 406 110 -1 -71 -49 329 87 -252 9 38
5184 38 117 -3 -11 -116 410 16 -28 -67 150 214 195 61 -331 208 90 122 -54 -78 75 250 149 -292 -102
5207 -102 320 -214 8 -376 -29 72 89 -225 -191 178 112 -54 -327 -57 -25 -231 -189 -251 126 -150 185 -384
5229 -384 -498 111 -207 -4 -21 65 -30 650 -110 -114 -311 37 90 -45 -239 112 306 278 -46 -107 -55 6 6 -169
5253 -169 -77 157 234 123 -225 -281 228 268 60 -344 -153 162 121 -289 -424 7 189 476 -17 98 16 -3
5275 -3 -245 -569 -146 -20 331 73 -371 -278 126 129 -65 -126 207 251 306 -269 -342 166 220 -9 -19 -222 46 273
5299 273 -9 -74 -7 366 109 -12 -399 -53 539 387 -31 -226 44 299 -88 -230 36 377 74 193 -139
5320a39J42J54N9j50p0J36K33l08L9K9q5L4Ol37P5L40Ql3l35Q4J87o8k29lM75
5345B44j16j40L1k46O32k71l76K09l46P52m26J43m3j9J46lj80MK8K39K2m20P2
5368f4L47O8k05k05JJ26r2q9j07J91K20q7l38J82K9J22L13o92J80O6J32k07k52
5391c61L18J19j48%k67n9O30l61r8j05J72M51o91J38R0L44k08L0l16J75J90j44
5413a01j40J32K87j08k98k96M03O08l60R4k43m8J64j11P3k32J81K03j27l91P4
5434b36M55J36l05j04P5k7K99p0k20j36L4L02m56K65K4K64l42J4k04P30m63J38
5456A73m65K41j43M10j49l61O7L50J58m09k03M60K32l43J43l85M8N30j05l21K35
5477A63j06L20l85J78l02L93j52J9k54K16K76N2n55J28J78K4l72J43J6L30J94
$$ plain form
5320 -139 3 157 216 66 -4 132 365 57 96 125 40 74 80 -257 -182 158 166 133 -202 -118 69 1 -228 -231 244
5345 244 128 -12 19 -227 405 134 -242 -33 -379 373 -53 90 47 28 174 171 -9 -5 23 262 284 -136 -64
5368 -64 283 351 146 -59 -58 68 -24 -113 -220 -29 191 104 -234 -52 -23 99 412 -280 -100 -34 98 -109 -361
5391 -361 -43 76 -72 -72 -339 -398 232 -129 -227 -332 -160 291 -400 -262 -172 172 -36 -6 -322 -147 43 -101
5413 -101 -241 -109 178 70 -228 -524 -121 487 127 221 -22 -70 94 -17 56 -176 5 208 81 -310 -236
5434 -236 219 355 50 -54 21 -6 293 223 3 -133 -99 203 -253 12 36 300 -42 -28 -232 498 35 173
5456 173 -292 -51 -194 216 67 -294 -227 123 281 -128 -331 129 361 18 161 -224 -176 354 249 -72 163
5477 163 57 377 -8 170 -132 261 109 128 -126 90 366 418 -137 -9 169 193 -179 -36 -20 310 504
5498E04n11o5m8K24n2j08J2R6l1O2k71L7M47k27k49j09K68M25m92l5j54J66J01
5521a0M6j28L2J3N7j70K23j79M58k54pj79qJ14J23j87k70L55k29M52m60J4L04
5544A10K02j07k14k04L97m0n1k31Q5Q3J74m5p8k66M94k0k85n3M2k6J21k74K71
5567H5K59J3m47r9L35K16j14m02j2Q4lj01J41O4l7J10K15n12K52J69k40R4j84
5590a14j25L24j39L8j95J34K53m44p6K5O1P6k36j65L62K78J03n35j3K54j30K52
5612a2k51l8k85L44Q5m59K86R8M10J5k37l15L31P9K8m07K18J79J69m34M3k8N91
5635D10k22m58L10j36L95k9j58j29K48O2J44m76K02L25j11m40L47m4J29j00J07
5656C76l94M00N0M3k61n5Mj8M5m47K19L87l27l83J11K94L52l14j28J90oJ33j40
$$ plain form
5498 504 -7 -72 -120 104 52 -56 -44 52 21 83 -188 -151 296 69 -180 -289 -21 404 -88 -123 -277 -111 -10
5521 -10 36 -92 -60 -47 10 -160 63 -116 342 88 81 -98 -106 8 131 -56 -326 29 -200 252 -208 -194 110
5544 110 312 205 -9 -213 184 144 93 -138 -53 30 204 159 81 -185 309 289 4 -49 -7 -33 88 -186 85
5567 85 344 357 -90 -189 146 362 248 -154 -166 -82 -85 -186 -45 19 -18 92 307 -205 47 216 -24 70 -114
5590 -114 -239 85 -54 -16 -211 -77 176 -268 -344 -319 -258 -182 -418 -583 -221 57 160 -375 -388 -134 -264 -12
5612 -12 -263 -301 -586 -242 -157 -616 -330 -232 178 193 -44 -359 -28 51 79 -328 -110 69 238 -196 -153 -181 410
5635 410 188 -270 40 -96 299 270 112 -17 231 293 437 -39 163 488 377 -63 284 240 369 269 376
5656 376 -18 382 432 475 214 159 163 145 190 -257 -38 349 22 -361 -250 44 396 82 -46 144 138 271 131
5679A31j64k43J56l9M8k30J74J70K42n41L20j93j40J06K09k83K89R8q4j71k53
5700c98J54K84l6k09l7K81r0k70N1K96J84J56n03J26N2k7j8l6j93N37m0m13J61
5723A2n1K48o7J8l65M36o3l78l1j60N19p0j08J17N8n7L14j55l28Q6p0L94k02j15
5747a8J89K49M7n21J10J08J32n6k81r8K29K77k07m67K39L85J65o18L6J63M65j81
5769C47k60J0J20l73L47j58l49N14LP8n23K06J39j79R1l44J74J76j30N6Q3q0q6
5792a38J98k47J99Q2M2j10l30K01J02j79K6L9k39L16R9j40P5J61l72L5l6M3K86
5815A13j40J2k92K44K03K3m64K58j42k19M32j35q0J58J85n2j13O0J81M6k72j97
5837a91L17K09l34K52n41M68n3J10l64K38j79L31j68j11j08L53r4Jk82J57K49
$$ plain form
5679 131 -33 -276 -120 -159 -111 -341 -167 3 245 -296 24 -169 -309 -203 6 -277 12 110 26 -145 -398
5700 -398 -244 40 4 -205 -242 39 -51 -321 -270 26 210 366 -137 -11 41 14 -4 -40 -233 304 264 -149 12
5723 12 -39 209 142 160 -205 231 168 -210 -241 -401 118 48 -60 57 115 58 372 217 -111 -25 -95 299 97 -18
5747 -18 171 420 467 -54 56 164 296 240 -41 -139 90 367 160 -307 -68 317 482 -136 -100 63 528 347
5769 347 87 97 217 -156 191 33 -316 198 201 279 -244 -38 101 -78 13 -331 -157 19 -111 -55 28 -52 -138
5792 -138 60 -187 12 94 136 26 -304 -103 -1 -180 -154 -115 -354 -38 61 -79 -4 157 -215 -180 -216 -173 113
5815 113 -27 -15 -307 -63 140 163 -301 -43 -185 -404 28 -107 -187 -29 156 104 -9 51 232 278 6 -191
5837 -191 126 335 1 253 -288 180 127 237 -127 111 -68 263 95 -16 -124 229 135 136 -146 11 260
5858B60J2q7j71PK40Rk68L9J56k6r9k45K23P5k4N4q1l7L4R3j66o5L59k02J46j71
5884F5j07K02j30j28K45k89L01k9o5l99M22qJ05k53j75L13j32L00k02k99N06k16
5906B7j62k32Q1J71K55k54K5m29P16k18k09k5n4L69J03j37j52R5J54j8j75j34
5928b03M94J96p20J45L20k3j45j3k6K12q0j7O4r4j53k9J49k64r3K43p0J3o8J2
5952a50J13L35n22J86O8pk60j38M56l32J06J33l81J45K72k39J86k7L1J10k29k49
5974c93J00L36Rj39j46J88M07j05k17j89M6L69r1k51q8L11j01M9n22L20o7J83
5996IJ01l34L88k6J70k56j63K6J82l86M2O1J17K04P2j18k66J63nR8k0j1K62j90
6020A20k13O1mK56m17N3J04j29L03p7l72K01K12J36k32J17l8oJ49k36J52J00J01
$$ plain form
5858 260 272 185 14 21 261 270 2 41 197 171 72 -173 50 125 101 155 74 37 71 164 -2 -67 292 90 236 65
5884 65 -42 160 30 -98 147 -142 159 130 65 -334 88 80 185 -68 -243 70 -62 238 36 -263 243 27
5906 27 -135 -367 -286 -115 140 -114 -89 -518 198 -20 -229 -254 -308 61 164 27 -125 -30 124 106 -69 -203
5928 -203 291 487 -233 -88 232 209 64 51 25 237 157 140 204 110 -43 -72 77 -187 -280 -37 -107 -94 -162 -150
5952 -150 -37 298 -224 -38 30 23 -237 -375 81 -251 -145 -12 -393 -248 24 -215 -29 -56 -25 85 -144 -393
5974 -393 -293 43 52 -87 -233 -45 362 257 40 -149 -103 266 175 -76 -164 147 46 95 -427 -107 -174 9
5996 9 110 -224 164 138 308 52 -111 -85 97 -289 -247 -186 -69 135 207 89 -177 -14 -19 79 59 48 310 120
6020 120 -93 -32 -36 220 -197 -144 -40 -169 134 57 -315 -114 98 234 2 119 81 75 224 -12 140 240 341
6043C41o5Q0m64J11K17J45l5m50M48k92L63k30k78L28o2m9m9L11J2j48m7m41K38
6066a6Q2p1m73L07o5L76jm14J52L38p4j65j36L17j18p6P5l54M76l55Q2J22j33
6089a24qK89j77k29L87k48J48k2n7J19m09K08n1J22p2J49j86j05J56j31M17j65
6111A1k2k77P8J24k30oo9M96j66j46j64J36K38L04m46K35L19k20j1k10r5N10k06
6134A83k47L87m50K88k10p7K56j37J76J86m77P2J41J13P3k55J66N8k25J03k3k82
6156a81M59j91J3k5j66J00m5l15J1M14j42J41j95k76J07K71j32j76N99m7l60J28
6178hl86K62k05L58j18J27K15k14J29p5l66M13m0J25K2j36O8j81J20j00J82R2
6200B84j12j20J3J13O9nl03P9Q1P3j9M6k58Q0m0mQ5J8J35j15Q9j73K98k09j28
$$ plain form
6043 341 276 356 -108 3 220 365 330 -120 328 36 399 169 -109 219 157 108 59 370 382 234 187 -254 -16
6066 -16 66 -5 -478 -171 -236 140 139 -275 -123 215 141 -24 -160 157 39 -37 38 -316 160 -195 -113 9 -124
6089 -124 -132 157 -20 -249 138 -110 38 16 -41 78 -331 -123 -174 -52 -124 25 -161 -266 -110 -241 176 11
6111 11 -11 -288 -210 -86 -316 -322 -391 105 -61 -207 -371 -235 3 307 -139 96 415 195 184 -26 -121 389 183
6134 183 -64 323 -127 161 -49 -126 130 -7 169 355 -122 -50 91 204 277 22 188 246 21 124 101 -181
6156 -181 278 87 100 75 -91 9 -36 -351 -340 74 -68 73 -122 -398 -291 -20 -152 -328 271 224 -136 -8
6178 -8 -394 -132 -337 21 -97 30 245 31 160 85 -281 132 92 217 239 103 171 -10 110 10 192 284
6200 284 172 52 65 178 247 242 -61 18 99 172 153 199 -59 21 -19 -23 62 80 215 100 189 16 314 105 -23
6225b3mj20O3k64M72m29J29K77j21N4q7Pl1q3J24K8N7j22q6j4K86n1P0J52l98
6250a14N9n3K7j82L11Jk5J46k49N7j99L70j02O6j5J41n07J80NO7J93m67M1pJ55
6275a01K04k68n6Q4K3J91P3m56K36K64k00j40J49l72L72K18l34j93J94J27j65
6296a50J33j2m5J20Jp5J67N2m21M1m5K72K75k6j76q5J49K30m93m4P8K56n7j21
6320B4j7Q5K75k77lj43M52r6j16J04n19K11J37J08k58P0l9M0j18%LJ97N6j13l85
6345c22K22P1J35m48J69P1m5J64k54J13j6J24o9L43n12L51Jk76J41o3O4j28j42
6368c06K37K31m26Q4K17k98L01l54J80l10J04M49K7l73J29J09j34j7k9J14j29
6389a94l2J87K05j42k19K63Ql65L15J75k22p8L04J05j76m75L39O3J96q0k7l66
$$ plain form
6225 -23 -27 -147 -84 -348 124 -305 -176 101 -20 34 -53 -46 -77 -160 -36 -8 49 -73 -159 -173 113 62 132 284 -114
6250 -114 -55 -108 -81 -263 48 49 24 170 -79 -22 -221 149 47 113 98 239 -268 -88 -83 -16 177 -290 -249 -256 -101
6275 -101 103 -165 -221 -137 -114 77 150 -306 -70 194 -6 -146 3 -369 3 221 -113 -306 -112 15 -150
6296 -150 -17 -29 -74 46 47 -28 139 191 -230 -189 -234 38 313 287 111 26 175 405 -88 -132 -54 202 145 24
6320 24 7 92 367 90 87 -56 396 300 184 288 -231 -20 117 225 -33 37 -2 38 -80 -80 -77 120 176 63 -322
6345 -322 -100 -29 106 -342 -173 -102 -147 17 -237 -124 -140 -16 -85 258 -254 97 98 -178 -37 -100 -36 -164 -306
6368 -306 -69 162 -264 -180 37 -261 40 -314 -134 -444 -340 109 136 -237 -108 1 -133 -150 -179 -65 -194
6389 -194 -226 -39 166 24 -195 68 76 -289 26 201 -21 -99 205 310 134 -341 -2 61 257 177 150 -216
6411b16L45n6J5q2j49J18K19L9m51M44J02j47K2L9k74oj44K26J72j70k4Q6Q8j77
6435A9L17k47L9r2J91M5n3k94K97J37l64Qj39K51j69J15q2r8N6j33K84j39K24
6458A73r6k79K00M2j52J74L38k62k05j01M9J56j28J13k70P1J41M17k83j05J37
6479A30K5J63l24K99n18K56n9k79M26L0j78M6J70m46K23L11n10K44m3n0Q8J35
6501A39r3j15j59L47P8l26K20j70N3o1K26l50M87j69k38K94j77P2j96P1jJ77j63
6524e4k1R8R3k68Kj4R6l1L48k29K3M7k65J06r6K70P3q8k67J09k84J57q1M54k77
6549i9L24m28J3J81J26r9J67j8j29J95k83m5K1K0k2k82M34k17L35k49L04j19j39
6572in2L04l27N6j04n2K00O9K6J57j40j12K2l44K88K5K36j91k2J51nj34j57J38
$$ plain form
6411 -216 129 73 88 6 -143 -25 194 233 -218 226 328 181 203 242 -32 -38 -182 44 216 46 22 108 196 19
6435 19 336 89 128 36 227 272 219 -75 222 359 -5 3 -136 115 -54 61 -21 -119 -63 -196 88 -51 173
6458 173 77 -202 -2 40 -112 62 400 138 -67 -168 -119 37 -91 22 -248 -177 -36 381 98 -7 130
6479 130 155 318 -6 293 -225 31 -28 -307 119 149 -29 17 187 -259 -36 275 -235 9 -34 -84 4 139
6501 139 46 -69 -228 119 197 -129 91 -79 -26 -87 139 -211 276 107 -131 163 -14 58 -138 -67 -68 109 -54
6524 -54 -75 23 116 -152 -150 -164 -68 -99 249 20 43 90 -175 -69 -165 105 178 90 -177 -68 -352 -195 -276 178 -99
6549 -99 225 -203 -190 -9 117 18 185 167 38 233 -50 -95 -74 -54 -76 -358 76 -141 194 -55 249 130 -9
6572 -9 -61 243 -84 -28 -132 -184 16 85 111 268 128 16 38 -306 -18 7 243 52 30 181 176 42 -115 23
6596B3l1k34M17j94j1RJ24J74m61K32K8Q3L35l76p5K49k97P1k22J28k29L43k09
6619a23m5J67m4M72l28p9K77J75k99k71J67j61PJ89l64j70O34j2k97n1J37L61
6641C42l66r5J62k49K02j0l76L15p4J49p3l2O7O2k76L49k51j7K00m3k44L54k26
6664a30j17K62M9q5k47M43j45Nl10L61q8k06L2K05K80R7l91m60O94n5J63k26m70
6687c39P67m67J40R4l20m5J36J60j50m3J70N1k02j7QK91j68O1L3Q0J19m56j35
6710b32j75M74k16K96o7R0q6j27Q9m09P3L95O6k90n0J77j38p2J96l26P9L56O1
6733A64n22N41j52O2k00o0Q3k6L92k47r4L46j16j39J04j94L1Q9J64j73r5J70l7
6756I1n8j9P1K25j38o2L2l9l58J05J27K30k02K85l41m4K59o3J8j45R9k02o4N42
$$ plain form
6596 23 -8 -242 175 -19 -30 -21 103 277 -184 48 76 159 494 118 43 292 -5 66 -156 -28 -257 86 -123
6619 -123 -168 -1 -45 427 99 20 297 472 173 -98 69 -92 -85 104 -260 -430 204 192 -105 -156 -19 342
6641 342 -24 -119 43 -206 -4 -14 -390 -75 -149 0 -73 -105 -38 24 -252 97 -154 -171 29 -14 -258 96 -130
6664 -130 -247 15 64 -21 -268 175 30 35 -275 86 -2 -208 -176 29 309 406 15 -445 249 194 357 131 -339
6687 -339 428 -39 101 195 -125 -170 -34 126 -24 -67 103 154 -48 -65 -57 234 66 127 160 240 359 -97 -232
6710 -232 -407 67 -149 147 80 170 84 -43 46 -363 -290 105 171 -119 -169 8 -130 -202 -6 -332 -253 103 164
6733 164 -358 183 31 93 -107 -167 -84 -110 282 35 -59 287 171 32 136 -58 -27 62 226 53 -42 128 91
6756 91 33 14 85 310 172 110 142 103 -255 -150 -23 207 5 290 -51 -95 164 101 119 -26 73 -129 -193 349
6780C49l32k08K46J37m38J49j44J80M4j23k12L78k04K87k90L87j08j83j33L62
6800A44j13j37J26K1j84P5Q6lL4m08L58N4n3j25J59K9j64Q0q1K47k21r7M1J86
6824E4l05J98K86m69J86Q6l23L46j04K0k43M12J31m11L35j58j02K71k09J38l96
6845b57J02K83m57N45q9l16P3J56R1o5OK30n13M00k28K55l36K35M2m15L8K71j49
6868i8L86k89j09J93k14K66J52k70J59j83K47O7l61l2J5R0J91O5q8l53K62k19
6890a23K3M25k48N4l6k17J39q8r8L47n0l35K22j55J91k74L84m09K19Q0j64J48
6912C5j02j6QJ47j6J31k58L42j82p2r0k8K62m56N38j54o4R0l38K1M14j74k8j42
6936a32J30o3J1J20k4l0k73M01k34J54K34m56M08n09K08J22k97L65n2M1l89K78
$$ plain form
6780 349 17 -191 55 192 -246 -97 -241 -61 -17 -140 -352 26 -178 109 -181 206 98 -85 -218 144
6800 144 31 -106 20 41 -143 -68 18 15 49 -359 -1 53 0 -125 34 63 -101 -21 -102 145 -76 -173 -132 54
6824 54 -251 -53 233 -236 -50 36 -287 59 -45 -25 -268 144 275 -136 199 41 -61 210 1 139 -257
6845 -257 -155 128 -329 216 127 -189 -116 40 131 66 72 302 -211 189 -39 216 -120 115 157 -258 -220 51 -98
6868 -98 288 -1 -110 83 -131 135 287 17 176 -7 240 307 -54 -86 -71 19 210 275 187 -166 96 -123
6890 -123 -100 325 77 131 95 -122 17 -71 -169 178 128 -207 15 -140 51 -223 161 -248 -29 51 -113 35
6912 35 -67 -83 -75 72 56 187 -71 271 89 17 -73 -101 161 -295 243 89 25 115 -223 -202 212 38 10 -132
6936 -132 -2 -65 -54 66 42 12 -261 140 -94 60 294 -162 246 -263 -55 67 -230 135 83 124 -265 13
6958A3J00L1l19K27K38k23K8l25L57j15j08K26m34P0J54j54O91n15K23J20k71
6979A4Q0o7J66k62j54K61j13J48J9M8O9j90K10j30l4J30j63M5j38m6R2p1q0k47
7003d13L53K03l07O1J56q1j34K71j21r9K56j88r1K8m4J19L9j9l9j24nP5J32j75
7027a47j53P8L11J2j26M0k25N4L67l34J53r5OP6j52N45o41L38j14j36q7L07J58
7050B35J65n70J49N8K48l28M0lK33l13J77J8m7k00oJ5L4N25o34J05j6M37l68P
7074c9O9m5K31l87Q7N4j47M27r5j30j89N1J89r9J44l59P4K14j37J19j09K91k17
7097cp0j01L09K18n74M48l33J34j78J21J89l4J07k79K43k73M4k94K55N1J79o3
7119I6j63j76L44m54J99K96j51q4n7K12M8p4l05J63J20k59K22j44K68m50M19j23
$$ plain form
6958 13 113 144 -175 52 290 67 95 -230 127 12 -96 130 -304 -234 -80 -234 457 -58 165 285 14
6979 14 94 27 193 -69 -223 38 -75 73 92 140 209 19 229 99 65 195 32 77 -61 -107 -15 -86 -166 -413
7003 -413 -60 143 -164 -103 53 -28 -162 109 -12 -111 145 -43 -134 -106 -150 -31 8 -11 -50 -174 -179 -104 28 -147
7027 -147 -300 -222 89 101 -25 15 -210 -156 211 -123 30 -65 -59 17 -135 410 -231 107 -7 -143 -230 77 235
7050 235 400 -170 -21 37 285 -43 -3 -6 227 -86 91 109 62 -138 -144 -129 -95 430 -204 -99 -115 322 -46 -39
7074 -39 30 -15 216 -171 -84 -30 -177 250 155 25 -164 -113 76 -23 121 -238 -164 50 -87 32 -77 214 -3
7097 -3 -73 -174 135 353 -221 227 -106 28 -150 -29 160 126 233 -46 197 -76 -32 -326 -71 -20 159 96
7119 96 -67 -243 101 -353 -154 142 -9 -93 -150 62 110 36 -269 -106 14 -245 -23 -167 101 -349 70 -53
7141e3j4Jk92K22q0M3K56lJ00l60K68k4J61l44P1J39J51p1J20j00k30K60j96j71
7165a46M19j52N4K0k35j99K40k60M0M15j02M2k7r0J81m53L01j7r8K44l96K16J19
7188A16m00M85j58k48L35PJ43l9m34K30K42j57Q5j11m4k60L12k78J4K65K2k61
7210a34q4q1J71K65j78j32j18L29m0j59L21j48j38J39j96P4j88K70l9J97k41j88
7232b98%K46p1j2K19n3n5nK3n5M00p38M35k35J76k51L85q8K31k29j76K02M5m41
7256c45L49j48p8N30l16k63K11k33N13k11M2n8M3k8j2J91l40L06j59j14K31k1
7278I0o2J97k79K1J42K1J17j77k22J06L15j73l15J52L62k52j23P0o3n1%J21j21
7301a24Q3j02k60L54J4P5J54l82J72Mj49K59j95J23q5J7L12p8m3j66k02J77Q4
$$ plain form
7141 -53 -67 -66 -358 -136 -216 -173 83 80 180 -180 88 64 225 -119 -48 91 242 171 291 191 -39 221 25 -146
7165 -146 273 121 175 195 -40 -239 1 -259 -219 196 94 136 109 19 200 -253 48 31 -67 177 -219 -3 116
7188 116 -284 201 43 -205 130 137 280 241 -193 37 279 122 207 96 52 -208 104 -174 -160 105 127 -134
7210 -134 -218 -299 -128 137 -41 -173 -291 38 -2 -161 160 12 -126 13 -183 -109 -297 -27 -66 131 -110 -298
7232 -298 -298 -52 -123 -135 84 31 -24 -29 -6 -61 339 -399 36 -199 -23 -274 111 23 254 25 -151 51 96 -345
7256 -345 4 -144 -222 308 -8 -271 -60 -293 220 9 51 -7 36 8 -4 187 -153 153 -6 -120 111 90
7278 90 28 225 -54 -33 109 130 247 70 -152 -46 269 96 -219 -67 295 43 -80 -10 -73 -124 -124 -3 -124
7301 -124 -41 -143 -403 -49 -35 40 194 -188 -16 -12 -161 98 -97 26 -59 -42 270 192 149 -17 -219 -42 42
7324D2J4Q5l45J13j33J48L18j16o7n5k09K44q0m6J09L3Q2K4q2J6p3J0J06j52K99
7349B85n97K44r8K2P4P6r4J36l30J79R3l47Q5L7K10O9j19J48P1l65M5K38L7j80
7373h1J5k11L11j94K39k15j33K49L93l67N9l07L13J69k75j0K18l99L13j60j5L90
7395C02k18J55n04K49J9L6j70q4L14j78J32J8J5J40l79P2J85r6J12j32R4j80o5
7418a63M5K54J33o68L91m9p7Q6N4J43k50J5r1K12J38N7l79K33o8K15k93j04K01
7441C5j14P8L3k63J71j4J35JK2j7J95j07k71N2R2J8J11K3k22L69o56M94j32l75
7465c42K47j60K63O7j24JR0m32R9J43q8P09m46k59K30K6R2r2K10k96m9k35L80
7488C4q4j8n8J71k22J92K59m68J99k1o3k7J86m5O1l20l2J30J51p3K31l75qL8K50
$$ plain form
7324 42 56 141 -204 -91 -224 -76 242 126 59 4 -205 39 -41 -87 22 55 137 161 79 95 22 32 138 -14 285
7349 285 -312 -68 -166 -144 -70 6 -88 48 -282 -103 -10 -357 -272 -235 -25 44 -75 73 144 -221 -176 62 99 -81
7373 -81 -66 -277 34 -160 79 -136 -269 -20 373 6 65 -242 71 240 -35 -45 173 -226 87 -73 -88 302
7395 302 84 239 -265 -16 3 39 -131 -215 99 -79 53 71 86 226 -153 -81 104 8 120 -12 82 -98 -163
7418 -163 -118 136 269 -399 -8 -57 -134 -48 6 149 -101 -86 -177 35 173 230 -149 84 16 231 -62 -166 35
7441 35 -79 -1 32 -231 -60 -74 61 62 84 67 262 155 -116 -64 28 46 157 180 -42 327 -329 165 33 -342
7465 -342 -95 -255 8 75 -49 -48 42 -390 -291 -148 -236 473 27 -232 -2 24 116 24 234 -62 -111 -346 34
7488 34 -50 -68 -126 45 -177 15 274 -194 5 -16 -79 -106 80 35 96 -224 -256 -126 25 -48 183 -192 -200 -162 88
7513H8k51L81k85j29q7L54j43J34j40K05l99K00j67L01l72L97p0k7q0J11P7r4
7535DJ22j33j31J44k20J43J76k01j45Q5N2K28j45k4K53l50M1q8k12L61J14M7p8
7558D3Q4K7J93j52l93L08l38r6K57j29l6J35Q5K98m93J88L32k57k5k17J80j66
7580a72J65p2k7P9Q3p7N1j2p7n3J49k5k87L71j00m0m3k1j3L58J59l98L8o9J78
7605A45o9Q2j65R6j46J98j41L28m09k09K00j29J05L55j24k02n0J10j0R2R4m9k32
7628a30K20P0p3K21l97J55O8n5j66J0K18j60l82L18j43L57k66O1Q4J66l90N3K28
7651F7j40J26k98L02Q5k94m8N4L98m9k14k32J37L93k41j9Nk24L48j90J96k1k37
7674i6rK74l51j20K80j05L65J22j39l89J1L6K83j75p0O4J56l61J80kk0O3J73N7
$$ plain form
7513 88 -163 218 -67 -196 -283 71 -72 62 -78 127 -272 -72 -239 62 -310 87 17 -10 -90 21 98 4
7535 4 126 -7 -138 6 -214 -71 105 -96 -241 -156 -104 124 -21 -45 208 -142 -101 -189 -401 -40 74 121 43
7558 43 127 154 347 195 -198 110 -228 -324 -67 -196 -232 -97 -12 286 -207 -19 313 56 31 -186 -6 -172
7580 -172 -7 -79 -106 -27 56 -21 30 18 -59 -112 37 12 -275 96 -4 -44 -87 -108 -121 237 396 -2 36 -33 145
7605 145 76 158 -7 89 -57 141 0 328 -81 -290 -90 -219 -114 241 117 -85 -135 -25 -35 57 151 102 -130
7628 -130 90 160 87 308 -89 66 134 79 -87 -77 141 -19 -401 -83 -226 131 -135 -74 10 176 -214 -161 67
7651 67 -73 53 -245 57 142 -152 -200 -146 252 203 -11 -243 -106 287 46 27 32 -192 156 -34 162 141 -96
7674 -96 -105 169 -182 -302 -22 -127 238 360 221 -168 -157 -121 162 -13 -83 -19 137 -224 -44 -46 -66 -3 170 227
7698B27k23J73l83R7Q4l34N87j61j5m56L51J62j34J72R7l24Q8M8m4j86J58p9K59
7721A64j40J91l52j6J22JK44k40ML76n12K93k60K30k01L41j14k41m2M36j25l35
7743a76J70j26J25Q6j99K37N2k13j2K67k35Nj47J90j05n2P0j8O5j1k01N13j86
7766I9j19k17K02J37j58J19j49K34j58L0j15J28k91K62m9K82l02k38R7J56p6J17
7788iJ79l71L48p0q5k85J52K48k38J2j52L09L0q8L3K7n4j34n5J96j87O5J02l5
7812f2j00j86O09o7j05j9k9j67Q8K50p4qo0l66J61n2R1J42k9K49m55L89k89J10
7836B1P4j0N4k57M60l10J93m44L26m07N42k36QM5k32K40R2l25L30L4l68L3J8j24
7860b43j16K19L16r8P8k86L99M5k84M7l46j1N77K98p25k6K66k88J96m33L65J60
$$ plain form
7698 227 4 177 -206 -109 -25 -359 228 67 52 -404 -53 109 -25 147 244 -80 8 56 12 -174 -16 -95 164
7721 164 24 215 -137 -153 -31 -30 214 -26 -22 354 -158 135 -125 105 -96 245 131 -110 -152 284 159 -176
7743 -176 -6 -132 -7 79 -120 117 169 -44 -56 211 -24 -19 -166 24 -81 -133 -63 -81 -16 -27 -228 285 99
7766 99 -20 -237 -35 102 -56 63 -86 148 -10 20 -95 33 -258 4 -45 237 -65 -303 -206 -50 -126 -9
7788 -9 170 -201 147 77 -8 -293 -141 107 -131 -119 -271 38 68 -20 13 40 -14 -148 -203 -7 -194 -129 -27 -62
7812 -62 -162 -348 261 194 89 70 41 -126 -38 212 138 130 70 -296 -135 -187 -96 46 17 266 -189 200 -89 21
7836 21 95 85 139 -118 342 32 225 -219 107 -300 242 6 14 59 -173 67 159 -166 164 198 -170 -137 -119 -243
7860 -243 -359 -140 176 78 156 -130 269 314 30 77 -269 -280 297 595 -130 -156 110 -178 18 -415 -50 110
7882A10k99L87j14R0l01K64m43K73j82J85J64j26Q2j98l5K36q2J14r4q0J36k35
7904a48K82pn8k51K5J29J74J9o4k71J6j30J24J1K55N2k80J99j04m05K37J50O5
7927B0J8j69Q6Q4j73J72qj23K32j15J98l64R3L3K36j87j0j56J35J06l58L15K14
7950B79j39k70L70l9r3j03j2j86RJ09J2K67j03j40J94q7j02J45o3k03N96k84j91
7973c4j22q5K84K88k60k66K97J04m31M8K12k01K54j1k49L1o3L58j33J1Q0j8j1
7996H3K41n47J86O0k29K7K81l03K07N5j36R4o6L22k00K8l5n6j0j49M3O5J03k3
8020D1L30k66j51l42L42k60J25M63j26m2l21M90l00J0j90L64j54j08P8L05k95
8041gM7k06K95k2M1k13N3l3K11N2l37j32L22j93k00N4J59JJ38R2m7m13L76Kk1
$$ plain form
7882 110 -189 198 84 174 -127 137 -306 -33 -215 -30 134 8 90 -108 -143 93 11 125 31 -49 87 -148
7904 -148 134 127 69 -182 -157 -28 146 165 101 -170 -154 -284 -160 -149 106 158 -122 77 -27 -432 -195 -45 20
7927 20 38 -131 -45 39 -134 38 30 -93 139 24 222 -142 -49 -16 220 33 23 -133 2 108 -250 65 279
7950 279 140 -130 240 201 108 5 -7 -193 -184 -75 -63 204 101 -39 155 68 -34 111 48 -155 441 157 -34
7973 -34 -156 -241 43 331 71 -195 102 206 -225 -177 35 -166 88 77 -172 -141 -204 154 21 32 112 94 83
7996 83 324 -223 -37 23 -206 -179 102 -201 6 61 -75 19 -47 275 75 103 68 12 2 -147 -104 -39 64 41
8020 41 371 105 -46 -388 -46 -306 -181 282 156 114 -207 283 -17 -7 -197 167 13 -95 -17 288 -7
8041 -7 40 -166 129 107 148 -65 -12 -45 166 218 -119 -251 71 -122 -322 -268 -109 -108 30 122 75 -338 38 40 19
8066A9j30L14j27MJ55k63J99j75j83L54k96QJ56L03l17J02on74J09L04J88j88
8088d4J26l6o3L7J09k84j14J55J84J85j25l11J91L5P8q9J22j03k21K19k14J15
8110d8P0k95M10J79l27O1J98o22N61k10M36l04j14l3L4n1k04M57k93O0M63n48
8132a20p4J91nL9J63l5k99L65r7l67K34P2j14p5K33N8j23q6p8m2J22J65j42R2
8156G7M4j66j56K96j0j46M3K4J78j13K02l94J47J73J85ll42J39j03l18L36j45
8178e2o2l3K48J05k86N6j7oJ73m37M34j51P4
$$ plain form
8066 19 -111 203 76 80 235 -28 171 -4 -187 167 -129 -121 35 338 21 123 117 -457 -348 -44 144 -44
8088 -44 82 46 -17 20 129 -155 -269 -114 70 255 130 -181 10 45 123 34 156 53 -168 51 -163 -48
8110 -48 22 -273 137 316 -11 50 248 -374 187 -23 413 109 -5 -38 -4 -55 -259 198 -95 -35 428 -120
8132 -120 -194 -3 -8 31 194 159 -140 225 128 -239 -5 67 -47 -122 111 169 46 -40 -118 -160 -38 127 -15 77
8156 77 121 -45 -201 95 85 -61 -18 6 184 71 273 -121 26 199 384 381 39 178 75 -243 93 -52
8178 -52 -114 -147 101 206 -80 -24 -41 -47 126 -311 123 -28 46
8191D6
$$ Imaginary data points
##PAGE= N=2
##DATA TABLE= (X++(I..I)), XYDATA
0@%%%%%%%%%%oJ2j4J6j6J6k2L0l2L6m4N0n8O9p9Q9j02J18j34J50j68J89k12K37
34A25k66K98l29L64m06M51m98N52o12O76p49Q31r22J025j143J285j452J646j885
53a009K187k580L115l889N118p383J2922m9011r3341N4862M1687k9565o6018R51
67a31954N0240L1405l0467l4132J6767M9681J2785l0366l0410J1676L6295J0233
79c8247m4591m1242K3497N1414q129n5133j3689N4271M8342k0397m6028J7257
91g2675P1835K7462m3848k6663M1030M8819o274m1274j4440L3177L4365j4587
103C6927m0935m904L8753K8677j7106l5799J957M7417K9857l3696m3283K2152
115C0017N4489J834n3891k7474L7659M2903k2095n8072m590N2405K1345m2436
$$ plain form
0 0 0 0 0 0 0 0 0 0 0 0 -6 6 -8 8 -8 8 -14 16 -16 20 -24 26 -32 37 -42 47 -55 63 -71 79 -89 100 -112 125
34 125 -141 157 -172 192 -214 237 -261 291 -321 355 -394 437 -485 540 -603 682 -770 876 -1009
53 -1009 1178 -1402 1713 -2176 2942 -4441 8481 -40530 -133871 -79009 -37322 -66887 -132905 -131954
67 -131954 -81714 -50309 -80776 -114908 -98141 -48460 -35675 -66041 -96451 -84775 -48480 -38247
79 -38247 -82838 -124080 -100583 -49169 -57298 -112431 -126120 -71849 -23507 -43904 -89932 -72675
91 -72675 -840 26622 -17226 -43889 -2859 45960 39686 -1588 -16028 17149 51514 36927
103 36927 -4008 -8912 29841 58518 41412 5613 7570 54987 84844 51148 7865 30017
115 30017 84506 86340 32449 4975 42634 85537 63442 5370 780 53185 74530 32094
127C2094l7003J7222L7510L393l5712k8932J4391L4845j375m1805k5787K5488
139e671L7780p504m7442j5450M8393L9958l2650m8883J6749N5584P703m8463l0123
152c0019K9161L9567j4007m9794j2811L6277K4306k0598l2217Q43L5038K7565
164C3311j6520l3508Q464M7498J8351l6449l3509K0069M2523l992n3143k6851
176c3756L6850L4173k9891m8752N312M4806J6907l0491k8293J9995M3303P008
188C7171l4230j9697K4148L0176p196l7115k0950K2245K9671j7258m7879q748
200d9662M1668K4445l1156l8316J5886N0679J1572m2565k4570L6477M0754j6959
212A8253m3058n168L3210J8651k3479l6142n21L2868J4708k6942k9148J0806L7250
$$ plain form
127 32094 -4909 12313 49823 53216 17504 -11428 2963 37808 36433 -5372 -31159 -5671
139 -5671 32109 24605 -22837 -38287 10106 50064 17414 -31469 -14720 40864 48567 104 -30019
152 -30019 -858 38709 24702 -25092 -37903 -1626 22680 2082 -30135 -29292 5746 33311
164 33311 16791 -16717 -8253 39245 57596 21147 -12362 7707 50230 46238 -6905 -33756
176 -33756 3094 37267 7376 -41376 -36064 8742 25649 -4842 -33135 -13140 30163 37171
188 37171 2941 -16756 7392 37568 30372 -6743 -27693 -5448 24223 6965 -40914 -49662
200 -49662 -7994 16451 -14705 -53021 -37135 13544 25116 -17449 -42019 -5542 35212 18253
212 18253 -24805 -29973 3237 21888 -1591 -37733 -38254 -5386 9322 -17620 -46768 -35962 1288
225A288J2117l0929k8045K3470M5219m641m7805j3421M0879K7763k7425m2030
237d3560N177M1542J2642l6434k8177K2156L5612k917l1039j4023K2238K9630
249A2847m720l4338j2437L0974K7249j8149l6509n4L7383K0634k8756l4712J7576
262b3012M5086K579m0483j7142L2661L2063j4076l6322m860L5167K0551k4526
274G686l0405Q770L2661J0048k3591k2998J1821L5359Q068l2738k1068K5871L4171
287D3655q838l8395j0731L4790K6486k5650m0247Q837M1645P103l6018k1492K1873
300C018L1758k927l1454j2992K5522K6466j2585l0969n362K5805K0258j7585l3927
313a4974j357L6359J5006l3888k9046J9537L5901k387l6282j5238K9402K9978
$$ plain form
225 1288 13405 -17524 -45569 -22099 23120 18479 -29326 -42747 -1868 25895 -1530 -43560
237 -43560 -38383 3159 15801 -20633 -48810 -26654 8958 6041 -24998 -39021 -16783 12847
249 12847 8127 -26211 -38648 -7674 19575 1426 -35083 -35137 2246 22880 -5876 -40588 -23012
262 -23012 22074 24653 -15830 -32972 -311 31752 17676 -18646 -23506 11661 32212 7686
274 7686 -22719 -13949 18712 28760 5169 -17829 -6008 29351 37419 4681 -16387 9484 43655
287 43655 34817 -3578 -14309 20481 46967 21317 -18930 -10093 31552 38655 2637 -18855 3018
300 3018 34776 31849 395 -12597 12925 39391 26806 -4163 -9525 16280 36538 18953 -14974
313 -14974 -16331 20028 35034 1146 -27900 -8363 27538 25151 -11131 -26369 3033 33011
325C3011j6973l6158J083L3403J2904k3470k5000O673K8207Q675k6319k2893J6185
338a0672L0193j144k9458j4604K2337K8924q699l5963o304L5405K0382k6275l0714
351b6592J1065L4018O002l0925k1502K1499L0834p053l2603o932K5607J9410j2511
364A0317k6594m463K6875J7756k0407k9254O389L0973Q081k7699k4560J6041L3936
377A7391k428l7618j2234L1320K3715j9508l0676K991K9369J2048k3674k4694
389c3998J1225K8559J874k5111j6164J5351K4978p8k7694j3852K4998K6822j3035
402C875l1153P58L1352J6090k1863k6633J1371L3861M115l0571j5002K3051K4776
415B4027p597k5888o171K3719K0780j3039k6257K527K7814J2299j8531k1838P429
$$ plain form
325 33011 16038 -20120 -19037 14366 27270 3800 -21200 -14527 13680 22355 -3964 -26857 -10672
338 -10672 19521 18377 -11081 -25685 -3348 25576 16877 -19086 -25390 10015 30397 4122 -26592
351 -26592 -15527 18491 24493 -6432 -27934 -6435 24399 17346 -15257 -22189 3418 22828 10317
364 10317 -16277 -20740 6135 23891 3484 -25770 -19381 11592 19673 -8026 -32586 -16545 17391
377 17391 14963 -22655 -34889 -3569 20146 638 -30038 -27047 2322 14370 -9304 -33998
389 -33998 -22773 5786 7660 -17451 -33615 -18264 6714 6636 -21058 -34910 -9912 16910 3875
402 3875 -27278 -26520 4832 20922 -941 -27574 -16203 17658 21773 -8798 -23800 -749 24027
415 24027 16430 -9458 -15629 8090 28870 15831 -10426 -7899 19915 32214 13683 -8155 -726
428g26K7799P505k6828k0549J9283K8642p967l1055p913K5336K0442j6961l0329
441a3321L497L0193Q527k5873j9451J2817K4157n6k4365j5287J5754K3441o461
454A3572k8117q331K2143J8205j3354k7652j469K8619J4380k5165k4822J4407
466a7584K9841j194k7826j2284K0368K3030q951k7652l197K4830J3983j6308k0934
479b3878L312K2904J0470j8525k0909J0161K7324J947k5373j3435J9171K3669
491A6838p007k7110o131K6378J7347j9261k4421O941K5782N390k1781j7485J2356
504a2164K4126r32k4395r739J9423J9078p490k1888m271K1517J7629j4176k4832
517a8114M021K6953Q039k2637j9235J3093K5301n81k6649j1416K3622K0891j1913
$$ plain form
428 -726 27073 34578 7750 -12799 6484 35126 27159 -3896 -11809 13527 33969 17008 -13321
441 -13321 -9824 20369 28896 3023 -16428 -3611 20546 20490 -3875 -19162 -3408 20033 13572
454 13572 -14545 -22876 -733 17472 4118 -23534 -25003 3616 17996 -7169 -31991 -17584
466 -17584 12257 11063 -16763 -29047 -8679 14351 5400 -22252 -25449 -619 13364 -2944 -23878
479 -23878 -20566 2338 12808 -5717 -26626 -16465 10859 12806 -12567 -26002 -6831 16838
491 16838 9831 -17279 -23410 2968 20315 1054 -23367 -16426 9356 14746 -7035 -24520 -12164
504 -12164 11962 11030 -13365 -23104 -3681 15397 7907 -13981 -18252 3265 20894 6718 -18114
517 -18114 -14093 12860 20899 -1738 -20973 -7880 17421 16840 -9809 -21225 2397 23288 11375
530A1375k3569J666K3906J2317j4575j9319N389K3716O555k0864j6676J1002K1122
543B2045q66k3603j3879J8116K1825r933k6872j560K5891J3359j7565k0152P529
556e665K4686M457k2758j5112J4723J9108n622k2832q411J5012J6102q411k3527
569a8250k682K2260J3145j4859j8909P153K4137P474j9143j5948J4741K4197m151
582A9165k4588o190J9613J5739j1422k1668J39K2476J0875j6622j7033R608K2246
595B2338M123j7507j2069J2336K1129j018k2879q691J9045J6462j1785k3318j423
608c257K0687J1216j8852k1636Q296K2827l39k3322j1983J3563J6859o296k2552
621a4789p159J7036J3112j2649k0499m49J8304Q413j5255j9773M871K1384K520
$$ plain form
530 11375 -12194 -10528 13378 25695 11120 -8199 -2810 20906 27461 6597 -10079 923 22045
543 22045 21179 -2424 -16303 1813 23638 13705 -13167 -14727 11164 24523 6958 -13194 -5665
556 -5665 19021 23478 720 -14392 331 19439 13817 -9015 -17426 -2414 13688 5277 -18250
569 -18250 -20932 1328 14473 -386 -19295 -12142 11995 19469 326 -15622 -881 23316 19165
582 19165 -5423 -11613 8000 23739 12317 -9351 -9212 13264 24139 7517 -9516 92 22338
595 22338 26461 8954 -3115 9221 30350 29332 6453 -2238 16807 33269 21484 -1834 -3257
608 -3257 17430 28646 9794 -11842 -3546 19281 18942 -4380 -16363 -2800 14059 7763 -14789
621 -14789 -21948 -4912 8200 -4449 -24948 -25397 -7093 1320 -13935 -33708 -28837 -7453 -4933
634d933k2653j4985J4231J7731o359k2938o326J8976J4895j2687j9756M458K2347
647a7999P756j3821j2320R553K0263L890j6940j1025J4410J8311n013j9770n456
660b8161J7103J5028r345j9238K485K4449J0897j5119j2447J3172K2552L476j6679
673H173q686J5903J8512p244k0585l050J5879R824j2125j7771N17J8848Q447j4986
687A1656j4501J0369K1081K720j7264r118J4544J8157n906k2752m936J7617R536
700C1203j6225j9786K291J6663M101j6876j4326R263J8994o05j6359o708J3501
713E131J5783m365j8110n343J6817J1857j3507k0021K304J7715M997j7014j4465
726a8221R195J9042l35j8235o755J6218J4748o889j5991j653J5802J0464j1618
$$ plain form
634 -4933 -27586 -42571 -28340 -10609 -16968 -39906 -46232 -27256 -12361 -25048 -44804 -40346 -17999
647 -17999 -10243 -24064 -36384 -26831 -6568 -2678 -19618 -30643 -16233 2078 -2935 -22705 -28161
660 -28161 -11058 3970 -5375 -24613 -22128 2321 13218 -1901 -14348 -1176 21376 24852 8173
673 8173 -513 15390 33902 26658 6073 3023 18902 28726 16601 -1170 -653 18195 26642 11656
687 11656 -2845 7524 28605 31325 14061 4943 19487 37644 31738 8986 4050 21667 31203
700 31203 14978 -4808 -2517 14146 18247 1371 -12955 -3692 15302 14697 -1662 -8370 5131
713 5131 20914 16549 -1561 -6904 9913 21770 8263 -11758 -9454 8261 13258 -3756 -18221
726 -18221 -9026 10016 9681 -8554 -15309 909 15657 8768 -7223 -8876 6926 17390 5772
739E772j6812L543J7570M197j5045j2243Q211J7673P65j7887q469J4761J5680
752A7716p855j8354j896J6149R812j2991j7017M230J8496L329j7011j0191J0881
765d702J5235j165j5296p084J2914J4348p634j7834k435J4903P722j2859j6412
778b0299K259J7578M483j6748j2004J2100J7503j884j5714m964J4888J3607p124
791C681j7248m72J5757O305j3198j4488L144J4218L634j4213j1794R950J7507
804B783n47j5499m172J5470J3361n386j6143m20J6592P704j3830j5109M739J5286
818D829O28j5284j0055R355J5621k236j5341l296J5032J2171o171j3560j67J4975
832F501Q404j1837j5333M353J5723J453j6204j0159J0173J4630k230j6548l453
$$ plain form
739 5772 -11040 -7497 10073 14270 -775 -13018 -4807 12866 13631 -4256 -12725 2036 17716
752 17716 9861 -8493 -10389 5760 15572 2581 -14436 -10206 8290 11619 -5392 -15583 -4702
765 -4702 10533 9368 -5928 -13012 -98 14250 6616 -11218 -13653 1250 8972 -3887 -20299
778 -20299 -18040 -462 4021 -12727 -24731 -12631 4872 2988 -12726 -17690 -2802 10805 3681
791 3681 -13567 -14039 1718 8023 -5175 -19663 -16519 -2301 1333 -12880 -24674 -14724 2783
804 2783 2236 -13263 -17435 -1965 11396 6010 -10133 -10553 6039 13743 -87 -15196 -10457 4829
818 4829 5457 -9827 -19882 -10527 5094 2858 -12483 -15779 -747 11424 5253 -8307 -8474 6501
832 6501 14905 3068 -12265 -7912 7811 9264 -6940 -17099 -6926 7704 5474 -11074 -14527
845a4527J6235J2018p921j3981K771J5626O377j1888j2409M693J5301J025j5113
858a793q856J0119J3216k208j3922m493J3986J2843p377j4855K164J6118N860
871B0802j3358j1486N576J4306K46j5345q637J0323J2498m254j3912k329J2444
884F874J0538o641j3716O90J5263N642j2533j1903M921J3312L95j5157r196R570
898a941J3243m964j4871k007J3855R258p852j2304K381J4899N266j2285j0819
911h141O791J2779j012j3930p577R195J1558m094j4297k780J3688R160q008j2672
925i340L010J4330N685j2470j1709P297J4155j713j5142o135R666J0211m981j3962
939a1098k438J2541Q429q975j2231K649J2991L953j0911j0684N532J3539m87j4680
$$ plain form
845 -14527 1708 13726 5805 -8176 -5405 10221 16598 4710 -7699 -3006 12295 13320 -1793
858 -1793 -10649 -530 12686 10478 -3444 -7937 6049 18892 11515 -3340 -1176 14942 20802
871 20802 7444 -4042 1534 15840 16086 741 -7896 2427 14925 10671 -3241 -5570 6874
884 6874 17412 10771 -2945 -2255 13008 18650 6117 -5786 -865 12447 12842 -2315 -11511 -1941
898 -1941 11302 6338 -8533 -10540 3315 12573 4721 -7583 -5202 9697 14963 2678 -8141
911 -8141 -1350 11429 10417 -3513 -11090 -1895 9663 5569 -8728 -11508 2180 11340 3332 -9340
925 -9340 -6330 8000 13685 1215 -10494 -3197 10958 9245 -5897 -12032 -2366 7845 2864 -11098
939 -11098 -13536 -995 7434 -1541 -13772 -11123 1868 5821 -5090 -15774 -10242 3297 2810 -11870
953a1870o937J0765J0737n284j3458j427J3014Q191q735j1685L715J4064L131
966D221j1532q125O260J2282k2j2963o411J1231J0971m404j1831m91J2958Q685
980A0829p521j1239L413J5098L861j1945q548P642J2059j657j2585o006J0199
993C600J0558o071j2882M69J2661O253p594j0732L706J2954M040j1952q833P345
1007C522J1271k111j3518n882Q898R492o252j4296p77J2709N670r492j0419M255
1021f930J2425K768j0617p791P380J1673k693j2524l939Q978Q446n519j2387j426
1035a2156J1504O661r301j0251M253J2320K644j0045p441P797J2452j844j2358
1048e765k893J0819Q466o280j0968r1J0811N896r353j0139M459J2125J304j0932
$$ plain form
953 -11870 -18807 -8042 2695 -2589 -16047 -17474 -4460 3731 -5004 -16689 -12974 1090 4221
966 4221 -7311 -15436 -9176 3106 3084 -9879 -16290 -5059 5912 1508 -10323 -10814 2144 10829
980 10829 3308 -7931 -4518 10580 14441 2496 -6052 1590 13649 11992 -593 -6599 3600
993 3600 14158 8087 -4795 -4326 8335 14588 6994 -3738 -32 12922 16962 5010 -3823 3522
1007 3522 14793 12682 -836 -6718 2180 11672 5420 -8876 -9653 3056 8726 -766 -11185 -6930
1021 -6930 5495 8263 -2354 -10145 -2765 8908 6215 -6309 -10248 -1270 7176 1657 -10730 -12156
1035 -12156 -652 6009 -3292 -13543 -9290 3030 5674 -4371 -11812 -4015 8437 6593 -5765
1048 -5765 -8658 2161 10627 4347 -6621 -6712 4099 9995 642 -9497 -5038 7087 8391 -2541
1062b541o296O771J1267j530j2059l442J0721Q668o289j0791L57J1684N146r313
1076B353j0355M598J1716Q00j2153o187P944R262k560j1095l303R747Q477o130
1090C114j1020J172J1647M573q502r021L777J1916J671j1985p049Q576R688l654
1104D903j1432l081R757P406o012j0936J731J1144M476r043p614M229J0830J357
1118G715j0013o614P647J0052l218j1550k563R653O748o172j0831J301J1211M263
1132G629r332p756N424J0790J3r614m659P458R245k718j1184j687J0229O203o568
1147C473r601J203J0551M288q979q841N515J0859j37j0019m546P769R287l047
1161G775j1365j587J0304O723p646r708K550R953L026r307p714M634J0127n50
$$ plain form
1062 -2541 -8837 -2066 9201 7671 -4388 -7830 2891 11559 5270 -5521 -5164 6520 11666 2353
1076 2353 -8002 -3404 8312 9112 -3041 -9228 -1284 7978 5418 -5677 -8980 767 9244 3114
1090 3114 -7906 -6734 4913 9486 984 -8037 -4260 7656 9327 -2658 -9707 -1131 8557 4903
1104 4903 -6529 -9610 147 7553 1541 -9395 -7664 3480 7956 -1087 -8701 -4472 6358 7715
1118 7715 -2298 -8912 -1265 8787 5569 -5981 -8544 1109 7857 1685 -9146 -7845 3366 7629
1132 7629 -1703 -9459 -4035 6755 6768 -2846 -7505 -47 9198 6480 -4704 -6391 3838 10041 3473
1147 3473 -6128 -4925 5626 9914 935 -7906 -2391 8468 8331 -1688 -6234 1535 10822 7775
1161 7775 -3590 -5177 5127 11850 4204 -5504 -2954 6999 10025 718 -6996 -2362 7765 7215
1175G215j0719m396P630Q402l795j0413j724R620O491p195r837K319J0869J995
1189F462r261p127M990R421q32j0680m137P869P728m280r834m59Q766N738o097
1204a733r124K221J0700K364q856o434N253R292j013r590m397Q304Q037m393j0496
1219i865L80R806M705o448q088L019R979K671r033o064O274R292j911q717l269
1234g269P858P608m165r977p1J0236M477p030p852L304J0030K520r190o253O521
1249G47R529k053r690k370P840O678m191r551n0Q902M919p695p998L401R070J285
1265H773q215n665N528Q564j616r872k680Q084O589n395q867O0Q577L863p410
1280C18p994L368R320R4q260n219N393Q491j873q799k614P853O666m842q465N47
$$ plain form
1175 7215 -3504 -7900 -270 8132 4337 -6076 -7800 1820 8311 1116 -8721 -6402 4467 6462
1189 6462 -2799 -9926 -4936 4485 3653 -7027 -11164 -3295 4433 153 -9681 -10140 -1374 4364 -1733
1204 -1733 -10857 -8636 2064 4428 -4428 -10862 -5609 3683 2670 -6920 -11317 -3013 5024 631 -9865
1219 -9865 -9485 321 5026 -1422 -9510 -6491 3488 6159 -2874 -8938 -2664 6628 4717 -4000 -7269
1234 -7269 589 8197 4032 -5945 -6016 4220 8697 1667 -6185 -2881 7149 9669 479 -5774 747
1249 747 10276 8223 -1467 -3837 4003 10681 6490 -3061 -3111 5791 10710 3015 -4983 -1582 7488 8773
1265 8773 558 -5107 421 8985 7369 -2503 -5183 2901 9490 4095 -4772 -4712 3865 7728 318
1280 318 -7676 -4308 5012 5106 -3154 -8373 -2980 5511 3638 -5161 -7775 78 6744 1902 -6563 -6016
1296f016Q638M051o860q083L664R615N01r120m824O810P791k229q376k398Q944
1311B108O355n322q211J625Q922L302p190o672L070Q654J032q911n289O641P771
1326G885l145q231k329P929O127n365q888J669R438K596p617o737M284P821k0
1341E417q756n026O094P269l043q519j562P642N326n042q167J075R099L184p522
1356b531o358M710P899o7q413m047O376P524k772q791q14Q417M775m865p323J616
1372d664Q580L024p517o128M876Q178o24q150l835O457P014k985q253r59Q378
1387C392N018n822p354K108Q202K011p260o273M467Q058j378q534l442O449O115
1402E757l534p884j171P829N091n465p722K367Q452J680o991n724L920Q049p31
$$ plain form
1296 -6016 2622 6673 -187 -8270 -4606 5009 5510 -3610 -8434 -1624 6167 3938 -4438 -6836 2108
1311 2108 8463 3141 -5070 -3445 5477 8779 1589 -5083 -2013 6641 7673 -1238 -6527 114 7885
1326 7885 4740 -3491 -5820 2109 8236 2871 -6017 -4348 5090 7686 69 -6668 -2384 5437 5417
1341 5417 -3339 -8365 -2271 4998 1955 -6564 -8126 -484 4842 -200 -8367 -7292 1807 4991 -2531
1356 -2531 -8889 -4179 3720 3653 -4760 -8807 -2431 5093 2321 -6470 -7284 1133 5908 1043 -6280 -4664
1372 -4664 3916 6940 -577 -6705 -1829 6349 5725 -2425 -6260 197 7211 4226 -4027 -4986 3392
1387 3392 8410 2588 -4766 -2658 5544 7555 295 -5978 -1511 6547 5169 -3365 -6807 -358 5757
1402 5757 2223 -5661 -6832 997 6088 623 -7099 -4732 3720 5400 -1591 -7315 -3395 4654 3923
1417C923q814l227O735N915l613p588l30P664M550n509o852K956Q449J309o698
1432a130m917M721P269q87q404l149O733O103l694q025J01P333M397n341o531
1447e421K194Q821J287p520m454M955O605j221p722k866O134N976l980p828J85
1462d855Q034L660o080n842K597Q243J227p339m506N246P022j897p783k566O427
1477A588N493l667q234Q12Q055L171n886o102L559P442J133o753m500M826P087
1492H024k416p645k367O298M912m328p494r3P450L458o135o128L318P326O22p095
1508b293l784N024O435k411p936k213O180M582m388p106L05O655L170n755n985
1523i520L342P773N45o665l600N475O547j749p346j595O797M717m643o868J190
$$ plain form
1417 3923 -4891 -8118 -1383 4532 919 -6669 -6999 665 5215 -294 -7146 -4190 4259 5568 -1130
1432 -1130 -6047 -1326 5943 5056 -3348 -6497 236 6339 2645 -5380 -5279 2054 6451 1110 -5421
1447 -5421 -3227 5594 6881 -639 -5093 -138 6467 5246 -2476 -5342 792 6768 2788 -5040 -4855
1462 -4855 3179 6839 759 -5083 -2486 5757 6984 -355 -4861 385 7407 5510 -2273 -4839 1588
1477 1588 7081 3414 -4820 -4008 4047 7218 1332 -4770 -1211 6231 7364 611 -3889 937 8024
1492 8024 5608 -2037 -4404 1894 6806 2478 -5016 -5109 2341 5799 -336 -6464 -3146 4180 4802 -2293
1508 -2293 -6077 -1053 5382 2971 -4965 -7178 -998 3584 -804 -7910 -7605 -950 2220 -3535 -9520
1523 -9520 -6178 1595 2140 -4525 -8125 -2650 3897 2148 -5198 -6793 4 4721 78 -6790 -5600
1538e600P346K288n507n234L422P636P27o861l113O018O206k233o508j292O634
1553C929M827m602o671J176P151K217o002m875L145O916J35p400l543N640N955
1568G998k745p246q40O110L558m209o585J075O907J965o268n153L079O702l40
1583D008o992l075N004N487k931p071j019O536L125m906n801J496P010J824o076
1598c381m414M011O422l61o519k105N062N541k438o964q62O562L293m674o045
1613f872J871O634J686n690m353M110O914p72n953k123N881N222l212o204j54
1628c015O420L331n265n959J688O849P14n885m150M013O175l19p008j805O403
1643B187M921l048o224O6O079L812n382o002K034O551M65o212m266L981N521q10
$$ plain form
1538 -5600 1746 4034 -1473 -6707 -3285 4351 5078 -1783 -4896 1122 7328 5095 -1413 -2705 3929
1553 3929 8756 4154 -2517 -1341 5810 8027 2025 -2850 295 7211 7346 -54 -3597 2043 7998
1568 7998 5253 -1993 -2833 3277 6835 2626 -3959 -2884 4023 5988 -280 -5433 -2354 4348 4008
1583 4008 -2984 -6059 -1055 4432 1501 -5570 -6589 -53 3072 -1834 -7635 -6139 871 2695 -3381
1598 -3381 -7795 -3784 2638 2277 -4242 -6347 -1285 4256 1818 -5146 -6008 554 3847 -827 -6872
1613 -6872 -5001 1633 3319 -2371 -6724 -2614 4300 3528 -2425 -4548 1333 6555 3343 -2861 -3015
1628 -3015 3405 6736 1471 -4488 -2800 4049 4763 -1122 -5272 -1259 4916 4597 -2411 -4216 2187
1643 2187 7108 4060 -2164 -2098 3981 7793 2411 -3591 -1557 4994 5459 -753 -5019 -1038 4483 3673
1659C673o458k216N524M804k974o011M39N807K924m576n279K068O300O21o211
1674a565m080M387N091j097o595j815M907M642k995o359J032O225K305m600m619
1689e136K289O425O64n996l665M700N270j652n924j492N047M048l105n952N15
1704c964O505K316n083m429K473N958L69n465l076M376N708k056n878j104N437
1719B087L620l373n845N33N844K272n322m592K530O056j06n452l662M806N260
1734D656k156n972r73O002L727m118n043N53O125J938n353m470K313N923o70n620
1750c138k663M425M750j780n787q49N578M169m043n176J468N595J842m808m073
1765d490K461N931o61o052j941M167M711k503n294q02N761L141m012m931J899
$$ plain form
1659 3673 -2785 -5001 523 5327 2353 -3658 -3219 2588 5512 936 -4343 -2275 4025 4646 -1565
1674 -1565 -5645 -1258 3833 2736 -3859 -5674 -767 3875 880 -5479 -4447 1778 4083 -517 -5136
1689 -5136 -2847 3578 4242 -1754 -5419 -719 4551 2899 -3025 -4517 530 4578 1473 -4479 -3964
1704 -3964 2541 4857 -226 -4655 -2182 3776 4145 -1320 -4396 -20 5688 3632 -2246 -3350 2087
1719 2087 5707 2334 -3511 -2978 2866 5138 -184 -4776 -2246 3810 3704 -1748 -5410 -604 4656
1734 4656 2500 -3472 -4445 1557 5284 1166 -3877 -3324 2801 4739 -614 -5084 -2771 3152 2482 -3138
1750 -3138 -5801 -1376 3374 1594 -4193 -5042 536 4705 662 -4514 -3046 2549 4391 -417 -4490
1765 -4490 -2029 3902 3241 -2811 -4752 -585 4126 1623 -3671 -4473 1288 4429 417 -4514 -2615
1780b615N716J492m661l974L084N653q79n971k070M607M172k361n346o40N467
1795A674L233m324m649J448N828J187n027l221L351N297p08n370k216M825M048
1810E376k672n597L84M860K654l974m361J339M997J416n014l457L080N657j294
1825C394n592j494M456L613k088n873K07N399K024l987m634J821M920J046m765
1840a553l574K865M892q04n623j294M512L697k480n520L85N039K828m453l576
$$ plain form
1780 -2615 3101 4593 -68 -4042 -958 4695 3816 -2155 -4225 382 4554 2193 -3153 -3793 1674
1795 1674 4907 583 -4066 -2618 3210 4397 -630 -3851 -500 4797 4089 -1281 -3497 1328 5376
1810 5376 2704 -2893 -2509 2351 5005 1031 -3330 -1991 3006 4422 -592 -4049 -969 4688 3394
1825 3394 -2198 -3692 764 4377 2289 -3584 -3377 2022 4046 59 -4575 -2754 2166 3212 -1553
1840 -1553 -5127 -2262 2630 1826 -3797 -5091 -579 3118 638 -4882 -4497 542 3370 -1083 -4659
$$ [...]
8191F5
##END NTUPLES=NMR FID
##END=
