##TITLE=1H_SA_31.186
 D2O, 8 sc, 
 3.3.2020
##JCAMPDX= 6.0         $$ Bruker NMR JCAMP-DX V2.0
##DATA TYPE= NMR FID
##DATA CLASS= NTUPLES
##ORIGIN= UXNMR, Bruker Analytische Messtechnik GmbH
##OWNER= root
$$ XWIN-NMR		Version 3.5
$$ Tue Mar  3 14:36:15 2020 Russian Standard Time (UT+4h)  she@DPX200
##.OBSERVE FREQUENCY= 200.1315
##.OBSERVE NUCLEUS= ^1H
##.DELAY= (6, 6)
##.ACQUISITION MODE= SIMULTANEOUS
##.ACQUISITION SCHEME= undefined
##.AVERAGES= 8
##.DIGITISER RES= 18
##SPECTROMETER/DATA SYSTEM= spect
##.PULSE SEQUENCE= zg30
##.SOLVENT NAME= D2O
##.SHIFT REFERENCE= (INTERNAL, D2O, 0, 15.7039)
##AUDIT TRAIL= $$ (NUMBER, WHEN, WHO, WHERE, WHAT)
$$ ##TITLE= Audit trail, XWIN-NMR		Version 3.5
$$ ##JCAMPDX= 5.01
$$ ##ORIGIN= Bruker BioSpin GmbH
$$ ##OWNER= she
$$ F:/spectra/data/she/nmr/H-F/1/audita.txt
$$ ##AUDIT TRAIL=  $$ (NUMBER, WHEN, WHO, WHERE, WHAT)
(   1,<2020-03-03 14:34:31.35 +0400>,<she>,<DPX200>,
      <created by zg, POWCHK disabled, PULCHK disabled
       configuration hash MD5:
       00 E9 B6 7A A2 85 ED C7 34 08 36 98 17 FE 4E 26
       data hash MD5: 16K
       11 BD 8F 32 78 6A CC 16 51 66 2D 0D 57 62 D1 FF>)
$$ ##END=
$$ 
$$ hash MD5
$$ 4D EB 6E 7F BC D6 11 CD F8 64 50 0E 9A 9B 4D C5
##$RELAX= 
##$RELAX= 
##$RELAX= 
##$RELAX= 
##$RELAX= 
##$RELAX= 
$$ Bruker specific parameters
$$ --------------------------
##$DU= <F:/spectra>
##$EXPNO= 1
##$NAME= <H-F>
##$PROCNO= 1
##$TYPE= <nmr>
##$USER= <she>
##$AMP= (0..31)
100 100 100 100 100 100 100 100 100 100 100 100 100 100 100 100 100 100 
100 100 100 100 100 100 100 100 100 100 100 100 100 100 
##$AQSEQ= 0
##$AQ_mod= 1
##$AUNM= <au_zg>
##$AUTOPOS= <>
##$BF1= 200.13
##$BF2= 200.13
##$BF3= 200.13
##$BF4= 200.13
##$BF5= 200.13
##$BF6= 200.13
##$BF7= 200.13
##$BF8= 200.13
##$BYTORDA= 1
##$CFDGTYP= 0
##$CFRGTYP= 5
##$CHEMSTR= <none>
##$CNST= (0..31)
1 1 145 1 1 1 1 1 1 1 1 1 1 1 1 1 1 1 1 1 1 1 1 1 1 1 1 1 1 1 1 1 
##$CPDPRG= <>
##$CPDPRG1= <>
##$CPDPRG2= <>
##$CPDPRG3= <>
##$CPDPRG4= <mlev>
##$CPDPRG5= <mlev>
##$CPDPRG6= <mlev>
##$CPDPRG7= <mlev>
##$CPDPRG8= <mlev>
##$CPDPRGB= <>
##$CPDPRGT= <>
##$D= (0..31)
0 1.2 0 0 0 0 0 0 0 0.06 0 0.03 0 0 0 0 0.0002 0 0 0 0 0 0 0 0 0 0 0 0 
0 0 0 
##$DATE= 1583231670
##$DBL= (0..7)
120 120 120 120 120 120 120 120 
##$DBP= (0..7)
150 150 150 150 150 150 150 150 
##$DBP07= 0
##$DBPNAM0= <>
##$DBPNAM1= <>
##$DBPNAM2= <>
##$DBPNAM3= <>
##$DBPNAM4= <>
##$DBPNAM5= <>
##$DBPNAM6= <>
##$DBPNAM7= <>
##$DBPOAL= (0..7)
0.5 0.5 0.5 0.5 0.5 0.5 0.5 0.5 
##$DBPOFFS= (0..7)
0 0 0 0 0 0 0 0 
##$DE= 6
##$DECBNUC= <off>
##$DECIM= 24
##$DECNUC= <off>
##$DECSTAT= 4
##$DIGMOD= 1
##$DIGTYP= 9
##$DL= (0..7)
0 120 120 120 120 120 120 120 
##$DP= (0..7)
150 150 150 150 150 150 150 150 
##$DP07= 0
##$DPNAME0= <>
##$DPNAME1= <>
##$DPNAME2= <>
##$DPNAME3= <>
##$DPNAME4= <>
##$DPNAME5= <>
##$DPNAME6= <>
##$DPNAME7= <>
##$DPOAL= (0..7)
0.5 0.5 0.5 0.5 0.5 0.5 0.5 0.5 
##$DPOFFS= (0..7)
0 0 0 0 0 0 0 0 
##$DQDMODE= 0
##$DR= 18
##$DS= 0
##$DSLIST= <SSSSSSSSSSSSSSS>
##$DSPFIRM= 0
$$ [...]
##$SUBNAM2= <"">
##$SUBNAM3= <"">
##$SUBNAM4= <"">
##$SUBNAM5= <"">
##$SUBNAM6= <"">
##$SUBNAM7= <"">
##$SUBNAM8= <"">
##$SUBNAM9= <"">
##$SW= 24.9337058887773
##$SWIBOX= (0..15)
0 0 2 0 0 0 0 0 0 0 0 0 0 0 0 0 
##$SW_h= 4990.01996007984
##$TD= 16384
##$TD0= 1
##$TE= 0
##$TE2= 300
##$TE3= 300
##$TEG= 300
##$TL= (0..7)
0 120 120 120 120 120 120 120 
##$TP= (0..7)
150 150 150 150 150 150 150 150 
##$TP07= 0
##$TPNAME0= <>
##$TPNAME1= <>
##$TPNAME2= <>
##$TPNAME3= <>
##$TPNAME4= <>
##$TPNAME5= <>
##$TPNAME6= <>
##$TPNAME7= <>
##$TPOAL= (0..7)
0.5 0.5 0.5 0.5 0.5 0.5 0.5 0.5 
##$TPOFFS= (0..7)
0 0 0 0 0 0 0 0 
##$TUNHIN= 0
##$TUNHOUT= 0
##$TUNXOUT= 0
##$USERA1= <user>
##$USERA2= <user>
##$USERA3= <user>
##$USERA4= <user>
##$USERA5= <user>
##$V9= 5
##$VALIST= <valist>
##$VCLIST= <CCCCCCCCCCCCCCC>
##$VD= 0
##$VDLIST= <DDDDDDDDDDDDDDD>
##$VPLIST= <PPPPPPPPPPPPPPP>
##$VTLIST= <TTTTTTTTTTTTTTT>
##$WBST= 1024
##$WBSW= 4
##$XGAIN= (0..3)
0 0 0 0 
##$XL= 0
##$YL= 0
##$YMAX_a= 399132
##$YMIN_a= -241602
##$ZGOPTNS= <>
##$ZL1= 120
##$ZL2= 120
##$ZL3= 120
##$ZL4= 120
##$ABSF1= 10
##$ABSF2= 0
##$ABSG= 5
##$ABSL= 3
##$ALPHA= 0
##$AQORDER= 0
##$ASSFAC= 0
##$ASSFACI= 0
##$ASSFACX= 0
##$ASSWID= 0
##$AUNMP= <proc_1d>
##$AZFE= 0.1
##$AZFW= 0.1
##$BCFW= 1
##$BC_mod= 2
##$BYTORDP= 1
##$COROFFS= 0
##$CY= 11.3945322036743
##$DATMOD= 1
##$DC= 2
##$DFILT= <>
##$DTYPP= 0
##$F1P= 16.9975609425685
##$F2P= -3.02152046262296
##$FCOR= 0.5
##$FTSIZE= 0
##$FT_mod= 4
##$GAMMA= 1
##$GB= 0.15
##$INTBC= 1
##$INTSCL= 1
##$ISEN= 128
##$LB= 0.24
##$LEV0= 0
##$LPBIN= 0
##$MAXI= 10000
##$MC2= 0
##$MEAN= 0
##$ME_mod= 0
##$MI= 1.114404
##$NCOEF= 0
##$NC_proc= 0
##$NLEV= 6
##$NOISF1= 3.799351
##$NOISF2= 2.8
##$NSP= 1
##$NTH_PI= 0
##$NZP= 0
##$OFFSET= 15.70392
##$PC= 1
##$PHC0= -9792.492
##$PHC1= 12.40082
##$PH_mod= 1
##$PKNL= yes
##$PPARMOD= 0
##$PSCAL= 0
##$PSIGN= 0
##$REVERSE= no
##$SF= 200.130013532006
##$SI= 16384
##$SIGF1= 3
##$SIGF2= 2
##$SINO= 400
##$SIOLD= 16384
##$SREGLST= <1H.CDCl3>
##$SSB= 0
##$STSI= 0
##$STSR= 0
##$SW_p= 3612.71676300578
##$SYMM= 0
##$S_DEV= 0
##$TDeff= 0
##$TDoff= 0
##$TI= <>
##$TILT= no
##$TM1= 0
##$TM2= 0
##$TOPLEV= 0
##$USERP1= <user>
##$USERP2= <user>
##$USERP3= <user>
##$USERP4= <user>
##$USERP5= <user>
##$WDW= 1
##$XDIM= 8192
##$YMAX_p= 0
##$YMIN_p= 0
$$ End of Bruker specific parameters
$$ ---------------------------------
##NTUPLES= NMR FID
##VAR_NAME=  TIME,          FID/REAL,        FID/IMAG
##SYMBOL=    X,             R,               I
##VAR_TYPE=  INDEPENDENT,   DEPENDENT,       DEPENDENT
##VAR_FORM=  AFFN,          ASDF,            ASDF
##VAR_DIM=   8192,          8192,            8192
##UNITS=     SECONDS,       ARBITRARY UNITS, ARBITRARY UNITS
##FACTOR=    0.0002004,     1,               1
##FIRST=     0,             0,               0
##LAST=      1.6414764,     0,               0
##MIN=       0,             -241602,         0
##MAX=       1.6414764,     399132,          0
$$ Real data points
##PAGE= N=1
##DATA TABLE= (X++(R..R)), XYDATA
$$ [...]
$$ plain form
2695 -3892 -734 -1132 1315 7287 8052 1733 -2669 -2553 -3102 -5530 -2038 5934 7785 2545 -613 94
2711 94 -2575 -7875 -6222 1199 5264 3680 3297 3723 -720 -7486 -7202 -1371 1514 222 2572 5580
2727 5580 2277 -5802 -8338 -5481 -3725 -3559 870 6336 4461 -2348 -3898 -2450 -4352 -6278 -1382
2742 -1382 6636 7236 2818 884 190 -4345 -7862 -4070 2665 3675 1832 3109 3838 -2021 -8296 -6510
2758 -6510 -791 1352 1964 5269 7018 2051 -4507 -4596 -2040 -2806 -2525 3186 7848 3787 -3020 -4623
2774 -4623 -4206 -6368 -6820 -1282 4725 3472 266 112 -847 -5944 -8888 -3092 3567 3831 2392 3505
2790 3505 2819 -2971 -7675 -5184 -877 12 1551 5834 6549 3 -5150 -4261 -1243 -1478 -276 5849
2806 5849 8846 5256 347 -943 -1976 -4748 -3451 3080 7068 4597 1301 1009 -613 -5901 -6945
$$ packed form
2695c892L158l98K447N972P65o319m402J16n49k428L492P972J851n240l158P07
2711I4k669n300J653P421M065j584l83M26m443o766K84N831K885j292K350L008
2727E580l303q079k536K857J756J66M429N466j875o809j550J448j902j926M896
2742a382Q018O00m418j934o94m535l517L792O735J010j843J277P29n859o275J786
2758f510N719K143O12L305J749m967o558q9K556p66K81N711M662m061o807j603
2774d623M17k162m52N538O007j253l206j54r59n097k944N796O659K64j439J113
2790C505o86n790m704K491M307Q89J539M283P15o546n153Q89L018k35J202O125
2806E849K997l590m909j290j033k772J297O531L988k471l296k92j622n288j044
$$ plain form
2821 -6945 -1591 3230 3474 3210 4739 1891 -4330 -7125 -3502 -115 -18 1702 5416 4449 -1816 -6245
2837 -6245 -5216 -4309 -4016 -385 4652 5819 1181 -2027 -1816 -3021 -5320 -2725 3892 7011 4700 2568
2853 2568 1896 -1663 -5641 -4958 453 3498 2875 3792 4456 1209 -4594 -6365 -2785 19 1401 3669
2869 3669 6307 4012 -1920 -4690 -3724 -3379 -3601 167 4912 4485 -94 -3503 -4009 -5788 -7046 -3285
2885 -3285 1783 3579 1891 822 -40 -3769 -6996 -5100 -179 2576 2775 3590 2691 -846 -5389 -5918
2901 -5918 -3179 -1229 938 4153 5831 2961 -2018 -3488 -2957 -2619 -815 2992 6782 6010 1999 -491
2917 -491 -2166 -4628 -4706 -604 3196 3982 2328 865 -1036 -4853 -6578 -4518 -286 1905 2617 3250
2933 3250 2350 -2168 -5422 -5274 -2844 -1016 1120 3745 4043 747 -3364 -4890 -4664 -4425 -1630 2504
$$ packed form
2821f945N354M821K44k64J529k848o221k795L623L387R7J720L714r67o265m429
2837f245J029R07K93L631N037J167m638l208K11j205k299K595O617L119k311k132
2853B568o72l559l978O83N411L045o23R17O64l247n803j771L580K804J382K268
2869C669K638k295n932k770R66L45k22L768M745m27m579l409n06j779j258L761
2885c285N068J796j688j069q62l729l227J896M921K755J99Q15q99l537m543n29
2901e918K739J950K167L215J678k870m979j470N31L38J804L807L790p72m011k490
2917d91j675k462p8M102L800P86j654j463j901l817j725K060M232K191P12O33
2933C250r00m518l254J48K430J828K136K625K98l296m111j526K26K39K795M134
$$ plain form
2949 2504 4752 3466 1171 -1166 -2734 -3942 -2809 872 4743 5034 4474 2885 -103 -3482 -4758
2964 -4758 -1963 1219 2871 4238 4020 2068 -1779 -4467 -4186 -2256 101 2425 4732 4348 901 -2781
2980 -2781 -4377 -4373 -3657 -861 2098 3918 2285 -249 -2563 -4949 -5754 -3999 -180 3084 3644 3012 1421
2997 1421 -1511 -4299 -4470 -2053 1005 3235 4595 3967 1623 -2028 -4413 -3625 -1432 779 3710 5610
3013 5610 4778 1458 -1264 -2607 -3027 -1684 1251 4596 5270 4027 978 -1674 -3970 -4672 -2608 688
3029 688 2970 3652 2193 133 -3011 -4842 -4852 -2378 616 2659 3812 3078 310 -2975 -4652 -3939
3045 -3939 -2171 216 2897 4231 2756 -174 -2885 -4350 -3878 -1953 976 4079 5023 3424 1029
3060 1029 -1234 -3157 -3122 -956 1933 4443 4985 3769 694 -2340 -4371 -3767 -1374 1525 3680 4131
$$ packed form
2949B504K248j286k295k337j568j208J133L681L871K91n60j589k988l379j276
2964d758K795L182J652J367k18j952l847k688K81J930K357K324K307l84l447l682
2980b781j596MP16K796K959J820j633k534k314k386q05J755L819L264N60o32j591
2997A421k932k788j71K417L058K230J360o28k344l651k385P88K193K211K931J900
3013E610q32l320k722j343m20J343K935L345O74j243l049k652k296p02K064L296
3029F88K282O82j459k060l144j831j0K474K994K043J153p34k768l285j677P13
3045c939J768K387K681J334j475k930k711j465M72J925K929L103R44j599k395
3060A029k263j923L5K166K889K510N42j216l075l034k031O04K393K899K155M51
$$ plain form
3076 4131 3221 105 -2640 -3929 -3266 -1425 1221 3250 3958 2163 -762 -3121 -4531 -4268 -2342 870
3092 870 2993 3193 1924 -310 -3065 -4213 -3728 -807 2593 4502 4620 3650 1312 -1876 -3093 -2091
3108 -2091 241 2587 4394 4668 3015 6 -2791 -3332 -2329 -333 2493 5077 5491 3558 1010 -1137
3124 -1137 -2260 -1917 212 3605 5233 4636 2458 21 -2520 -4505 -3838 -951 1388 2935 2797 1652
3140 1652 -682 -3814 -4261 -2630 -509 1999 3887 4796 2939 -223 -2439 -3017 -1851 -348 2403 4423
3156 4423 4266 1873 -726 -2780 -3583 -3017 -621 2910 4279 4086 2157 460 -2082 -3013 -1719 1188
3172 1188 3770 4642 4750 3173 13 -2753 -3337 -1671 281 2136 3743 4043 1423 -1822 -3555 -3378
3188 -3378 -2934 -956 2411 4415 3305 590 -1306 -2749 -3889 -3367 -90 2738 3810 2533 1131
$$ packed form
3076D131r10l116k745j289O63J841K646K029P08j795k925k359j410K63J926L212
3092H70K123K00j269k234k755j148M85K921L400J909J18r70k338l188j217J002
3108b091K332K346J807K74j653l009k797n41J003J996K826K584M14j933k548k147
3124a137j123L43K129L393J628n97k178k437k541j985O67K887K339J547j38j145
3140A652k334l132m47J631K121K508J888R09j857l162k216n78J166J503K751K020
3156D423j57k393k599k054q03N66K396L531J369j93j929j697k542r31J294K907
3172A188K582Q72J08j577l160k766n84J666J952J855J607L00k620l245j733J77
3188c378M44J978L367K004j110k715j896j443j140N22L277K828J072j277j402
$$ plain form
3203 1131 -437 -2843 -4485 -2210 795 2869 3045 3319 1928 -1340 -3991 -3749 -1973 -623 1505 3908
3219 3908 4148 853 -2113 -3213 -2596 -2013 -8 3154 4929 3710 760 -481 -2045 -3731 -2854 718
3235 718 3361 3298 1856 566 -1519 -4312 -4848 -2312 677 1990 2928 3588 1544 -2083 -3897 -2523
3251 -2523 -514 748 2461 4669 3900 322 -2159 -2323 -2808 -2629 -402 3138 4211 1505 -17 -1310
3267 -1310 -2766 -3969 -2397 1794 3919 3195 2728 1845 -665 -3772 -3270 -109 1627 1996 2886 3479 1078
3284 1078 -3076 -4387 -2728 -1490 -518 1986 4413 2761 -560 -2647 -2087 -2519 -2765 413 4259 4141
3300 4141 1192 -264 -1207 -2963 -4455 -1902 2231 3009 1911 1521 1473 -1522 -4558 -3462 167 1781
3316 1781 1806 3436 3279 565 -3445 -3396 -1461 -1008 -176 2961 4683 2247 -1557 -2704 -1766 -2729 -2249
$$ packed form
3203A131j568k406j642K275L005K074J76K74j391l268k651K42J776J350K128K403
3219C908K40l295k966j100O17N83K005L162J775j219k950j241j564j686Q77L572
3235G18K643o3j442j290k085k793n36K536K989J313R38O60k044l627j814J374
3251b523K009J262J713K208p69l578k481j64m85J79K227L540J073k706j522j293
3267a310j456j203J572M191K125p24m67q83k510l107N02L161J736L69Q90N93k401
3284A078m154j311J659J238R72K504K427j652l321k087N60m32k46L178L846j18
3300D141k949j456r43j756j492K553M133P78j098l90m8k995l036J096L629J614
3316A781K5J630j57k714m010M9J935M53Q32L137J722k436l804j147R38r63M80
$$ plain form
3333 -2249 1033 4546 3417 977 226 -611 -3162 -4093 -1473 2508 2971 1581 1492 510 -3063 -5497 -3543
3350 -3543 -350 443 733 2753 2897 -1257 -4483 -3582 -1974 -1362 -432 2879 3928 870 -2493 -2542 -2660
3367 -2660 -3992 -3174 1058 3687 1903 -639 -879 -1715 -4465 -4126 -212 2912 2202 1901 2551 858 -3162
3384 -3162 -4295 -1663 856 850 1905 3379 2926 -1454 -3993 -2412 -1188 -1220 534 3891 4339 190 -1928
3401 -1928 -1541 -2251 -3467 -1789 2311 3899 1460 -150 -444 -2151 -4496 -3761 75 2237 1333 1214
3417 1214 2388 -180 -3919 -4475 -1089 702 680 2187 3799 1955 -2266 -3558 -1820 -1688 -1428 1189
3433 1189 4511 3690 -13 -1670 -1308 -1999 -2758 -97 3584 4122 1891 1049 653 -1740 -4249 -2378 1437
3450 1437 2735 1727 1710 1568 -1074 -4457 -3647 -1057 -231 129 2153 3493 629 -2920 -3625 -2180 -2077
$$ packed form
3333b249L282L513j129k440p51q37k551r31K620L981M63j390q9r82l573k434J954
3350c543L193P93K90K020J44m154l226R01J608O12R30L311J049l058l363m9j18
3367b660j332Q18M232K629j784k542k40q36k750L39L914L124p10l01O50j693m020
3384c162j133K632K519oJ055J474m53m380k539J581J224l2J754L357M48m149k118
3401a928L87p10j216J678M100J588k439j610k94j707k345P35L836K162r04j19
3417A214J174k568l739n56L386J791k2J507J612j844m221j292J738J32K60K617
3433A189L322q21l703j657L62o91p59K661L681N38k231q42l96k393k509J871L815
3450A437J298j008j7j42k642l383Q10K590Q26L60K024J340k864l549p05J445J03
$$ plain form
3467 -2077 -1416 1496 3831 2270 -717 -2154 -1939 -3559 -3655 -434 2913 2656 799 51 -409 -2688 -4059
3484 -4059 -1608 1615 2179 2358 2713 2012 -1383 -3727 -2881 -371 303 811 2674 3358 301 -2830 -2948
3501 -2948 -2232 -1916 -823 1899 3682 1657 -1335 -1383 -2049 -3317 -2873 22 2598 1490 231 -351 -1381
3518 -1381 -4000 -4585 -1738 822 1135 1300 2404 871 -2228 -3959 -2455 -628 449 1491 3319 3007
3534 3007 -420 -2321 -2349 -1802 -1873 -14 2828 3390 1785 -456 -831 -1983 -2970 -1469 1795 3177 2731
3551 2731 1397 1096 -1020 -3189 -3225 -674 1134 1595 1491 1590 -202 -2834 -3785 -2778 -1309 -178 1366
3568 1366 2875 1842 -857 -2384 -2494 -1821 -1864 117 2314 2613 723 -560 -1507 -2470 -3126 -1482 1587
3585 1587 2837 2332 1535 820 -1118 -2972 -1916 89 1693 2444 2540 2449 211 -2052 -2476 -1515 -392
$$ packed form
3467b077O61K912K335j561k987j437K15j620r6L221L347k57j857p48m60k279j371
3484d059K451L223N64J79L55p01l395k344Q46K510O74N08J863O84l057l131j18
3501b948P16L16J093K722J783k025k992m8o66j268M44K895K576j108j259n82j030
3518a381k619n85K847K560L13J65J104j533l099j731J504J827J077J042J828l12
3534C007l427j901k8N47p1J859K842N62j605k241l75j152r87J501L264J382m46
3551B731j334l01k116k169l6K551J808M61j04R9j792k632r51J007J469J131J544
3568A366J509j033k699j527j10O73m3J981K197K99j890j283r47r63o56J644L069
3585A587J250n05p97p15j938j854J056K005J604P51R6r1k238k263m24R61J123
$$ plain form
3602 -392 632 2067 2910 1534 -758 -2399 -2575 -2290 -1625 695 2770 2251 950 -500 -2104 -2727 -2920
3619 -2920 -922 1185 1799 1433 819 -301 -2346 -3460 -2646 -672 948 1856 2494 1629 -437 -2278 -2571
3636 -2571 -1147 2 1074 2469 3138 1535 -959 -1899 -2129 -1826 -682 1429 2848 2130 817 -425
3652 -425 -1893 -2366 -2240 -178 1457 2190 1915 1050 -767 -2688 -3009 -2108 -672 386 1534 1368 319
3669 319 -1406 -3190 -3032 -2348 -920 670 2044 1928 341 -1300 -2235 -2628 -1822 -222 1291 2657 1899
3686 1899 717 -736 -2148 -2560 -1828 129 1813 2434 1994 1127 -606 -1696 -2310 -941 615 1635
3702 1635 2099 2172 879 -1044 -2131 -2313 -1551 61 1476 1946 1927 670 -1284 -2184 -2300 -1921 173 2102
3720 2102 2399 1674 575 -1140 -2243 -2606 -1850 5 1407 2092 1588 382 -1238 -2280 -2042 -858 612
$$ packed form
3602c92J024J435Q43j376k292j641j76K85O65K320K075n19j301j450j604o23j93
3619b920J998K107O14l66o14j120k045j114Q14J974J620R08O38q65k066j841k93
3636b571J424J149J072J395O69j603k494r40k30L03J144K111J419p18j313j242
3652d25j468m73J26K062J635P33k75q65j817j921l21R01J436J058J148j66j049
3669C19j725j784J58O84J428J590J374j16j587j641r35l93Q06J600J513J366p58
3686A899j182j453j412m12P32J957J684O21m40q67j733j090o14J369J556J020
3702A635M64P3j293j923j087j82P62J612J415M70j9j257j954r00j16L79K094J929
3720B102K97p25j099j715j103l63P56J855J402O85n04j206j620j042K38J184J470
$$ plain form
3737 612 1957 2969 2697 1187 -838 -1339 -1798 -822 706 2102 2930 2141 212 -1230 -1824 -1986 -1365
3754 -1365 356 1692 2166 1777 340 -769 -2248 -2134 -1138 518 2003 2445 1721 169 -1357 -2582
3770 -2582 -2339 -1229 179 1427 2065 1239 -179 -1916 -3108 -2302 -1192 -45 1354 2000 1385 -400
3786 -400 -1390 -2328 -1926 -911 522 1835 2144 1154 -321 -1365 -2278 -2151 -799 422 1866 1818 1231 -123
3804 -123 -1602 -2673 -1809 -683 406 1432 1819 1443 -64 -1891 -2372 -1933 -1030 327 1822 1957 931
3821 931 -415 -1689 -1806 -2025 -820 832 2160 1917 820 -211 -1394 -2330 -2005 -559 815 1481 1599
3838 1599 1281 -92 -1383 -2231 -1171 -83 1106 2317 2566 1525 20 -1380 -1367 -1029 -382 991 1994
3855 1994 2255 955 -516 -1108 -1984 -1848 -519 1562 2166 1905 1031 83 -1132 -2048 -1562 169 1434
$$ packed form
3737F12J345J012k72j510k025n01m59R76J528J396Q28p89j929j442n94j62O21
3754a365J721J336M74l89j437j109j479J14R96J656J485M42p24j552j526j225
3770b582K43J110J408J248O38q26j418j737j192Q06J110J147J399O46o15j785
3786d00r90r38M02J015J433J313L09r90j475j044r13J27J352J221J444m8n87j354
3804a23j479j071Q64J126J089J026L87l76j507j827m81M39R03J357J495J35j026
3821I31j346j274j17k19J205J652J328k43j097j031j183r36L25J446J374O66J18
3838A599l18j373j291q48J060J088J189J211K49j041j505j400J3L38O47J373J003
3855A994K61j300j471n92q76J36J329K081O04k61q74r48j215r16M86J731J265
$$ plain form
3872 1434 1773 2083 1399 44 -2022 -2049 -1110 -480 477 1609 2071 1001 -840 -1955 -1627 -1260 -652 1222
3890 1222 2392 2058 632 -547 -1216 -1765 -1697 125 1687 2046 1372 967 -55 -1726 -2499 -1201 444
3907 444 928 1262 2103 1271 -274 -1784 -1962 -810 58 807 2014 2505 356 -1122 -1488 -1546 -1297 -611
3925 -611 1352 2131 1321 -82 -650 -1357 -1991 -1653 48 1812 1465 941 745 -153 -1773 -2562 -766 69
3943 69 711 1240 1589 813 -949 -2208 -2035 -640 282 825 2322 1915 39 -1304 -1549 -1508 -1064 -127 1683
3962 1683 2011 1011 155 -147 -1239 -2104 -1633 692 1664 1493 1202 1087 -43 -1972 -2348 -397 870
3979 870 834 1284 1707 605 -1323 -2193 -1558 -853 -399 903 2090 1505 -25 -1271 -1378 -1607 -1476 233
3997 233 1783 2104 941 -209 -494 -1429 -2190 -1063 699 1598 1256 1097 737 -622 -2230 -1568 22
$$ packed form
3872A434L39L10o84j355k066k7R39O30R57J132M62j070j841j115L28L67O08J874
3890A222J170l34j426j179o69n49O8J822J562L59o74m05j022j671p73J298J645
3907D44M84L34Q41q32j545j510j78J152Q68P49J207M91k149j478l66n8K49O86
3925f11J963P79q10j403n68p07o34L38J701J764l47n24j96q98j620p89J796Q35
3943F9O42N29L49p76j762j259J73J395R22N43J497m07j876j343k45M1M44R37J810
3962A683L28j000q56l02j092q65M71K325R72j71k91j15j130j929l76J951J267
3979H70l6M50M23j102j928q70O35P05M54J302J187n85j530j246j07k29J31J709
3997B33J550L21j163j150k85r35p61J127J762Q99l42j59l60j359j608O62J590
$$ plain form
4014 22 1168 1024 1815 1921 639 -1515 -1631 -569 -376 383 1675 2587 1474 -180 -976 -754 -1130 -864
4032 -864 733 2115 1978 673 209 -262 -1753 -1836 -465 1148 1219 1211 1023 675 -1476 -2351 -1371 140 328
4051 328 593 1790 1501 -79 -1706 -1601 -1005 -670 -138 1617 2292 985 -529 -919 -777 -1602 -1003 719
4069 719 2315 1323 745 179 -608 -1799 -2102 -154 1489 1011 833 1177 558 -1266 -2208 -1323 225 397
4087 397 749 1523 1220 -799 -2047 -1501 -1499 -760 -178 1276 1784 -56 -1067 -1192 -1377 -1815 -957 973 1604
4106 1604 982 343 -123 -884 -1884 -1862 125 1089 984 817 965 -115 -1576 -1948 -536 275 615 1087
4124 1087 2287 1190 -795 -1861 -1087 -727 -509 184 1632 1683 183 -736 -849 -1414 -1878 -396 1267
4141 1267 1635 816 103 -21 -1017 -1984 -1294 112 1128 898 911 1049 -630 -1880 -1669 -827 -210 572 1597
$$ packed form
4014B2J146j44P91J06j282k154j16J062J93P59J292R12j113j654p96K22l76K66
4032h64J597J382j37j305m64m71j491q3J371J613P1qj88l48k151q75R80J511J88
4051C28K65J197k89j580j627J05N96L35N32J755O75j307j514l90J42q25N99J722
4069G19J596r92n78n66p87j191l03J948J643m78j78L44o19j824r42Q85J548J72
4087C97L52P74l03k019j248N46KP39N82J454N08j840j011j25j85m38Q58J930O31
4106A604o22o39m66p61j000K2J987R64j05j67J48j080j461l72J412Q11L40M72
4124A087J200j097j985j066P74L60K18O93J448N1j500r19j13n65m64J482J663
4141A267L68q19p13j24r96r67O90J406J016k30J3J38j679j250K11Q42O17P82J025
$$ plain form
4160 1597 1498 755 -922 -1309 -795 -503 -309 1068 2225 1826 145 -341 -525 -1414 -1397 -101 1552 1575 608
4179 608 284 101 -1144 -1765 -917 458 878 1306 1362 1010 -472 -1895 -1594 -404 -256 527 1014 1206 10
4198 10 -1375 -1402 -1323 -1138 -496 627 1307 905 -138 -790 -1134 -1456 -1090 -45 1369 1007 754 442 -1002
4217 -1002 -1404 -1804 -794 491 714 830 1128 381 -641 -1634 -771 -378 85 976 1673 980 -155 -1062
4235 -1062 -1481 -936 -1112 -155 1081 1138 642 -168 -779 -1090 -1529 -933 132 957 905 656 -98 -750 -1585 -1754
4255 -1754 -716 124 779 1065 1246 272 -1517 -1686 -671 -420 361 801 1480 1049 67 -1027 -1003 -989 -587
4274 -587 127 1482 1366 771 -129 -773 -1201 -1428 -141 646 1114 770 643 67 -808 -1335 -1204 -187 847
4293 847 1099 1349 924 -210 -1030 -1736 -990 -436 -46 808 1154 492 74 -1111 -1100 -1012 -376 544 1208 1188
$$ packed form
4160A597r9p43j677l87N14K92J94J377J157l99j681m86j84q89J7J296J653K3r67
4179F08l24j83j245o21Q48J375M20M28N6l52j482j423L01J190J48P83M87J92j196
4198A0j385k7P9J85O42J123O80m02j043o52l44l22L66J045J414l62k53l12j444
4217a002m02m00J010J285K23J16K98p47j022r93Q63L93M63Q91O97o93j135r07
4235a062m19N45j76R57J236N7m96q10o11l11m39N96J065Q25n2k49p54o52q35j69
4255a754J038Q40O55K86J81r74j789j69J015K51P81M40O79m31r82j094K4J4M02
4274e87P14J355j16n95r00o44m28k27J287P87M68l44j27n76q75n27J31J017J034
4293H47K52K50m25j134q20p06P46N54L90Q54L46o62m18j185J1Q8O36R20O64k0
$$ plain form
4313 1188 412 -6 -451 -1003 -1114 -347 661 1419 1051 694 94 -803 -1231 -827 179 709 1138 1201 897
4332 897 89 -741 -1394 -660 9 563 1240 1013 480 -328 -903 -1159 -1064 -534 443 1230 929 101 -303 -1083
4352 -1083 -1360 -835 -247 562 1097 996 645 -8 -1039 -1282 -731 31 587 1197 1261 740 -507 -961 -802
4371 -802 -521 33 560 1450 1343 329 -118 -953 -1291 -862 -86 1073 1230 918 570 -249 -813 -1285 -700
4390 -700 63 645 817 939 315 -479 -1488 -1014 -808 -71 452 974 1230 264 -585 -1057 -1233 -1030 -288 746
4410 746 1018 878 302 -275 -1124 -1220 -708 -75 651 1319 735 267 -626 -1042 -1031 -543 -14 743 1001 734 147
4431 147 -448 -950 -988 -445 168 672 709 1038 481 -719 -822 -1128 -528 33 1098 1205 825 416 -203 -907
4451 -907 -1015 -738 73 898 1046 616 6 -487 -1078 -1072 -643 178 852 1088 923 401 -378 -1283 -1036 -369 386
$$ packed form
4313A188p76m18m45n52j11P67J008P58l68l57o00q97m28M04J006N30M29O3l04
4332H97q08q30o53P34O69N54O77k27n33q08n75k56R5N30R77P87l01q28m04p80
4352a083k77N25N88Q09N35j01l51o53j031k43N51P62N56O10O4n21j247m54J59
4371h02K81N54N27Q90j07j014m47q35l38M29P76J159J57l12l48q19n64m72N85
4390g00P63N82J72J22o24p94j009M74K06P37N23N22K56r66q49m72j76K03P42J034
4410G46K72j40n76n77q49r6N12O33P26O68n84m68q93m16J1M88N29P57K58k67n87
4431A47n95n02l8N43O13N04L7L29n57j200j03l06O00N61J065J07l80m09o19p04
4451i07j08K77Q11Q25J48m30o10m93n91OM29Q21O74K36j65n22p79r05K47O67P55
$$ plain form
4472 386 518 1138 859 65 -800 -1149 -611 -327 236 736 1295 937 224 -348 -862 -727 -466 82 1118 610
4492 610 686 -29 -272 -892 -716 -455 497 867 1090 769 -92 -868 -799 -628 -442 107 841 1133 736 195 -896
4513 -896 -920 -824 -294 130 816 775 285 226 -808 -732 -734 -506 362 1008 938 332 -55 -412 -1049 -1283 -411 49
4535 49 605 570 760 108 -819 -1067 -719 -413 345 743 1079 581 -144 -774 -647 -531 -412 321 810 951 373
4556 373 -268 -704 -1172 -697 -354 622 830 598 557 -155 -588 -1074 -568 63 484 877 398 627 -104 -1305
4576 -1305 -1034 -839 -392 93 773 992 516 -621 -682 -818 -587 -32 803 994 998 264 -341 -367 -734 -590 -43
4597 -43 825 852 649 313 237 -737 -1188 -406 231 574 754 626 348 -207 -764 -659 -627 -201 447 947 995 157
4619 157 -502 -499 -979 -675 -316 737 1181 616 139 -78 -750 -976 -1035 235 953 906 384 748 -226 -717 -846
$$ packed form
4472C86J32O20k79p94q65l49N38K84N63N00N59l58p13n72n14J35K61N48J036n08
4492F10P6p15k43o20J76K61R52L70K23l21q61p76O9J71J86N49P34K92l97n41j091
4513h96k4R6N30M24O86m1m90n9j034P6kK28Q68O46p0o06l87l57o37k34Q72M60
4535D9N56l5J90o52r27k48L48L06P58L98L36m98p25o30J27J16J19P33M89J41n78
4556C73o41m36m68M75L43R76K08k32m1p12m33m86N06O31M21L93m79K29p31j201
4576a305K71J95M47M85O80K19m76j137o1j36K31N55Q35J91Mp34o05k6l67J44N47
4597d3Q68K7k03l36p6r74m51P82O37L43J80j28k78n55n57J05L2M26O48N00M8q38
4619A57o59Lm80L04L59J053M44n65m77k17o72k26n9J270P18m7n22L64r74m91j29
$$ plain form
4640 -846 -452 110 598 881 1098 377 -336 -828 -561 -260 -32 553 1059 1439 337 -395 -466 -412 -215 71
4660 71 701 838 567 129 -489 -437 -931 -791 154 903 438 504 427 -338 -723 -1007 -97 355 337 481 568 162
4682 162 -806 -959 -756 -462 -48 771 1013 782 -45 -585 -290 -365 -327 360 897 762 344 -104 -308 -552 -1115
4703 -1115 -264 376 736 715 519 591 -574 -1100 -721 -250 67 377 692 965 263 -927 -877 -440 -433 92 318
4724 318 897 475 -407 -670 -640 -772 -572 165 960 709 523 132 -72 -651 -1005 -331 689 1045 578 584 308
4745 308 -563 -828 -518 192 354 482 1050 626 47 -518 -626 -282 -14 225 1023 923 481 -163 -306 -551
4765 -551 -637 -343 411 934 344 354 51 -404 -877 -723 -41 593 456 415 783 55 -706 -860 -586 129 150
4786 150 580 929 493 -329 -595 -514 -146 -133 192 855 849 452 -342 -206 -442 -633 -479 526 630 259 426
$$ packed form
4640h46L94N62M88K83K17p21p13m92K67L01K28N85N06L80j102p32p1N4J97K86
4660G1O30J37k71m38o18N2m94J40R45P49m65O6p7p65l85k84R10M52j8J44Q7m06
4682A62r68j53K03K94M14Q19K42k31q27n40K95p5L8O87N37j35m18m48k04k44n63
4703a115Q51O40L60k1j96P2j165n26L79M71L17L10L15K73p02j190N0M37PN25K26
4724C18N79m22q82k63L0j32K00P37P95k51j86l91k04n79l54O74J020L56m67Ok76
4745C08q71k65L10P10J62J28N68m24n79n65j08L44K68K39P98j00m42o44j43k45
4765e51q6K94P54N23n90J0l03m55m73J54O82O34j37m1L68p28p61j54K74P15K1
4786A50M30L49m36q22k66Q1L68J3L25O63ol97p94J36k36j91J54J005J04l71J67
$$ plain form
4807 426 29 -354 -933 -539 183 619 434 726 640 -228 -908 -869 -611 -163 216 750 567 405 -320 -645 -484
4828 -484 -452 -392 261 757 465 -107 -298 -582 -626 -670 236 714 741 267 236 39 -576 -829 -479 190 378 689
4850 689 882 364 -122 -791 -669 -224 104 494 660 715 356 -286 -366 -415 -606 20 84 825 448 66 -659
4871 -659 -260 -396 -319 63 601 515 432 91 -381 -711 -947 -659 178 262 646 663 511 -228 -660 -341 -58 373
4893 373 281 747 418 201 -274 -648 110 -754 27 495 867 247 -141 -55 -771 -547 -173 196 646 713 74
4914 74 -103 -376 -437 -504 -409 160 420 103 28 -43 -533 -603 -889 -247 -140 325 516 193 -190 -448 -592 -276
4936 -276 -176 -24 610 337 161 10 -1 -452 -578 -116 215 415 324 219 265 -138 -758 -762 -308 131 261 493
4958 493 590 -135 -479 -523 -542 -246 202 464 574 183 -368 -411 -293 -549 -225 376 641 428 415 -246 -375 -310
$$ packed form
4807D26l97l83n79L94P22M36j85K92q6q68o80L9K58M48L79N34j83j62p25l25J61
4828d84L2O0O53M96k92n72j91k84m4m4R06M78K7m74l1j97o15k53L50O69J88L11
4850F89J93n18m86o69J22M45L28L90J66N5l59o42q0m9j91O26O4P41l77l82p25
4871f59L99j36P7L82N38q6q3l41m72l30k36K88Q37Q4L84J7j52p39m32L19K83M31
4893C73r2M66l29k17m75l74P58q64P81M68L72o20l88Q6p16K24L74L69M50O7o39
4914G4j77k73o1o7R5N69K60l17p5p1m90p0k86O42J07M65J91l23l83k58j44L16
4936b76J00J52O34k73j76j51j1m51j26M62L31K00r1j05M6m03o20mM54M39J30K32
4958D93R7p25l44m4j9K96M48K62J10l91n51m3J18k56L24O01K65k13j3o61j29O5
$$ plain form
4980 -310 -733 -294 323 712 714 125 36 -414 -792 -352 -201 146 412 443 390 -192 -501 -312 -764 -216 291 563
5002 563 255 240 182 -528 -460 -263 -83 417 794 563 105 84 -374 -608 -453 -30 138 391 526 260 -2
5023 -2 -306 -675 -292 176 130 348 344 425 -176 -573 -472 -233 226 425 604 364 105 -201 -270 -804 -481 -42
5045 -42 307 606 507 172 -98 -539 -541 -210 -18 596 441 394 52 -189 -586 -819 -292 168 425 465 497 332
5067 332 -173 -740 -265 -610 76 176 554 478 226 -421 -453 -214 -235 246 242 400 156 176 -170 -421 -528 -372
5089 -372 317 432 423 357 449 63 -427 -365 -266 276 548 428 459 -11 -477 -543 -32 -208 118 359 521 587 235
5112 235 -219 -376 -78 0 163 139 651 279 372 -133 -769 -486 -331 348 542 321 124 -107 -453 -422 -393 71
5134 71 248 678 355 259 406 -443 -487 -123 -62 239 517 292 146 85 -391 -72 -526 -183 268 238 207 369
$$ packed form
4980c10m23M39O17L89Kn89q9m50l78M40J51L47K66L1n3n82l09J89m52N48N07K72
5002E63l08j5n8p10O8J97J80N00L77k31m58k1m58k34J55M23J68K53J35k66k62
5023bl04l69L83M68m6K18mQ1o01l97J01K39M59J99J79k40k59l06o9n34L23M39
5045d2L49K99r9l35k70m41kL31J92O14j55m7l42k41l97k33N27M60K57M0L2j65
5067C32n05n67M75l45O86J00L78p6k52o47l2K39k1M81mJ58k44K0l46k51j07J56
5089c72O89J15ro6R2l86m90O2R9N42K72j20L1m70m66o6N11j76L26K41J62O6l52
5112B35m54j57K98P8J63k4N12l72R3n05o36K83J55O79J94k21j97k31l46L1K9M64
5134G1J77M30l23r6J47q49m4L64O1L01K78k25j46o1m76L19m54L43M51l0l1J62
$$ plain form
5156 369 -77 -204 -418 -453 -79 193 481 264 293 -70 -585 -241 -4 -28 -195 294 545 394 -52 -267 -185
5177 -185 32 23 161 298 305 438 -126 -144 -258 -164 -187 212 359 95 290 -394 -163 -519 -381 24 498 357
5199 357 326 63 82 -440 -452 -173 -106 437 99 532 189 -151 -285 -453 -204 30 284 474 558 166 -182 -408
5221 -408 -204 -187 -195 174 205 275 37 -333 -430 -498 -510 143 50 221 231 341 -30 -371 -520 -138 138 -92 451
5244 451 297 -91 1 -318 -521 -316 -279 277 344 176 64 -226 -380 -285 -84 65 638 426 420 36 -70 -246
5266 -246 -285 -8 -2 450 256 204 79 -332 -267 -130 -202 325 308 384 281 225 -304 -282 -277 -45 63 375 393 268
5290 268 152 -20 -98 -391 -227 36 392 420 274 112 -54 -392 -446 -409 29 500 505 384 -48 -451 -609 -60
5312 -60 -140 -48 410 350 249 113 -193 -394 -324 -313 -1 -23 575 13 -211 -262 -171 -278 -216 284 409 246 99
$$ packed form
5156C69m46j27k14l5L74K72K88k17K9l63n15L44K37k4j67M89K51j51m46k15Q2
5177a85K17rJ38J37PJ33n64j8j14R4k3L99J47k64J95o84K31l56J38M05M74j41
5199C57l1k63J9n22j2K79O7N43l38M33l43l40j34j68K49K34K54J90Q4l92l48k26
5221d08K04J7qL69L1P0k38l70r7o8j2O53r3J71J0J10l71l41j49L82K76k30N43
5244D51j54l88R2l19k03K05L7N56O7j68j12k90j54R5K01J49N73k12ol84j06j76
5266b46l9K77OM52j94n2j25m11O5J37p2N27j7P6j03n6n29K2NK32J08L12J8j25
5290B68j16j72p8k93J64K63L56K8j46j62j66l38n4L7M38M71Nj21m32m03j58N49
5312f0q0R2M58o0j01j36l06k01P0J1L12k2N98n62k24n1R1j07O2N00J25j63j47
$$ plain form
5335 99 112 -359 -380 -314 4 351 123 456 253 138 -294 -206 -79 -108 98 248 275 270 16 -312 -293 -66 -125 78
5359 78 412 237 45 -110 6 -398 -469 124 79 423 27 200 -49 -361 -227 -157 172 191 302 432 407 -92
5381 -92 -570 -232 -166 -48 -451 188 457 -44 -7 -449 -204 -211 12 128 463 617 -198 -222 -262 167 -316 -47
5403 -47 -81 300 55 -89 -345 -342 -335 -131 -36 193 90 337 100 44 -201 -422 -223 -95 240 310 433 -232 -146
5426 -146 -301 -104 -185 102 197 447 84 150 -55 -148 -185 -114 -9 133 336 55 177 -294 -194 -291 90 -38
5448 -38 89 416 335 73 -81 -407 -269 -277 2 234 286 288 -91 -270 -192 -338 -192 37 121 691 223 -43 -89
5471 -89 -96 -251 -497 154 444 203 254 -87 -74 -452 -113 -208 120 83 44 319 -251 -73 -295 -174 56 159 169
5494 169 405 285 -12 -39 33 -263 -182 489 201 398 478 -349 10 -154 -346 14 26 391 2 502 64 -133
$$ packed form
5335I9J3m71k1O6L18L47k28L33k03j15m32Q8J27k9K06J50K7nk54l28J9K27n9K03
5359G8L34j75j92j55J16m04p1N93m5L44l96J73k49l12J34P0L29J9J11J30k5m99
5381i2m78L38O6J18m03O39K69n01L7m42K45pK23J16L35J54q15k4m0M29m83K69
5403d7l4L81k45j44k56LPK04R5K29j03K47k37n6k45k21J99J28L35P0J23o65Q6
5426a46j55J97q1K87R5K50l63O6k05r3l7P1J05J42K03k81J22m71J00r7L81j28
5448c8J27L27q1k62j54l26J38qK79K32N2Kl79j79P8j46J46K29Q4N70m68k66m6
5471h9pj55k46O51K90k41N1l41J3l78L39r5L28l7l9K75n70J78k22J21K30J03J0
5494A69K36j20k97k7P2k96Q1O71k88J97Q0q27L59j64j92L60J2L65l89N00m38j97
$$ plain form
5516 -133 -431 -247 -90 -67 312 300 80 -54 -121 -133 68 112 223 272 130 405 -111 3 -277 -441 247 -134
5538 -134 279 231 380 1 -222 -80 -443 -214 310 250 243 240 -577 -213 -217 -544 110 147 315 -80 345 -250 -171
5561 -171 -226 -293 -44 394 101 -64 -55 -494 -256 -440 -88 79 216 134 328 -97 -272 -213 -549 -416 -7 7
5583 7 30 235 91 6 -112 -398 -157 -244 167 416 95 52 -126 -78 56 -221 -86 207 212 -31 78 -73 -17
5606 -17 -175 -247 -74 520 221 353 213 -251 -112 -429 81 -25 271 389 204 160 23 -124 -387 -170 85
5627 85 267 283 166 247 -304 -26 -111 3 364 141 128 57 -176 -318 131 -115 -41 258 402 48 122 -267 -295
5650 -295 -34 -266 -25 24 393 83 -37 -66 68 -167 -363 4 296 35 299 347 181 -262 -160 111 226
5671 226 387 128 121 -189 137 -90 -53 -73 -163 -49 313 401 85 -218 51 -328 -240 -3 148 352 259 123 34
$$ packed form
5516a33k98J84J57K3L79j2k20j34o7j2K01M4J11M9j42K75n16J14k80j64O88l81
5538a34M13m8J49l79k23J42l63K29N24o0plq17L64ml27O54L7J68l95M25n95P9
5561a71n5o7K49M38k93j65Rm39K38j84L52J67J37q2J94m25j75N9l36J33M09J4
5583GK3K05j44q5j18k86K41q7M11K49l21m3j78M8J34k77J35K93Nk43J09j51N6
5606a7j58p2J73N94k99J32j40m64J39l17N10j06K96J18j85m4j37j47k63K17K55
5627H5J82J6j17Q1n51K78q5J14L61k23j3p1k33j42M49k46P4K99J44l54P4l89k8
5650b95K61k32K41M9L69l10j20k9J34k35j96L67K92k61K64M8j66m43J02K71J15
5671B26J61k59pl10L26k27L7k0r0J14L62Q8l16l03K69l79Q8K37J51K04r3j36q9
$$ plain form
5694 34 -199 -300 10 46 304 130 75 253 -179 -201 -338 -199 -139 125 126 475 63 93 -281 -164 -154 -131 174
5717 174 269 302 290 -86 -84 218 137 -303 -75 -86 279 -62 -227 -247 -362 124 -131 -16 96 346 0 55 -296
5740 -296 -198 -207 -235 -118 108 142 -26 -73 -303 -153 -387 -267 259 250 172 43 -161 -222 -47 -460 106 290 39
5763 39 147 11 -5 -284 -88 -214 79 74 37 222 -380 -294 -149 81 -51 -152 174 298 23 -229 -123 13
5785 13 -32 28 199 333 138 -110 -29 72 -66 -95 23 10 146 310 173 -266 -305 -287 -165 144 190 92 75 518
5809 518 -62 -141 -422 -26 7 280 364 -190 -80 -38 -184 -293 -20 -12 -35 371 253 -253 -235 -105 -566 -142 127
5832 127 28 314 239 -101 -83 -57 46 94 -93 339 193 218 164 -28 -57 -583 -51 291 151 347 99 179 -132
5855 -132 -165 -43 55 332 161 442 -49 25 -299 -116 -382 -223 6 6 416 184 146 -19 -456 -266 -38 95
$$ packed form
5694C4k33j01L10L6K58j74n5J78m32k2j37J39O0K64JL49m12L0l74J17J0K3L05
5717A74R5L3j2l76KL02q1m40K28j1L65l41j65k0j15M86k55J15J12K50l46N5l51
5740b96R8rk8J17K26L4j68m7k30J50k34J20N26rp8j29k04o1J75m13N66J84k51
5763C9J08j36j6k79J96j26K93nl7J85o02Q6J45K30j32j01L26J24k75k52J06J36
5785A3m5O0J71J34j95k48Q1J01j38k9J18j3J36J64j37m39l9J8J22L09M6r8j7M43
5809E18n80p9k81L96L3K73Q4n54J10M2j46j09K73Qk3M06j18n06J8J30m61M24K69
5832A27r9K86p5l40J8K6J03M8j87M32j46K5n4j92k9n26N32L42j40J96k48Q0l11
5855a32l3J22R8K77j71K81m91P4l24J83k66J59K29%M10k32l8j65m37J90K28J33
$$ plain form
5877 95 111 410 228 253 -214 -307 23 54 -189 74 38 210 182 -499 -272 -333 447 -29 -57 55 490 -53 -202
5900 -202 -33 -330 40 27 -5 320 129 131 -59 -102 -95 -235 68 -76 177 131 67 57 -115 -403 -334 -151 457 129
5924 129 2 -106 158 -84 67 -96 -46 250 273 38 -59 -150 -304 -176 141 281 -71 338 247 121 -250 -240
5946 -240 -181 165 28 28 452 -76 -111 -148 -24 -189 -104 167 218 -54 29 52 -61 -207 -262 -232 372 279 26 255
5970 255 -76 -120 -424 -175 -37 89 61 356 -69 -95 -261 -450 -176 -116 101 128 256 71 -67 -160 -157 -164 255
5993 255 -84 169 231 -274 3 -479 -402 46 -224 282 137 1 68 14 -85 -139 -375 -52 -126 41 202 -312
6015 -312 -2 -293 -289 -186 48 200 297 243 -157 -126 127 -40 132 -74 91 446 98 -32 60 -108 -362 -262
6037 -262 157 389 44 -18 -9 -325 -110 -84 -185 124 482 206 165 221 -254 -415 -249 36 44 33 426 40 -124
$$ packed form
5877I5J6K99j82K5m67r3L30L1k43K63l6J72k8o81K27o1P80m76k8J12M35n43j49
5900b02J69k97L70j3l2L25j91Kj90m3Pj40L03j44K53m6o4j0j72k88O9J83O08l28
5924A29j27j08K64k42J51j63N0K96K3k35r7r1j54J28L17J40l52M09r1j26l71J0
5946b40N9L46j37%M24n28l5l7J24j65Q5K71N1k72Q3K3j13j46n5L0O04r3k53K29
5970B55l31m4l04K49J38J26k8K95m25k6j66j89K74O0K17K7J28j85j38r3LpM19
5993B55l39K53O2n05K77m82P7M48k70N06j45j36O7n4r9n4k36L23p4J67J61n14
6015c12L10k91MJ03K34J52R7n4m00L1K53j67J72k06J65L55l48j30R2j68k54J00
6037b62M19K32l45o2Rl16K15K6j01L09L58k76m1N6m75j61J66K85Qj1L93l86j64
$$ plain form
6060 -124 -391 -257 -156 -148 113 278 332 -104 -143 69 -370 -474 -213 371 102 14 81 128 -102 -419 -409 -258 87
6083 87 299 299 82 -39 -189 -559 -264 17 136 169 107 82 90 -215 -172 -366 -276 316 128 207 104 55 11 -278
6107 -278 -260 -89 444 233 536 281 143 -429 -183 -170 198 302 515 289 33 -33 -131 -398 -138 -59 22 358
6129 358 3 -150 102 -431 -236 -248 187 325 205 597 80 136 -180 -257 -50 -37 203 370 -38 25 -159 -498
6151 -498 -293 -218 112 270 80 245 -162 -265 -589 -227 19 34 112 256 327 -20 53 80 39 -32 -35 192 445
6174 445 328 6 -14 -97 -210 -32 228 204 397 142 120 -74 -218 -145 -152 318 337 183 63 -139 -362 -218 -297
6197 -297 -11 108 103 258 103 -141 -365 -292 -183 -81 -215 171 336 367 -241 -340 -138 -139 -217 218 235 436 52
6220 52 -4 -232 -174 -130 -158 366 88 138 74 -68 -71 -328 -436 51 155 82 3 41 117 -447 -117 -194 -8 161 442
$$ packed form
6060a24k67J34J01QK61J65N4m36l9K12m39j04K61N84k69q8O7M7k30l17J0J51L45
6083H7K12%k17j21j50l70K95K81J19L3o2k5Ql05M3j94R0N92j88P9j03m9m4k89
6107b78J8J71N33k11L03k55j38n72K46J3L68J04K13k26k56o6r8k67K60P9Q1L36
6129C58l55j53K52n33J95j2M35J38j20L92n17N6l16p7K07J3K40J67m08O3j84l39
6151d98K05P5L30J58j90J65m07j03l24L62K46J5P8J44P1l47P3K7m1p1lK27K53
6174D45j17l22k0q3j13J78K60k4J93k55k2j94j44P3pM70J9j54j20k02k23J44p9
6197b97K86J19nJ55j55k44k24P3J09J02j34L86J65L1o08r9K02jp8M35J7K01l84
6220E2n6k28N8M4k8N24k78N0o4j42lk57j08M87J04p3p9L8P6n64L30p7J86J69K81
$$ plain form
6245 442 273 -59 -79 -240 -372 15 108 215 224 134 -202 -117 -212 -318 1 251 527 -70 440 287 -124 -596
6267 -596 -503 -339 217 142 152 424 437 -218 -127 -230 -476 39 117 97 238 186 104 -42 -464 -82 -73 176 214 174
6291 174 431 27 -229 -184 -121 -73 124 203 539 -16 -13 -337 -270 -336 -15 36 265 255 -6 -262 -385 -70 -366
6314 -366 181 384 429 81 203 -39 -212 -181 -229 144 255 208 79 175 -169 -324 -81 -14 169 231 275 257 216
6337 216 -458 -252 -274 -250 143 400 341 119 155 -108 -371 -616 -302 96 251 383 188 55 -410 -523 -404
6358 -404 -195 272 42 90 133 106 -359 -500 -286 106 -70 195 219 372 -145 -320 -301 -637 -281 -223 142 307
6380 307 -75 370 -294 -554 -197 90 -10 301 293 -69 81 -123 -255 -613 -339 311 251 211 100 -103 -393
6401 -393 -349 -39 -122 108 450 306 263 -215 -116 -264 -191 -152 161 167 326 22 -1 -261 -178 -280 -252 321 376 547
$$ packed form
6245D42j69l32k0j61j32L87R3J07Rr0l36Q5r5j06L19K50K76n97N10j53m11m72
6267e96R3J64N56p5J0K72J3o55R1j03k46N15P8k0J41n2q2j46m22L82RK49L8m0
6291A74K57m04k56M5O3M8J97P9L36n55Ll24O7o6L21N1K29j0k61k56j23L15k96
6314c66N47K03M5l48J22k42j73L1m8L73J11m7j29R6l44j55K43O7J83O2M4j8m1
6337B16o74K06k2K4L93K57n9k22L6k63k63k45L14L98J55J32j95j33m65j13J19
6358d04K09M67k30M8M3k7m65j41K14L92j76K65K4J53n17j75J9l36L56N8L65J65
6380C07l82M45o64k60L57K87j00L11ql62J50k04j32l58K74O50o0m0j11k03k90
6401c93M4L10q3K30L42j44m3m78R9j48P3L9L13OJ59l04k3k60Q3j02K8N73N5J71
$$ plain form
6425 547 134 -29 -472 -504 -223 -366 71 314 476 132 1 -172 -314 -244 -69 447 563 504 472 -105 -236
6446 -236 -186 -311 -486 -16 369 221 89 -262 -347 -152 -294 -141 138 481 182 119 -114 -242 -494 -176 -133
6467 -133 55 672 315 194 -276 -733 -154 -238 29 82 137 290 346 -291 -404 150 -175 286 400 301 214 207 -162
6490 -162 -195 -250 -297 -26 175 221 377 108 -241 -313 -488 -408 -20 462 803 32 48 -189 -475 -205 187 -70
6512 -70 281 288 183 174 -242 -249 -376 -98 -170 436 395 316 270 -97 -360 -195 -124 275 355 203 125 104 -103 -611 -466
6537 -466 -104 -175 421 552 496 190 -513 -142 -499 -53 151 477 316 -83 153 -41 -277 -194 -269 63 496
6558 496 482 96 -136 -60 -372 -540 -332 162 406 193 1 -96 -257 -522 -373 -231 107 250 363 565 299
6579 299 -157 -399 -167 249 98 281 467 360 104 -259 -295 -278 -32 74 552 251 110 -175 -160 -352 -164
$$ packed form
6425E47m13j63m43l2K81j43M37K43J62l44j31j73j42P0J75N16J16n9l2n77j31
6446b36N0j25j75M70L85j48j32l51q5J95j42J53K79L43k99o3k33j28k52L18M3
6467a33J88O17l57j21m70m57N79q4K67N3N5J53N6o37j13N54l25M61J14r9q7pl69
6490a62l3n5m7K71K01M6J56k69l49p2j75Q0L88M82L41p71J6k37k86K70L92k57
6512g0L51Pj05rm16pj27K78p2O06m1p9m6l67k63J65P1L99Q0j52p8k1k07n08J45
6537d66L62p1N96J31n6l06p03L71l57M46K04L26j61l99K36j94k36Q3p5L32M33
6558D96j4l86k32P6l12j68K08M94K44k13j92r7j61k65J49J42L38J43J13K02k66
6579B99m56k42K32M16j51J83J86j07k56l63l6J7K46J06M78l01j41k85J5j92J88
$$ plain form
6600 -164 146 216 473 513 257 -30 -221 -454 -194 -197 40 159 328 486 -55 -309 -551 -327 74 90 341 167
6622 167 184 57 -228 -314 -654 -86 338 353 210 20 68 -425 -609 -294 -157 208 536 484 424 125 -389 -105
6644 -105 31 86 -116 390 484 300 -116 -404 -439 -145 -21 67 620 588 150 -309 -304 -407 -249 -150 230 273 223
6667 223 302 -108 -196 -164 -632 71 56 334 74 449 -3 -505 -541 -250 336 382 123 425 362 -285 -585 -79
6689 -79 -209 -290 408 574 219 -52 -245 -401 -570 -537 191 202 418 142 -112 -302 -389 -622 -390 21 440 217
6711 217 457 424 -328 -611 -200 -212 0 -4 495 600 -26 -177 -247 -332 -166 37 131 673 390 1 -170 -481
6733 -481 -363 -361 20 747 173 288 -34 105 -255 -504 -238 255 318 218 382 51 -400 -532 -397 -198 41
6754 41 179 476 285 -253 -220 -474 -167 -334 122 237 524 233 -29 167 -292 -254 -79 198 435 547 165
$$ packed form
6600a64L10P0K57M0k56k87j91k33K60lK37J19J69J58n41k54k42K24M01J6K51j74
6622A67J7j27k85q6l40N68M24J5j43j90M8m93j84L15J37L65L28n2o0k99n14K84
6644a05J36N5k02N06R4j84m16k88l5K94J24Q8N53l2m38m59Nj03J58R9L80M3n0
6667B23P9m10q8L2m68P03j5K78k60L75m52n02l6K91N86M6k59L02o3o47l00N06
6689g9j30q1O98J66l55k71j93j56j69L3P28J1K16k76k54j90q7k33K32M11M19k23
6711B17K40l3p52k83M11j2K12mM99J05o26j51p0q5J66K03R4N42k83l89j71l11
6733d81J18KL81P27n74J15l22J39l60k49K66M93O3j00J64l31m51j32J35J99K39
6754D1J38K97j91n38L3k54L07j67M56J15K87k91k62J96m59L8J75K77K37J12l82
$$ plain form
6775 165 -116 -350 -423 -533 -54 -12 574 318 192 81 -121 -365 -314 -1 267 356 11 513 -23 -473 -366
6796 -366 -322 -159 -208 484 652 91 -67 -188 -614 -624 -182 177 694 315 405 -42 -224 -503 -571 -192 197 551
6818 551 260 248 155 -273 -411 -198 -281 160 520 227 258 123 -551 -439 -171 -210 33 366 264 99 -349 -344
6840 -344 -266 -164 81 82 595 355 384 -132 -299 -403 -578 -210 458 207 264 249 -154 -189 -737 -469 -295 335
6862 335 155 780 229 -176 -509 -386 -106 165 328 416 359 16 -94 1 -230 -384 -36 477 570 605 343 -27
6884 -27 -512 -774 -448 114 441 560 299 191 177 -347 -266 -177 -258 280 530 426 171 -175 -472 -299 -175 -137
6906 -137 314 596 395 -37 -200 -167 -516 -286 414 462 697 410 360 99 -259 -610 -455 -118 347 668 676 350
6928 350 -203 -421 -508 -273 263 309 493 220 231 -275 -432 -607 -378 -140 221 311 224 85 -326 -390 -594 -321
$$ packed form
6775A65k81k34p3j10M79M2N86k56j26j11k02k44N1L13K68Q9l45N02n36m50J07
6796c66M4J63m9O92J68n61j58j21m26j0M42L59N17l79R0m47j82k79o8L79L89L54
6818E51k91j2r3m28j38K13q3M41L60k93L1j35o74J12K68l9K43L33j02j65m48N
6840c44P8J02K45JN13k40K9n16j67j04j75L68O68k51N7j5m03l5n48K68J74O30
6862C35j80O25n51m05l33J23K80K71J63Q8n7l43j10R5k31j54L48N13R3L5k62l70
6884b7m85k62L26N62L27J19k61j08j4n24Q1Q9q1N38K50j04k55l46k97J73J24L8
6906a37M51K82k01m32j63L3l49K30P00M8K35k87n0k61l58l51J55L37M65L21Ql26
6928C50n53k18q7K35N36M6J84k73J1n06j57j75K29K38L61R0q7j39m11o4k04K73
$$ plain form
6950 -321 195 269 474 276 248 -50 -272 -439 -35 281 161 634 482 266 -436 -659 -200 15 75 370 519
6971 519 227 80 -67 -160 -555 -20 244 497 419 194 41 -279 -419 -478 -310 -128 416 565 403 101 -317
6992 -317 -476 -620 -379 132 223 495 556 101 -360 -396 -105 -292 334 339 288 510 196 -344 -591 -316 -245 -17
7014 -17 478 645 75 -72 -304 -31 -435 -28 506 728 798 243 83 -275 -487 -545 -17 98 659 809 642
7035 642 -211 -248 -459 -218 -284 64 243 238 575 -213 -571 -520 -511 -41 144 302 394 448 -244 -76 -858 -235 46
7058 46 140 556 611 509 262 -266 -551 -230 188 654 542 433 318 62 -414 -508 -229 34 249 456 449 565
7080 565 -47 -432 -318 -185 -322 218 282 421 234 -150 -377 -346 -67 -398 161 650 202 206 -397 -423 -541 -526
7102 -526 -304 168 464 357 374 -83 -358 -440 -233 -65 254 547 560 127 -334 -390 -368 -200 -59 230 624 720
$$ packed form
6950c21N16P4K05j98k8k98k22j67M04L16j20M73j52k16p02k23M59K15O0K95J49
6971E19k92j47j47r3l95N35K64K53p8k25j53l20j40n9J68J82N44J49j62l02m18
6992c17j59j44K41N11R1K72O1m55m61l6K91j87O26Nn1K22l14n40k47K75P1K28
7014a7M95J67n70j47k32K73m04M07N34K22P0n55j60l58k12n8N28J15N61J50j67
7035F42q53l7k11K41o6L48J79nL37p88l58N1RM70J85J58R2N4o92J68p82O23K81
7058D6R4M16N5j02k47n28k85L21M18M66j12j09j15k56m76r4K79K63K15K07pJ16
7080E65o12l85J14J33j37N40O4J39j87l84k27L1K79l31N59M89m48Mo03k6j18J5
7102e26K22M72K96j07J7m57k75q2K07J68L19K93J3m33m61n6K2J68J41K89L94R6
$$ plain form
7124 720 577 -388 -346 -300 -351 -7 322 417 311 -38 -34 -571 -685 -362 -199 44 472 615 -103 -431 -362 -808
7146 -808 -281 -184 231 417 320 123 -390 -671 -624 -197 13 322 186 339 100 -297 -418 -698 -587 -18 385
7167 385 438 685 209 -270 -461 -312 -146 -58 248 527 550 217 -299 -401 -526 -481 95 415 490 420 -60 -117
7189 -117 -390 -578 -504 222 538 412 360 114 -276 -645 -794 -361 153 163 118 301 -107 -186 -1005 -457 -45 65
7211 65 130 346 313 298 -388 -666 -183 -107 209 315 725 612 316 -454 -439 -461 -257 274 329 368 434 -56 -301
7234 -301 -551 -544 -320 -56 11 313 312 -258 -333 -686 -628 -85 -201 484 647 129 144 -464 -426 -305 -318 415 230
7257 230 572 343 147 -405 -400 -602 -356 253 602 364 121 79 -171 -755 -544 31 114 651 376 226 -277
7278 -277 -358 -719 -353 -194 31 657 489 400 -128 -461 -298 -834 -506 244 528 203 238 -107 -575 -805 -459
$$ packed form
7124G20j43r65M2M6n1L44L29R5j06l49Mn37j14L23J63K43M28J43p18l28O9m46
7146h08N27R7M15J86r7j97n13k81M7M27K10L09j36J53k39l97j21k80J11N69M03
7167C85N3K47m76m79j91J49J66Q8L06K79K3l33n16j02j25M5N76L20P5p0m80n7
7189a17k73j88P4P26L16j26n2k46l90l69j49M33N14J0m5J83m08p9q19N48M12J10
7211F5O5K16l3j5o86k78M83P6L16J06M10j13k96p70J5k2K04N31N5L9O6m90k45
7234c01k50PK24K64O7L02jn70p5l53N8N43j16O85J63n18J5o08L8J21j3P33j85
7257B30L42k29j96n52Nk02K46O09L49k38k43m2k50n84K11N75Q3N37k75j50n03
7278b77q1l61L66J59K25O26j68q9n28l33J63n36L28P50K84l25L5l45m68k30L46
$$ plain form
7299 -459 -382 224 462 198 473 91 -261 -474 -398 -367 370 532 473 721 1 -606 -521 -440 74 193 620 566
7321 566 418 -295 -375 -419 -518 -345 193 765 692 385 72 -69 -805 -392 -237 344 329 315 210 -202 -438 -584
7343 -584 -178 -131 279 253 376 217 -173 -665 -549 -623 -108 180 460 491 416 -249 -438 -364 -514 -83 414 679
7365 679 631 283 -40 -249 -576 -144 -282 323 428 130 425 93 -397 -575 -387 108 275 474 579 114
7385 114 -146 -685 -347 -498 -39 457 704 511 16 -271 -759 -618 -473 -101 722 410 134 213 -70 -802
7405 -802 -776 -342 154 287 663 682 60 -408 -649 -676 -265 356 334 429 609 350 -74 -500 -318 -284 -193 370
7427 370 502 442 49 -309 -477 -332 -542 163 466 478 353 34 149 -370 -869 -462 110 131 490 482 111 -279
7449 -279 -706 -715 -221 -196 395 700 757 229 -525 -231 -451 -518 144 272 274 214 -252 -387 -488 -783 -340 192 504
$$ packed form
7299d59P7O06K38k64K75l82l52k13P6L1P37J62n9K48p20o07Q5Q1N14J19M27n4
7321E66j48p13q0m4r9J73N38N72p3l07l13j41p36M13J55N81j5j4j05m12k36j46
7343e84M06M7M10k6J23j59l90m92J16p4N15K88K80L1p5o65j89P4j50M31M97K65
7365F79m8l48l23k09l27M32j38O05J05k98K95l32m90j78J88M95J67J99J05m65
7385A14k60n39L38j51M59M96K47j93m95k87m88J41J45L72Q23l12k76P9k83p32
7405h02K6M34M96J33L76J9o22m68k41k7M11O21k2R5J80k59m24m26J82L4R1N63
7427C70J32o0l93l58j68J45k10P05L03J2j25l19J15n19m99M07N72K1L59ql71l90
7449b79m27rM94K5N91L05N7n28p54K94k20o7O62J28Ko0m66j35j01k95M43N32L12
$$ plain form
7472 504 611 27 33 -641 -495 -554 -296 180 312 593 427 243 -486 -621 -625 -290 167 462 1058 341 -20 -324
7494 -324 -661 -501 -95 404 502 745 11 -237 -356 -517 -797 -270 96 487 686 285 227 -809 -689 -416
7514 -416 -118 455 181 556 540 -177 -591 -413 -631 -207 286 382 647 515 -17 -498 -447 -364 -192 53 765
7535 765 649 211 -153 -557 -727 -278 -2 617 832 591 644 -79 -201 -263 -438 -18 305 568 496 210 31
7556 31 -734 -452 -94 -74 370 277 216 205 -84 -476 -552 -532 -372 113 532 831 23 -234 -648 -613 -513 255 665
7579 665 583 404 421 -339 -373 -704 -320 82 622 539 732 302 -131 -449 -373 -278 -32 381 675 967 125 -71
7601 -71 -251 -138 -440 22 429 435 481 -12 -26 -274 -719 -482 53 548 581 226 414 -209 -332 -230 -518 93
7623 93 541 232 496 269 -100 -474 -655 -448 45 427 648 694 284 -266 -259 -242 -329 101 328 604 607 315 -84
$$ packed form
7472E04J07n84Oo74J46n9K58M76J32K81j66j84p29j35mL35M57K95N96p17l61l04
7494c24l37J60M06M99R8K43p34k48j19j61k80N27L66L91J99m01n8j036J20K73
7514d16K98N73k74L75j6p17m14J78k18M24M93R6K65j32n32m81N1Q3J72K45P12
7535G65j16m38l64m04j70M49K76O19K15k41N3p23j22o2j75M20L23K63p2k86j79
7556C1p65K82L58K0M44r3o1j1k89l92p6K0J60M85M19K99q08k57m14L5J00P68M10
7579F65q2j79J7p60l4l31L84M02N40q3J93m30m33l18P6R5K46M13K94K92q42j96
7601g1j80J13l02M62M07OM6m93j4k48m45K37N35M95L3l55J88o23j23J02k88O11
7623I3M48l09K64k27l69l74j81K07M93L82K21M6m10n50PJ7q7M30K27K76Lk92l99
$$ plain form
7646 -84 -249 -421 -166 231 787 781 578 341 -107 -420 -180 -382 12 269 844 719 226 -150 -475 -752 -93
7667 -93 -86 171 642 243 260 -481 -323 -385 -298 -255 570 481 452 259 -310 -692 -464 -82 -66 471 813 625 100
7690 100 -385 -512 -568 -243 107 550 724 779 -103 -537 -448 -505 -112 -64 702 774 410 -135 -542 -405 -321 62
7712 62 372 664 530 290 2 -85 -596 -590 -325 208 587 426 394 -56 -410 -574 -591 -640 -42 425 498 346 430
7735 430 -90 -89 -368 -469 251 458 353 248 -22 -612 -509 -327 -198 87 365 562 453 -37 -418 -625 -534
7756 -534 150 160 418 452 333 85 -435 -441 -424 -154 108 347 668 351 347 -585 -751 -458 -281 349 420 393 296
7779 296 42 -578 -667 -298 -291 63 496 729 -21 135 -133 -466 -188 -156 635 425 412 540 -89 -385 -414 -210
7801 -210 22 437 369 577 374 -329 -492 -606 -223 29 277 902 584 160 -289 -434 -827 -494 -9 567
$$ packed form
7646h4j65j72K55L97N56ok03k37m48l13K40k02L94K57N75j25m93l76l25k77O59
7667i3PK57M71l99J7p41J58o2Q7M3Q25q9k9j93n69l82K28L82J6N37L42j88n25
7690A00m85j27n6L25L50M43J74N5q82m34Q9n7L93M8P66P2l64n45m07J37Q4L83
7712F2L10K92j34k40k88q7n11OK65N33L79j61l2m50l54j64j7m9N98M67P3j52Q4
7735D30n20Jk79j01P20K07j05j05k70n90J03J82J29K85K78J97j09m90l81k07R1
7756e34O84J0K58L4j19k48n20oJ7K70K62K39L21l17mr32j66K93J77O30P1k7r7
7779B96k54o20q9L69PL54M33K33p50J56k68l33K78L2P91k10j3J28o29k96k9K04
7801b10K32M15o8K08k03p03j63j14L83K52K48O25l18m24m49j45l93L33M85N76
$$ plain form
7821 567 559 378 48 -127 -356 -720 -378 -275 553 558 377 387 -56 -742 -695 -387 89 243 768 481 346 -437
7843 -437 -567 -520 -394 -146 464 575 638 24 39 -299 -685 -226 442 442 668 321 -207 -13 -647 -174 -343 105
7865 105 335 204 126 72 -112 -524 -491 -456 -31 279 275 481 2 -322 -734 -526 -653 18 390 713 326 -146
7887 -146 -184 -464 -591 -466 255 337 513 526 222 -396 -740 -410 -411 -46 434 247 321 -202 -295 -570 -619 -412 -245
7910 -245 567 456 275 -36 -336 -710 -439 -248 45 364 568 301 59 -357 -501 -734 -389 223 103 664
7930 664 125 196 -293 -364 -641 -235 289 564 161 48 73 -406 -635 -652 -427 61 577 509 436 41 -103 -332
7952 -332 -447 -297 39 213 679 382 97 -318 -639 -1008 -131 52 576 474 337 42 -310 -486 -465 -329
7972 -329 38 500 452 308 -60 -647 -809 -269 -175 158 480 386 608 -14 -285 -377 -170 -449 238 451 374 62
$$ packed form
7821E67qj81l30j75k29l64L42J03Q28Nj81J0m43o86M7L08M76J54N25k87j35p83
7843d37j30M7J26K48O10J11O3o14J5l38l86M59O68%K26l47n28J94o34M73j69M48
7865A05K30j31p8n4j84m12L3L5M25L10mK06m79l24m12K08j27O71L72L23l87m72
7887a46l8k80j27J25P21Q2J76J3l04o18l44L30jL65M80j87P4n23r3k75m9K07J67
7910b45Q12j11j81l11l00l74K71J91K93L19K04k67k42m16j44k33L45O12j20N61
7930F64n39P1m89p1k77M06N24K75m03j13K5m79k29j7K25M88N16o8p3l95j44k29
7952c32j15J50L36J74M66k97k85m15l21l69Q77J83N24j02j37k95l52j76K1J36
7972c29L67M62m8j44l68n87j62N40R4L33L22r4K22o22k71r2K07k79O87K13p7l12
$$ plain form
7994 62 140 -254 -512 -275 -196 72 657 385 270 -188 -396 -759 -445 -216 256 431 602 583 -120 -415 -516
8015 -516 -63 -122 -301 583 667 445 -132 -345 -453 -379 -71 391 770 790 187 -44 -268 -389 -461 72 363 435
8037 435 537 284 119 -448 -463 -282 30 351 572 329 370 -58 -348 -466 -482 75 78 390 428 255 -410 -445
8059 -445 -632 -791 -8 314 630 486 51 -223 -331 -782 -554 -171 327 514 628 92 18 -533 -641 -522
8079 -522 -150 228 440 477 380 -444 -355 -522 -331 99 388 571 470 89 -288 -251 -362 -268 -125 371 369 505
8101 505 112 -401 -770 -510 -625 36 452 543 291 555 -197 -422 -534 -303 172 402 856 492 168 -540
8121 -540 -383 -398 -510 -68 488 665 412 92 -281 -298 -674 -302 171 595 630 551 189 -29 -642 -799 -416
8142 -416 315 560 235 654 -106 -308 -338 -356 -501 103 386 458 290 -157 -452 -518 -609 -418 172 580 841 456
$$ packed form
7994F2P8l94k58K37P9K68N85k72j15m58k08l63L14K29M72J75J71j9p03k95j01
8015e16M53n9j79Q84Q4k22n77k13j08P4L08M62L79K0o03k31k24j21p2N33K91P2
8037D35J02k53j65n67j5J81L12L21K21k43M1m28k90j18j6N57LL12L8j73o65l5
8059d45j87j59P83L22L16j44m35k74j08m51K28L83M98J87J14n36p4n51j08J19
8079e22L72L78K12L7r7q24Q9j67J91M30K89J83j01l81l77L7j11R4J43M96kJ36
8101E05l93n13l69K60j15O61M16R1k52K64p52k25j12K31M75K30M54l64l24p08
8121e40J57j5j12M42N56J77k53l20l73j7l76L72M73M24L5p9l62k18o13j57L83
8142d16P31K45l25M19p60k02l0j8j45O04K83P2j68m47k95o6r1J91N90M08K61l85
$$ plain form
8164 456 23 -548 -585 -732 -177 -12 522 680 452 130 -487 -411 -622 -514 92 571 482 584 125 -135 -765
8185 -765 -539 -104 315 274 388 151
$$ packed form
8164D56m33n71l7j47N55J65N34J58k28l22o17P6k11J08O06M79q9J02m59k60o30
8185g65K26M35M19m1J14k37
8191A51
$$ Imaginary data points
##PAGE= N=2
##DATA TABLE= (X++(I..I)), XYDATA
$$ plain form
0 0 0 0 0 0 2 0 8 -8 8 -16 16 -24 25 -32 40 -48 58 -69 81 -98 114 -132 153 -176 203 -231 263 -301 340
29 340 -384 433 -484 544 -609 678 -757 842 -934 1035 -1150 1273 -1410 1561 -1728 1915
45 1915 -2125 2361 -2631 2943 -3302 3729 -4240 4874 -5669 6717 -8159 10279 -13724 20279
59 20279 -37352 178205 399132 156392 95514 109726 100846 -11175 -2074 57821 53762 -14421
71 -14421 16530 28849 -97741 -241602 -159037 24412 66959 -12008 10228 91188 64263 -39618
83 -39618 -51336 -9937 -24568 -29552 73798 133733 4966 -161064 -150023 -60840 -83876 -149535
95 -149535 -81431 45557 63017 13029 17689 24343 -34357 -35948 109608 233778 184391 96699
107 96699 131940 178736 85974 -36002 -21056 58556 68270 56087 87864 64853 -61856 -134892
$$ packed form
0@%%%%KkQj6J6k4L2m0M9n7P2q8J06j27J50j79K12k46K85l29L79m34M94n64O41
29C40p24Q17r17J028j153J287j435J599j776J969k185K423k683K971l289L643
45A915m040M486m992N574o245P031p969R114j0543J2386j4876J8438k4003L4003
59B0279n7631K15557K20927k42740o0878J4212q880j12021R101N9895m059o8183
71a4421L0951J2319j26590j43861Q2565J83449M2547p8967K2236Q0960k6925j03881
83c9618j1718M1399j4631m984J03350N9935j28767j66030J1041Q9183k3036o5659
95a49535O8104J26988J7460m9988M660O654n8700j591J45556J24170m9387q7692
107I6699L5241M6796r2762j21976J4946P9612R714j2183L1777k3011j26709p3036
$$ plain form
119 -134892 -56582 18734 -27292 -56017 47525 137517 70849 -41473 -58392 -38442 -58071
130 -58071 -38482 50750 75567 -16464 -75033 -29197 -24801 -127925 -174246 -64365 52960 49081
142 49081 9701 19177 7256 -55020 -56668 26841 68429 32751 48258 136042 138419 11823
154 11823 -75871 -30699 31923 31469 42621 95486 97103 30839 2333 27538 8376 -47967 -14358
167 -14358 103466 144123 63072 -8290 -7742 -19817 -72306 -76767 -19548 6777 -14744 -6698 16636
180 16636 -36905 -132616 -134689 -38860 20246 6451 12873 56371 47585 -18371 -48191 -26289 -20975
193 -20975 -22524 33714 102494 76726 -15230 -48958 -16940 -13879 -38821 -7237 70575 99322
205 99322 71573 56107 48386 1562 -38823 4214 82866 92702 50637 42425 51488 4071 -71727
$$ packed form
119a34892P8310P5316m6026k8725J03542Q9992o6668j12322j6919J9950j9629
130e8071J9589Q9232K4817r2031n8569M5836M396j03124m6321J09881J17325l879
142D9081l9380R476j1921o2276j648Q3509M1588l5678J5507Q7784K377j26596
154A1823q7694M5172O2622m54J1152N2865J617o6264k8506K5205j9162n6343L3609
167a4358J17824M0657q1051p1362N48j2075n2489m461N7219K6325k1521Q046K3334
180A6636n3541r5711k073R5829N9106j3795O422M3498q786o5956k9820K1902N314
193b0975j549N6238O8780k5768r1956l3728L2018L061k4942L1584P7812K8747
205I9322k7749j5466p721m6824m0385M3037P8652R836m2065q212R063m7417p5798
$$ plain form
218 -71727 -87145 -47572 -24060 -14708 15364 26703 -28386 -94858 -93823 -57485 -55688 -61414 -17214
231 -17214 35352 19891 -40833 -76815 -87048 -103599 -99951 -47308 1878 -7502 -37406 -37586 -37185
244 -37185 -72801 -97842 -55377 16304 50351 51845 54259 42100 -2942 -36361 -21005 9980
256 9980 17188 25732 55057 61187 9698 -50921 -63000 -43508 -28136 -5233 38310 64751 45183
269 45183 12287 -2217 -13442 -33256 -25800 22245 60239 48844 12677 -14424 -44359 -84167
281 -84167 -99045 -70508 -33183 -17109 -9323 -1934 -18084 -58332 -78167 -52830 -12003 17246
293 17246 42950 66655 62328 23074 -15723 -29497 -30042 -24345 -798 32842 41453 13296 -22126
306 -22126 -42990 -54477 -55264 -30424 15976 52194 60728 52471 35593 8426 -17105 -16059 12917
$$ packed form
218g1727j5418L9573K3512R352L0072J1339n5089o6472J035L6338J797n726M4200
231a7214N2566j5461o0724l5982j0233j6551L648N2643M9186r380k9904j80M01
244c7185l5616k5041M2465P1681L4047J494K414j2159m5042l3419J5356L0985
256I980P208Q544K9325O130n1489o0619j2079J9492J5372K2903M3543K6441j9568
269D5183l2896j4504j1225j9814P456M8045L7994j1395l6167k7101k9935l9808
281h4167j4878K8537L7325J6074P786P389j6150m0248j9835K5337M0827K9249
293A7246K5704K3705m327l9254l8797j3774n45N697K3547L3640Q611k8157l5422
306b2126k0864j1487p87K4840M6400L6218Q534q257j6878k7167k5531J046K8976
$$ plain form
319 12917 41783 52775 49115 33095 -1422 -44391 -70318 -65944 -44340 -16898 9617 24507
331 24507 14031 -14791 -37739 -41717 -30283 -7439 25675 56302 63380 42345 8371 -22000
343 -22000 -41795 -43646 -24449 4926 24541 25170 9599 -14742 -40839 -54397 -42738 -10530 25937
356 25937 50924 58173 46594 18920 -10447 -25919 -20630 -1066 23702 41284 40333 18817 -14653
369 -14653 -43717 -55933 -48412 -23595 8870 34737 41486 27173 2156 -21066 -30256 -20748 3933
382 3933 32005 49836 48306 27835 -4496 -35033 -50210 -43400 -19495 8659 27837 29804 14934
395 14934 -9628 -31778 -38965 -26575 466 31044 50167 49717 29191 -2358 -29528 -42561 -36825
408 -36825 -16477 8668 24924 23287 3602 -23607 -45731 -51578 -37401 -7931 23029 43462
$$ packed form
319A2917K8866J0992l660j6020l4517m2969k5927M374K1604K7442K6515J4890
331B4507j0476k8822k2948l978J1434K2844L3114L0627P078k1035l3974l0371
343b2000j9795j851J9197K9375J9615O29j5571k4341k6097j3558J1659L2208L6467
356B5937K4987P249j1579k7674k9367j5472N289J9564K4768J7582r51k1516l3470
369a4653k9064j2216P521K4817L2465K5867O749j4313k5017k3222r190R508K4681
382C933K8072J7831j530k0471l2331l0537j5177O810K3905K8154J9178J967j4870
395A4934k4562k2150p187J2390K7041L0578J9123m50k0526l1549k7170j3033N736
408c6825K0348K5145J6256j637j9685k7209k2124n847J4177K9470L0960K0433
$$ plain form
420 43462 45773 30492 3878 -20872 -30046 -19360 3956 26504 39166 35872 14611 -15805 -40822
433 -40822 -46908 -34400 -8095 21007 41905 42820 24862 594 -16855 -22118 -12952 11144 38024
446 38024 50700 39749 13982 -14943 -41068 -54463 -46919 -22481 1492 12323 9892 -5311
458 -5311 -30450 -52208 -52624 -30391 -1770 21085 36178 38900 19726 -11883 -35120 -37652 -26726
471 -26726 -8517 14673 29923 21470 -5158 -28513 -39386 -42456 -33457 -3625 32923 49872 41135
484 41135 23865 6561 -11881 -19996 -3515 25293 42284 43130 37238 21009 -12206 -44704 -47822
497 -47822 -25877 -5095 8326 20903 21254 -2238 -33674 -44960 -37972 -29529 -14436 15070 35519
510 35519 20688 -13604 -36187 -43714 -49505 -44562 -15790 14070 17899 3849 -5471 -17869 -41351
$$ packed form
420D3462K311j5281k6614k4750r174J0686K3316K2548J2662l294k1261l0416k5017
433d0822o086J2508K6305K9102K0898R15j7958k4268j7449n263R166K4096K6880
446C8024J2676j0951k5767k8925k6125j3395P544K4438K3973J0831k431j5203
458e311k5139k1758m16K2233K8621K2855J5093K722j9174l1609k3237k532J0926
471b6726J8209K3190J5250q453k6628k3355j0873l070Q999K9832L6548J6949q737
484D1135j7270j7304j8442q115J6481K8808J6991Q46n892j6229l3215l2498l118
497d7822K1945K0782J3421J2577L51k3492l1436j1286O988Q443J5093K9506K0449
510C5519j4831l4292k2583p527n791M943K8772K9860L829j4050r320j2398k3482
$$ plain form
523 -41351 -50395 -20431 21459 38115 35216 34494 25291 -4044 -29437 -22361 -793 10842 23075
536 23075 44440 44998 6932 -30711 -30075 -12213 -4844 5137 35392 55936 39573 9889 -4511
549 -4511 -15808 -33380 -26325 13277 38105 18184 -10919 -18694 -29463 -61094 -76073 -48857 -13628
562 -13628 -3153 1222 9154 -6083 -44817 -57182 -25204 3567 3892 10845 39627 44558 4290
575 4290 -34120 -35736 -27659 -26005 -5553 29895 32973 -2482 -22895 -12727 -14905 -37984 -28826
588 -28826 23935 60041 47140 26603 20703 1711 -27992 -23839 12258 25089 7445 7756 25500
601 25500 3658 -54793 -79304 -49026 -20106 -17528 -5216 16223 4762 -33172 -42374 -23328
613 -23328 -26050 -39718 -10481 44718 49696 1936 -28083 -21352 -23618 -37598 -18716 22064 30816
$$ packed form
523d1351r044K9964M1890J6656k899p22r203k9335k5393P076K1568J1635J2233
536B3075K1365N58l8066l7643O36J7862P369R981L0255K0544j6363k9684j4400
549d511j1297j7572P055L9602K4828j9921k9103p775j0769l1631j4979K7216L5229
562a3628J0475M375P932j5237l8734j2365L1978K8771L25O953K8782M931m0268
575D290l8410j616Q077J654K0452L5448L078l5455k0413J0168k178k3079R158
588b8826N2761L6106j2901k0537n900j8992k9703M153L6097J2831j7644L11J7744
601B5500k1842n8451k4511L0278K8920K578J2312K1439j1461l7934r202J9046
613b3328k722j3668K9237N5199M978m7760l0019O731k266j3980J8882M0780Q752
$$ plain form
626 30816 14902 21070 32431 684 -41727 -22038 40091 64325 46089 43358 56565 36831
638 36831 -2113 -6865 12175 11235 9287 44199 72455 35031 -26582 -33261 -740 2393 -12434
651 -12434 8610 46983 44986 16019 5525 -1403 -34150 -49381 -4261 44018 27250 -16134
663 -16134 -16058 -228 -27256 -65817 -53933 -12869 3860 9639 32385 35144 -10329 -41542 -7518
676 -7518 35678 27617 13149 47820 82881 56901 6874 -5330 1133 -6610 1785 45065 64594
689 64594 25759 -6975 11059 24283 -11271 -33767 9279 63284 62934 41156 38015 25265 -12381
702 -12381 -23085 14110 34207 8778 -1444 31385 36873 -21807 -71111 -55520 -22731 -18611
714 -18611 -11511 15883 16693 -20100 -33667 -9853 -7725 -38278 -28636 34975 68807 32746 -6426
$$ packed form
626C0816j5914O168J1361l1747m2411J9689O2129K4234j8236k731J3207j9734
638C6831l8944m752J9040r40j948L4912K8256l7424o1613o679L2521L133j4827
651a2434K1044L8373j997k8967j0494o928l2747j5231M5120M8279j6768m3384
663a6134P6J5830k7028l8561J1884M1064J6729N779K2746K759m5473l1213L4024
676g518M3196q061j4468L4671L5061k5980n0027j2204O463p743Q395M3280J9529
689F4594l8835l2734J8034J3224l5554k2496M3046N4005l50k1778l141j2750l7646
702a2381j0704L7195K0097k5429j0222L2829N488n8680m9304J5591L2789M120
714a8611P100K7394Q10l6793j3567K3814K128l0553R642O3611L3832l6061l9172
$$ plain form
727 -6426 -4545 -2276 -20885 -16244 20097 33084 15301 19517 43705 22390 -36493 -46801 7879
740 7879 45955 32553 23843 41044 36278 1226 -11899 5043 4884 -6305 23074 71374 59534
753 59534 -2353 -28140 -1076 9052 -10697 -4286 33111 42923 20125 10720 11353 -18619 -50710
766 -50710 -23792 34413 43468 8984 3298 25707 15550 -21907 -24447 8989 27886 31705 55385
779 55385 71774 36383 -11396 -5296 30951 30564 9396 26083 61407 52886 11124 -8520 -7956
792 -7956 -18603 -20946 16729 52294 36597 3432 9181 25631 3276 -28038 -9873 34479 46347
805 46347 32272 28698 19840 -17206 -43747 -24425 1702 -8179 -20399 4633 25803 -4359 -47471
818 -47471 -47640 -21633 -10341 -175 29408 45803 23265 757 9382 15299 -8535 -17585 20022
$$ packed form
727f426J881K269j8609M641L6341J2987j7783M216K4188k1315n8883j0308N4680
740G879L8076j3402q710J7201m766l5052j3125J6942j59j1189K9379M8300j1840
753E9534o1887k5787K7064J0128j9749O411L7397R812k2798r405O33k9972l2091
766e0710K6918N8205R055l4484n686K2409j0157l7457k540L3436J8897L819K3680
779E5385J6389l5391m7779O100L6247l87k1168J6687L5324q521m1762j9644N64
792g956j0647k343L7675L5565j5697l3165N749J6450k2355l1314J8165M4352J1868
805D6347j4075l574q858l7046k6541J9322K6127r881j2220K5032K1170l0162m3112
818d7471j69K6007J1292J0166K9583J6395k2538k2508Q625N917k3834r050L7607
$$ plain form
831 20022 57127 43641 10140 81 -3996 -23147 -29597 -3222 19996 16287 16077 34380 31706
844 31706 -7745 -31668 -6560 26549 30009 26178 37270 35731 4952 -19421 -17872 -17083 -26731
857 -26731 -15948 18604 27621 -5365 -33865 -30147 -23176 -30644 -24882 5923 26768 20198 11306
870 11306 10347 -6369 -32765 -30895 3001 23788 14473 6746 11816 2864 -24968 -37527 -21947
883 -21947 -4602 3902 20363 38545 28678 -2781 -15438 -2251 6586 4249 15686 39665 42848
896 42848 20407 -324 -8783 -19549 -26491 -9586 18964 25696 10740 2308 2622 -9983 -28173
909 -28173 -23578 3219 22724 25501 26454 22666 1843 -22408 -24096 -8641 -628 1277 13247 24111
923 24111 11651 -15509 -29514 -25487 -18579 -8896 11614 28916 24873 7790 -1511 -6080 -16009
$$ packed form
831B0022L7105j3486l3501j0059m077j9151o450K6375K3218l709k10J8303k674
844C1706l9451k3923K5108L3109L460l831J1092j539l0779k4373J549P89r648
857b6731J0783L4552R017l2986k8500L718O971p468N762L0805K0845o570q892
870A1306r59j6716k6396J870L3896K0787r315p727N070q952k7832j2559J5580
883b1947J7345Q504J6461J8182r867l1459j2657J3187Q837k337J1437K3979L183
896D2848k2441k0731q459j0766o942J6905K8550O732j4956q432L14j2605j8190
909b8173M595K6797J9505K777R53l788k0823k4251j688J5455Q013J905J1970J0864
923B4111j2460k7160j4005M027O908R683K0510J7302m043j7083r301m569r929
$$ plain form
936 -16009 -19220 -1772 22773 28945 18227 7072 -4300 -20333 -30188 -20394 -1165 9553 14036
949 14036 18145 13675 -6287 -25664 -25242 -10907 748 10082 20498 22347 6980 -13620 -23759
962 -23759 -24439 -21694 -10779 8856 21668 15687 353 -10898 -17786 -22694 -17026 1115 19462
975 19462 24383 18674 9676 -3973 -20618 -26678 -16135 641 11525 15694 14861 5485 -12287 -24521
989 -24521 -22630 -11708 2021 15404 26607 25317 10010 -7358 -16361 -17217 -11588 -424 13867
1002 13867 20593 13152 -1589 -15756 -26363 -29251 -20201 -2038 13908 19607 16546 7475 -4891
1015 -4891 -15745 -16914 -5951 9610 20815 25281 20088 6324 -11566 -23908 -24253 -15983 -3428
1028 -3428 9511 16515 13187 436 -13036 -20163 -17543 -7343 8698 22707 28614 23093 9437
$$ packed form
936a6009l211J7448K4545O172j0718j1155j1372j6033r855R794J9229J0718M483
949A4036M109m470j9962j9377M22J4335J1655R334J0416J849j5367k0600j0139
962b3759o80K745J0915J9635J2812n981j5334j1251o888m908N668J8141J8347
975A9462M921n709q998j3649j6645o060J0543J6776J0884M169q33r376j7772j2234
989b4521J891J0922J3729J3383J1203j290j5307j7368r003q56N629J1164J4291
1002A3867O726p441j4741j4167j0607k888R050J8163J5946N699l061r071j2366
1015d891j0854j169J0963J5561J1205M466n193j3764j7890j2342l45Q270J2555
1028c428J2939P004l328j2751j3472p127K620J0200J6041J4009N907n521j3656
$$ plain form
1041 9437 -5643 -16674 -18950 -10917 2304 12605 15067 8202 -4594 -18298 -27280 -25843 -13933
1054 -13933 2882 17348 23283 19621 7896 -4970 -12530 -11085 -1486 10921 21425 24347 15997
1067 15997 227 -15405 -24292 -23640 -13695 489 12985 17174 12530 1410 -10253 -16839 -13849
1080 -13849 -1522 13978 25461 26907 19644 5989 -9509 -19335 -19071 -10024 2185 11400 12994
1093 12994 6347 -7428 -20218 -25235 -20710 -8934 6050 19105 23588 17063 3554 -8164 -14110
1106 -14110 -12151 -3359 10175 20223 19577 10219 -3194 -15641 -23371 -20729 -8416 6806 16793
1119 16793 18454 13770 2268 -10656 -16887 -11073 1519 12835 20657 22528 14020 -1927 -16532
1132 -16532 -21294 -18262 -9783 3239 14327 15910 5089 -7979 -15845 -18973 -16591 -6001 10351
$$ packed form
1041I437j5080j1031k276Q033J3221J0301K462o865j2796j3704q982J437J1910
1054a3933J6815J4466N935l662j1725j2866p560J445R599J2407J0504K922q350
1067A5997j5770j5632q887O52R945J4184J2496M189m644j1120j1663o586K990
1080a3849J2327J5500J1483J446p263j3655j5498r826K64R047J2209R215J594
1093A2994o647j3775j2790n017M525J1776J4984J3055M483o525j3509j1718n946
1106a4110J959Q792J3534J0048o46r358j3413j2447p730K642J2313J5222R987
1119A6793J661m684j1502j2924o231N814J2592J1316P822J871q508j5947j4605
1132a6532m762L032Q479J3022J1088J583j0821j3068p866l128K382J0590J6352
$$ plain form
1145 10351 20759 19058 9618 -1882 -14160 -22669 -18905 -4692 7602 11743 11346 7344 -4411
1158 -4411 -19327 -23777 -13896 273 11716 20319 23972 15881 -205 -11389 -11531 -8229 -2641 8788
1172 8788 20767 19007 3574 -11744 -18993 -22306 -20863 -9013 8358 16197 11367 4927 -1479 -12667
1186 -12667 -21755 -15268 3081 14923 15198 12230 7104 -7749 -24335 -27382 -18023 -9553 -3683 6990
1200 6990 12385 940 -18389 -24480 -17852 -11615 -4742 9911 23227 19683 5935 -3183 -8148 -16002
1214 -16002 -17567 -1281 17355 18087 6002 -1134 -5740 -17453 -25804 -16668 885 9797 12160 16248
1228 16248 12850 -6778 -22220 -16283 -1632 3336 4084 13544 17692 3524 -16301 -22897 -20094 -19208
1242 -19208 -11123 8389 18914 6735 -8874 -10515 -9279 -17739 -19259 -1122 18567 18569 9164 3701
$$ packed form
1145A0351J0408j701r440j1500j2278q509L764J4213J2294M141l97m002j1755
1158d411j4916m450R881J4169J1443Q603L653q091j6086j1184j42L302N588J1429
1172H788J1979j760j5433j5318p249l313J443J1850J7371P839m830o440o406j1188
1186a2667r088O487J8349J1842K75k968n126j4853j6586l047R359Q470N870J0673
1200F990N395j1445j9329o091O628O237O873J4653J3316l544j3748r118m965p854
1214a6002j565J6286J8636P32j2085p136m606j1713q351R136J7553Q912K363M088
1228A6248l398j9628j5442N937J4651M968P48R460M148j4168j9825o596K803Q86
1242a9208Q085J9512J0525j2179j5609j641J236q460j520J8137J9689Kr405n463
$$ plain form
1256 3701 -5332 -21429 -25604 -8172 7236 5739 4001 13200 12363 -8923 -24979 -16500 -663 5604
1270 5604 12226 24190 22320 1544 -12352 -8051 -6436 -14567 -10247 13061 23386 6979 -11714
1283 -11714 -14871 -16679 -24025 -17803 4286 15195 7611 4661 10406 875 -22597 -26543 -3865 13101
1297 13101 9627 6295 9506 527 -20348 -27279 -16545 -11336 -14036 -1152 20319 17014 -10240
1310 -10240 -22965 -12110 -4818 -7177 1251 20251 23328 9041 1407 1353 -12239 -27962 -16092
1323 -16092 12499 19268 2161 -5268 -337 -7550 -24524 -23475 -4772 4612 5369 15590 22738 3986
1337 3986 -23229 -21742 -746 3641 -4551 2208 18909 13038 -9728 -18502 -15815 -19915 -19688 2399
1351 2399 24413 15080 -6666 -6435 3701 -6580 -21048 -9206 15862 21874 12644 10813 7100
$$ packed form
1256C701r033j6097m175J7432J5408j497j738R199q37k1286j6056Q479J5837O267
1270E604O622J1964j870k0776j3896M301J615q131M320K3308J0325j6407j8693
1283a1714l157j808p346O222K2089J0909p584k950N745r531k3472l946K2678J6966
1297A3101l474l332L211q979k0875o931J0734N209k700J2884K1471l305k7254
1310a0240j2725J0855P292k359Q428J9000L077j4287p634n4j3592j5723J1870
1323a6092K8591O769j7107p429M931p213j6974J049J8703R384P57J0221P148j8752
1337C986k7215J487K0996M387q192O759J6701n871k2766q774K687m100K27K2087
1351B399K2014r333k1746K31J0136j0281j4468J1842K5068O012r230j831l713
$$ plain form
1364 7100 -13446 -27575 -11942 8896 5795 -2362 10079 21975 4949 -20193 -19324 -3722 1482
1377 1482 5411 21052 27294 7726 -10894 -5887 412 -12629 -19328 2896 25099 17016 -3694
1390 -3694 -8215 -8326 -18245 -18760 2175 17687 11092 5617 16797 16976 -8358 -25538 -9108 13111
1404 13111 13407 8672 14619 12747 -7197 -19463 -10652 -4647 -11464 -5113 20443 29850 6511 -13964
1418 -13964 -8677 39 -4758 -2662 15558 24313 12610 4598 6567 -3263 -24890 -24674 3073 18156
1432 18156 6915 -2583 3231 951 -16440 -22061 -7735 2675 2749 11698 25649 15915 -12067 -21092
1446 -21092 -5040 2978 -5153 -1343 15418 17682 58 -11719 -10614 -14759 -20519 -5630 19658
1459 19658 21699 3648 -2050 5765 445 -15618 -12900 7609 17710 13327 12743 12553 -3264 -22630
$$ packed form
1364G100k0546j4129J5633K0838l101q157J2441J1896j7026k5142Q69J5602N204
1377A482L929J5641O242j9568j8620N007O299j3041o699K2224K2203q083k0710
1390c694m521j11r919n15K0935J5512o595n475J1180J79k5334j7180J6430K2219
1404A3111K96m735N947j872j9944j2266Q811O005o817O351K5556R407k3339k0475
1418a3964N287Q716m797K096J8220Q755j1703q012J969r830k1627K16K7747J5083
1432A8156j1241r498N814k280j7391n621J4326J0410P4Q949J3951r734k7982r025
1446b1092J6052Q018q131L810J6761K264j7624j1777J105m145n760J4889K5288
1459A9658K041j8051n698P815n320j6063K718K0509J0101m383n84j90j5817j9366
$$ plain form
1473 -22630 -17989 1471 5566 -791 6360 19663 12387 -9803 -16826 -7950 -2618 -269 13013 25590
1487 25590 15491 -3227 -6248 -747 -8414 -17501 -4741 16945 19105 5624 -712 -1822 -11733
1500 -11733 -17682 -4734 12783 13565 8477 14670 17845 1091 -18357 -14524 2365 8125 7151 12984
1514 12984 15106 1365 -13610 -12107 -6174 -9073 -6882 11651 24994 14995 -2838 -6331 -3826
1527 -3826 -7127 -7531 6058 18005 14123 6082 4445 -1020 -17006 -23107 -7851 8874 9904 5561
1541 5561 7528 6220 -6579 -15871 -9432 779 4318 9544 20258 18955 1314 -13067 -11076 -5675
1555 -5675 -6574 -3146 8940 15095 5895 -5385 -8854 -12035 -16196 -9925 7315 17949 12401 5419
1569 5419 4373 -682 -11944 -14161 -3083 7506 9062 9081 8554 -176 -15559 -21053 -12222 -4078 -1248
$$ packed form
1473b2630M641J9460M095o357P151J3303p276k2190p023Q876N332K349J3282J2577
1487B5590j0099j8718l021N501p667r087J2760K1686K160j3481o336j110r911
1500a1733n949J2948J7517P82n088O193L175j6754j9448L833J6889N760r74N833
1514A2984K122j3741j4975J503N933k899K191J8533J3343r999j7833l493K505
1527c826l301m04J3589J1947l882q041j637n465j5986o101J5256J6725J030m343
1541E561J967j308j2799r292O439J0211L539N226J0714j303j7641j4381J991N401
1555e675q99L428J2086O155r200j1280l469l181m161O271J7240J0634n548o982
1569E419j046n055j1262k217J1078J0589J556J9n27q730j5383n494Q831Q144K830
$$ plain form
1584 -1248 4632 13229 11646 -1159 -11019 -9902 -7012 -3811 5820 16636 17246 6122 -2713 -6159
1598 -6159 -11120 -15171 -9060 4293 12062 9025 3716 -805 -8458 -15073 -11049 1034 9420 11959
1612 11959 13621 13373 3550 -9207 -13431 -7540 -645 4326 9294 11854 5568 -6280 -12624 -12987 -11223
1627 -11223 -5939 4520 14719 14862 6404 -1324 -5443 -9006 -8577 -754 9486 13708 11133 5997
1641 5997 -1366 -10806 -16200 -12360 -2028 5688 8998 10221 7026 -2121 -10297 -11542 -6112 765 7844
1656 7844 14253 15241 7358 -3239 -10143 -11855 -9974 -3877 4698 10528 9009 1433 -5555 -11151 -13339
1671 -13339 -10222 -1061 8823 13279 11426 6217 -1193 -8613 -12420 -8239 -107 6508 9838 8972 2984
1686 2984 -6472 -13623 -14368 -9250 -1559 5953 11590 11759 5207 -3309 -8664 -9430 -6155 1382 9341 12910
$$ packed form
1584a248N880Q597j583j2805r860J117K890L201R631J0816O10j1124q835l446
1598f159m961m051O111J3353P769l037n309m521p653o615M024J2083Q386K539
1612A1959J662k48r823j2757m224N891O895M971M968K560o286j1848o344l63J764
1627a1223N284J0459J0199J43q458p728m119l563M29P823J0240M222k575n136
1641E997p363r440n394L840J0332P716L310J223l195r147q176j245N430O877P079
1656G844O409R88p883j0597o904j712J881O097Q575N830j519p576o988n596k188
1671a3339L117R161R884M456j853n209p410p420l807M181Q132O615L330q66n988
1686B984r456p151p45N118P691P512N637J69o552q516n355p66L275P537P959L569
$$ plain form
1702 12910 10303 2656 -5478 -11945 -14061 -10467 -2514 6058 9951 8228 2694 -4510 -10453 -10868 -5587
1717 -5587 2684 10200 13919 12121 5481 -3942 -10321 -11301 -7152 -48 6440 10519 8458 1358 -6615
1732 -6615 -11542 -11155 -5935 2419 10672 14432 12160 5622 -1736 -7291 -8501 -4079 3616 10456 12014
1747 12014 8659 1850 -6526 -12306 -12778 -6869 1331 7878 11541 10314 3610 -4013 -8835 -7938 -2455
1762 -2455 4729 11283 14008 10561 2453 -5425 -10749 -11296 -6506 1087 8307 10244 7234 938 -5359
1777 -5359 -9894 -9522 -3356 5731 12316 13855 11062 4830 -3424 -9601 -9217 -3179 2927 8341 9957
1792 9957 7239 -507 -8725 -11956 -10331 -5126 2280 9316 12767 8352 824 -5332 -8626 -8842 -4586
1807 -4586 3577 9953 9856 4860 -1522 -8012 -13557 -13369 -6115 2688 7523 8271 6616 1175 -6680 -10612
$$ packed form
1702A2910k607p647q134o467k116L594P953Q572L893j723n534p204n943m15N281
1717e587Q271P516L719j798o640r423o379r80M149P104O488M079k061p100p973
1732f615m927L87N220Q354Q253L760k272o538p358n555j210M422P695O840J558
1747A2014l355o809q376n780m72N909Q200O547L663j227o704p623m822Q97N483
1762b455P184O554K725l447q108p878n324n47M790P593P220J937l010o296o297
1777e359m535L72O166R087O585J539k793o232q254o177L84O038O106N414J616
1792I957k718p746q218l231J625N205P406P036L451m415p528o156l294k16M256
1807d586Q163O376r7m996o382o490n545J88P254Q803M835P48j655n441p855l932
$$ plain form
1823 -10612 -7567 -586 5781 10537 12929 9495 -253 -8060 -9728 -8057 -4936 1547 9183 11493 5446
1838 5446 -2860 -6871 -9089 -9018 -2442 7741 13253 11689 7078 3147 -3732 -10353 -10186 -1303 6150
1853 6150 8172 7143 4789 -2145 -11434 -14031 -8911 -2305 2095 7880 12233 8523 -1913 -8497 -7216
1868 -7216 -4503 -1429 5079 12036 12319 4104 -2722 -5935 -9794 -11371 -4277 6958 11471 7390 3250
1883 3250 368 -4972 -10404 -7214 2766 8794 9701 10750 10092 508 -10664 -11883 -4777 136 1701
1898 1701 6085 9903 4329 -6799 -11263 -9377 -8034 -5093 4689 13597 10570 240 -4481 -4995 -8511
1913 -8511 -11151 -3955 6703 8928 4039 1529 -2493 -11414 -16844 -8977 2756 5863 4238 7493
1927 7493 8418 -746 -11119 -9810 -2235 1454 4190 11003 12303 2073 -9364 -9797 -6417 -8843 -8039
$$ packed form
1823a0612L045O981O367M756K392l434r748p807j668J671L121O483P636K310o047
1838E446q306m011k218P1O576J0183N512j564m611l931o879o621J67Q883P453
1853F150K022j029k354o934r289k597N120O606M400N785M353l710j0436o584J281
1868g216K713L074O508O957K83q215o826l213l859j577P094J1235M513m081m140
1883C250k882n340n432L190R980O028R07J049o58r584j1172j219P106M913J565
1898A701M384L818n574j1128m464J886J343K941R782Q908l027j0330m721n14l516
1913h511k640P196J0658K225m889k510m022q921n430P867J1733L107j625L255
1927G493R25r164j0373J309P575L689K736O813J300j0230j1437m33L380k426Q04
$$ plain form
1942 -8039 3016 11783 7337 -2489 -5779 -6820 -11030 -10097 1508 10913 7714 3300 3802 821 -10827
1957 -10827 -17624 -9285 2029 3549 2217 4358 1912 -9535 -15633 -9979 -3659 -3321 612 12057
1971 12057 14657 2815 -8220 -6678 -2946 -4042 -1192 9597 13671 5155 -1821 -1466 -5040 -14203
1985 -14203 -12426 3238 12674 7249 2068 3582 172 -9660 -10741 -623 5793 4693 7313 12734
1999 12734 6439 -9633 -15692 -7121 -1030 -3285 -505 8454 7660 -3990 -10019 -7615 -8767 -11268
2013 -11268 -2174 12491 13569 1283 -4173 -1487 -4200 -11914 -8984 3970 9335 4926 3802 3976
2027 3976 -5030 -16209 -11779 1899 6062 2165 5255 11715 6236 -7685 -11091 -4156 -1387 -837
2041 -837 6806 14177 6020 -7507 -9485 -4672 -7427 -11923 -3473 9965 10442 -15 -3782 -3641 -9347
$$ packed form
1942h039J1055Q767m446r826l290j041m210R33J1605R405l199m414N02k981j1648
1957a0827o797Q339J1314J520j332K141k446j1447o098N654O320L38L933J1445
1971A2057K600j1842j1035J542L732j096K850J0789M074q516o976L55l574r163
1985a4203J777J5664R436n425n181J514l410r832j081J0118O416j100K620N421
1999A2734o295j6072o059Q571O091k255K780Q959p94j1650o029K404j152k501
2013a1268R094J4665J078j2286n456K686k713p714K930J2954N365m409j124J74
2027C976r006j1179M430J3678M163l897L090O460n479j3921l406O935K769N50
2041h37P643P371q157j3527j978M813k755m496Q450J3438M77j0457l767J41n706
$$ plain form
2056 -9347 -13592 -4176 8128 7157 480 2887 4901 -5758 -18059 -13736 -1242 2182 797 4827
2070 4827 6683 -3334 -13330 -9371 -2052 -3666 -2959 8842 17233 8864 -4278 -5637 -2457 -4903
2084 -4903 -5231 4675 12187 6894 -513 213 -926 -11190 -15273 -2872 10193 8651 3309 4675 3951
2099 3951 -5188 -11415 -4394 2911 2767 3601 11224 10243 -3819 -14618 -9878 -2909 -3835 -3056 5942 10009
2115 10009 1632 -6115 -5188 -5591 -9806 -5552 8700 15279 7338 -306 1101 -92 -8418 -9989 236
2130 236 8289 6280 5489 7364 1404 -10665 -12321 -2098 4948 3157 4680 11506 10095 -1789 -8920
2145 -8920 -5043 -2273 -2959 2794 12130 9914 -1748 -7245 -4625 -6104 -10968 -6263 5753 9911 4211
2160 4211 -200 -1084 -6126 -12421 -7594 3082 7180 3587 3898 5977 -293 -11641 -13344 -4804 511
$$ packed form
2056i347m245R416J2304r71o677K407K014j0659j2301M323J2494L424j385M030
2070D827J856j0017r996L959P319j614P07J1801Q391q369j3142j359L180k446
2084d903l28R906P512n293p407P26j139j0264m083J2401J3065j542n342J366p24
2099C951r139o227P021P305j44Q34P623r81j4062j0799M740O969r26P79Q998M067
2115A0009q377p747R27m03m215M254J4252O579p941p644J407j193q326j571J0225
2130B36Q053k009p91J875n960j2069j656J0223P046j791J523O826j411j1884p131
2145h920L877K770o86N753R336k216j1662n497K620j479m864M705J2016M158n700
2160D211m411q84n042o295M827J0676M098l593L11K079o270j1348j703Q540N315
$$ plain form
2175 511 1404 5256 8873 2858 -6607 -8305 -3624 -2826 -3041 4767 13624 10946 1072 -4112 -4159 -6340
2191 -6340 -7523 -1100 7349 7614 2164 475 -821 -7822 -13195 -7517 3582 7069 4985 5415 5017
2206 5017 -2496 -9952 -7917 -2041 122 1192 6958 8910 359 -9356 -10624 -7064 -5653 -3635 3931
2221 3931 9645 5988 -135 -2782 -3648 -7039 -5761 3482 10983 9787 4590 2490 -53 -6548 -9581
2236 -9581 -3979 3230 5305 6007 6821 3771 -4596 -9495 -6078 -187 2401 5410 10046 9990 2392 -4415
2252 -4415 -6348 -5252 -4249 -612 6388 8296 2695 -3360 -6228 -8018 -10184 -7459 395 6621 6244
2267 6244 3262 1066 -3273 -8228 -8240 -1748 3781 5319 5991 5662 1077 -6463 -10634 -8282 -3825 -350
2283 -350 3600 6808 5010 -1830 -6212 -6550 -5275 -3250 1853 8665 10011 5618 -346 -3737 -6727
$$ packed form
2175E11Q93L852L617o015r465j698M681P98k15P808Q857k678r874n184m7k181
2191f340j183O423Q449K65n450j689j296p001n373N678J1099L487k084M30l98
2206E017p513p456K035N876K163J070N766J952q551r715j268L560J411K018P566
2221C931N714l657o123k647q66l391J278R243P501j196n197k100k543o495l033
2236i581N602P209K075P02Q14l050q367m899L417N891K588L009M636n6p598o807
2252d415j933J096J003L637P000J908n601o055k868j790k166K725P854O226l77
2267F244k982k196m339m955j2O492N529J538O72l29m585p540m171K352M457L475
2283c50L950L208j798o840m382l38J275K025N103O812J346m393n964l391k990
$$ plain form
2298 -6727 -7424 -3757 2441 5879 4757 2314 -1040 -6044 -10112 -9476 -3043 2441 4924 5874 4553 -285
2314 -285 -5986 -8579 -6252 -2547 1261 5066 6856 3355 -3120 -7740 -8795 -7748 -4365 606 5921
2329 5921 6677 3046 -1275 -4863 -6513 -6190 -1622 4603 7660 7256 4488 110 -4693 -7738 -6079 -1648
2345 -1648 3396 6479 6620 4117 -353 -5762 -7222 -4862 -669 3943 7302 8387 4745 -1275 -5242
2360 -5242 -6926 -5579 -2017 3106 6246 5737 2307 -2837 -6341 -8130 -6989 -2187 3809 6501 6114
2375 6114 3211 -1500 -5842 -7656 -5355 -619 3557 6406 6060 3117 -2048 -6723 -8049 -5256 -1021
2390 -1021 4003 6859 7155 3884 -1163 -5004 -6032 -3958 240 5338 8213 6885 2558 -2341 -5875
2405 -5875 -7477 -5384 -759 3915 6205 5650 2613 -2077 -5826 -6834 -3909 825 4690 6796 6702 2692
$$ packed form
2298f727o97L667O198L438j122k443l354n004m068O36O433N484K483R50j321m838
2314b85n701k593K327L705L808L805J790l501o475m620j055J047L383M971N315
2329E921P56l631m321l588j650L23M568O225L057m04k768m378m803l045J659M431
2345a648N044L083J41k503m470n409j460K360M193M612L359J085l642o020l967
2360e242j684J347L562N123L140n09l430n144l504j789J141M802N996K692l87
2375F114k903m711m342j814K301M736M176K849l46k943n165m675j326K793M235
2390a021N024K856K96l271n047l841j028K074M198N098K875j328m327m899l534
2405e875j602K093M625M674K290n55l037m690l749j008K925M734L865K106r4m010
$$ plain form
2421 2692 -2585 -6365 -7444 -4909 -1287 2800 5122 4240 390 -4489 -7448 -7474 -5408 -382 5414 8048
2437 8048 6708 3357 -1034 -4405 -5243 -3084 1873 5607 6980 5609 2176 -3072 -7187 -7387 -4183
2452 -4183 249 4017 6498 6215 3127 -2050 -4871 -3853 -1441 3043 7393 9642 7959 2606 -2176
2467 -2176 -5057 -5700 -4174 155 4779 5961 3684 -46 -3885 -6843 -7301 -3526 2322 6384 7475
2482 7475 6999 3934 -709 -4907 -3974 -444 3353 6084 8252 6519 1567 -3895 -6125 -5167 -2892 1051
2498 1051 5554 8154 5513 929 -2269 -3798 -4112 -1993 3844 8243 8596 5481 2166 -1169 -5306
2513 -5306 -6242 -2011 3052 5212 5353 4196 962 -4662 -7723 -5763 -1941 1309 3810 6784 5972 -150
2529 -150 -5424 -6250 -4640 -3124 574 5449 7030 3435 -1128 -3283 -4849 -6045 -3184 3443 7892
$$ packed form
2421B692n277l780j079K535L622M087K322q82l850m879k959k6K066N026N796K634
2437H048j340l351m391l371q38K159M957L734J373j371l433n248m115k00L204
2452d183M432L768K481k83l088n177k821J018K412M484M350K249j683n353m782
2467b176k881o43J526M329M624J182k277l730l839k958m58L775N848M062J091
2482G475m76l065m643m198R33L530L797K731K168j733m952n462k230R58K275L943
2498A051M503K600k641m584l198j529l14K119N837M399L53l115l315l335m137
2513e306r36M231N063K160J41j157l234n624l061J960L822L250K501K974q12o122
2529a50n274q26J610J516L698M875J581l595m563k155j566j196K861O627M449
$$ plain form
2544 7892 6578 3892 1614 -1810 -5751 -5638 -256 4238 5522 5777 5555 1445 -4725 -7319 -3899 143
2560 143 2777 5858 8435 6492 320 -3780 -3361 -2294 -1253 2648 8315 8194 2906 -1879 -3760 -5624
2576 -5624 -7206 -3859 2352 5404 3538 1500 58 -3963 -8177 -5940 773 4665 4625 5410 5542 1522
2592 1522 -5111 -6685 -2853 -79 1418 5038 7893 3414 -3497 -6031 -3844 -3347 -2751 2522 8517
2607 8517 8091 3023 -98 -1356 -3506 -4226 410 7373 7809 4312 3221 2298 -3243 -7659 -5190 1717
2623 1717 3916 3755 5416 4691 -1425 -7105 -5616 -1682 -276 473 5555 7975 2800 -4849 -6124 -4839
2639 -4839 -4840 -3633 2416 7130 4053 -1143 -2004 -2560 -6704 -7235 -239 6479 5910 2972 2442 249 -5569
2656 -5569 -8218 -3833 1826 1986 2163 5021 3704 -3610 -8985 -5919 -1466 -454 1149 6246 7503
$$ packed form
2544G892j314k686k278l424l941J13N382M494J284K55k22m110o170k594L420M042
2560A43K634L081K577j943o172m100M19J067J041L901N667j21n288m785j881j864
2576e624j582L347O211L052j866k038j442m021m214K237O713L892m0P85J32m020
2592A522o633j574L832K774J497L620K855m479o911k534K187M97N96N273N995
2607H517m26n068l121j258k150p20M636O963M36l497j091r23n541m416K469O907
2623A717K199j61J661p25o116n680J489L934J406P49N082K420n175p649j275J285
2639d839jJ207O049M714l077n196q61n56m144n31O996O718n69k938n30k193n818
2656e569k649M385N659J60J77K858j317p314n375L066M453J012J603N097J257
$$ plain form
2671 7503 1754 -3599 -3551 -3145 -4906 -2969 4985 7660 2279 -2522 -3152 -4337 -8554 -7604 -716 4028
2687 4028 2403 1470 2154 -953 -7426 -8483 -1247 3582 2851 3204 6173 4100 -3627 -7163 -4377 -1633
2703 -1633 -1741 1877 7574 5779 -2047 -5355 -3564 -2730 -4599 -997 6746 8965 4329 1034 433 -2384
2719 -2384 -6208 -2695 4960 6670 3205 2386 3364 -844 -7920 -7816 -1907 1629 1655 3762 5716 759
2735 759 -6251 -6323 -2447 -1553 -2191 2647 7826 5128 -2158 -5401 -4219 -5218 -5602 -218 5987 4889 176
2752 176 -523 -797 -4609 -8016 -3159 4533 6197 3713 3307 3208 -2233 -6884 -4463 822 1830 1569 5129
2769 5129 6500 687 -6455 -6289 -2106 -1488 -641 4296 7626 3505 -2409 -3188 -2831 -5201 -5099 1202
2785 1202 6592 4155 -1311 -1860 -3028 -7144 -8921 -3612 2037 2212 1363 2288 1000 -5325 -9033 -4563
$$ packed form
2671G503n749n353M8M06j761J937P954K675n381m801o30j185m217R50O888M744
2687D028j625r33O84l107o473j057P236M829p31L53K969k073p727l536K786K744
2703a633j08L618N697j795p826l308J791Q34j869L602P743K219m636l295o01k817
2719b384l824L513P655J710l465q19R78m208p076J04N909L536K6K107J954m957
2735G59p010p2L876Q94o38M838N179k698p286l243J182r99l84N384O205j098m713
2752A76o99k74l812l407M857P692J664k484m06r9n441m651K421N285J008k61L560
2769E129J371n813p142J66M183O18Q47M937L330m121n914p79L57k370J02O301
2785A202N390k437n466n49j168m116j777N309N649J75q49R25j288o325l708M470
$$ plain form
2801 -4563 809 1393 1675 4879 5094 -1107 -6101 -5390 -2848 -3255 -567 5238 7008 1595 -3213 -2752
2817 -2752 -2456 -4348 -3167 3902 7888 5317 2086 1381 -1005 -5553 -5623 607 4687 3211 2144 3315
2833 3315 883 -5507 -7865 -4087 -92 542 2635 5554 3402 -2732 -5825 -4002 -2744 -2720 -10 5589
2849 5589 5426 528 -3431 -3661 -4667 -5634 -2691 3421 5529 2868 1035 753 -2210 -5578 -3841 1825
2865 1825 5579 4841 4739 4315 607 -4437 -5090 -1451 1037 1981 4228 6384 3302 -2761 -4698 -3467
2881 -3467 -2323 -1276 2769 6385 5464 970 -1764 -3006 -4451 -5279 -1365 3567 3994 1435 -518 -1987
2897 -1987 -5457 -7793 -5243 -372 2054 2376 3204 2043 -1903 -5877 -5379 -2096 265 1861 4426 5350
2913 5350 1948 -3092 -4609 -3485 -3132 -1136 3251 5900 4229 362 -1596 -2663 -4265 -3611 714
$$ packed form
2801d563N372N84K82L204K15o201m994P11K542m07K688N805J770n413m808M61
2817b752K96j892J181P069L986k571l231p05k386m548p0O230M080j476j067J171
2833C315k432o390k358L778L995O34K093K919k152o134l093J823J258K4K710N599
2849E589j63m898l959k30j006r67K943O112K108k661j833k82k963l368J737N666
2865A825L754p38j02m24l708n044o53L639K488R44K247K156l082o063j937J231
2881c467J144J047M045L616r21m494k734j242j445q28L914M932M27k559j953j469
2897a987l470k336K550M871K426L22Q28j161l946l974M98L283K361J596K565R24
2913E350l402n040j517J124L53J996M387K649j671l867j958j067j602O54M325
$$ plain form
2928 714 4891 5541 3089 1535 -1056 -4746 -6035 -3271 842 2033 2573 2852 755 -3380 -6612 -5866
2944 -5866 -3072 -809 1354 3594 3470 -343 -3964 -5094 -4623 -3751 -1472 2413 3560 1998 -1036 -3372
2960 -3372 -5007 -5765 -4061 422 3759 3971 2904 1384 -1165 -4160 -4401 -906 2565 4384 4850 4141
2976 4141 1661 -2663 -4777 -4461 -1972 188 2390 4337 3315 -244 -3540 -4853 -4277 -2636 275
2991 275 3373 4494 2430 -260 -3057 -5150 -5366 -3448 288 2708 2409 986 -1213 -3800 -6225 -5715
3007 -5715 -2803 501 2940 3675 2994 235 -3055 -4753 -3511 -940 1416 3736 5102 3217 233
3022 233 -2733 -4112 -3616 -1442 1182 4245 4549 2821 98 -2435 -3844 -3612 -1067 2236 4074 3886
3038 3886 2499 -206 -3337 -5167 -4708 -2191 484 2165 2880 1094 -1663 -4628 -5566 -4535 -2208 811
$$ packed form
2928G14M177O50k452j554k591l690j289K764M113J191N40K79k097m135l232P46
2944e866K794K263K163K240j24l813l621j130M71Q72K279L885J147j562l034k336
2960c372j635p58J704M483L337K12j067j520k549k995k41L495L471J819M66p09
2976D141k480m324k114L16K489K160K202J947j022l559l296j313N76J641K911
2991B75L098J121k064k690k797k093k16J918L736K420k99j423k199k587k425N10
3007e715K912L304K439P35o81k759l290j698J242K571K356K320J366j885k984
3022B33k966j379M96K174K624L063L04j728k723k533j409K32K545L303J838j88
3038C886j387k705l131j830M59K517K675J681P15j786k757k965r38J031K327L019
$$ plain form
3054 811 3014 3214 2176 -1037 -3565 -4615 -3625 -1606 1349 3302 3476 1474 -1587 -3908 -5255 -4544
3070 -4544 -1376 1982 3821 3866 2075 11 -2888 -3783 -2883 172 2746 4497 4229 2220 -880 -3557
3086 -3557 -4708 -3895 -1598 692 2723 2612 630 -2663 -4302 -5363 -4355 -2082 1012 3058 2781 1031
3102 1031 -1854 -3693 -5023 -4232 -1564 1306 3069 2831 870 -1563 -4007 -4863 -3363 -514 1881 3568
3118 3568 3745 2041 -1170 -3334 -3675 -2166 67 2685 4807 4178 1937 -835 -2646 -2826 -2292 1
3134 1 3290 5000 3750 1860 -922 -3142 -4048 -2647 28 2475 3212 2847 670 -1909 -4541 -5065 -3079
3151 -3079 -286 1540 3290 3180 1194 -2125 -3687 -3289 -2075 150 2677 4079 3567 738 -2093 -3394
3167 -3394 -4385 -2832 -275 2494 3629 2388 405 -963 -3227 -3950 -1864 1710 4016 4733 4244 2616
$$ packed form
3054H11K203K00j038l213k528j050R90K019K955J953J74k002l061k321j347P11
3070d544L168L358J839M5j791k064k899q95R00L055K574J751k68k009l100k677
3086c557j151Q13K297K290K031j11j982l293j639j061J008K273L094K046k77j750
3102A031k885j839j330P91K668K870J763k38j961k433k444q56J500K849K395J687
3118C568J77j704l211k164l41J509K233K618K122o29k241k772j811j80N34K293
3134AL289J710j250j890k782k220r06J401K675K447P37l65k177k579k632n24J986
3151c079K793J826J750j10j986l319j562L98J214K225K527J402n12k829k831j301
3167c394r91J553K557K769J135j241j983j368k264p23K086L574K306P17m89j628
$$ plain form
3183 2616 -116 -2944 -2469 -579 1314 3064 4157 3783 943 -2547 -4324 -3399 -2545 -513 2293 4186
3199 4186 2881 119 -1564 -2641 -3164 -1871 1240 4428 4871 2820 751 -928 -3374 -4305 -1973 938
3215 938 2041 2356 2506 749 -2958 -5085 -3475 -893 747 2376 4474 3827 833 -2235 -2506 -1810
3231 -1810 -1439 861 3816 4987 2583 -434 -1709 -2901 -3918 -2192 1118 3620 3396 1596 733 -1296
3247 -1296 -3898 -3950 -734 2046 2927 3040 2963 1295 -2603 -4143 -2841 -371 653 2556 4396 3216
3263 3216 -656 -3049 -2759 -1911 -1646 637 4182 4577 1659 -729 -1588 -2453 -3743 -1509 2219 3871
3279 3871 2669 1037 920 -1196 -4070 -2929 280 2475 2913 3345 3461 794 -3261 -3843 -1458 -389
3295 -389 534 2584 4566 2483 -1676 -3302 -2532 -2174 -2108 1158 4534 3906 829 -593 -834 -2376 -3533
$$ packed form
3183B616k732k828M75J890J893J750J093l74k840l490j777R25Q54K032K806J893
3199D186j305k762j683j077n23J293L111L188M43k051k069j679k446r31K332K911
3215I38J103L15J50j757l707k127J610K582J640J629K098o47k994l068k71O96
3231a810L71K300K955J171k404l017j275j192j017J726L310K502k24j800q63k029
3247a296k602n2L216K780Q81J13p7j668l898j540J302K470J024J903J840j180
3263C216l872k393K90Q48K65K283L545L95k918k388q59q65j290K234L728J652
3279C871j202j632j17k116k874J141L209K195M38M32J16k667m055n82K385J069
3295c89R23K050J982k083m159j626P70L58O6L266L376o28l077j422k41j542j157
$$ plain form
3312 -3533 -942 3301 4230 2235 1856 690 -2058 -4534 -2916 572 1741 1831 3146 3371 -367 -3830
3328 -3830 -3260 -702 54 955 3990 5187 2639 -1257 -1995 -1259 -1767 -1247 2353 5559 3512 627 -224
3345 -224 -618 -2683 -3222 236 4004 3603 2637 2051 1078 -2224 -4409 -1538 1498 2130 1984 3223 2864
3362 2864 -1224 -4058 -2607 -1278 -971 578 3444 4100 335 -2527 -1950 -1684 -2919 -1767 2625 4441
3378 4441 1680 -429 -1046 -2145 -4472 -3857 448 3214 2108 1156 1763 46 -3629 -4217 -1068 1569
3394 1569 1638 2429 3731 2128 -1742 -3491 -2201 -328 -578 799 3914 4125 -181 -2422 -2277 -2138 -2884
3411 -2884 -900 3245 4155 1514 216 -152 -1739 -4201 -2896 1070 3213 2000 1303 1498 -1043 -4304
3427 -4304 -4308 -1383 634 380 1588 3373 956 -2917 -3707 -1751 -714 -383 2072 4614 3231 -377
$$ packed form
3312c533K591M243R29j995l79j166k748k476J618L488J169R0J315K25l738l463
3328c830N70K558P56R01L035J197k548l896p38P36n08N20L600L206k047k885q51
3345b24l94k065n39L458L768m01r66n86r73l302k185K871L036O32j46J239l59
3362B864m088k834J451J329L07J549K866O56l765k862N77K66j235J152M392J816
3378D441k761k109o17j099k327O15M305K766j106r52O07j717l675n88L149K637
3394A569O9P91J302j603l870j749J290J873k50J377L115K11m306k241J45J39p46
3411b884J984M145R10k641j298l68j587k462J305L966K143j213o97J95k541l261
3427d304mK925K017k54J208J785k417l873p90J956J037L31K455K542j383l608
$$ plain form
3443 -377 -1672 -1298 -2189 -2670 104 4025 3950 1693 329 336 -1990 -3509 -1340 2605 3638 2483 2752
3460 2752 2483 -830 -3937 -2460 241 977 1552 2811 3399 349 -3014 -3182 -1900 -1400 -472 2391 3989
3477 3989 2246 -937 -1813 -1502 -2556 -2294 391 3706 2741 698 55 -873 -3176 -3879 -1351 1670 2299
3494 2299 1493 1825 1271 -1635 -3940 -1825 570 1274 2226 3557 3419 191 -2294 -2152 -1175 -1242 43
3511 43 2808 3734 1437 -1380 -1554 -2329 -3129 -1999 1208 2692 2299 569 57 -1021 -3718 -3781 -904
3528 -904 1104 1460 1444 1453 -133 -3375 -4225 -2556 -802 32 1443 2564 1994 -974 -2943 -2694 -1353 -1022
3546 -1022 420 3305 3403 1314 -454 -1350 -2077 -2266 -1245 1946 3361 2193 1079 438 -1124 -3201
3562 -3201 -2629 275 1749 2147 2187 1639 10 -2820 -3473 -1800 -291 72 1687 2637 1215 -1592 -3016
$$ packed form
3443c77j295L74q91m81K774L921p5k257j364Pk326j519K169L945J033j155K69
3460B752k69l313l107J477K701P36N75J259N88l050l363j68J282N00R28K863J598
3477C989j743l183q76L11j054K62K685L315r65k043o43r28k303p03K528L021O29
3494B299q06L32n54k906k305K115K395P04R52J331j38l228k485J42R77o7J285
3511D3K765R26k297k817j74p75q00J130L207J484l93j730n12j078k697o3K877
3528i04K008L56j6Rj586l242q50J669J754Q34J411J121n70k968j969K49J341L31
3546a022J442K885R8k089j768q96p27j89J021L191J415j168j114o41j562k077
3562c201N72K904J474L98M0n48j629k830o53J673J509L63J615R50j422k807j424
$$ plain form
3579 -3016 -2653 -2140 -1403 601 2811 2726 628 -1377 -1696 -2401 -2635 -658 1642 2707 2084 1083 -315
3596 -315 -1985 -3031 -2220 204 1711 2505 2529 1932 14 -2205 -2130 -789 584 1499 2971 2885 1478 -976
3614 -976 -2156 -1667 -1641 -741 1350 2941 2259 323 -1110 -2124 -2603 -2300 -362 1958 2457 1746 607
3631 607 -770 -2398 -3421 -1766 5 1111 1812 1684 700 -1212 -2541 -2489 -1127 -185 1193 2461 2612
3648 2612 1111 -973 -2127 -1879 -1026 250 1959 2755 2220 728 -766 -1659 -2238 -1750 379 2201 2553
3665 2553 1708 748 -605 -2226 -2587 -1154 500 1490 1917 1942 364 -1507 -3050 -2953 -1769 -387 934
3682 934 1600 1292 -403 -2101 -2859 -2853 -1617 -220 1398 2324 1391 109 -1328 -2484 -2414 -1477 281 1813
3700 1813 2019 1416 -251 -1130 -2763 -2262 -1274 637 1646 2233 1888 320 -1386 -2246 -2322 -542 388 1748
$$ packed form
3579c016L63N13P37K004K210q5k098k005l19p05k34J977K300J065o23j001j398
3596c15j670j046Q11K424J507P94K4n97j918k219P5J341J373R15J472q6j407k454
3614i76j180M89K6R00K091J591o82j936j433j014m79L03J938K320M99p11j139
3631F07j377j628j023J655J771J106P01j28r84j912j329N2J362R42J378J268J51
3648B612j501k084j154K48Q53J276J709P96n35j492j494q93n79M88K129J822L52
3665B553q45r60j353j621l61J433J654R90M27K5j578j871j543R7J184J382J321
3682I34O66l08j695j698p58OJ236J397J618R26r33j282j437j156P0R37J758J532
3700A813K06o03j667q79j633N01R88J911J009N87l45j568j706q60p6J780R30J360
$$ plain form
3718 1748 2439 1808 147 -1755 -2415 -2525 -1541 371 1439 1912 941 -464 -1733 -2649 -2591 -1546 106
3735 106 1583 1791 1126 -430 -1529 -2638 -2297 -1280 616 1778 1997 1650 -70 -1418 -2129 -1574 -515
3752 -515 1152 2185 2470 1819 150 -1256 -1833 -1477 -444 955 2226 2596 1671 85 -1264 -2179 -1896
3769 -1896 -355 1183 2369 2232 1617 57 -1314 -2450 -1733 -461 770 2146 2229 1288 -776 -2090
3785 -2090 -2946 -1941 -853 251 1641 1656 975 -604 -1788 -2169 -1828 -589 1045 2413 2093 1115 -481
3802 -481 -1505 -2271 -1909 -514 1095 1565 1795 954 -589 -2314 -2518 -1550 -483 853 1658 1823 1262 -886
3820 -886 -1816 -1959 -1647 -78 732 1754 1774 708 -893 -1887 -2353 -2062 -602 845 1730 1204 288 -959
3838 -959 -1842 -2326 -1928 -505 1101 1524 1736 746 -562 -2174 -2472 -1607 -179 998 1543 2063 833 -732
$$ packed form
3718A748O91o31j661j902o60j10R84J912J068M73r71j405j269r16N8J045J652
3735A06J477K08o65j556j099j109L41J017J896J162K19l47j720j348p11N55J059
3752e15J667J033K85o51j669j406n77L56J033J399J271L70r25j586j349r15K83
3769a896J541J538J186j37o15j560j371j136P17J272J231J376Q3r41k064j314
3785b090q56J005J088J104J390J5o81j579j184l81L41J239J634J368l20r78j596
3802d81j024p66L62J395J609M70K30q41j543j725k04R68J067J336Q05J65n61k148
3820h86r30j43L12J569Q10J022K0j066j601r94m66K91J460J447Q85n26r16j247
3838i59q83m84L98J423J606M23K12r90j308j612k98Q65J428J177N45N20j230j565
$$ plain form
3856 -732 -1842 -1909 -1400 -313 1063 2282 1826 509 -965 -1706 -2150 -1509 -74 1475 1957 1663 448
3873 448 -677 -1604 -2303 -1299 255 1349 1894 1716 836 -599 -2012 -2126 -737 122 1097 1812 2160 210
3891 210 -1261 -1805 -1714 -1252 -502 1366 2158 1856 -59 -967 -1048 -1933 -1400 219 2249 1890 976 601 -270
3910 -270 -1738 -2475 -933 404 1394 1815 1507 704 -948 -2074 -1587 -544 612 967 2244 2283 205
3927 205 -1087 -1219 -1165 -874 110 1868 2588 1204 -630 -727 -1485 -2327 -1492 467 2135 1521 532 186 -645
3946 -645 -2037 -2363 -550 931 1390 1690 1646 772 -1467 -2367 -1587 -398 52 919 1986 1447 -72 -1488
3964 -1488 -1439 -1323 -1234 194 1921 2389 801 -69 -778 -1295 -2007 -1008 1021 1900 1218 631 579 -706 -2202
3983 -2202 -1990 -99 1044 1308 1536 1714 334 -1439 -2160 -1279 -452 303 1311 2150 1340 -854 -1524 -1394
$$ packed form
3856g32j110o7N09J087J376J219m56j317j474p41m44O41J435J549M82k94j215
3873D48j125r27o99J004J554J094N45j78q80j435j413j14J389Q59R75P15L48j950
3891B10j471n44R1M62P50J868P92l02j915r08q1q85N33J619K030l59r14l75q71
3910b70j468p37J542J337R90M21l08q03j652j126M87J043J156L55J277L9k078
3927B05j292j32N4K91R84J758P20j384j834r7p58q42Q35J959J668o14r89l46q31
3946f45j392l26J813J481M59L00m4q74k239r00P80J189M50Q67J067n39j519j416
3964a488M9J16Q9J428J727M68j588q70p09n17p12R99K029Q79o82n87n2j285j496
3983b202K12J891J143K64K28J78j380j773p21Q81Q27P55J008Q39q10k194o70J30
$$ plain form
4001 -1394 -1401 -1504 248 1886 1887 391 -458 -673 -1709 -2101 -919 1005 1772 942 776 552 -892 -2243
4019 -2243 -1662 102 908 964 1548 1640 -138 -1798 -1398 -593 -175 428 1669 2464 1536 -462 -1299 -907 -1044
4038 -1044 -483 1185 2466 1683 199 -179 -365 -1364 -1642 -252 1942 1946 793 1082 431 -1351 -2129 -562
4056 -562 556 937 1262 1789 1525 -200 -1843 -1719 -647 -429 277 1898 2573 683 -533 -715 -889 -940
4074 -940 -260 1261 2547 1646 447 574 -210 -1562 -1249 350 1830 1612 1231 1221 312 -1354 -2005 -470
4092 -470 888 1021 1287 1845 1343 -660 -1746 -1183 -680 -350 608 1897 1701 183 -1314 -1319 -1232 -1374 -663
4111 -663 1230 1602 832 -150 -208 -886 -2027 -1511 231 1399 1259 1027 820 -424 -1990 -1619 -607 440
4129 440 618 1163 1880 703 -1026 -1450 -936 -667 -320 1010 2609 1298 304 -919 -785 -1181 -898 -75
$$ packed form
4001a394pj03J752J638Jj496q49k15j036l92J182J924P67q30j66k24j444j351
4019b243N81J764Q06N6N84R2j778j660M00Q05M18O03J241P95r28j998q37L92j37
4038a044N61J668J281p83j484l78j86r99k78J390K194Mj153K89o51j782p78J567
4056e62J118L81L25N27k64j725j643J24J072K18P06J621O75j890j216j82j74n1
4074i40O80J521J286r01j199J27p84j352L13J599J480k18l81j0r09j666o51J535
4092d70J358J33K66N58n02k003j086N63N03L30R58J289j96j518j497nQ7j42P11
4111f63J893L72p70r82n8o78j141N16J742J168j40k32k07j244j566L71J012J047
4129D40J78N45P17j177j729m24N14K69L47J330J599j311r94j223J34l96K83Q23
$$ plain form
4147 -75 1827 1899 538 -115 -370 -1356 -2044 -1230 501 995 979 984 708 -520 -1914 -1398 -424 349 597 1298
4167 1298 1480 362 -979 -1057 -884 -695 44 1333 2274 1421 -160 -237 -528 -926 -648 419 2082 1671
4185 1671 860 407 -50 -1137 -1605 -564 1002 1530 1077 1098 666 -828 -1591 -1047 -45 346 695 1716
4203 1716 1559 -40 -965 -1247 -1213 -772 59 868 1662 747 -393 -1121 -1114 -1316 -841 316 1137 1250 647 294
4223 294 -665 -1491 -1574 -375 1033 963 1247 969 209 -844 -1329 -681 -208 294 1051 1352 1329 -278 -1117 -1117
4243 -1117 -869 -598 393 1422 1799 545 -751 -946 -1366 -1295 -610 610 1259 876 174 -193 -864 -1555 -1514
4262 -1514 -187 988 1187 1162 832 -111 -1306 -1509 -1009 -369 19 869 1192 543 -424 -1034 -1140 -846 -462
4281 -462 472 1441 1156 702 -98 -1081 -1043 -981 96 1050 1395 1087 549 -61 -1184 -1633 -1039 224 684 813
$$ packed form
4147g5J902P2j361o53k55r86o88Q14J731M94j6Nk76j228j394N16R74P73K48P01
4167A298J82j118j341p8J73J89P39J289R41q53j581p7k91l98K78J067J663m11
4185A671q11m53m57j087m68J041J566N28m53K1m32j494p63N44J002L91L49J021
4203A716j57j599r25k82L4M41Q31Q09P94r15j140p28Pk02M75J157Q21J13o03l53
4223B94r59q26q3J199J408p0K84k78p60j053m85O48M73N02P57L01k3j607q39%
4243a117K48K71R91J029L77j254j296j95m20P1O85J220O49l83p02l67o71o91M1
4262a514J327J175J99k5l30r43j195k03N00O40L88Q50L23o49r67o10j06K94L84
4281d62R34R69k85m54q00r83L8O2J077R54L45l08n38o10j123m49N94J263M60J29
$$ plain form
4301 813 1283 421 -239 -1344 -1363 -889 -13 269 1328 1251 316 -349 -1452 -1268 -733 -447 368 1209 892 236
4321 236 -434 -910 -1518 -869 82 893 975 1073 461 -404 -1222 -1524 -903 1 638 1064 1103 541 -402 -1017 -1054
4342 -1054 -892 -104 653 1198 1106 247 -251 -1078 -870 -611 176 910 1012 950 418 -366 -1099 -1053 -1004 -140 829
$$ packed form
4301H13M70q62o60j105j9M74Q76K82J059p7r35o65j103J84N35K86Q15Q41l17o56
4321B36o70m76o08O49R51Q11Q2R8o12q65q18l02O21R04O37M26L9n62r43o15l7
4342a054J62P88P57N45r2q59m98q27K08K59P87P34J02o2n32p84p33M6M9Q64R69
$$ [...]
8191b67
##END NTUPLES=NMR FID
##END=
