##TITLE=1H_SA_31.126
 D2O, 8 sc, 
 20.8.2019
##JCAMPDX= 6.0         $$ Bruker NMR JCAMP-DX V2.0
##DATA TYPE= NMR FID
##DATA CLASS= NTUPLES
##ORIGIN= UXNMR, Bruker Analytische Messtechnik GmbH
##OWNER= root
$$ XWIN-NMR		Version 3.5
$$ Tue Aug 20 14:33:04 2019 Russian Standard Time (UT+4h)  she@DPX200
##.OBSERVE FREQUENCY= 200.13155
##.OBSERVE NUCLEUS= ^1H
##.DELAY= (6, 6)
##.ACQUISITION MODE= SIMULTANEOUS
##.ACQUISITION SCHEME= undefined
##.AVERAGES= 8
##.DIGITISER RES= 18
##SPECTROMETER/DATA SYSTEM= spect
##.PULSE SEQUENCE= zg30
##.SOLVENT NAME= D2O
##.SHIFT REFERENCE= (INTERNAL, D2O, 0, 15.7039)
##AUDIT TRAIL= $$ (NUMBER, WHEN, WHO, WHERE, WHAT)
$$ ##TITLE= Audit trail, XWIN-NMR		Version 3.5
$$ ##JCAMPDX= 5.01
$$ ##ORIGIN= Bruker BioSpin GmbH
$$ ##OWNER= she
$$ F:/spectra/data/she/nmr/H-F/1/audita.txt
$$ ##AUDIT TRAIL=  $$ (NUMBER, WHEN, WHO, WHERE, WHAT)
(   1,<2019-08-20 14:31:59.17 +0400>,<she>,<DPX200>,
      <created by zg, POWCHK disabled, PULCHK disabled
       configuration hash MD5:
       00 E9 B6 7A A2 85 ED C7 34 08 36 98 17 FE 4E 26
       data hash MD5: 16K
       6F 56 89 F6 2E 7E E8 10 8E 89 19 9E D6 8E F9 BE>)
$$ ##END=
$$ 
$$ hash MD5
$$ BF D9 4B BC 44 3D AC D5 AF F6 EC 85 04 04 0E AF
##$RELAX= 
##$RELAX= 
##$RELAX= 
##$RELAX= 
##$RELAX= 
##$RELAX= 
$$ Bruker specific parameters
$$ --------------------------
##$DU= <F:/spectra>
##$EXPNO= 1
##$NAME= <H-F>
##$PROCNO= 1
##$TYPE= <nmr>
##$USER= <she>
##$AMP= (0..31)
100 100 100 100 100 100 100 100 100 100 100 100 100 100 100 100 100 100 
100 100 100 100 100 100 100 100 100 100 100 100 100 100 
##$AQSEQ= 0
##$AQ_mod= 1
##$AUNM= <au_zg>
##$AUTOPOS= <>
##$BF1= 200.13
##$BF2= 200.13
##$BF3= 200.13
##$BF4= 200.13
##$BF5= 200.13
##$BF6= 200.13
##$BF7= 200.13
##$BF8= 200.13
##$BYTORDA= 1
##$CFDGTYP= 0
##$CFRGTYP= 5
##$CHEMSTR= <none>
##$CNST= (0..31)
1 1 145 1 1 1 1 1 1 1 1 1 1 1 1 1 1 1 1 1 1 1 1 1 1 1 1 1 1 1 1 1 
##$CPDPRG= <>
##$CPDPRG1= <>
##$CPDPRG2= <>
##$CPDPRG3= <>
##$CPDPRG4= <mlev>
##$CPDPRG5= <mlev>
##$CPDPRG6= <mlev>
##$CPDPRG7= <mlev>
##$CPDPRG8= <mlev>
##$CPDPRGB= <>
##$CPDPRGT= <>
##$D= (0..31)
0 1.2 0 0 0 0 0 0 0 0 0 0.03 0 0 0 0 0 0 0 0 0 0 0 0 0 0 0 0 0 0 0 0 
##$DATE= 1566297118
##$DBL= (0..7)
120 120 120 120 120 120 120 120 
##$DBP= (0..7)
150 150 150 150 150 150 150 150 
##$DBP07= 0
##$DBPNAM0= <>
##$DBPNAM1= <>
##$DBPNAM2= <>
##$DBPNAM3= <>
##$DBPNAM4= <>
##$DBPNAM5= <>
##$DBPNAM6= <>
##$DBPNAM7= <>
##$DBPOAL= (0..7)
0.5 0.5 0.5 0.5 0.5 0.5 0.5 0.5 
##$DBPOFFS= (0..7)
0 0 0 0 0 0 0 0 
##$DE= 6
##$DECBNUC= <off>
##$DECIM= 24
##$DECNUC= <off>
##$DECSTAT= 4
##$DIGMOD= 1
##$DIGTYP= 9
##$DL= (0..7)
0 120 120 120 120 120 120 120 
##$DP= (0..7)
150 150 150 150 150 150 150 150 
##$DP07= 0
##$DPNAME0= <>
##$DPNAME1= <>
##$DPNAME2= <>
##$DPNAME3= <>
##$DPNAME4= <>
##$DPNAME5= <>
##$DPNAME6= <>
##$DPNAME7= <>
##$DPOAL= (0..7)
0.5 0.5 0.5 0.5 0.5 0.5 0.5 0.5 
##$DPOFFS= (0..7)
0 0 0 0 0 0 0 0 
##$DQDMODE= 0
##$DR= 18
##$DS= 0
##$DSLIST= <SSSSSSSSSSSSSSS>
##$DSPFIRM= 0
$$ [...]
##$SUBNAM2= <"">
##$SUBNAM3= <"">
##$SUBNAM4= <"">
##$SUBNAM5= <"">
##$SUBNAM6= <"">
##$SUBNAM7= <"">
##$SUBNAM8= <"">
##$SUBNAM9= <"">
##$SW= 24.9336996594482
##$SWIBOX= (0..15)
0 0 2 0 0 0 0 0 0 0 0 0 0 0 0 0 
##$SW_h= 4990.01996007984
##$TD= 16384
##$TD0= 1
##$TE= 0
##$TE2= 300
##$TE3= 300
##$TEG= 300
##$TL= (0..7)
0 120 120 120 120 120 120 120 
##$TP= (0..7)
150 150 150 150 150 150 150 150 
##$TP07= 0
##$TPNAME0= <>
##$TPNAME1= <>
##$TPNAME2= <>
##$TPNAME3= <>
##$TPNAME4= <>
##$TPNAME5= <>
##$TPNAME6= <>
##$TPNAME7= <>
##$TPOAL= (0..7)
0.5 0.5 0.5 0.5 0.5 0.5 0.5 0.5 
##$TPOFFS= (0..7)
0 0 0 0 0 0 0 0 
##$TUNHIN= 0
##$TUNHOUT= 0
##$TUNXOUT= 0
##$USERA1= <user>
##$USERA2= <user>
##$USERA3= <user>
##$USERA4= <user>
##$USERA5= <user>
##$V9= 5
##$VALIST= <valist>
##$VCLIST= <CCCCCCCCCCCCCCC>
##$VD= 0
##$VDLIST= <DDDDDDDDDDDDDDD>
##$VPLIST= <PPPPPPPPPPPPPPP>
##$VTLIST= <TTTTTTTTTTTTTTT>
##$WBST= 1024
##$WBSW= 4
##$XGAIN= (0..3)
0 0 0 0 
##$XL= 0
##$YL= 0
##$YMAX_a= 295883
##$YMIN_a= -317825
##$ZGOPTNS= <>
##$ZL1= 120
##$ZL2= 120
##$ZL3= 120
##$ZL4= 120
##$ABSF1= 10
##$ABSF2= 0
##$ABSG= 5
##$ABSL= 3
##$ALPHA= 0
##$AQORDER= 0
##$ASSFAC= 0
##$ASSFACI= 0
##$ASSFACX= 0
##$ASSWID= 0
##$AUNMP= <proc_1d>
##$AZFE= 0.1
##$AZFW= 0.1
##$BCFW= 1
##$BC_mod= 2
##$BYTORDP= 1
##$COROFFS= 0
##$CY= 11.3945322036743
##$DATMOD= 1
##$DC= 2
##$DFILT= <>
##$DTYPP= 0
##$F1P= 20.1720416913024
##$F2P= 0.152960286110954
##$FCOR= 0.5
##$FTSIZE= 0
##$FT_mod= 4
##$GAMMA= 1
##$GB= 0.15
##$INTBC= 1
##$INTSCL= 1
##$ISEN= 128
##$LB= 0.24
##$LEV0= 0
##$LPBIN= 0
##$MAXI= 10000
##$MC2= 0
##$MEAN= 0
##$ME_mod= 0
##$MI= 1.114404
##$NCOEF= 0
##$NC_proc= 0
##$NLEV= 6
##$NOISF1= 3.799351
##$NOISF2= 2.8
##$NSP= 1
##$NTH_PI= 0
##$NZP= 0
##$OFFSET= 15.70392
##$PC= 1
##$PHC0= -9217.883
##$PHC1= 17.20096
##$PH_mod= 1
##$PKNL= yes
##$PPARMOD= 0
##$PSCAL= 0
##$PSIGN= 0
##$REVERSE= no
##$SF= 200.130013532006
##$SI= 16384
##$SIGF1= 3
##$SIGF2= 2
##$SINO= 400
##$SIOLD= 16384
##$SREGLST= <1H.CDCl3>
##$SSB= 0
##$STSI= 0
##$STSR= 0
##$SW_p= 3612.71676300578
##$SYMM= 0
##$S_DEV= 0
##$TDeff= 0
##$TDoff= 0
##$TI= <>
##$TILT= no
##$TM1= 0
##$TM2= 0
##$TOPLEV= 0
##$USERP1= <user>
##$USERP2= <user>
##$USERP3= <user>
##$USERP4= <user>
##$USERP5= <user>
##$WDW= 1
##$XDIM= 8192
##$YMAX_p= 0
##$YMIN_p= 0
$$ End of Bruker specific parameters
$$ ---------------------------------
##NTUPLES= NMR FID
##VAR_NAME=  TIME,          FID/REAL,        FID/IMAG
##SYMBOL=    X,             R,               I
##VAR_TYPE=  INDEPENDENT,   DEPENDENT,       DEPENDENT
##VAR_FORM=  AFFN,          ASDF,            ASDF
##VAR_DIM=   8192,          8192,            8192
##UNITS=     SECONDS,       ARBITRARY UNITS, ARBITRARY UNITS
##FACTOR=    0.0002004,     1,               1
##FIRST=     0,             0,               0
##LAST=      1.6414764,     0,               0
##MIN=       0,             -317825,         0
##MAX=       1.6414764,     295883,          0
$$ Real data points
##PAGE= N=1
##DATA TABLE= (X++(R..R)), XYDATA
$$ [...]
$$ plain form
2525 -1077 -4058 -4444 -1546 2386 3835 3627 2995 1066 -2246 -3378 -986 1347 2111 3121 3160 -240
2541 -240 -4157 -4519 -1671 412 2248 4052 4552 1346 -1962 -2251 -967 -105 1804 4769 4763 151 -2314
2558 -2314 -2342 -1993 -1291 1700 5699 4990 2285 473 142 -1848 -1441 2867 5692 4071 1407 -67 -1470
2575 -1470 -4035 -3292 1133 3618 2949 2116 1448 -1367 -4063 -1901 2212 3188 2073 2736 1309 -2709
2591 -2709 -5781 -3586 -348 396 1335 3329 1328 -2999 -4008 -1354 -48 -457 2324 4363 1461 -3394
2607 -3394 -4507 -2845 -3467 -2289 1784 3275 -469 -3423 -2904 -2528 -4130 -2313 2888 4051 -349 -2555
2623 -2555 -2773 -4875 -6047 -2798 1687 1038 -1378 -1020 -1481 -5427 -6071 -774 2922 2468 1211 1804 -739
2640 -739 -4781 -4338 -189 985 -18 1541 3011 -1321 -5810 -3853 567 927 1067 3761 3739 -1217
$$ packed form
2525a077k981l86K898L932J449k08o32j929l312j132K392K333P64J010L9l400
2541b40l917l62K848K083J836J804N00l206l308k89J284Q62J909K965om612k465
2558b314k8L49P02K991L999p09k705j812l31j990M07M308K825j621k664j474j403
2575a470k565P43M425K485o69q33o68k815k696K162M113R76j115O63j427m018
2591b709l072K195L238P44R39J994k001m327j009K654J306m09K781K039k902m855
2607c394j113J662o22J178M073J491l744k954N19L76j602J817N201J163m400k206
2623b555k18k102j172L249M485o49k416L58m61l946o44N297L696m54j257N93k543
2640g39m042M43M149J174j003J559J470m332m489J957M420L60J40K694k2m956
$$ plain form
2656 -1217 -4189 -2345 -1310 -1863 347 4853 2815 -2590 -3657 -1313 -1270 -1626 2455 6501 4224 341
2672 341 119 212 -2756 -1950 3878 6228 2130 -375 523 -825 -3922 -1984 3509 4600 2272 2151 1993
2689 1993 -2137 -4552 -592 3739 2498 701 2042 1522 -3624 -5947 -1606 1771 1067 2509 4802
2704 4802 1985 -3648 -3022 1031 1198 -212 3031 4946 721 -4498 -3803 -1524 -2351 -979 3600 4137
2720 4137 -969 -2975 -921 -1815 -3973 -594 4344 3409 -1218 -2704 -2114 -4523 -4878 -270 3192 1435
2736 1435 -908 420 -395 -4525 -4579 1390 4360 1789 451 1435 -1604 -5373 -3843 688 1050 125
2752 125 2240 3072 -2031 -5531 -2365 1934 1381 1273 4124 2894 -2124 -4058 -1154 -487 -1334 1874
2768 1874 5458 2886 -2822 -2905 22 -49 -280 3582 6399 2900 -553 -247 -355 -2424 -1077 4693 5478
$$ packed form
2656a217k972J844J035n53K210M506k038n405j067K344M3l56M081M046k277l883
2672C41k22R3k968Q06N828K350m098k505Q98j348l097J938N493J091k328j21j58
2689A993m130k415L960M331j241j797J341n20n146k323M341L377p04J442K293
2704D802k817n633O26M053J67j410L243J915m225n219O95K279q27J372M579N37
2720D137n106k006K054q94k158L379M938r35m627j486N90k409l55M608L462j757
2736A435k343J328q15m130n4N969K970k571j338R84l039l769J530M531L62r25
2752A25K115Q32n103l500L166M299n53j08K851j230n018j934K904O67q47L208
2768A874L584k572n708q3K927p1k31L862K817l499l453L06j08k069J347N770P85
$$ plain form
2785 5478 1211 -321 783 -686 -3037 68 4906 4840 2516 2264 1846 -2266 -3774 824 4433 2597
2801 2597 1201 2589 1438 -3008 -3630 456 2658 2484 3777 4900 813 -3660 -2209 840 940 378
2817 378 2989 3820 -458 -4390 -3076 -864 -1101 1136 4484 4056 -900 -2506 -1218 -1564 -2244 557
2833 557 3906 2489 -1576 -2627 -2582 -4067 -3019 1172 3710 1285 -568 -271 -1144 -4158 -3117 1789
2849 1789 3234 1022 188 -316 -3050 -5034 -2889 1051 1388 1109 2104 1486 -2439 -4454 -1229 1350
2865 1350 1325 1656 2922 989 -3074 -3865 -1545 -759 -384 2363 4083 1343 -2317 -2229 -702 -500 958
2882 958 3847 4192 1209 -1227 -1608 -2028 -2526 -28 3621 3657 978 -434 -493 -1309 -2036 1183 4403 3725
2900 3725 1943 1008 -786 -3037 -2822 758 2699 2252 1679 1548 -794 -2768 -2432 935 2287 2664 3042
$$ packed form
2785E478m267j532J104j469k351L105M838o6k324k52m18m112j508M598L609j836
2801B597j396J388j151m446o22M086K202j74J293J123m087m473J451L049J00n62
2817C78K611Q31m278l932J314K212k37K237L348m28m956j606J288l46o80K801
2833E57L349j417m065j051M5j485J048M191K538k425j853K97q73l014J041M906
2849A789J445k212q34n04k734j984K145L940L37k79R95o18l925k015L225K579
2865A350k5L31J266j933m063p91K320P86L75K747J720k740l660Q8J527K02J458
2882I58K889L45k983k436l81m20m98K498L649L6k679j412n9q16p27L219L220o78
2900C725j782r35j794k251K15L580J941m47n73j31k342j974L36L367J352L77L78
$$ plain form
2917 3042 2224 -856 -3581 -2313 -658 172 1279 2150 1477 -1662 -3605 -2666 -1143 -23 2122 3522
2933 3522 2273 -1204 -2833 -1798 -2361 -1416 1579 2871 885 -1481 -2554 -2717 -2910 -821 1574 2861
2949 2861 1604 -270 -1409 -2636 -3654 -1849 1113 2043 692 -323 -1778 -3834 -3844 -1775 1088 1986
2965 1986 1903 1063 -521 -2671 -3045 -1195 633 1715 2397 1947 -146 -2903 -3321 -1673 152 1722 2867
2982 2867 2702 714 -1890 -2140 -1057 190 1708 3043 2453 11 -1713 -2684 -2129 -877 1187 3357
2998 3357 3012 1281 -293 -1123 -1524 -456 1641 3628 3417 1756 -184 -1624 -2336 -1381 1252 2874
3014 2874 2846 2202 281 -1288 -1997 -1231 1238 2777 2897 2351 495 -1712 -2892 -2384 -431 1507 2193
3031 2193 2054 1016 -1566 -2325 -1993 -245 1274 2705 2673 1137 -1372 -3036 -2870 -1853 -95 1654
$$ packed form
2917C042q18l080k725J268J655Q30J107Q71o73l139j943R39J523J120K145J400
2933C522j249l477j629J035n63R45K995J292j986k366j073j63j93K089K395J287
2949B861j257j874j139j227j018J805K962R30j351j015j455k056j0K069K863Q98
2965A986q3q40j584k150l74J850J828J082O82m50k093k757m18J648J825J570J145
2982B867j65j988k604k50J083J247J518J335n90k442j724r71N55J252K064K170
2998C357l45j731j574q30m01J068K097J987k11j661j940j440p12R55K633J622
3014B874k8o44j921j569p09P66K469J539J20n46j856k207j180N08J953J938O86
3031B193j39j038k582p59L32J748J519J431l2j536k509j664J66J017J758J749
$$ plain form
3047 1654 2055 690 -1204 -2904 -2551 -1591 296 2154 2506 1265 -364 -2112 -2720 -2158 -706 1356
3063 1356 1845 1378 -110 -1755 -2969 -1995 -215 2002 2418 2053 822 -1630 -2656 -2451 -1039 791
3079 791 1836 1630 602 -1254 -2827 -2632 -759 1136 2511 3301 2062 531 -1522 -1785 -570 381
3095 381 2300 3185 2559 118 -1548 -2069 -1182 463 2367 3539 2830 1188 -621 -1895 -1358 -340 1789
3112 1789 2717 1789 152 -1098 -2442 -2317 -895 1767 3035 3097 1899 445 -1087 -1603 -328 1829
3128 1829 2899 2645 1957 46 -1837 -2346 -1009 778 1865 2563 1969 90 -2006 -2442 -1452 68 916
3145 916 1828 1603 -627 -2711 -3307 -2713 -1417 112 2183 1937 87 -1404 -2069 -1916 -802 1082 2773
3162 2773 2475 495 -1280 -2193 -3013 -2216 126 2104 964 321 -418 -2247 -3423 -2406 390 1617
$$ packed form
3047A654M01j365j894j700L53R60J887J858L52j241j629j748o08N62J452K062
3063A356M89m67j488j645j214R74J780K217M16l65j231k452j026K05J412J830
3079G91J045k06j028j856j573J95J873J895J375P90j239j531k053k63J215R51
3095C81J919Q85o26k441j666n21Q87J645J904J172p09j642j809j274N37J018K129
3112A789R28r28j637j250j344J25J422K662J268O2j198j454j532n16J275K157
3128A829J070k54o88j911j883n09J337J787J087O98n94j879k096m36R90J520Q48
3145I16R12k25k230k084n96N94J296J529K071k46j850j491o65J53J114J884J691
3162B773k98j980j775r13q20P97K342J978j140o43p39j829j176J017K796J227
$$ plain form
3178 1617 1347 871 -381 -2724 -3989 -2884 -483 721 962 1286 89 -1731 -3359 -1761 186 1316
3194 1316 2162 2624 1477 -1309 -2523 -1583 -840 -140 1905 2517 1105 -1665 -2345 -1635 -1046 161 2344
3211 2344 3294 1010 -1001 -1753 -2235 -2317 -577 2190 2321 588 -723 -1129 -2189 -2206 227 2794 3075
3228 3075 1738 1131 -34 -2169 -2236 372 2235 1725 1145 1343 -594 -2734 -2676 -342 1512 1484 2229 2253
3246 2253 -568 -3013 -2245 -311 380 738 2090 1649 -1205 -3151 -2235 -1100 -734 1146 3272 2377 -727
3263 -727 -1538 -1005 -1318 -1076 1199 3108 1512 -959 -1452 -1965 -2329 -1712 1398 2684 1125 -252 -177 -1098
3281 -1098 -2953 -1243 1613 2342 854 636 361 -2351 -3562 -1373 968 1334 947 1598 1210 -2242 -3031
3298 -3031 -339 1008 1076 1574 2502 472 -2683 -2400 -752 -574 -61 2360 2938 73 -2031 -1532 -458
$$ packed form
3178A617k70m76j252k343j265J105K401J204K41L24j197j820j628J598J947J130
3194A316Q46M62j147k786j214R40P43P00K045O12j412k770o80P10N89J207K183
3211B344R50k284k011p52m82q2J740K767J31j733j311m06j060j7K433K567K81
3228C075j337o07j165k135o7K608J863n10n80J98j937k140N8K334J854k8P45K4
3246B253k821k445P68J934O91L58J352m41k854j946R16J135L66J880K126q95l104
3263g27q11N33l13K42K275J909j596k471m93n13l64O17L110J286j559j377P5r21
3281a098j855J710K856P29j488k18k75k712j211K189K341L66l87O51l88l452p89
3298c031K692J347O8M98R28k030l155K83J648J78N13K421N78k865k104M99J074
$$ plain form
3315 -458 -778 650 3100 3103 148 -1287 -960 -1413 -2007 492 3077 2549 173 -624 -449 -1753 -1806 1110
3333 1110 3406 2243 732 727 -328 -2867 -1992 1472 2691 1487 1029 1301 -666 -3078 -1883 1577
3349 1577 1707 2049 2327 2236 -1084 -2910 -773 671 218 597 2688 1346 -1803 -2563 -685 -53 260
3366 260 2057 3494 1206 -1368 -1639 -585 -1123 -561 2059 3389 793 -1253 -970 -1212 -2042 -273 2902
3383 2902 3214 688 -215 52 -1641 -2958 -355 2523 1973 250 289 -488 -2890 -3072 -227 2031 1360
3400 1360 950 1711 29 -3284 -2554 125 1259 551 1488 1897 -924 -3194 -2188 -350 -296 87 2614
3417 2614 2817 -955 -2593 -1209 -823 -956 426 2481 1714 -1699 -2085 -1375 -1722 -2039 887 3173 1258
3434 1258 -1230 -1013 -1064 -2325 -1622 1336 2416 675 -217 -298 -1693 -3471 -2066 1446 1785 152 280
$$ packed form
3315d58l20J428K450Lk955j435L27m53n94K499K585n28k376p97J75j304n3K916
3333A110K296j163j511nj055k539Q75L464J219j204m58K72j967k412J195L460
3349A577J30L42K78r1l320j826K137J444m53L79K091j342l149p60J878O32L13
3366B60J797J437k288k574k71J054n38N62K620J330k596k046K83k42q30J769L175
3383B902L12k526r03K67j693j317K603K878n50j723L9p77k402j82K845K258o71
3400A360m10P61j682l313P30K679J134p08R37M09k821k270J006J838N4L83K527
3417B614K03l772j638J384L86j33J382K055p67l413l86P10l47l17K926K286j915
3434A258k488K17n1j261P03K958J080j741q92q1j395j778J405L512L39j633J28
$$ plain form
3451 280 497 -1594 -2874 -978 1240 870 649 1706 585 -2637 -3101 -1116 484 36 926 1947 220
3468 220 -2238 -2202 -367 -119 -18 2099 2905 200 -2183 -1722 -809 -1475 -310 2018 2391 -348 -1614
3485 -1614 -1064 -1325 -1872 271 2973 2153 70 -333 -558 -1858 -2301 374 2384 1676 25 395 -731
3502 -731 -2588 -1754 759 2183 1716 1181 1264 -630 -3184 -2014 154 1151 647 1385 921 -1298 -2867
3519 -2867 -1536 231 554 1058 2338 1667 -1328 -2210 -668 -304 -364 1074 2149 907 -1560 -1792 -1155
3536 -1155 -1159 -763 1568 2463 927 -884 -1073 -1072 -1887 -928 1697 1924 176 -619 -1053 -2013 -2604 -607 1459
3555 1459 1820 608 840 -209 -2057 -2494 9 1466 1104 1050 1203 -390 -2304 -2142 -444 656 892
3572 892 1736 1721 -401 -1978 -1548 -600 302 1033 2104 1685 -560 -1771 -1478 -1062 -272 689 1904 1930 83
$$ packed form
3451B80K17k091j280J896K218l70k21J057j121l222m64J985J600m48Q90J021j727
3468B20k458L6J835K48J01K117Q06k705k383M61R13o66J165K328L73k739j266
3485a614N50k61n47K143K702q20k083m03k25j300m43K675K010p08j651L70j126
3502g31j857Q34K513J424m67n35Q3j894k554J170K168R97n04P38m64k219j569
3519b867J331J767L23N04J280o71k995q82J542L64o0J438J075j242k467k32O37
3536a155mL96K331Q95j536j811j89Jq15R59K625K27j748p95m34r60n91J997K066
3555A459L61j212K32j049j848m37K503J457l62n4J53j593j914J62J698J100K36
3572H92Q44j5k122j577M30R48R02P31J071m19k245j211K93M16P90R61J215K6j847
$$ plain form
3591 83 -1192 -945 -869 -233 1299 2686 1683 351 -402 -1241 -1700 -1017 1191 2310 1976 524 373 -1050
3609 -1050 -1586 -531 1428 2049 1601 1202 626 -1091 -2019 -1060 344 1536 1103 1457 400 -1186 -1942
3626 -1942 -568 648 1241 2091 1806 440 -1195 -1845 -1049 -315 408 1212 1576 138 -1182 -1970 -1607 -779
3644 -779 310 1914 2200 313 -1021 -1434 -1808 -1444 -323 1348 1343 245 -602 -1429 -1944 -1880 -415 1317
3662 1317 1481 820 -83 -1525 -1986 -1656 -555 757 800 710 -559 -1245 -2202 -1999 -370 685 1272 1179 506
3681 506 -518 -1880 -1572 -730 642 995 1341 649 -928 -1654 -1860 -641 295 1349 1349 1018 -440 -1194
3699 -1194 -1506 -863 -153 1426 1649 972 -308 -1103 -1491 -1390 -293 623 1885 1261 403 -717 -1169 -1142
3717 -1142 -611 755 1938 1643 550 -413 -1545 -1496 -730 576 1486 1342 1034 -114 -1235 -1512 -750 532
$$ packed form
3591H3j275K47P6O36J532J387j003j332p53q39m59O83K208J119l34j452j51j423
3609a050n36J055J959O21m48l99n76j717r28R59J404J192m33L54j057j586p56
3626a942J374J216N93Q50k85j366j635o50P96P34P23Q04L64j438j320p88L63Q28
3644g79J089J604K86j887j334m13l74L64J121J671nj098q47q27n15O4J465J732
3662A317J64o61r03j442m61L30J101J312M3r0j269o86r57K03J629J055N87r3o73
3681E06j024j362L08Q42J372L53L46o92j577p26k06J219R36J054%l31j458p54
3699a194l12O43P10J579K23o77j280p95l88J01J097R16J262o24q58j120m52K7
3717a142N31J366J183k95j093r63j132M9P66J306R10j44l08j148j121k77P62J282
$$ plain form
3735 532 1367 1442 1015 -635 -1345 -1998 -1009 -318 715 1318 1109 -270 -1217 -1435 -967 -367 577 1392 1044
3754 1044 42 -1125 -1779 -1643 -801 480 1307 1019 283 -1093 -1702 -1781 -755 310 1671 1183 96
3771 96 -777 -1759 -1954 -1396 -327 495 670 -51 -632 -1595 -2047 -1315 -67 988 1081 880 337 -1160 -1976
3790 -1976 -1129 -467 455 1163 1123 258 -818 -1694 -1009 -430 807 1542 1482 415 -728 -1467 -1418 -652 159
3809 159 837 1303 420 -748 -1333 -1447 -934 16 1396 1562 853 -26 -578 -1141 -1031 130 1768 1478 1021
3828 1021 167 -556 -1325 -729 13 1429 1797 1552 829 -365 -1066 -986 -97 1346 1526 1537 621 -483 -1678
3847 -1678 -1561 -392 323 1418 1632 923 -641 -900 -832 -278 361 1247 1788 1127 -597 -968 -790 -665 -199
3866 -199 1186 2078 1104 -35 -639 -1066 -1185 -241 1238 1640 903 32 -686 -1312 -1956 -570 671 1205
$$ packed form
3735E32Q35P5m27j650p10o53R89O91J033O03k09j379r47k18M68O00R44Q15l48
3754A044j002j167o54J36Q42J281Q27k88p36j376o09p9J026J065J361m88j087
3771I6q73r82j95N58J069Q22J75p21n81r63m52P32J248J055R3k01n43j497q16
3790a976Q47O62R22P08m0q65j076q76O85N79J237P35o0j067j143p39M9P66Q11
3809A59O78M66q83j168n85j14N13R50J380J66p09q79n52n63J10J161J638k90m57
3828A021q54p23p69N96P42J416L68k45p23j194p01Q0Q89J443J80J1r16j104j195
3847a678J17J169P15J095K14p09j564k59O8N54O39Q86N41o61j724l71J78J25M66
3866a99J385Q92r74j139o04m27j19R44J479M02p37q71p18o26o44J386J241N34
$$ plain form
3884 1205 774 523 -160 -1139 -1456 78 844 1329 929 800 214 -1362 -1467 -859 383 512 1415 1487 -270
3903 -270 -1636 -1454 -358 -126 488 1538 1577 -7 -1320 -1282 -926 -719 325 1522 939 -157 -860 -1019
3921 -1019 -1000 -546 667 1597 1282 297 -166 -537 -1514 -1156 621 1747 977 -81 214 -672 -1900 -717
3939 -717 786 1340 1072 1120 703 -930 -1951 -934 294 581 510 1008 522 -1020 -1917 -650 157 541
3957 541 1263 1711 695 -883 -1139 -176 -213 191 1498 1905 543 -908 -522 -761 -912 -154 1681 2092
3975 2092 537 -315 -474 -837 -1037 261 1666 1473 194 -280 -343 -1478 -1764 -111 1229 1135 360 829
3993 829 -182 -1776 -1741 333 1304 804 1012 892 -612 -1937 -1743 67 222 -46 965 1157 -475 -1938
4011 -1938 -1267 -21 -303 484 1534 876 -1160 -1959 -1186 -1019 -982 485 1395 710 -853 -1484 -653 -1082
$$ packed form
3884A205m31k51o83r79l17J534P66M85m00j29n86j576j05O08J242J29R03P2j757
3903b70j366J82J096K32O14J050L9j584j313L8L56K07J044J197n83j096p03j59
3921a019J9M54J213R30l15r85m63l71r77L58J777J126p70j058K95q86j228J183
3939g17J503N54k68M8m17j633j021J017J228K87p1M98m86j542q97J267Q07L84
3957E41P22M48j016j578k56R63l7M04J307M07j362j451L86k39j51P58J835M11
3975B092j555q52j59l63k00J298J405j93j279m74o3j135k86J653J340r4p75M69
3993H29j011j594L5K074R71n00K08j20j504j325J94J810J55k68J011J92j632j463
4011a938O71J246k82P87J050o58k036p99P73J67L7J467R10o85j563o31Q31m29
$$ plain form
4029 -1082 -863 918 1663 182 -658 -778 -871 -2062 -1388 812 1221 341 -417 -203 -1371 -2103 -810 1359
4047 1359 1166 217 571 382 -1579 -2035 -547 1019 784 373 1040 363 -1405 -1686 102 519 529 1364
4065 1364 1760 483 -1474 -1601 106 -280 -6 1532 1756 -17 -1106 -847 -38 -470 541 2218 1786
4082 1786 261 -403 -25 -632 -1096 757 2227 1372 200 64 -117 -864 -826 1053 2099 1068 469 870
4100 870 63 -1343 -894 834 1222 418 436 546 -707 -1673 -1135 772 628 892 1356 1289 -887 -1821 -547
4119 -547 183 316 732 1746 490 -1292 -1580 -798 -584 -509 822 1630 513 -1268 -930 -566 -884 -504
4137 -504 1186 1356 74 -834 -668 -1382 -1246 -565 1346 849 -123 -18 -600 -1511 -1555 -27 1265 1055 153
4156 153 189 -180 -1564 -1363 110 910 476 579 740 -39 -1216 -1050 469 747 647 1452 1467 -183 -1370
$$ packed form
4029a082K19J781P45j481q40j20r3j191O74K200M09q80p58K14j168p32J293K169
4047A359j93r49L54j89j961m56J488J566k35m11O67o77j768k81J788M17J0Q35
4065A364L96j277j957j27J707l86K74J538K24j773j089K59Q09m32J011J677m32
4082A786j525o64L78o07m64J853J470q55j172j36j81p47L8J879J046j031n99M01
4100H70q07j406M49J728L88q04J8J10j253r66N38J907j44K64M64o7k176r34J274
4119e47P30J33M16J014j256j782k88P82K14P5J331Q08j117j781L38L64l18L80
4137e04J690J70j282r08J66p14J36O81J911m97r72J05n82r11m4J528J292k10r02
4156A53L6l69j384K01J473Q00m34J03J61p79j177J66J519K78j00Q05J5j650j187
$$ plain form
4175 -1370 -919 311 422 811 1469 1327 135 -647 -372 105 -182 1148 1683 1584 16 -498 -288 -490 -189
4194 -189 936 1867 1127 -111 99 49 -662 30 1070 1885 1063 427 290 -84 -1232 -54 807 1003 811
4213 811 429 55 -721 -1356 -472 886 829 854 776 59 -1110 -1189 -476 166 257 451 1109 -165 -1333 -1364 -616
4234 -616 -270 33 1070 1069 54 -1177 -848 -749 -972 -99 703 1018 -338 -1103 -962 -1165 -653 -291 1159
4253 1159 947 -121 -291 -620 -1336 -1154 56 990 669 165 -386 -584 -1727 -999 375 649 499 483 141
4272 141 -319 -1381 -947 210 587 804 848 468 -669 -810 -744 -150 360 667 1228 631 -242 -936 -565 -79
4292 -79 688 917 1157 682 -360 -867 -621 -521 349 1021 1331 789 -29 -178 -602 -635 217 1236 1432 1004
4312 1004 230 -426 -960 -894 -76 728 947 742 161 -465 -909 -1128 -504 822 903 877 449 -205 -1030 -1455
$$ packed form
4175a370M51J230J11L89O58j42j192p82K75M77k87J330N35r9j568n14K10k02L01
4194a89J125R31p40j238K10n0p11O92J040Q15q22o36j37l74j148J178Q61J96j92
4213H11l82l74p76o35Q84J358n7K5p8p17j169p9P13O42R1J94O58j274j168l1P48
4234f16L46L03J037jj015j231L29R9k23Q73Q02L15j356p65J41k03N12L62J450
4253A159k12j068j70l29p16J82J210R34l21n04n51j98j143P28J374K74j50j6l42
4272A41m60j062M34J157L77K17M4l80j137j41O6N94N10L07N61n97q73o94L71M86
4292g9P67K29K40m75j042n07K46J00Q70O72L10n42q18j49m24l3Q52J019J96m28
4312A004p74o56n34O6Q18Q04K19k05n81o26m44k19O24J326Q1k6m28o54q25m25
$$ plain form
4332 -1455 -590 -92 697 910 567 -413 -1218 -1065 -446 292 434 848 924 -163 -1043 -1009 -831 -104 290 1103
4352 1103 900 -164 -859 -751 -665 -282 668 1117 969 388 -576 -1054 -826 -340 418 905 720 -98 -460 -905
4372 -905 -1316 -336 652 1248 720 477 -134 -733 -859 -716 -64 985 1148 804 -105 -685 -1060 -514 326 814
4392 814 1132 1015 405 -541 -626 -679 -1 352 1233 1277 173 -176 -612 -794 -316 366 1288 1188 517 -455 -269
4413 -269 -757 -291 581 875 992 309 -243 -457 -748 -830 -71 759 1260 721 -105 -653 -981 -434 20 655
4433 655 1071 641 77 -597 -1152 -867 -183 619 1145 820 440 -353 -1023 -423 -376 249 691 1047 575 -367
4453 -367 -883 -994 -540 -17 708 1015 287 -277 -786 -500 -469 -61 922 842 656 -10 -754 -1025 -753 -423 773
4474 773 799 683 -79 -193 -630 -786 -139 414 975 623 37 -397 -880 -1088 -361 354 639 806 247 -124
$$ packed form
4332a455Q65M98P89K13l43r80q05J53O19P38J42M14P6j087q80L4J78P27L94Q13
4352A103k03j064o95J08Q6L83R50M49j48n81r64m78K28M86P58M87j85q18l62m45
4372i05m11R80R88N96n28k43o11n99j26J43O52J049J63l44r09n80l75N46Q40M88
4392H14L18j17o10r46q5n3O78L53Q81M4j104l49m36j82M78O82R22j00o71r72J86
4413b69m88M66Q72K94J17o83n52k14k91q2P59Q30N01n39q26n48l28N47M54O35
4433F55M16m30n64o74n55K85O84Q02N26l25l80p93o70O00M7O25M42L56m72r42
4453c67n16j11M54N23P25L07p28n64n09K86L1M08R83q0j86o66p44k71K72L30J196
4474G73K6j16p62j14m37j56O47N53N61l52n86m34m83k08P27P15K85J67n59l71
$$ plain form
4494 -124 -976 -1001 -389 64 530 892 617 -41 -722 -770 -269 -183 378 1120 794 -310 -705 -1049 -807 -196 456
4515 456 894 739 -251 -517 -575 -916 -512 74 1061 449 -6 -353 -638 -1143 -540 313 1271 711 440 -146
4535 -146 -759 -762 -175 411 620 401 439 -144 -934 -969 -513 -17 689 723 729 331 -778 -907 -527 178 87 642
4557 642 706 184 -735 -1082 -457 -128 113 900 1055 426 -632 -739 -362 -329 58 1123 1084 157 -414 -576
4577 -576 -873 -855 88 917 694 122 -84 -622 -892 -787 250 658 453 255 -150 -263 -1177 -876 75 677
4597 677 296 363 533 -712 -1036 -820 103 637 669 809 216 -318 -1061 -443 -206 -61 669 938 878 -569
4617 -569 -925 -493 -385 -145 609 1140 621 -612 -886 -420 -395 -195 523 960 0 28 -493 -203 -668 197
4637 197 844 869 227 253 21 -881 -889 -94 963 522 683 456 -62 -884 -681 229 352 1008 809 991 241
$$ packed form
4494a24q52k5O12M53M66L62k75o58o81m8N01Q6N61P42l26j104l95l44K42O11O52
4515D56M38j55r90k66n8l41M04N86R87o12m55l47k85n05O03Q53R58n60k71n86
4535a46o13lN87N86K09k19L8n83p90l5M56M96P06L4Ol98j109j29L80P05r1N55
4557F42O4n22r19l47O25L29K41P87J55o29j058j07L77L3L87J065l9r27n71j62
4577e76k97J8R43Q29k23n72k06n38k70J05J037M08k05j98m05j13r14L01R51O02
4597F77l81O7J70j245l24K16R23N34L2J40n93n34p43O18K37J45P30K69o0j447
4617e69l56M32J08K40P54N31n19j233k74M66K5K00P18M37r60K8n21K90m65Q65
4637A97O47K5o42K6k32r02qP95J057m41J61k27n18q22K03R10J23O56j99J82p50
$$ plain form
4658 241 -587 -846 97 102 332 859 704 -180 -977 -729 -328 36 211 1105 1107 -225 -710 -327 -507 119 591
4679 591 862 846 -490 -473 -737 -454 -770 780 1149 840 -134 -242 -521 -1093 -445 643 996 238 -128 172
4699 172 -912 -1236 -389 515 655 259 406 215 -441 -1293 -396 348 301 286 663 184 -982 -1172 -356 156
4719 156 -42 604 879 267 -592 -771 -136 -33 -110 813 771 125 -521 -342 -503 -616 -74 725 767 138 -277
4740 -277 -142 -520 -207 248 1096 1058 87 459 -173 -717 -752 85 858 587 336 234 167 -1233 -828 417
4760 417 423 808 974 570 -115 -697 -433 119 424 386 783 822 -282 -980 -507 103 181 532 999 448 -448
4781 -448 -780 -150 -48 -227 517 906 166 -549 -811 -658 -767 -534 501 874 -44 -399 -478 -544 -1211 -648
4801 -648 517 950 -117 -450 -351 -714 -1321 -363 440 268 130 280 -54 -980 -979 -139 100 463 244 301 -235
$$ packed form
4658B41q28k59R43NK30N27j55q84p97K48M01L64J75Q94Kj332m85L83j80O26M72
4679E91K71j6j336J7k64K83l16J550L69l09r74j08k79n72O48J088L53p58l66L00
4699A72j084l24Q47R04J40l96J47j91o56q52Q97P44m7j5L77m79j166j90Q16N12
4719A56j98O46K75o12q59j79O35J03p7R23m2o46o46J79j61j13N42P99M2o29m15
4740b77J35l78L13M55Q48l8r71L72o32n44l5Q37P73k71k51j02o7j400M05J245
4760D17OL85J66m04o85n82K64N52L05l8L97L9j104o98M73O10P8L51M67n51q96
4781d48l32O30J02j79P44L89p40p15k62J53j09K33J035L73r18l55p9o6o67N63
4801f48J165M33j067l33R9l63o07R58Q03j72j38J50l34r26JQ40K39L63k19N7n36
$$ plain form
4822 -235 -838 -688 -361 247 280 627 211 146 -886 -693 -310 94 231 715 720 -348 -468 -570 -300 -510 -68
4843 -68 1189 631 -301 -3 -420 -485 -674 458 1158 658 -268 -330 156 -761 -371 631 639 293 152 156 -70
4864 -70 -872 -277 553 655 485 269 240 -381 -922 -367 402 437 465 735 390 -437 -630 -55 75 268 387
4885 387 665 443 -200 -765 -156 -346 -110 615 738 204 -274 -243 -529 -186 173 651 700 157 -201 -508 -683
4906 -683 -651 -442 599 542 -40 141 -244 -934 -920 -1 499 683 178 27 -407 -1016 -747 -349 756 48
4926 48 274 226 -349 -921 -716 -4 -38 370 188 474 -502 -845 -824 -426 24 565 903 403 -354 -651 -495
4947 -495 -437 -68 309 881 264 -61 -321 -587 -315 -4 356 765 371 -122 -375 -325 -438 -94 233 742 504
4968 504 3 63 -377 -638 106 538 519 273 291 -90 -537 -792 -451 106 194 562 381 79 -524 -485 -235 257
$$ packed form
4822b35o03J50L27O08L3L47m16o5j032J93L83M04J37M84Nj068j20j02K70k10M42
4843f8J257n58r32K98m17o5j89J132P00n00r26o2M86r17L90J002Ql46j41Mk26
4864g0q02N95Q30J02j70k16k9o21n41N55P69L5K8K70l45q27j93N75J30J93J19
4885C87K78k22o43n65O09j90K36P25J23n34m78L1k86L43L59M78M9n43l58l07j75
4906f83L2K09J041n7n82J81l85o90J4R19N00J84n05j51m34o09K69L98J105p08
4926D8K26m8n75n72K05P12l4M08j82K86r76l43K1L98M50N41L38n00p57k97J56
4947d95N8L69L77N72o17l25k60k66K72L11L60M09l94m93k53N0j13L44L27N09k38
4968E04n01O0m40k61P44M32j9k46J8l81m47k55L41N57Q8L68j81l02o03L9K50M92
$$ plain form
4990 257 349 534 326 -112 -684 -456 -35 -94 464 378 518 128 -210 -655 -665 -170 47 562 573 7 -288 -700
5012 -700 -229 -107 -59 717 651 214 -40 -526 -555 -217 272 624 520 315 -298 -264 -615 -260 -60 270 437
5033 437 515 228 -424 -642 -624 171 323 507 511 -4 -297 -548 -560 168 252 297 453 80 -508 -508 -529 -164 -45
5056 -45 377 528 294 165 -524 -492 -613 -48 542 502 171 -293 -488 -430 -489 -108 351 630 123 -214 58 -458
5078 -458 -785 -89 345 492 424 149 -316 -513 -393 245 120 375 475 -19 -76 -612 -273 -95 223 668 341
5099 341 382 -105 -630 -453 -180 -97 380 425 315 -59 -598 -612 -587 -92 444 196 181 36 -212 -170 -618 -69
5121 -69 205 482 650 130 -147 -471 -677 -383 484 341 429 -167 -219 -369 -698 -329 235 783 553 123 -176
5142 -176 -244 -920 -299 315 594 445 183 -176 -373 -633 -149 92 342 407 345 -106 -379 -321 -285 -32 0 625
$$ packed form
4990B57R2J85k08m38n72K28M21n9N58q6J40l90l38m45j0M95K17N15J1n66k95m12
5012g00M71J22M8P76o6m37k54m86k9L38M89L52j04k05o13L4l51L55K00L30J67
5033D37P8k87o52k18J8P95J52J84Mn15k93k51j2P28Q4M5J56l73n88%k1L65J19
5056d5M22J51k34j29o89L2j21N65N90m0l31m64j95N8n9L81M59K79n07l37K72n16
5078d58l27O96M34J47o8k75m65j97J20O38j25K55J00m94n7n36L39J78L18M45l27
5099C41M1m87n25J77K73Q3M77M5j10l74n39j4K5M95N36k48j5j45k48M2m48N49
5121f9K74K77J68n20k77l24k06K94Q67j43Q8n96n2j50l29L69N64N48k30m30k99
5142a76o8o76O21O14K79j49k62l59j97k60M84K41K50O5o2m51k73N8L6K53L2O25
$$ plain form
5164 625 393 -167 -339 -556 -566 -534 -22 445 486 -15 -467 -592 -428 -445 71 459 504 225 9 -512 -468 -380
5186 -380 19 424 346 -16 -233 -215 -619 -252 506 429 296 151 101 -289 -408 -61 46 407 477 513 -161 -287
5208 -287 -842 -501 -200 270 491 567 564 -236 -182 -486 2 106 401 610 353 -326 -340 -223 -339 -215 555 742
5230 742 314 42 -80 -556 -175 150 278 554 100 4 -160 -516 -508 93 283 503 211 1 -186 -762 -405
5251 -405 -76 182 353 137 126 -253 -565 -428 -137 242 459 400 353 -93 -633 -298 -427 -155 464 541 175
5272 175 -149 -614 -228 -473 -167 302 650 159 -129 -306 -236 -352 -349 50 404 23 176 -195 -637 -780 0
5293 0 534 559 262 227 -148 -412 -579 -288 186 329 216 52 -96 -548 -588 -84 144 177 512 220 196 -310
5315 -310 -419 -17 35 240 444 412 -225 -650 -200 -213 -57 173 343 684 137 -271 -335 -197 -170 -126 623 346
$$ packed form
5164F25k32n60j72k17j0L2N12M67M1n01m52j25J64j7N16L88M5k79k16n21M4Q8
5186c80L99M05p8l62k17J8m04L67P58p7j33j45n0l90j19L47J07L61P0L6o74j26
5208b87n55L41L01M70K21P6lq00N4l04M88J04K95K09k57o79j4J17j16J24P70J87
5230G42m28k72j22m76L81L25J28K76m54r6j64l56QO01J90K20k92k10j87n76L57
5251d05L29K58J71k16j1l79l12J37K91L79K17n9m7m46n40L35j29K72O19P7l66
5272A75l24m65L86k45L06M69L48m91k88j77P0j16LL99L54l81J53l71m42j43P80
5293@N34K5k97l5l75k64j67K91M74J43j13j64j48m52m0N04K28L3L35k92k4n06
5315c10j09M02N2K05K04l2o37m25M50j3J56K30J70L41n47m08o4J38K7M4P49k77
$$ plain form
5337 346 -25 -40 -134 -350 -532 -138 454 746 -175 -275 -54 -512 -692 193 375 410 188 56 -97 -325 -388
5358 -388 145 146 350 111 235 -253 -785 -110 72 35 199 199 133 -429 -645 -247 -242 6 238 329 -147 -288 -426
5381 -426 26 -266 -85 540 180 472 244 -164 -195 -31 -87 335 98 162 -53 -81 -138 -339 17 515 237 315
5403 315 203 157 -517 -700 -179 431 34 245 488 196 -819 -188 21 247 148 135 270 86 -336 -229 -67
5424 -67 57 400 392 3 -519 -608 -234 -19 -168 146 470 430 -255 -227 -3 -109 187 134 499 107 68 161 -53
5447 -53 -275 14 352 621 659 -222 60 -110 -463 -190 501 456 196 124 199 -345 -387 -77 152 382 365 359 171
5470 171 -332 -383 94 337 139 -48 261 80 -459 -254 -78 -138 102 422 415 102 -200 -428 -320 -225 377 195
5492 195 538 -133 -637 -111 -228 -458 -25 258 448 181 -31 -225 -313 -257 121 215 192 24 129 110 -448 -38
$$ packed form
5337C46l71j5r4k16j82L94N92K92r21j00K21m58j80Q85J82L5k22j32j53k28o3
5358c88N33JK04k39J24m88n32O75J82l7J64%o6n62k16L98NK48K32R1m76j41j38
5381d26M52k92J81O25l60K92k28m08l1J64n6M22k37O4k15k8n7k01L56M98k78P8
5403C15j12m6o74j83N21O10l97K11K43k92j015O31K09K26r9j3J35j84m22J07J62
5424f7J24L43ql89n22q9L74K15j49L14L24m0o85K8K24j06K96n3L65l92l9R3k14
5447e3k22K89L38K69L8q81K82j70l53K73O91m5k60p2P5n44m2L10K29K30j7oj88
5470A71n03n1M77K43j98j87L09j81n39K05J76o0K40L20pl13l02k28J08R5O02j82
5492A95L43o71n04N26j17k30M33K83J90k67k12j94q8N6L78R4k3j68J05j9n58M10
$$ plain form
5514 -38 250 -85 120 236 -208 -84 -395 -165 217 132 95 212 -114 -682 -817 67 -42 120 79 108 131 -634
5536 -634 -731 -145 104 280 46 181 267 -170 -206 -159 -167 -19 419 378 20 -175 -414 -53 -288 287 376 552 179
5559 179 -163 20 175 -256 -159 419 324 168 89 -46 -340 -442 -125 475 320 -78 228 221 -315 -495 84 58
5581 58 358 300 377 154 -320 -236 -50 121 50 345 9 74 -185 -355 -179 149 68 389 148 -88 -347 -234
5603 -234 -130 -129 179 342 446 -16 -455 16 -114 -258 70 454 216 -191 -141 -236 -557 -93 335 -117 199
5624 199 231 -89 -324 -317 -243 221 243 483 173 -75 -263 -247 -425 208 195 -271 299 19 -480 -420 -256 207 143
5647 143 152 388 50 -112 -193 -257 151 172 381 313 -99 -309 -293 -249 -105 58 30 406 303 -111 -211 -201 -283 79
5671 79 105 255 173 -12 -379 -121 -177 -245 287 243 58 18 -129 -266 -282 56 236 454 208 -40 -66 -512 -116
$$ packed form
5514c8K88l35K05J16m44J24l11K30L82q5l7J17l26n68j35Q84j09J62m1K9K3p65
5536f34r7N86K49J76k34J35Q6m37l6M7qJ48M38m1l58j95k39L61k35N75Q9J76l73
5559A79l42J83J55m31R7N78r5j56p9j35k94j02L17O00j55l98L06pn36j80N79k6
5581E8L00n8P7k23m74Q4J86J71p1K95l36O5k59j70J76L28q1L21k41k36k59J13
5603b34J04JL08J63J04m62m39M71j30j44L28L84k38m07N0r5l21M64M28m52L16
5624A99L2l20k35PP4M64K2K40l10k48j88J6j78O33j3m66N70k80m99O0J64M63o4
5647A43RK36l38j62q1o4M08K1K09o8m12k10J6M4J44J63k8L76j03m14j00J0q2L62
5671G9K6J50q2j85l67K58n6o8N32m4j85m0j47j37j6L38J80K18k46k48k6m46L96
$$ plain form
5694 -116 -331 310 191 118 384 -31 -1 -337 -481 55 62 141 10 -22 -155 -125 147 170 83 -44 -142 -88 -431 -170
5718 -170 -214 -83 246 313 146 -259 -158 -23 -129 -22 116 122 308 113 -336 -375 -337 -87 419 240 140 -279
5740 -279 200 -217 -167 -37 92 186 43 245 224 -275 -117 -183 47 81 297 188 -106 -186 -128 -78 -19 36 513
5763 513 184 100 -189 -338 43 132 373 254 78 60 15 -60 -236 126 218 144 253 -47 -98 -272 -245 -182 99
5786 99 168 354 85 216 -60 -184 -16 177 140 531 185 -9 -302 -222 -123 163 28 326 -27 178 -81 -164
5808 -164 -20 143 255 23 209 106 -196 -125 -264 75 437 11 251 0 30 40 53 68 5 192 -25 -15
5830 -15 -271 -101 -96 -232 89 355 381 120 106 -317 -187 -471 -179 180 46 351 165 25 -230 -150 199 358
5852 358 110 143 282 168 -179 -36 225 -84 346 139 97 312 -274 -273 241 -16 283 39 286 -59 -299
$$ packed form
5694a16k15O41j19p3K66m15L0l36j44N36PP9j31l2j33L0K72K3q7j27r8N4l43K61
5718a70m4J31L29O7j67m05J01J35j06J07J38OJ86j95m49l9L8K50N06j79j00m19
5740b79M79m17N0J30J29R4j43K02k1m99J58o6K30L4K16j09k94q0N8N0N9N5M77
5763E13l29q4k89j49L81Q9K41j19j76j8m5p5j76L62R2p4J09l00n1j74K7O3K81
5786I9O9J86k69J31k76j24J68J93l7L91l46j94k93Q0R9K86j35K98l53K05k59q3
5808a64J44J63J12k32J86j03l02P1j39L39L62m26K40k51L0J0J3J5o3J87k17J0
5830a5k56J70Nj36L21K66K6k61j4m23J30k84K92L59j34L05j86j40k55Q0L49J59
5852C58k48L3J39j14l47J43K61l09M30k07m2K15n86JN14k57K99k44K47l45k40
$$ plain form
5873 -299 -266 39 -278 71 292 181 -70 -267 -50 227 105 54 282 42 -43 -199 146 -97 102 -18 187
5894 187 -303 44 -192 51 -42 -236 -50 417 -26 64 -166 -164 -353 -155 319 180 343 345 -308 -355 -35 -177
5916 -177 -3 170 100 -57 -16 77 -305 -308 -113 -61 332 31 -169 -282 162 -149 -113 146 -130 157 137 -19 -71
5939 -71 -271 23 -253 -246 449 -91 238 -141 -306 6 68 147 59 231 -132 -125 -143 0 -10 117 -110 66 -67
5962 -67 -211 0 15 208 95 355 222 -263 -66 -78 30 64 -116 49 21 -5 -251 -134 -200 197 -26 249
5984 249 154 -435 14 -174 -79 -271 -88 -18 201 -78 -48 40 -212 65 215 112 129 40 86 -256 0 38 171
6007 171 -73 145 -130 1 225 -7 -278 63 -131 19 328 145 -109 -100 -300 -197 49 422 480 210 217 -155
6029 -155 -117 162 151 352 99 -332 -303 -179 310 -95 69 350 238 5 -289 -214 61 -121 125 -34 65 47
$$ packed form
5873b99L3L05l17L49K21j11k51j97K17K77j22n1K28k40q5j56L45k43J99j20K05
5894A87m90L47k36K43r3j94J86M67m43R0k30Kj89J98M74j39J63Ko53m7L20j42
5916a77J74J73p0j57M1R3l82lJ95N2L93l01k00j13M44l11L6K59k76K87k0j56n2
5939g1k00K94k76PO95n40L29l79j65L12O2P9q8J72l63Pj8J43j0J27k27J76j33
5962f7j44K11J5J93j13K60j33m85J97j2J08L4j80J65k8k6k46J17o6L97k23K75
5984B49r5n89M49j88R5j92J83P0K19k79L0Q8k52K77J50j03J7q9M6l42K56L8J33
6007A71k44K18k75J31K24k32k71L41j94J50L09j83k54Rk00J03K46L73N8k70Pl72
6029a55L8K79j1K01k53m31K9J24M89m05J64K81j12k33k94P5K75j82K46j59R9j8
$$ plain form
6051 47 159 299 -13 -270 -68 225 59 -74 -90 29 -207 278 -90 318 115 -55 132 -199 -229 -141 -209 84
6073 84 -55 39 182 -148 -23 25 78 -188 -191 62 134 -111 2 -384 198 -155 165 -36 31 74 108 -172 -118 39
6097 39 173 65 -193 -151 -486 30 -138 -46 410 79 -20 13 -366 -111 -121 -194 -89 -110 74 -71 -183 -219 -404
6120 -404 223 -40 -6 -181 272 128 -239 -86 104 39 121 41 158 -92 109 31 -39 203 -39 -49 151 79 -260
6143 -260 -40 -137 225 451 360 42 -36 -102 -183 213 -91 261 448 248 -59 204 -145 174 -140 4 -40 314
6165 314 -166 3 -3 -183 65 -7 112 52 423 -258 -358 -105 158 167 19 20 240 7 74 -105 -26 124 -278
6188 -278 -26 264 -330 -127 110 31 77 143 -84 -243 -259 -215 -350 86 145 -174 20 245 -43 -43 -5 -189 -250
6211 -250 301 121 7 9 -258 67 144 -57 -259 87 -144 -73 -216 123 -96 161 102 201 164 189 -6 -3 -124
$$ packed form
6051D7J12J40l12k57K02K93j66j33j6J19k36M85l68M08k03j70J87l31l0Q8o8K93
6073H4j39R4J43l30J25M8N3k66lK53P2k45J13l86N82l53L20k01O7M3L4k80N4J57
6097C9J34j08k58M2l35N16j68R2M56l31r9L3l79K55j0p3J05k1J84j45j12l6j85
6120d04O27k63L4j75M53j44l67J53J90o5Q2q0J17k50K01p8p0K42k42j0K00p2l39
6143b60K20r7L62K26r1l18p8o6q1L96l04L52J87k00l07K63l49L19l14J44m4L54
6165C14m80J69oj80K48p2J19o0L71o81j00K53K63Rj48JK20k33O7j79P9J50m02
6188b78K52K90n94K03K37p9M6O6k27j59j6M4j35M36N9l19J94K25k88%L8j84o1
6211b50N51j80j14Kk67L25P7k01k02L46k31P1j43L39k19K57n9R9l7K5j95Lj21
$$ plain form
6234 -124 62 -82 56 -125 135 6 -116 125 -133 -39 -26 -50 -194 205 -39 -232 -217 61 42 -48 11 -58 -7
6257 -7 -22 92 20 16 124 115 303 -184 -242 -129 -17 -4 241 115 14 -71 -131 -41 -129 33 108 143 -136 -233 106 -25
6283 -25 242 74 83 225 72 -215 -170 -158 24 -8 25 -86 263 -10 93 -405 175 25 13 -251 -200 -111 -159 93
6307 93 -38 -78 -111 248 78 -102 -178 252 -148 -97 43 -122 80 -103 -258 -124 214 43 -8 224 173 -80
6329 -80 41 51 6 -230 190 301 60 186 230 -18 245 -158 -213 184 235 42 83 -117 -285 -134 -140 304 -105
6352 -105 -221 -176 -356 -349 -137 389 247 27 445 24 -149 -315 -13 258 -112 43 80 290 -115 -212 150 -158
6374 -158 -63 106 8 -3 186 -137 -226 -206 -77 -135 153 332 109 58 44 35 296 -24 -83 258 -150 -210 -39 -193
6398 -193 -254 316 -50 -125 -38 -338 111 139 75 440 -144 -81 98 -56 -445 -224 -103 61 59 243 -230 96 -148
$$ packed form
6234a24J86j44J38j81K60j29j22K41k58R4J3k4j44L99k44j93J5K78j9r0N9o9N1
6257gj5J14p2mJ08rJ88m87n8J13J12J3K45j26j01q5o0R0q8J62P5L5k79r7L39j31
6283b5K67j68RJ42j53k87M5J2J82l2L3j11L49k73J03m98N80j50j2k64N1Q9m8K52
6307I3j31m0l3L59j70j80p6M30m00N1J40j65K02j83j55J34L38j71n1K32n1k53
6329h0J21J0m5k36M20J11k41J26M4k48K63m03n5L97N1j93M1k00j68J51oM44m09
6352a05j16M5j80PK12N26j42k20M18m21j73j66L02K71l70J55L7K10m05r7L62l08
6374a58R5J69r8j1J89l23q9K0J29n8K88J79k23n1j4rK61l20n9L41m08o0J71j54
6398a93o1N70l66p5Q7l00M49K8o4L65n84O3J79j54l89K21J21J64kJ84m73L26k44
$$ plain form
6421 -148 26 -139 3 359 266 111 267 236 -308 153 -36 214 252 -185 256 -202 117 77 -48 253 -90
6442 -90 131 77 -91 194 -105 -332 -101 -86 -188 54 -110 74 -32 -167 12 -99 -48 38 -254 -77 -193 -109
6464 -109 -133 132 323 -71 -80 230 -66 10 0 109 126 -84 -473 -333 -104 -188 81 -79 -28 -35 -27 -109 -30 -111 11
6489 11 -117 155 105 -166 -368 124 -220 171 -129 210 -5 -62 -153 2 519 37 -45 -39 -93 171 -37 -194 -165
6512 -165 -55 -249 -111 -264 -158 18 -44 6 -395 -141 -221 398 291 21 -184 -136 278 227 184 263 140 203 107
6535 107 -19 4 131 270 17 229 -433 -20 94 -53 -66 -52 -20 107 144 -65 -93 -376 -37 322 152 -149
6557 -149 -39 -385 -45 30 -106 -315 -71 -4 81 -230 -62 -204 53 148 85 150 -128 -134 -85 82 300 139 -147
6580 -147 87 291 -166 -237 -231 -103 -155 -62 -248 -6 30 51 -109 -413 -33 180 293 144 -165 -270 -97 -155 -372
$$ packed form
6421a48J74j65J42L56r3j55J56l1n44M61j89K50L8m37M41m58L19m0j25L01l43
6442i0K21n4j68K85k99k27K31J5j02K42j64J84j06j35J79j11N1Q6k92J77j16Q4
6464a09k4K65J91l94rL10k96P6j0J09J7k10l89J40K29q4K69j60N1pQq2P9q1J22
6489A1j28K72n0k71k02M92l44L91l00L39k15n7r1J55N17m82q2On4K64k08j57K9
6512a65J10j94J38j53J06J76o2N0m01K54q0O19j07k70k05M8M14n1m3P9j23O3r6
6535A07j26K3J27J39k53K12o62M13J14j47j3J4L2J27L7k09k8k83L39L59j70l01
6557a49J10l46L40P5j36k09K44O7Q5l11J68j42K57R5o3O5k78oM9J67K18j61k86
6580a47K34K04m57p1OJ28n2R3j86K42L6K1j60l04L80K13J13j49l09j05J73n8k17
$$ plain form
6603 -372 -60 111 14 -80 -49 -105 -203 31 9 314 73 147 -173 -493 -19 -346 5 -7 -211 264 181 51 -209
6626 -209 233 88 9 183 -79 -16 23 59 -37 250 193 -1 210 371 -381 -49 -19 126 209 219 -116 -147 -14
6649 -14 46 -60 24 102 -88 182 -265 -15 -28 -66 -343 -104 31 -217 74 -455 161 -264 -71 118 3 76
6671 76 -225 -134 144 -164 -108 -42 358 8 -72 99 -11 -267 -278 196 -230 29 -29 -57 -250 -332 -375 -232 -51
6694 -51 -104 283 -102 -82 -259 -433 192 1 203 -17 -77 -35 -277 -56 -121 15 179 355 71 -158 -199 -65
6716 -65 -151 -131 45 -124 226 37 -128 -185 145 180 347 -12 170 -203 35 -112 -241 100 -100 70 57 -43
6738 -43 -175 -16 39 -112 215 -26 322 2 -38 -136 332 272 -178 17 -198 198 -94 -63 -133 34 -114 92
6760 92 -100 -191 -129 -335 -230 -4 112 29 205 -175 -131 -117 -199 -217 -33 202 204 25 -327 -211 172 -144 100
$$ packed form
6603c72L12J71r7r4L1n6r8K34k2L05k41P4l20l20M74l27L51j2k04M75q3j30k60
6626b09M42j45p9J74k62O3L9L6r6K87n7j94K11J61p52L32L0J45Q3J0l35l1J33
6649a4O0j06Q4P8j90K70m47K50j3l8k77K39J35k48K91n29O16m25J93J89j15P3
6671G6l01R1K78l08N6O6M00l50q0J71j10k56j1M74m26K59n8k8j93q2m3J43J81
6694e1n3L87l85K0j77j74O25j91K02k20o0M2k42K21o5J36J64J76k84k29m1J34
6716f5q6K0J76j69L50j89j65n7L30L5J67l59J82l73K38j47j29L41k00J70j3j00
6738d3j32J59N5j51L27k41L48l20m0r8M68o0m50J95k15L96k92L1p0J67j48K06
6760I2j92r1O2k06J05K26J16q3J76l80M4J4q2j8J84K35Kj79l52J16L83l16K44
$$ plain form
6783 100 302 -105 134 147 101 -422 -195 -255 267 -83 139 -86 102 61 -175 135 309 -17 -204 -136 -109 154
6805 154 -160 139 23 -67 259 -147 -68 -80 -169 64 56 47 224 235 -266 108 285 -196 -109 160 13 -155 17
6828 17 -170 -222 -121 -10 203 314 78 68 -148 -78 93 -198 -20 65 203 82 54 -205 -218 -88 -37 43 -74
6851 -74 27 26 -227 29 125 -261 238 366 -14 16 -173 -88 -87 201 195 154 160 123 -150 7 -64 -188 319 358 -54
6876 -54 -38 -224 108 60 188 -63 26 215 176 95 56 -272 -95 -228 102 37 170 -76 -302 -327 277 -208 204
6899 204 -55 55 322 22 -65 144 90 41 -62 -78 0 128 -75 -77 69 211 221 -111 7 -289 43 8 113
6922 113 -64 50 320 -124 -68 124 7 -73 -46 208 263 321 -95 -290 35 -296 486 264 181 91 -43 -265
6944 -265 -121 -135 127 63 -317 -99 37 -115 -290 -487 -207 208 199 220 83 -146 9 -83 132 -192 -129 20
$$ packed form
6783A00K02m07K39J3m6n23K27o0N22l50K22k25J88m1k36L10J74l26j87O8K7K63
6805A54l14K99j16r0L26m06P9j2q9K33qrJ77J1n01L74J77m81Q7K69j47j68J72
6828A7j87n2J01J11K13J11k36j0k16P0J71k91J78Q5J38j21k8k59j3J30N1Q0j17
6851g4J01jk53K56R6l86M99J28l80L0j89Q5JK88om1Ol7k73J57p1j24N07L9m12
6876e4J6j86L32m8J28k51Q9J89l9q1l9l28J77j33L30o5J33k46k26k5O04m85M12
6899B04k59J10K67l00q7K09n4m9j03j6P8J28k03kJ46J42J0l32J18k96L32l5J05
6922A13j77J14K70m44N6J92j17q0K7K54N5N8m16j95L25l31P82k22q3r0j34k22
6944b65J44j4K62o4l80K18J36j52j75j97K80M15rK1j37k29J55r2K15l24O3J49
$$ plain form
6966 20 -8 -85 -70 41 -141 145 405 58 189 293 -105 -24 -95 -51 152 187 134 26 13 15 95 133 100 183 -44
6991 -44 30 119 -63 97 -219 -147 315 255 313 -243 53 -390 -11 78 24 219 -250 215 -171 -72 -80 276 -29 134
7015 134 233 12 -65 -23 244 -110 -1 308 -127 89 -212 -160 -5 -74 226 -124 58 295 -53 -239 23 -155
7037 -155 -150 -180 230 -214 65 -217 -10 -89 21 116 -39 -281 -168 -106 -22 245 352 379 114 78 -98 2 -257
7060 -257 44 290 131 144 158 -37 -79 88 -177 -18 333 -3 56 40 -152 -230 -135 -224 -32 72 25 20 67 -7
7084 -7 9 -82 -165 83 -74 -38 -17 -279 -88 -276 -79 429 -13 339 -212 -184 260 -128 36 -9 405 -89 -31
7107 -31 153 -41 -14 98 -43 47 -168 263 19 -113 -90 206 108 254 -77 5 149 -122 -80 -241 -42 -337
7129 -337 119 -6 61 75 -286 -340 43 112 238 -127 9 18 -460 -276 -40 -200 105 168 -55 62 -96 -104 65
$$ packed form
6966B0k8p7J5J11j82K86K60l47J31J04l98Q1p1M4K03L5n3j08j3KQ0L8l3Q3k27
6991d4P4Q9j82J60l16P2M62o0N8n56K96m43L79Q9n4J95m69M65l86R9qL56l05J63
7015A34R9k21p7M2K67l54J09L09m35K16l01N2J55o9L00l50J82K37l48j86K62j78
7037a55Nl0M10m44K79k82K07p9J10R5j55k42J13O2Q4K67J07K7k65l6j76J00k59
7060b57L01K46j59J3J4j95m2J67k65J59L51l36N9j6j92p8R5q9J92J04m7nM7p4
7084gJ6r1q3K48j57L6K1k62J91j88J97N08m42L52n51K8M44l88J64m5M14m94N8
7107c1J84j94K7J12j41R0k15M31k44j32K3K96r8J46l31Q2J44k71M2j61J99k95
7129c37M56j25O7J4l61n4L83O9J26l65J36Rm78J84K36j60L05O3k23J17j58qJ69
$$ plain form
7152 65 -114 -188 185 10 4 94 -88 3 -67 570 -70 -48 -156 -27 -431 70 -4 -35 2 54 -24 107 -177 -135 -52
7177 -52 181 -36 -183 -144 -88 36 128 188 -94 269 -95 -207 -146 -148 50 -62 -161 414 99 103 131 -153 -27 -165
7201 -165 -33 103 74 -261 -87 -84 -47 101 202 141 7 -91 -505 -153 158 259 181 10 161 347 187 -144
7223 -144 -201 8 15 316 -19 414 -10 118 -72 -196 -206 92 121 239 -121 -264 -141 -43 141 -17 -173 63
7245 63 2 -41 52 16 -184 -165 232 64 151 -242 104 -508 -153 -206 41 82 137 -177 -88 -29 -206 2 168 431
7269 431 -90 106 -210 -173 -93 -172 214 72 -292 192 183 100 -160 -185 -9 89 -13 -128 -68 -403 -81 -19 127
7292 127 67 234 103 20 133 -216 20 397 -20 215 -8 -304 181 150 39 60 243 116 188 -115 -128 -94
7314 -94 139 160 104 308 -67 13 -175 -18 -162 -293 277 -50 -110 234 236 128 35 -51 10 -127 131 -239 -122
$$ packed form
7152F5j79p4L73j75oR0j82R1p0O37o40K2j08J29m04N01p4l1L7N2p8J31k84M2Q3
7177e2K33k17j47L9N6J24R2O0k82L63l64j12O1kJ98j12r9N75l15MK8k84J26j38
7201a65J32J36k9l35J74LL7J48J01o1j34r8m14L52L11J01p8j71J51J86j60l31
7223a44n7K09PL01l35M33m24J28j90j24j0K98K9J18l60j43J23R8J84j58j56K36
7245F3o1m3R3l6k00J9L97j68Q7l93L46o12L55n3K47M1N5l14Q9N9j77K08J66K63
7269D31n21J96l16L7Q0p9L86j42l64M84rq3k60k5J76R8j02j15O0l35L22O2J46
7292A27o0J67j31q3J13l49K36L77m17K35k23k96M85l1j11K1J83j27P2l03j3L4
7314i4K33K1n6K04l75Q0j88J57j44j31N70l27o0L44Kj08r3q6O1j37K58l70J17
$$ plain form
7337 -122 -159 -183 115 9 32 -144 53 -210 217 -32 -98 53 -323 -97 71 -43 -392 37 -125 113 19 -29
7359 -29 -52 83 -142 18 -60 66 -172 -145 131 -40 99 -139 -124 3 117 51 0 -9 12 -183 -20 -144 -28
7382 -28 237 -193 -175 -7 -143 -15 78 160 94 -174 170 17 162 -39 -305 -89 59 51 107 173 -361 -255 -331
7405 -331 211 -26 502 137 -253 232 -129 137 76 -253 0 -24 225 -124 190 40 -153 82 317 105 11
7426 11 3 -52 -153 -202 94 91 186 123 62 -288 -10 -329 -132 -94 -110 19 80 138 -208 120 170 156 -258 156 131 116
7452 116 167 -530 -177 5 42 -54 318 -27 -132 -34 212 146 -144 44 181 -90 48 -233 233 76 164 393
7474 393 432 18 -6 -114 -25 161 349 227 206 168 15 -143 -82 197 350 185 176 172 495 0 39 -234 269 51
7498 51 3 -268 42 -32 -308 -15 164 158 -41 -198 255 119 -150 -139 20 59 191 -77 37 -226 -27 -409
$$ packed form
7337a22l7k4K98j06K3j76J97k63M27k49o6J51l76K26J68j14l49M29j62K38r4m8
7359b9k3J35k25J60p8J26k38K7K76j71J39k38J5J27J14o6n1rK1j95J63j24J16
7382b8K65m30J8J68j36J28R3Q2o6k68L44j53J45k01k66K16J48qN6O6n34J06p6
7405c31N42k37N28l65l90M85l61K66o1l29K53k4K49l49L14j50j93K35K35k12r4
7426A1qn5j01m9K96lR5o3o1l50K78l19J97L8j6J29O1N8l46L28N0j4m14M14k5j5
7452A16N1o97L53J82L7r6L72l45j05R8K46o6k90J88J37k71J38k81M66j57Q8K29
7474C93L9m14k4j08Q9J86J88j22k1l8j53j58O1K79J53j65rmL23m95L9k73N03k18
7498E1m8k71L10p4k76K93J79oj99j57M53j36k69J1J59L9J32k68J14k63J99l82
$$ plain form
7520 -409 -79 226 337 7 6 -44 -164 -33 19 116 70 300 -61 -162 -143 -98 16 130 49 -350 -95 -1 150
7543 150 -419 -281 260 -125 -22 -41 181 -250 -219 -54 47 296 -122 159 85 19 57 -19 18 134 31 24 56
7566 56 -197 -119 104 -271 20 -83 169 224 -159 -145 -162 77 47 166 70 53 270 -169 51 -178 228 -89 -71
7589 -71 57 -251 -123 220 -234 -141 469 221 94 -140 109 31 3 111 -2 5 -41 61 -86 -282 74 161 238
7612 238 217 -166 57 -48 -4 -174 -200 206 83 244 41 186 -39 -345 -166 -174 125 248 357 -75 -119 -240
7634 -240 -124 -139 51 40 -5 -60 -123 -242 285 -183 93 -75 132 -214 -213 -5 55 -18 -247 -306 -102 -41 -1 -92
7658 -92 -148 -12 191 51 -212 56 164 218 -398 -142 -329 -115 53 34 111 -234 -302 -23 -33 226 191 307 83
7681 83 -69 17 35 -34 -114 363 -70 38 -4 -143 206 330 247 361 14 415 -111 125 -172 -82 41 -18 -61
$$ packed form
7520d09L30L05J11l30jn0j20J31N2R7m6K30l61j01J9M5J14J14q1l99K55R4J51
7543A50n69J38N41l85J03j9K22m31L1J65J01K49m18K81p4o6L8p6L7J16j03pL2
7566E6k53P8K23l75K91j03K52N5l83J4j7K39l0J19r6j7K17m39K20k29M06l17J8
7589g1J28l08J28L43m54R3O10k48j27k34K49p8k8J08j13Pm6J02j47j96L56Q7P7
7612B38k1l83K23j05M4j70k6M06j23J61k03J45k25l06J79qK99J23J09m32m4j21
7634b40J16j5J90j1m5n5o3j19N27m68K76j68K07l46JK08O0p3k29n9K04O1M0r1
7658i2n6J36K03j40k63K68J08N4o16K56j87K14J68j9P7l45o8K79j0K59l5J16k24
7681H3j52Q6J8o9q0M77m33J08m2j39L49J24q3J14l47M01n26K36k97R0J23n9m3
$$ plain form
7704 -61 -128 -27 -33 231 -244 169 79 -57 273 -106 -66 -188 -205 -160 193 -15 -21 214 264 -156 -136 9 -83 229
7728 229 256 -192 -111 -66 -221 138 423 195 -5 -16 13 189 -19 137 -73 296 -30 85 250 61 1 -24
7750 -24 85 217 217 -187 57 -85 -49 29 113 -270 276 56 13 20 -120 -2 75 -85 376 -129 -76 -374 -199 -174
7774 -174 -197 67 122 91 -260 -128 -56 -117 -103 205 80 134 -334 140 37 96 290 267 -62 200 161 42 -17 -422
7798 -422 -26 85 -2 365 22 200 -41 -189 3 -100 44 329 204 87 -174 -180 -168 -21 216 51 56 74
7820 74 295 -113 -132 107 -115 294 237 212 199 186 -38 65 -50 -12 283 -42 17 31 -177 57 29 75 43 -8
7844 -8 2 244 -51 -104 -120 54 -155 118 283 107 -176 -434 148 -48 130 307 -146 148 -128 -124 40 -268
7866 -268 -147 249 -36 2 -327 -381 -403 167 101 -31 254 -205 -298 64 -399 24 22 318 144 -123 -74 108 -52
$$ packed form
7704f1o7J01oK64m75M13r0j36L30l79M0j22j7M5L53k08oK35N0m20K0J45r2L12
7728B29K7m48Q1M5j55L59K85k28k00j1K9J76k08J56k10L69l26J15J65j89o0k5
7750b4J09J32%m04K44j42L6P8Q4l83N46k20m3Pj40J18P7j60M61n05N3k98J75K5
7774a74k3K64N5l1l51J32P2o1J4L08j25N4m68M74j03N9J94k3l29K62l9j19n9m05
7798d22L96J11q7L67l43J78k41j48J92j03J44K85j25j17k61oJ2J47K37j65NJ8
7820G4K21m08j9K39k22M09n7k5j3j3k24J03j15L8K95l25N9J4k08K34k8M6l2n1
7844hJ0K42k95n3j6J74k09K73J65j76k83k58N82j96J78J77m53K94k76MJ64l08
7866b68J21L96k85L8l29n4k2N70o6j32K85m59r3L62m63M23kK96j74k67M9J82j60
$$ plain form
7889 -52 2 -191 -53 -23 -244 390 80 80 -18 -35 -147 56 106 -23 -101 -323 -186 -133 198 -24 290 -71 75
7912 75 -48 -191 156 -34 117 -67 318 -43 184 -177 -2 130 -38 -127 103 -118 -351 -159 21 12 289
7933 289 -67 -54 17 -87 -295 84 185 240 -189 -152 -132 18 62 -133 -174 -65 224 -42 320 -7 162 248 113
7956 113 -275 31 124 78 -289 -195 -211 -285 -37 -24 175 -394 35 -235 -200 213 133 138 -147 93 -112 -95 -113 9
7980 9 -13 91 84 121 -162 99 241 -286 -53 138 263 -70 -57 24 -87 298 -32 -10 36 -13 36 283 -32 -235
8004 -235 -65 -47 137 180 158 -37 -15 -284 -320 -401 206 113 197 142 -151 -136 87 -6 91 201 -19 -389 6 -97
8028 -97 -66 -107 -9 -143 47 247 -80 -69 60 -125 83 29 -35 -268 177 90 -213 -7 201 -9 195 250 145
8051 145 -157 -125 -46 -249 46 -70 173 -26 -62 105 -185 -47 526 115 125 179 -119 -1 79 50 330 102
$$ packed form
7889e2N4j93J38L0k21O34l10%r8j7j12K03N0j29p8k22J37N3L31k22L14l61J46
7912G5j23j43L47j90J51j84L85l61K27l61J75J32j68q9K30k21k33J92J80rK77
7933B89l56J3P1j04k08L79J01N5m29L7K0J50M4j95m1J09K89k66L62l27J69Q6j35
7956A13l88L06R3m6l67R4j6p4K48J3J99n69M29k70L5M13q0Nk85K40k05J7j8J22
7980Ik2J04pL7k83K61J42n27K33J91J25l33J3Q1j11L85l30K2M6m9M9K47l15k03
8004b35J70J8J84M3k2j95K2k69l6q1O07r3Q4n5k93J5K23r3R7J10k20l70L95j03
8028i7L1m1R8j34J90K00l27J1J29j85K08n4o4k33M45q7l03K06K08k10K04N5j05
8051A45l02L2P9k03K95j16K43j99l6J67k90J38N73m11J0N4k98J18Q0k9K80k28
$$ plain form
8073 102 186 -192 -340 -321 -114 135 246 279 219 271 197 72 -56 -149 -78 42 226 139 -124 60 6 -293 -62
8096 -62 72 58 254 -229 -196 -101 7 -134 163 215 238 -230 9 -341 -42 -37 204 68 169 -28 -133 -147 417
8119 417 47 -48 246 -121 46 -161 -101 11 -74 -70 213 64 54 61 100 148 -160 -348 201 122 169 -267 -51 -144
8143 -144 51 -78 273 -271 -8 143 -6 56 -142 29 53 -129 58 187 -46 199 -368 -111 75 218 -173
8164 -173 171 204 -417 -44 -174 -224 15 26 269 13 -133 -88 4 177 -91 -395 -10 -392 -435 -151 -62 -144 117
8187 117 106 47 155 -116
$$ packed form
8073A02Q4l78j48J9K07K49J11L3o0N2p4j25j28r3P1J20J84q7k63J84n4k99K31
8096f2J34j4J96m83L3R5J08j41K97N2K3m68K39l50K99NK41j36J01j97j05j4N64
8119D17l70r5K94l67J67k07O0J12q5MK83j49j0PL9M8l08j88N49p9M7m36K16r3
8143a44J95j29L51n44K63J51j49O2j98J71K4j82J87J29k33K45n67K57J86J43l91
8164a73L44L3o21L73j30n0K39J1K43k56j46M5R2J73k68l04L85l82m3K84Q9q2K61
8187A17j1n9J08k71
8191a16
$$ Imaginary data points
##PAGE= N=2
##DATA TABLE= (X++(I..I)), XYDATA
$$ plain form
0 0 0 0 0 0 0 0 0 5 -8 8 -8 9 -16 16 -24 24 -32 37 -41 50 -59 68 -80 91 -106 120 -137 156 -175 197 -224
31 -224 249 -281 314 -347 389 -433 480 -534 590 -654 723 -800 887 -983 1093 -1215 1352
48 1352 -1514 1701 -1924 2194 -2525 2950 -3511 4291 -5454 7378 -11136 21251 -104901 -317825
62 -317825 -153418 -42073 -66577 -77431 26238 30574 -47113 -45591 14782 -24562 -34305 113287
74 113287 216033 60699 -124556 -100210 -18375 -79091 -126850 -34725 35106 -22782 -57814
85 -57814 -34825 -85666 -148049 -28474 153006 129086 -19322 -26380 47231 -9742 -108967 -53010
97 -53010 64199 77387 63279 96829 56407 -57155 -29977 144201 204457 109628 94928 179050
109 179050 139216 -19656 -67687 6244 32314 22785 68064 63891 -66379 -137828 -35803 45622
$$ packed form
0@%%%%%%%Nj3J6j6J7k5L2m0M8n6O9p8R1j09J27j48J71j97K26k57K93l31L72m21
31b24M73n30N95o61P36q22R13j014J124j244J377j523J687j870K076k308K567
48A352k866L215l625M118m719N475o461P802r745J2832j8514L2387j26152k12924
62c17825J64407J11345k4504j0854J03669M336p7687J522O0373l9344r743J47592
74A13287J02746j55334j85255K4346Q1835o0716m7759R2125O9831n7888l5032
85e7814K2989n0841o2383J19575J81480k3920j48408p058P3611n6973r9225N5957
97e3010J17209J3188j4108L3550m0422j13562K7178J74178O0256r4829j4700Q4122
109A79050l9834j58872m8031P3931K6070r529M5279m173j30270p1449J02025Q1425
$$ plain form
121 45622 -11060 -17288 112225 161847 35430 -66932 -41033 -18533 -28385 31982 96347 24936
133 24936 -76569 -43224 16780 -45720 -88620 37548 165644 116054 8697 -9518 -18525
144 -18525 -70816 -55979 24868 18270 -63424 -64912 -24558 -99507 -204133 -141904 13598 53069
156 53069 1485 -77 8284 -51879 -86648 -27857 10566 -22547 -11140 49260 4472 -134464
168 -134464 -165201 -59017 8229 -4093 19038 66441 33365 -35464 -32395 -6120 -27834 -15257
180 -15257 71434 90991 -24692 -117816 -85896 -42849 -58120 -34636 51298 81887 35938 15382
192 15382 22253 -10997 -25274 59402 141604 96364 4807 -8301 -834 -52482 -79143 -11369
204 -11369 58128 56744 45999 51522 8851 -49327 -13667 81456 101954 57876 53127 63900 2836
$$ packed form
121D5622n6682o228J29513M9622j26417j02362K5899K2500r852O0367O4365p1411
133B4936j01505L3345O0004o2500m2900J26168J28096m9590j07357j8215r007
144a8525n2291J4837Q0847o598q1694j488M0354p4949j04626O2229J55502L9471
156E3069n1584j562Q361o0163l4769N8791L8423l3113J1407O0400m4788j38936
168a34464l0737J06184O7246j2322K3131M7403l3076o8829L069K6275k1714J2577
180a5257Q6691J9557j15683r3124L1920M3047j5271K3484Q5934L0589m5949k0556
192A5382O871l3250j4277Q4676Q2202m5240r1557j3108P467n1648k6661O7774
204a1369O9497j384j0745N523m2671n8178L5660R5123K0498m4078m749J0773o1064
$$ plain form
217 2836 -75653 -66965 -7282 19988 37535 69705 52701 -20095 -43925 12242 49422 38686
229 38686 57938 102058 74209 -18593 -71663 -63995 -55335 -41308 6900 33117 -10893 -59730
241 -59730 -51818 -34821 -45540 -22987 52838 92246 48061 -10047 -34736 -55756 -71419 -39068
253 -39068 14267 20070 -8663 -18279 -24675 -60490 -74548 -17276 54702 68755 45391 25581 -8983
266 -8983 -60719 -77545 -44589 -16476 -15171 -9351 -7567 -47744 -98303 -90292 -32321 12944 36812
279 36812 61049 63196 19999 -25437 -29943 -13810 -1966 22099 51267 38815 -15721 -54787
291 -54787 -49766 -30470 -5291 38217 78637 73826 35074 3342 -14609 -26299 -15092 24091
303 24091 49204 28766 -11223 -39215 -58213 -64706 -37684 17199 57773 64429 52216 30634
$$ packed form
217B836p8489Q688N9683K7270J7547L2170j7004p2796k3830N6167L7180j0736
229C8686J9252M4120k7849r2802n3070P668Q660J4027M8208K6217m4010m8837
241e9730P912J6997j0719K2553P5825L9408m4185n8108k4689k1020j5663L2351
253c9068N3335N803k8733r616o396l5815j4058N7272P1978J4053k3364j9810l4564
266h983n1736j6826L2956K8113J305N820J784m0177n0559Q011N7971M5265K3868
279C6812K4237K147m3197m5436m506J6133J1844K4065K9168j2452n4536l9066
291e4787N021J9296K5179M3508M0420m811l8752l1732j7951j1690J1207L9183
303B4091K5113k0438l9989k7992j8998o493K7022N4883M0574O656j2213k1582
$$ plain form
315 30634 -33 -16264 4343 42028 60887 53323 32743 -1277 -42927 -63584 -45458 -5181
327 -5181 28692 48255 48493 22695 -13504 -29836 -16350 8848 31039 42833 34648 -2164 -48364
340 -48364 -73402 -67638 -40866 -4225 28846 38791 20620 -7215 -22779 -19716 604 31897 58038
353 58038 56897 25479 -17256 -50736 -63726 -52476 -20743 12896 26318 15709 -8232 -30960
365 -30960 -38611 -21773 12336 43918 54413 38548 4246 -34090 -58271 -55684 -29660 3206
377 3206 23537 22835 3682 -21408 -34764 -25328 4267 39662 62435 60955 33388 -6085 -38494
390 -38494 -48516 -35243 -8827 13878 18900 3003 -23983 -44486 -45287 -22571 13276 45551 57647
403 57647 42138 9052 -24268 -42526 -38388 -16629 9334 21057 11239 -14235 -39772 -51135
$$ packed form
315C0634l0667j6231K0607L7685J8859p564k0580l4020m1650k0657J8126M0277
327e181L3873J9563K38k5798l6199j6332J3486K5198K2191J1794q185l6812m6200
340d8364k5038N764K6772L6641L3071R945j8171k7835j5564L063K0320L1293K6141
353E8038j141l1418m2735l3480j2990J1250L1733L3639J3422j0609k3941k2728
365c0960p651J6838L4109L1582J0495j5865l4302l8336k4181K587K6024L2866
377C206K0331p02j9153k5090j3356R436K9595L5395K2773j480k7567l9473l2409
390c8494j0022J3273K6416K2705N022j5897k6986k0503q01K2716L5847L2275J2096
403E7647j5509l3086l3320j8258M138K1759K5963J1723r818k5474k5537j1363
$$ plain form
415 -51135 -38303 -6053 31067 52902 50397 27268 -5661 -31376 -36740 -20445 4131 18821
427 18821 15437 -4971 -34202 -56202 -55219 -28786 8483 37810 49289 38511 10140 -18063 -27563
440 -27563 -15579 5289 25151 32632 18643 -12881 -42142 -48471 -31887 -2804 30488 54879
452 54879 54074 30729 4671 -7852 -5555 10729 36244 52225 40371 8987 -19195 -35144 -37413
465 -37413 -19177 17965 48735 51773 35504 15624 -3369 -11702 3407 34023 50693 42916 24418
478 24418 916 -30344 -49301 -33549 2696 28937 37558 36556 21196 -6310 -17939 -847
490 -847 24182 36839 43996 42840 13827 -31335 -54219 -43587 -24088 -7151 12078 20693 -447
503 -447 -30410 -37923 -28844 -20496 -1444 27865 34123 -659 -40429 -55159 -57210 -55480 -34139 -780
$$ packed form
415e1135J2832L2250L7120K1835k505k3129l2929k5715n364J6295K4576J4690
427A8821l384k0408k9231k2000R83K6433L7269K9327J1479j0778k8371k8203r500
440b7563J1984K0868J9862P481j3989l1524k9261o329J6584K9083L3292K4391
452E4879q05k3345k6058j2523K297J6284K5515J5981j1854l1384k8182j5949k269
465c7413J8236L7142L0770L038j6269j9880j8993q333J5109L0616J6670p777j8498
478B4418k3502l1260j8957J5752L6245K6241Q621j002j5360k7506j1629J7092
490h47K5029J2657P157j156k9013m5162k2884J0632J9499J6937J9229Q615k1140
503d47k9963p513R079Q348J9052K9309O258l4782l9770j4730k051J730K1341L3359
$$ plain form
517 -780 7367 -12198 -27072 -31550 -42396 -40243 -2173 39034 38245 10275 -8065 -24044 -50366
530 -50366 -57423 -29022 -2540 -2457 -7539 -9518 -33416 -63672 -50932 -2875 22949 19175 21754 21961
544 21961 -7952 -44096 -40977 -16268 -4084 8057 28985 21108 -21691 -41154 -12713 15073
556 15073 19353 38338 71377 66617 23932 -1229 1635 709 5853 38330 57352 25140 -13449
569 -13449 -11251 -2195 -16018 -10539 38165 70914 51554 23472 14343 -1632 -18196 4098 43659
582 43659 40292 10752 8702 13258 -19442 -49162 -17065 36193 47093 34985 35165 21160 -15961
595 -15961 -24018 7805 20314 2048 6943 26648 -3389 -65080 -75612 -34626 -12545 -12640 3820
608 3820 14542 -16993 -46808 -34889 -23208 -40221 -31835 14070 18662 -41612 -83266 -67947 -53562
$$ packed form
517g80Q147j9565j4874m478j0846K153L8070M1207p89k7970j8340j5979k6322
530e0366p057K8401K6482Q3n082j979k3898l0256J2740M8057K5824l774K579K07
544B1961k9913l6144L119K4709J2184J2141K0928p877m2799j9463K8441K7786
556A5073M280J8985L3039m760m2685k5161K864r26N144L2477J9022l2212l8589
569a3449K198R056j3823N479M8704L2749j9360k8082r129j5975j6564K2294L9561
582D3659l367k9540k050M556l2700k9720L2097N3258J0900j2108J80j4005l7121
595a5961q057L1823J2509j8266M895J9705l0037o1691j0532M0986K2081r5J6460
608C820J0722l1535k9815J1919J1681j7013Q386M5905M592o0274m1654J5319J4385
$$ plain form
621 -53562 -60110 -41008 -4415 -6488 -32864 -32577 -27317 -55112 -64054 -10539 34269 4134 -42123
634 -42123 -42474 -37597 -63469 -67985 -29733 -5950 -13963 -8017 2363 -31161 -69739 -38294 24570
647 24570 28005 -3960 -726 12857 -19041 -55360 -42719 -15433 -10372 5971 36565 19506 -35231
660 -35231 -38619 15143 36353 15450 27306 67273 58334 9752 -7170 3905 2105 13173 57351
673 57351 70836 22737 -7645 22839 40397 10892 10496 64401 89836 54642 23158 17641 -1742
686 -1742 -16165 18212 54771 30945 -3634 13808 31281 -6995 -35671 7946 61399 59338
698 59338 41214 41331 22548 -13168 -5305 33237 30581 2793 19167 48537 13752 -45984 -40499
711 -40499 7537 21959 15681 28764 26314 -13462 -33779 -13544 -13159 -42526 -29042 20088 13974
$$ packed form
621e3562o548J9102L6593k073k6376K87N260k7795q942N3515M4808l0135m6257
634d2123l51M877k5872m516L8252K3783q013N946J0380l3524l8578L1445O2864
647B4570L435l1965L234J3583l1898l6319J2641K7286N061J6343L0594j7059n4737
660c5231l388N3762K1210k0903J1856L9967q939m8582j6922J1075j800J1068M4178
673E7351J3485m8099l0382L0484J7558k9505l96N3905K5435l5194l1484n517j9383
686a742j4423L4377L6559k3826l4579J7442J7473l8276k8676M3617N3453k061
698E9338j8124J17j8783l5716P863L8542k656k7788J6374K9370l4785n9736N485
711d0499M8036J4422o278J3083k450l9776k0317K0235L85k9367J3484M9130o114
$$ plain form
724 13974 -50054 -76602 -47317 -31744 -35445 -11777 17244 3619 -17880 -6555 -5810 -40670 -43163
737 -43163 15000 46082 3426 -36307 -26165 -21132 -42789 -37014 -394 10120 -2412 7389 12002
750 12002 -30399 -62309 -22805 27673 14280 -18906 -10562 -1334 -32617 -53207 -28879 -5026
762 -5026 -2108 19203 46382 22162 -25642 -15025 33927 40669 19042 33634 60186 37919 -3293
775 -3293 -7827 2406 -1193 13945 53341 54221 7660 -10422 18129 24198 -1178 7853 50076
788 50076 56208 20968 1425 -1371 -17908 -20172 18605 46477 23785 3623 23468 30684 -1394
801 -1394 -11707 29671 61761 49259 34137 29949 5373 -22912 -9251 20311 13038 -4610 12545
814 12545 26529 -8328 -45228 -27764 7881 13572 11456 21374 11096 -23371 -33970 -15684 -16319
$$ packed form
724A3974o4028k6548K9285J5573l701K3668K9021j3625k1499J1325P45l4860k493
737d3163N8163L1082m2656l9733J0142N033k1657N775L6620J0514j2532R801M613
750A2002m2401l1910L9504N0478j3393l3186Q344R228l1283k0590K4328K3853
762e026K918K1311K7179k4220m7804J0617M8952O742k1627J4592K6552k2267m1212
775c293m534J0233l599J5138L9396Q80m6561j8082K8551O069k5376R031M2223
788E0076O132l5240j9543k796j6537k264L8777K7872k2692k0162J9845P216l2078
801a394j0313M1378L2090j2502j5122m188k4576k8285J3661K9562p273j7648J7155
814A2545J3984l4857l6900J7464L5645N691k116R918j0278l4467j0599J8286o35
$$ plain form
827 -16319 -30013 -9877 23225 8962 -35235 -42505 -18869 -10104 -7751 14699 29120 8900 -11685
840 -11685 -8964 -15484 -38973 -31574 8930 18860 -14352 -36127 -29581 -30970 -40900 -24605 5751
853 5751 10070 924 4118 -581 -30409 -42605 -10916 17614 7661 -7336 -2177 -6388 -29195 -33123
867 -33123 -9799 7630 11670 24641 31841 6777 -22824 -15867 8554 10241 3992 14532 19351
880 19351 -3304 -26957 -24481 -14387 -8537 9432 34212 30504 3178 -6831 5180 6574 1009
893 1009 15628 36510 30903 6630 -5843 -10415 -18308 -11430 15830 32148 20084 7861 9911
906 9911 4342 -11149 -7764 16866 29979 20446 9983 515 -18134 -30679 -17283 4027 9615
919 9615 8573 14890 13499 -6528 -18455 -4728 14568 21103 23724 24593 9603 -14090 -22477 -14705
$$ packed form
827a6319j3694K0136L3102j4263m4197p270K3636Q765K353K2450J4421k0220k0585
840a1685K721o520k3489P399M0504R930l3212k1775O546j389r930J6295L0356
853E751M319r146L194m699k9828j2196L1689K8530r953j4997N159m211k2807l928
867c3123K3324J7429M040J2971P200k5064k9601O957K4421J687o249J0540M819
880A9351k2655k3653K476J0094N850J7969K4780l708k7326j0009J2011J394n565
893A009J4619K0882n607k4273j2473m572p893O878K7260J6318j2064j2223K050
906I911n569j5491L385K4630J3113r533j0463r468j8649j2545J3396K1310N588
919I615j042O317j391k0027j1927J3727J9296O535K621Q69j4990k3693q387P772
$$ plain form
933 -14705 -9492 -5342 8136 17038 3914 -17228 -21316 -12830 -5562 4072 18612 21410 5722 -11140
947 -11140 -17967 -21861 -23411 -10150 9625 14023 1176 -9177 -12281 -14459 -11162 5412 22938
960 22938 25648 16991 7511 -5135 -19469 -20832 -6059 7111 8142 2593 -3224 -14071 -24436
973 -24436 -20597 -4230 10235 17073 19274 13424 -3071 -17322 -16711 -6150 2526 8604 12391 6682
987 6682 -8401 -18975 -16907 -7155 4671 18036 26304 20484 4634 -7367 -10643 -8972 -2571 7703
1001 7703 13411 6678 -7511 -18959 -23859 -20605 -8702 8180 18516 16484 7164 -2454 -9897 -11969
1015 -11969 -3459 9090 15786 12684 2790 -9233 -19726 -21260 -10997 3708 14774 17735 13536
1028 13536 3079 -8320 -12234 -6016 4823 12740 14018 7223 -5921 -19113 -24296 -18865 -6479
$$ packed form
933a4705N213M150J3478Q902j3124k1142m088Q486P268R634J4540K798j5688j6862
947a1140o827l894j550J3261J9775M398j2847j0353l104k178L297J6574J7526
960B2938K710q657r480j2646j4334j363J4773J3170J031n549n817j0847j0365
973b4436L839J6367J4465O838K201n850j6495j4251O11J0561Q676O078L787n709
987F682j5083j0574K068R752J1826J3365Q268n820j5850j2001l276J671O401J0274
1001G703N708o733j4189j1448m900L254J1903J6882J0336k032r320r618p443k072
1015a1969Q510J2549O696l102r894j2023j0493j534J0263J4705J1066K961m199
1028A3536j0457j1399l914O218J0839P917J278o795j3144j3192n183N431J2386
$$ plain form
1041 -6479 6501 14555 14072 5708 -4701 -9117 -5422 3891 14986 21280 17933 6067 -7436 -17005
1055 -17005 -17066 -8631 3334 13328 15017 8278 -1515 -9078 -10002 -2394 9148 18482 18728 10001 -2803
1070 -2803 -14689 -19429 -15143 -3908 7638 12516 9410 968 -7579 -11267 -4981 6702 17591 22612
1084 22612 18706 7495 -6353 -15183 -15112 -7270 2811 9643 9280 1442 -9316 -15381 -13030 -3650
1098 -3650 7953 16826 18039 9702 -3842 -14294 -17167 -12633 -3138 5989 9124 3072 -6782 -13950
1112 -13950 -14547 -9210 3083 16009 20903 15798 5366 -5110 -12416 -12584 -3779 6231 9952 5313
1126 5313 -2809 -11456 -18190 -16258 -4850 8419 15958 15896 9856 -1328 -11718 -12527 -4178 4175 8041
1141 8041 9432 4477 -7444 -17066 -17095 -7267 3697 13464 19708 16235 4385 -5503 -6482 -3072 1450
$$ packed form
1041f479J2980Q054m83q364j0409m416L695R313J1095O294l347j1866j3503r569
1055a7005o1Q435J1965R994J689o739r793p563r24P608J1542R334K46q727j2804
1070b803j1886m740M286J1235J1546M878l106q442q547l688O286J1683J0889N021
1084B2612l906j1211j3848q830P1P842J0081O832l63p838j0758o065K351R380
1098c650J1603Q873J213q337j3544j0452k873M534R495R127L135o052r854p168
1112a3950n97N337J2293J2926M894n105j0432j0476p306j68Q805J0010L721m639
1126E313q122q647o734J932J1408J3269P539o2o040j1184j0390q09Q349Q353L866
1141H041J391m955j1921r622k9R828J0964R767O244l473j1850r888r79L410M522
$$ plain form
1156 1450 9258 15210 10188 -3732 -14527 -16209 -13426 -5826 7366 16724 13672 4685 -1787 -6079
1170 -6079 -9307 -4442 8739 15852 9837 -767 -8228 -16067 -19517 -11954 2592 10475 10217 8591
1184 8591 3822 -7293 -13072 -3945 9687 13782 10837 8270 -268 -14424 -20664 -12588 -3562 1676
1198 1676 8749 12604 3280 -11757 -13359 -3730 2699 5821 12491 14523 1854 -12655 -15758 -14293
1212 -14293 -12988 -3654 11160 12845 -385 -9315 -6260 -4797 -4869 5303 18979 19284 7733 -94
1226 -94 -5687 -14569 -14367 1216 13691 8269 469 1340 -1337 -11363 -10505 5334 16759 15520 12663
1241 12663 8726 -5148 -18016 -11657 2239 4337 659 6559 8914 -5472 -17486 -9980 3867
1254 3867 9433 15003 21666 14348 -4061 -9406 -1273 -537 -5096 4946 17957 9996 -9888 -14667
$$ packed form
1156A450P808N952n022j3920j0795j682K783P600J3192R358l052q987o472m292
1170f079l228M865J3181P113o015j0604p461p839l450P563J4546P883k58j626
1184H591m769j1115n779R127J3632M095k945k567q538j4156o240Q076R026N238
1198A676P073L855r324j5037j602R629O429L122O670K032j2669j4509l103J465
1212a4293J305R334J4814J685j3230q930L055J463p2J0172J3676L05j1551p827
1226i4n593q882K02J5583J2475n422p800Q71k677j0026Q58J5839J1425j239k857
1241A2663l937j3874j2868O359J3896K098l678N900K355j4386j2014P506J3847
1254C867N566N570O663p318j8409n345Q133P36m559J0042J3011p961j9884m779
$$ plain form
1268 -14667 -8142 -5744 -673 13860 20172 7977 -2165 196 -3317 -15753 -10845 9943 15488
1281 15488 625 -9552 -8912 -13047 -17220 -4622 11442 10800 5453 10367 8388 -10654 -19124 -1003
1295 -1003 14528 8742 1190 3246 -2664 -17427 -17295 -3493 1505 579 11920 19744 2522 -17633
1309 -17633 -11868 4772 4771 450 7945 11162 -4027 -15746 -11444 -9079 -11583 1050 21584 17783
1323 17783 -4373 -9252 3103 2976 -4032 5084 20184 14727 755 -1837 -5239 -16574 -13149 10522
1337 10522 20833 6179 -2523 7002 6253 -8628 -8083 11199 18516 11525 9285 7106 -10280 -21728
1351 -21728 -5810 10776 4860 -2276 9814 14844 -3547 -15757 -2653 10087 9419 13305 19822
1364 19822 6696 -13764 -12091 1725 -1906 -9603 4163 19406 7732 -12714 -11404 -1752 -2343
$$ packed form
1268a4667O525K398N071J4533O312j2195j0142K361l513j2436M908K0788N545
1281A5488j4863j0177O40m135m173J2598J6064o42n347M914j979j9042q470J8121
1295a003J5531n786p552K056n910j4763J32J3802M998r26J1341P824j7222k0155
1309a7633N765J6640jm321P495L217j5189j1719M302K365k504J2633K0534l801
1323A7783k2156m879J2355j27p008R116J5100n457j3972k592l402j1335L425K3671
1337A0522J0311j4654q702R525p49j4881N45J9282P317o991k240k179j7386j1448
1351b1728J5918J6586n916p136J2090N030j8391j2210J3104J2740o68L886O517
1364A9822j3126k0460J673J3816l631p697J3766J5243j1674k0446J310R652n91
$$ plain form
1377 -2343 2036 17275 17523 -668 -7874 -209 -5544 -20158 -11791 11690 13094 -5016 -11083 -6502
1391 -6502 -10905 -13725 1322 14558 6818 146 6990 3426 -17765 -22859 -1094 12015 2255 -4469
1405 -4469 136 -5380 -17294 -12405 1757 3289 1191 12711 17259 -3895 -22065 -10665 4643
1418 4643 551 -3946 4635 5880 -9400 -16388 -8550 -6416 -8573 5874 22957 12810 -8844 -9205
1432 -9205 2589 -441 -7306 3795 15194 6536 -4956 -4655 -6933 -15664 -7612 15510 19831 3610
1446 3610 -1278 7036 2679 -10627 -6025 10242 12687 4506 3717 205 -14895 -19778 -1967 11188
1460 11188 4341 434 10954 10791 -6304 -12559 -116 8506 6734 10015 12388 -1082 -16156 -11052
1474 -11052 514 -2454 -5188 8116 16932 3779 -10724 -7544 -1023 -1690 3634 14466 10287 -5518
$$ packed form
1377b343M379J5239K48j8191p206P665n335j4614Q367K3481J404j8110o067M581
1391f502m403k820J5047J3236p740o672O844l564k1191n094K1765J3109r760o724
1405d469M605n516j1914M889J4162J532k098J1520M548k1154j8170J1400J5308
1418D643m092m497Q581J245j5280o988P838K134k157J4447J7083j0147k1654l61
1432i205J1794l030o865J1101J1399q658j1492L01k278q731Q052K3122M321j6221
1446C610m888Q314m357j3306M602J6267K445q181p89l512j5100m883J7811J3155
1460A1188o847l907J0520j63j7095o255J2443Q622j772L281K373j3470j5074N104
1474a1052J1566k968k734J3304Q816j3153j4503L180O521o67N324J0832m179j5805
$$ plain form
1488 -5518 -9801 -4915 -9234 -16461 -5328 12364 10301 -3549 -6681 -3948 -7802 -7125 5937 13461
1502 13461 5541 239 3059 -3580 -18091 -16024 1638 8952 1793 -591 932 -5938 -13226 -6407
1516 -6407 4817 4846 4085 10389 7867 -8951 -18648 -9318 332 -1051 -243 5815 2738 -8758 -11281
1531 -11281 -4751 -2205 -351 10244 17407 6899 -7487 -8437 -3130 -4903 -4999 4319 9158 1092 -6290
1546 -6290 -6431 -8041 -10099 -1033 13134 14107 3769 -778 136 -5391 -10327 -3440 7063 7070 1982 206
1562 206 -4318 -12189 -11542 695 9136 7512 6627 8263 2742 -7901 -8818 -552 4275 4414 5911 4459
1578 4459 -5629 -14138 -9704 -2684 33 3101 10528 10318 160 -7507 -5911 -2633 -518 4834 9911
1593 9911 4710 -5235 -9186 -7701 -8221 -6224 3613 11510 8342 996 -2659 -4298 -5684 -2002 5952
$$ packed form
1488e518m283M886m319p227J1133J7692k063j3850l132K733l854O77J3062P524
1502A3461p920n302K820o639j4511K067J7662P314p159k384J523o870p288O819
1516f407J1224K9p61O304k522j6818r697R330R650j383Q08O058l077j1496k523
1531a1281O530K546J854J0595P163j0508j4386r50N307j773r6R318M839q066p382
1546f290j41j610k058R066J4167R73j0338m547R14n527m936O887J0503Pn088j776
1562B06m524p871O47J2237Q441j624q85J636n521j0643r17Q266M827J39J497j452
1578D459j0088q509M434P020K717L068P427k10j0158p667J596L278K115N352N077
1593I911n201r945l951J485n20J997R837P897l168p346l655j639j386L682P954
$$ plain form
1608 5952 9514 4785 -316 -3578 -8910 -13334 -7717 2507 7128 5818 3362 471 -4895 -7365 -2283
1623 -2283 5242 7395 7459 6382 244 -8664 -11820 -6658 -252 3271 5962 6796 1770 -4899 -6067 -2872
1639 -2872 1739 5669 10580 9725 1811 -6259 -8774 -7838 -5307 -276 5948 6936 1683 -3847 -5967 -5542
1655 -5542 -2579 4412 10903 10065 4576 -1128 -5394 -8713 -7202 -490 5210 5945 2723 -1210 -5483
1670 -5483 -8006 -5131 2307 8083 9260 7462 2699 -3989 -8146 -7817 -2589 2146 4911 4044 247
1685 247 -5636 -8874 -7142 -1113 4541 8864 9698 5848 -1113 -6142 -6452 -3467 1185 5245 5944 2294
1701 2294 -3734 -7694 -7899 -4415 1117 7497 9878 7534 1954 -3091 -5560 -4697 -294 5108 6823
1716 6823 4270 -761 -6033 -8968 -6889 -1368 5445 9252 8884 5057 -291 -4235 -4113 -382 4538
$$ packed form
1608E952L562m729n101l262n332m424N617J0224M621j310k456k891n366k470N082
1623b283P525K153O4j077o138q908l156N162O406L523K691Q34n026o669j168L195
1639b872M611L930M911q55p914q070k515R36K531N031O224R88n253n530k120M25
1655e542K963O991O491q38n489n704m266l319J511O712N700P35l222l933m273
1670e483k523K875P438N776J177j798m763o688m157L29N228M735K765q67l797
1685B47n883l238J732O029N654M323Q34l850o961n029l10K985M652M060O99l650
1701B294o028l960k05L484N532O380K381k344n580n045k469Q63M403N402J715
1716F823k553n031n272k935K079N521O813L807l68l827n348l944J22L731M920
$$ plain form
1731 4538 7913 6476 2464 -3188 -7981 -8227 -3871 2393 7118 8683 6324 1468 -3399 -4562 -1977
1746 -1977 2777 6402 7815 4975 -1371 -6535 -8885 -6601 -1541 4225 7836 6818 2419 -2273 -4219
1761 -4219 -3249 544 5968 8741 6839 1461 -3850 -7886 -8135 -4412 1654 5668 5981 3272 -897 -4368
1777 -4368 -5275 -1772 4044 7716 7749 4628 -1082 -6466 -8840 -6017 -696 3745 5352 4558 694 -4435
1793 -4435 -6167 -2764 1872 6543 8839 8018 2293 -4371 -6996 -5996 -2719 1274 5384 6089 1454
1808 1454 -3929 -5575 -4615 -1392 4091 9171 9237 4237 -1360 -4356 -5850 -4937 -410 5303 5725 1681
1824 1681 -1956 -4936 -6436 -4799 2315 7690 8272 5733 2901 -1746 -6579 -6098 6 4383 4352 3357
1840 3357 1003 -4522 -8492 -6213 347 4102 6148 8262 5801 -1340 -6256 -4624 -884 1218 3884
$$ packed form
1731D538L375j437m012n652m793k46M356O264M725J565k359m856m867j163K585
1746a977M754L625J413k840o346n164k350K284N060N766L611j018m399m692j946
1761d219R70L793N424K773j902n378n311m036k49L723O066M014L13k709m169l471
1777d368r07L503N816L672L3l121n710n384k374K823N321M441J607p94l864n129
1793d435j732L403M636M671K296q21n725o664k625J000L277L993M110P05m635
1808A454n383j646R60L223N483N080O6n000n597k996j494R13M527N713M22m044
1824A681l637k980j500J637P114N375N82k539k832m647m833M81O104M377l1r95
1840C357k354n525l970K279O560L755K046K114k461p141m916J632L740K102K666
$$ plain form
1855 3884 5835 2583 -4592 -8020 -6422 -4131 -1002 5284 9624 5983 -1195 -3928 -3371 -3115 -1172
1870 -1172 4821 7239 2302 -2694 -4286 -6451 -8261 -2786 6080 8343 4592 1177 935 -3147 -5693
1885 -5693 -1077 5759 6661 3818 2368 -1499 -8539 -10082 -2466 3690 3715 3665 5512 1961 -5088 -5919
1901 -5919 -337 3184 3821 6633 6893 -1347 -8933 -7191 -2132 -1549 36 6006 8110 1060 -4855 -3728
1917 -3728 -1532 -934 3590 10067 6952 -2059 -4989 -3560 -6027 -7588 -556 6741 4814 -1373 -2825
1932 -2825 -3628 -6810 -4599 4351 7996 3423 370 953 -3665 -10640 -8768 737 4312 1214 847 197
1948 197 -5431 -9165 -3386 3307 2848 2796 6822 4441 -6439 -11545 -5192 -282 -1052 672 3899 10
1964 10 -8151 -8192 -3214 -2996 -2378 5478 10329 2471 -6888 -6035 -2620 -4250 -3059 4215 6014 -703 -4689
$$ packed form
1855C884J951l252p175l428J598K291L129O286M340l641p178k733N57K56J943
1870a172N993K418m937m996j592k165j810N475Q866K263l751l415k42m082k546
1885e693M616O836R02k843j450l867p040j543P616O156K5n0J847l551p049q31
1901e919N582L521O37K812K60q240p586J742N059N83J585N970K104p050n915J127
1917c728K196N98M524O477l115r011k930J429k467j561P032P297j927o187j452
1932b825q03l182K211Q950L645m573l053N83m618o975J872R505L575l098l67o50
1948A97n628l734N779O693m59n2M026k381j0880n106O353M910p70J724L227l889
1964A0q161m1M978K18O18P856M851p858r359Q53L415j630J191P274J799o717l986
$$ plain form
1981 -4689 -2656 -5088 -8212 -589 10074 8899 916 -653 859 -3731 -7173 -1022 5812 3154 137
1996 137 1656 -2030 -10136 -9068 2204 7104 3003 2594 6204 1955 -6462 -5124 1541 2669 2516
2011 2516 6238 5937 -4149 -10437 -3851 2097 320 862 8639 9011 -461 -4852 -1366 -482 -1079 4378
2027 4378 9691 3320 -6017 -5289 -1658 -5222 -6532 2243 9355 4443 -1954 -1875 -2061 -5750 -2312 6471
2043 6471 7100 -427 -1554 872 -4526 -11497 -6445 4105 5159 1227 1349 1014 -5416 -7535 -56
2058 -56 4621 1173 1092 5728 1642 -9743 -11591 -3458 520 -1156 1212 4393 -906 -7958 -5093 -591
2074 -591 -2478 -1711 6695 8803 -972 -8894 -5239 -2858 -4800 -2247 5005 4477 -2417 -3626 -1090 -4329
2090 -4329 -6249 2120 11218 6926 -1264 -1192 -593 -5166 -6620 355 5132 1977 189 2130 -2156 -8536
$$ packed form
1981d689K033k432l124P623J0663j175p983j569J512m590l442O151O834k658l017
1996A37J519l686q106J068J1272M900m101m09L610m249q417J338O665J128j53
2011B516L722l01j0086o288O586N948j777N42P777L72r472m391L486Q84n97N457
2027D378N313o371r337P28L631l564j310Q775P112m912o397P9j86l689L438Q783
2043F471O29p527j127K426n398o971N052J0550J054l932J22l35o430k119P479
2058e6M677l448q1M636m086j1385j848Q133L978j676K368L181n299p052K865M502
2074e91j887P67Q406K108r775p922L655K381j942K553P252n28o894j209K536l239
2090d329j920Q369R098m292q190P2N99m573j454O975M777l155j788J941m286o380
$$ plain form
2106 -8536 -5299 5330 7857 2670 3141 5216 -875 -6995 -3777 2290 1986 2219 6086 4042 -5065
2121 -5065 -7808 -866 3827 1470 3818 9214 7235 -1740 -4131 -724 -788 -889 4936 8515 1360 -5872
2137 -5872 -3495 -764 -3234 -2669 5748 9539 3406 -987 -389 -2591 -4861 167 7003 5796 -832
2152 -832 -715 224 -4651 -7983 -1168 6164 5901 2709 3280 1154 -4953 -4886 1745 4602 1236 1878 4096
2169 4096 -1239 -9011 -8046 -854 1706 1651 4041 4909 -855 -5596 -2583 526 -385 1348 6433 5419
2185 5419 -2655 -7208 -4264 -2522 -2597 1385 6597 4290 -1213 -1942 -916 -3102 -2924 4033 8341 4058
2201 4058 -1729 -2065 -2689 -6098 -4581 2252 4901 2288 994 1298 -2803 -5776 -1228 5571 6357 3485
2217 3485 3482 1971 -2916 -6643 -2585 1931 2386 3062 4588 1900 -4533 -5079 -82 2741 2801 4792 6470
$$ packed form
2106h536L237J0629K527n187M71K075o091o120L218O067l04K33L867k044r107
2121e065k743O942M693k357K348N396j979q975k391L407o4j01N825L579p155p232
2137e872K377K731k470N65Q417L791o133m393N98k202k270N028O836j207o628
2152h32J17R39m875l332O815P332k63l192N71k126o107O7O631K857l366O42K218
2169D096n335p772R65P192K560n5K390Q68n764m741L013L109r11J733N085j014
2185E419q074m553K944J742p5L982N212k307n503p29J026k186J78O957M308m283
2201D058n787l36o24l409J517O833K649k613j294L04m101k973M548O799P86k872
2217C485lj511m887l727M058M516M55O76J526k688o433n46M997K823O0J991J678
$$ plain form
2234 6470 2555 -3636 -4505 -2004 -1353 455 4626 5266 638 -3826 -2443 -1101 -1121 1891 7299 7558
2250 7558 3028 -749 -1528 -3089 -3108 1073 5102 4188 460 -977 -1982 -4400 -3832 1510 5819 5478
2266 5478 3413 2029 -1237 -4336 -3701 1129 3841 2835 2429 1489 -2421 -5767 -3767 623 3220 4542
2282 4542 5571 3811 -951 -3881 -2491 72 1151 2891 4738 1978 -3061 -5732 -4296 -2149 -275
2297 -275 3324 5297 3162 -771 -2840 -2745 -2615 -266 3338 5048 2190 -1581 -3427 -4832 -4323 -1711
2313 -1711 3117 4809 3081 1118 -784 -3379 -3744 -475 3005 4320 2476 707 -2266 -5832 -6099
2328 -6099 -3459 552 2771 3198 2375 -882 -3502 -4133 -1195 1759 3493 4216 3128 -660 -4423 -4781
2344 -4781 -3262 -586 2000 4070 3295 113 -3036 -3463 -2266 -84 2885 4513 3640 409 -2527 -4572
$$ packed form
2234F470l915o191q69K501O51J808M171O40m628m464J383J342k0L012N408K59
2250G558m530l777p79j561j9M181M029r14l728j437j005k418N68N342M309l41
2266E478k065j384l266l099O35M830K712j006m06r40l910l346K000M390K597J322
2282D542J029j760m762k930J390K563J079J740J847k760n039k671J436K147J874
2297b75L599J973k135l933k069R5J30K349L604J710k858l771j846j405N09K612
2313a711M828J692j728j963j902k595l65L269L480J315j844j769k973l566k67
2328f099K640M011K219M27q23l257k620o31K938K954J734P23j088l788l763l58
2344d781J519K676K586K070p75l182l149m27J197K182K969J628q73l231k936k045
$$ plain form
2360 -4572 -4427 -2564 1018 3480 3093 771 -1327 -2905 -3067 -779 2688 5639 5199 3130 414 -2837
2376 -2837 -4048 -2459 621 3245 3435 2043 -226 -3194 -4222 -2496 836 3268 4915 3881 1040
2391 1040 -2208 -4000 -3672 -1069 1757 3008 3055 405 -2139 -3885 -2887 -551 2752 5159 5129 2653
2407 2653 -455 -2498 -2578 -1645 647 2936 2947 1060 -2442 -4150 -4947 -3339 -473 2965 3786 2390 -340
2424 -340 -2880 -4360 -3450 -497 2228 2808 1661 -1004 -3070 -4852 -3886 -809 2327 3823 3370 1890
2440 1890 -1201 -3245 -3287 -1029 1263 2307 2347 480 -3290 -5378 -5504 -3522 -701 1574 2833 1511
2456 1511 -1256 -3647 -3818 -2476 -236 2367 3411 2057 -1379 -3660 -4589 -3597 -1724 2326 3960 3040
2472 3040 641 -1360 -2897 -2857 -740 2482 3871 2401 191 -2277 -4620 -5292 -3200 264 2031 1935
$$ packed form
2360d572J45J863L582K462l87k322k098j578j62K288L467K951m40k069k716l251
2376b837j211J589L080K624J90j392k269k968j028J726L332K432J647j034k841
2391A040l248j792L28K603K826J251M7k650k544j746R98K336L303K407l0k476
2407B653l108k043q0R33K292K289J1j887l502j708p97J608K866L438Q21j396k730
2424c40k540j480R10K953K725N80j147k665k066j782R66L077L136J496m53j480
2440A890l091k044m2K258K292J044M0j867l770k088j26J982K821K275J259j322
2456A511k767k391j71J342K240K603J044j354l436k281r29R92J873M050J634r20
2472C040k399k001j537M0K117L222J389j470k210k468k343o72K092L464J767r6
$$ plain form
2488 1935 777 -1109 -3996 -4376 -1259 1760 2840 3570 2887 -249 -3634 -4619 -2423 63 1886 3609
2504 3609 3347 500 -2583 -2895 -1233 397 2127 4762 4227 479 -3058 -3994 -3616 -2784 219 2582
2520 2582 2200 -912 -2841 -3372 -3636 -2510 1404 4443 4085 1394 -990 -2450 -4149 -2724 596 2853
2536 2853 2481 1197 335 -2523 -4448 -2801 1571 3358 3237 3085 1436 -2067 -4573 -2982 -682 701
2552 701 1621 2386 410 -3616 -5306 -2803 -972 283 2750 4586 1846 -2204 -3117 -2085 -1310 -434
2568 -434 2966 4487 916 -2653 -2974 -2656 -3154 -271 3891 5133 2462 -46 -746 -2299 -3052 190
2584 190 4119 3832 1185 -565 -1538 -4037 -4857 -1030 3007 2854 2010 2077 -15 -3451 -3352 612 2561
2601 2561 1849 2441 2945 -923 -4935 -4214 -96 1581 2025 4353 4223 -422 -2869 -1010 911 628 2135
$$ packed form
2488A935j158j886k887l80L117L019J080P30o83l136l385r85K196K486J823J723
2504C609k62k847l083l12J662J630J730K635n35l748l537r36L78Q32L003K363
2520B582l82l112j929n31k64J126L914L039l58k691k384j460j699J425L320K257
2536B853l72j284q62k858j925J647M372J787j21j52j649l503k506J591K300J383
2552G01R20P65j976m026j690K503J831J255K467J836k740m050r13J032P75Q76
2568d34L400J521l571l569l21L18m98K883M162J242k671k508p00j553p53L242
2584A90L929k87k647j750r73k499q20L827M037j53q44O7k092l436R9L964J949
2601B561p12N92N04l868m012P21M118J677M44K328j30m645k447J859J921k83J507
$$ plain form
2618 2135 5579 4576 -1047 -3623 -2033 -1692 -1494 1664 5209 2595 -952 -1246 -715 -2580 -1964 3200
2634 3200 6090 2786 -810 -878 -1899 -4119 -2474 2945 3881 1683 1641 1640 -1897 -4237 -547 4375 4570
2651 4570 2661 2963 1977 -2612 -4630 -970 1668 923 1724 3660 1159 -4245 -4441 -291 1423 610
2667 610 3384 4786 984 -3565 -3038 -1601 -1966 -616 3682 4825 -886 -3484 -1345 -477 -1825 558
2683 558 5702 5813 1147 -617 -193 -2354 -3655 1441 5268 2428 -1171 -213 -571 -4193 -4187 1241 4649
2700 4649 2527 1824 2326 -898 -4647 -2527 2021 2759 506 1815 2920 -1508 -5078 -2609 1854 2052
2716 2052 2461 4887 4129 -1361 -3362 -117 1274 -443 1823 5286 2585 -3104 -4227 -1315 -1187 -899
2732 -899 3033 5342 1598 -1844 -756 -342 -2604 -1601 3924 5304 528 -2151 -961 -2107 -4334
$$ packed form
2618B135L444j003n623k576J590L41J98L158L545k614l547k94N31j865O16N164
2634C200K890l304l596o8j021k220J645N419R36k198m2jl537k340L690M922J95
2651D570j909L02r86m589k018L660K638p45Q01J936k501n404j96M150J714q13
2667F10K774J402l802m549N27J437l65J350M298J143n711k598K139Q68j348K383
2683E58N144J11m666j764M24k161j301N096L827k840l599R58l58l622ON428L408
2700D649k122p03N02l224l749K120M548P38k253J309J105m428l570K469M463J98
2716B052M09K426p58n490k001L245J391j717K266L463k701n689j123K912J28K88
2732h99L932K309l744l442J088M14k262J003N525J380m776k679J190j146k227
$$ plain form
2747 -4334 -1167 3909 3512 1161 1283 1630 -2899 -4420 109 4350 3116 449 1283 -15 -4731 -4991
2763 -4991 -648 1388 466 1425 3292 -118 -5179 -3800 895 1491 418 2633 3428 -991 -4937 -3205
2779 -3205 -1509 -2142 -147 4055 3472 -1905 -3803 -1247 -1050 -1759 943 4747 3021 -1203 -1767 -1768 -3597
2796 -3597 -3781 1596 4324 1529 -1317 -342 -1003 -3664 -2607 2656 4162 2300 1216 988 -2175 -4769
2812 -4769 -1902 2158 2232 295 1907 1668 -2488 -4231 -1042 2328 2527 2565 4038 2099 -2537 -3319 -260
2829 -260 706 149 2412 4506 1599 -3142 -3148 -464 -470 472 4228 5101 1364 -1649 -989 -1037 -2358 -489
2847 -489 3828 3683 -343 -2187 -1684 -2687 -3270 15 3793 2941 648 390 -383 -3679 -3895 317 2717
2864 2717 1369 200 -91 -1645 -4790 -4244 -218 1120 1049 1930 1804 -1819 -4717 -3246 -224 439 378
$$ packed form
2747d334L167N076l97k351J22L47m529j521M529M241j234k667Q34j298m716k60
2763d991M343K036r22R59J867l410n061J379M695N96j073K215P95m419l946J732
2779c205J696o33J995M202n83n377j898K556J97p09K702L804j726m224n64jj829
2796c597j84N377K728k795k846R75o61k661J057N263J506j862j084k28l163k594
2812d769K867M060P4j937J612k39m156j743L189L370J99L8J473j939m636p82L059
2829b60R66n57K263K094k907m741oK684oR42L756Q73l737l013O60m8j321J869
2847d89M317j45m026j844N03j003n83L285L778q52k293k58p73l296k16M212K400
2864B717j348j169k91j554l145N46M026J338p1Q81j26l623k898J471L022O63o1
$$ plain form
2881 378 1813 1010 -2866 -5044 -3628 -2290 -1517 516 2937 1695 -2513 -3751 -2197 -2095 -1644 936
2897 936 3199 910 -2324 -3320 -3432 -3790 -2223 1612 3258 952 -1057 -1266 -1923 -3063 -879 2307
2913 2307 3483 1924 401 -401 -2957 -3427 -1151 2026 2346 1729 2101 331 -2346 -2562 -34 2603
2929 2603 3036 3107 2933 522 -2410 -2677 -16 1001 1876 3290 3303 1148 -1972 -1412 81 966 2853
2946 2853 4756 3961 890 -1035 -1498 -1001 -805 1830 4040 3007 478 -903 -1623 -1867 -872 1788 4029
2963 4029 3124 1279 -458 -1601 -2953 -1972 803 2416 1669 734 -660 -2506 -3515 -2275 360 2287
2979 2287 2297 1779 131 -2177 -3879 -2388 -534 972 1138 1206 -296 -3262 -4154 -3251 -1076 -12 2053
2996 2053 2001 201 -2176 -3254 -2988 -1824 -457 1314 1895 -129 -2227 -3377 -3494 -2168 -497 1664
$$ packed form
2881C78J435q03l876k178J416J338P73K033K421j242m208j238J554J02M51K580
2897I36K263k289l234r96j12l58J567L835J646k306k009k09o57j140K184L186
2913B307J176j559j523q02k556m70K276L177L20o17L72j770k677k16K528K637
2929B603M33P1j74k411k932k67K661J017Q75J414J3k155l120N60J493Q85J887
2946B853J903p95l071j925m63M97J96K635K210j033k529j381p20k44R95K660K241
2963D029r05j845j737j143j352R81K775J613p47r35j394j846j009J240K635J927
2979B287J0n18j648k308j702J491J854J506J66O8j502k966q92R03K175J064K065
2996B053n2j800k377j078K66J164J367J771N81k024k098j150j17J326J671K161
$$ plain form
3012 1664 2604 1294 -455 -1902 -2814 -2007 -322 1892 2404 1004 -613 -2154 -3060 -2679 -152 1838
3028 1838 3054 2238 1267 -408 -2116 -1454 513 2381 3376 2653 1478 -473 -2241 -1771 -360 1635
3044 1635 2995 3170 2714 144 -1130 -1242 80 1921 2846 3406 2461 305 -1503 -2380 -947 168 2135
3061 2135 3211 2600 311 -783 -1462 -1118 233 2772 3383 2684 779 -1250 -2486 -2311 -1083 923
3077 923 2208 2029 418 -1108 -2534 -2901 -1047 852 1990 1790 474 -1366 -3096 -3750 -2717 -573
3093 -573 526 1015 495 -1249 -2969 -3231 -1992 -191 1337 2290 1905 120 -2233 -3020 -2553 -816 49
3110 49 1695 1158 -512 -2443 -3462 -3133 -1819 249 1820 1765 295 -1826 -2832 -3034 -2342 -335 1336
3127 1336 1571 375 -1091 -2373 -2552 -1978 606 2715 2943 2186 548 -776 -2156 -1389 466 1955
$$ packed form
3012A664R40j310j749j447r12Q07J685K214N12j400j617j541r06L81K527J990
3028A838J216q16r71j675j708O62J967J868R95p23j175j951j768M70J411J995
3044A635J360J75m56k570j274j12J322J841R25N60r45k156j808q77J433J115J967
3061B135J076o11k289j094o79L44J351K539O11o99j905k029j236J75J228K006
3077I23J285j79j611j526j426l67J854J899J138k00j316j840j730o54J033K144
3093e73J099M89n20j744j720k62J239J801J528R53l85j785k353p87M67J737Q65
3110D9J646n37j670j931j019L29J314K068J571n5j470k121j006k02O92K007J671
3127A336K35j196j466j282j79N74K584K109K28p57j638j324j380P67J855J489
$$ plain form
3143 1955 2209 2077 409 -1475 -3055 -1766 81 1302 2343 2687 1280 -1411 -2127 -1495 -115 776
3159 776 2405 2891 890 -1031 -2079 -1654 -435 1097 3185 3899 2577 192 -446 -656 -517 1209 3061
3176 3061 3622 2051 -46 -826 -2024 -2027 -205 2405 2566 1367 382 -387 -2212 -2300 -162 2010 2326 1147
3194 1147 375 -1192 -2930 -2746 -614 944 1537 2043 2094 -275 -2334 -1826 -41 1318 1984 2632 2219
3211 2219 -360 -2641 -2349 -895 -931 604 2352 1559 -1218 -2374 -1729 -1732 -790 1278 2974 1447 -864
3228 -864 -1642 -2062 -2805 -1800 1052 2314 881 -411 -450 -1418 -2520 -933 1991 2737 1918 798 327
3245 327 -1936 -3143 -1370 1100 1521 1255 997 -144 -2269 -3580 -1241 1051 1189 1770 1990 443 -2625
3262 -2625 -2791 -785 -47 366 1718 2366 -154 -2376 -2132 -469 -176 651 3474 3294 561 -1358 -984
$$ packed form
3143A955K54j32j668j884j580J289J847J221J041L44j407k691p16O32J380Q91
3159G76J629M86k001j921j048M25J219J532K088P14j322k385o38k10J39J726J852
3176C061N61j571k097p80j198lJ822K610J61j199r85p69j825q8K138K172L16j179
3194A147p72j567j738J84K132J558N93N06N1k369k059N08J785J359O66O48m13
3211B219k579k281K92J454l6J535J748p93k777j156O45lR42K068J696j527k311
3228h64p78m20p43J005K852J262j433j292l9r68j102J587K924P46q19j120m71
3245C27k263j207J773K470M21k66k58j141k125j311K339K292J38N81K20j547l068
3262b625j66K006P38M13J352O48k520k222K44J663K93Q27K823j80k733j919L74
$$ plain form
3279 -984 -678 -1283 668 3243 2749 -93 -965 -1163 -2141 -1921 1116 3538 2253 308 520 -280 -2368
3296 -2368 -2239 868 2230 1257 771 561 -871 -3257 -1912 1166 1658 1239 2269 1750 -933 -2914 -1045
3313 -1045 1038 1082 1510 2282 1219 -1766 -3092 -1300 -634 -500 1390 3308 1140 -1834 -2129 -893 -939
3330 -939 -631 1766 3064 216 -2061 -1900 -1898 -2964 -1549 2036 2471 -201 -1199 -1035 -1890 -3175 -924
3347 -924 2061 1624 444 -135 -574 -3165 -3766 -640 1538 940 41 880 -307 -3106 -3185 -370 884
3364 884 585 1020 1519 -1069 -3745 -2880 -558 -314 -622 1480 1513 -1365 -3012 -1739 -762 -684 532 3102
3382 3102 2293 -1239 -2248 -1285 -1083 -1850 597 3209 1521 -884 -1198 -739 -1665 -1386 1798 3494 1434
3399 1434 27 123 -448 -2549 -1500 1984 2470 1010 815 815 -1230 -2828 -187 2234 1980 1331 2331
$$ packed form
3279i84L06o05J951K575m94k842q72j98r78K20L037K422j285j945K12q00k088
3296b368J29L107J362r73m86k10j432k386J345L078M92m19J030n19k683j981J869
3313a045K083M4M28P72j063k985j326J792O66J34J890J918k168k974k95J236m6
3330i39L08K397J298k848k277J61Kj066J415L585M35k672r98J64q55j285K251
3347i24K985m37j180n79m39k591o01L126K178n98q99Q39j187k799p9K815J254
3364H84k99M35M99k588k676Q65K322K44l08K102L3k878j647J273R77P8J216K570
3382C102q09l532j009R63K02p67K447K612j688k405l14M59r26K79L184J696k060
3399A434j407R6n71k101J049L484M86j460j95%k045j598K641K421k54o49J000
$$ plain form
3416 2331 1641 -1219 -2612 -212 1488 1050 1629 2634 836 -2274 -2227 69 242 392 2132 3212 857
3433 857 -2199 -1373 -260 -914 -61 2310 2558 -235 -1835 -1372 -1723 -2205 1 2877 1999 -526 -992
3450 -992 -713 -2094 -2358 100 2289 1164 -481 -422 -1296 -3154 -3040 260 1895 443 293 322 -1257
3467 -1257 -3114 -2414 475 898 275 1111 835 -1801 -3469 -2207 -30 59 743 1983 1394 -1701 -2538
3484 -2538 -896 -89 -36 1229 2616 1155 -1613 -1856 -968 -1191 -502 1787 3114 1562 -940 -848 -299
3501 -299 -1261 86 2776 3409 1640 208 350 -761 -2068 112 2467 2215 1270 733 634 -1185 -1622
3518 -1622 889 2590 2338 1499 2141 875 -1995 -1662 510 1534 1005 2046 2236 359 -1869 -1433 563
3535 563 892 1337 2554 2661 204 -1640 -1024 -68 -153 551 2298 1913 -686 -1531 -1451 -1216 -960 744 2460
$$ packed form
3416B331o90k860j393K400J700m38N79J005j798l110M7K296J73J50J740J080k355
3433H57l056Q26J113o54Q53K371K48k793j600M63l51m82K206K876q78k525m66
3450i92K79j381k64K458K189j125j645N9q74j858J14L300J635j452j50K9j579
3467a257j857P00K889M23o23Q36k76k636j668J262K177Q9O84J240n89l095q37
3484b538J642Q07N3J265J387j461k768k43Q88k23O89K289J327j552k502R2N49
3501b99r62J347K690O33j769j432J42j111j307K180K355k52r45n37r9j819m37
3518a622K511J701k52q39O42j266k870L33K172J024n29J041J90j877k228M36J996
3535E63L29M45J217J07k457j844O16R56q5P04J747l85k599q45Q0K35K56J704J716
$$ plain form
3554 2460 1641 -638 -1067 -1154 -2191 -1855 481 2041 798 -627 -904 -1801 -2677 -1631 689 1279 566
3571 566 -44 -137 -1569 -2926 -1716 206 1066 553 449 -122 -2203 -2785 -1349 -27 515 940 1560 730
3589 730 -1962 -2197 -1234 19 243 1450 1837 515 -1858 -1807 -1260 -742 133 1710 2236 569 -813 -1184
3607 -1184 -1264 -801 588 2218 1857 729 -256 -922 -1388 -1319 509 1891 1913 1268 235 -260 -925 -1083 695
3626 695 2398 1852 1675 546 -640 -1499 -1564 -67 888 1580 1568 879 -486 -1959 -1383 34 906 1487
3644 1487 1724 1070 -741 -1867 -1720 -674 -43 860 1744 1040 -698 -1919 -1377 -1015 -316 1339 1687 888
3662 888 -914 -1447 -1777 -1742 -733 315 1104 416 -847 -1483 -2090 -2147 -847 598 1296 409 -290 -1285 -2197
3681 -2197 -2387 -1038 262 725 488 151 -777 -2019 -2251 -1031 518 1156 1436 1006 -372 -1690 -1714 -645
$$ packed form
3554B460q19k279m29q7j037L36K336J560j243j425k77q97q76J046K320N90p13
3571E66o10r3j432j357J210J922Q60n13j04n71k081n82J436J322N42M25O20q30
3589G30k692k35R63J253K24J207L87j322k373N1N47N18Q75J577N26j667j382l71
3607a184q0M63J389J630l61j128r85o66m66O9J828J382K2o45j033m95o65j58J778
3626F95J703n46j77j129j186q59o5J497R55O92j2o89j365j473N76J417Q72N81
3644A487K37o54j811j126J47J046O31R03Q84p04j738j221N42L62O99J655L48p99
3662H88j802n33l30L5J009J048P89o88j263o36o07n7J300J445O98q87o99r95r12
3681b197j90J349J300M63k37l37r28j242k32J220J549O38K80m30j378j318k4J069
$$ plain form
3699 -645 -26 850 1476 1026 -165 -1604 -1564 -1111 -133 1049 1701 1642 287 -948 -1310 -1061 -122 867 1895
3718 1895 1489 417 -711 -1108 -891 -522 1032 2019 1887 1066 45 -851 -1132 -508 995 1877 2097 1252
3736 1252 -50 -908 -1270 -998 627 1427 2014 1652 912 -500 -1386 -733 281 1335 1314 1492 92 -1119
3754 -1119 -1615 -1464 -303 764 1390 1324 782 -459 -1275 -1188 -42 743 1587 1709 761 -458 -1266 -1316 -773
3773 -773 136 1314 1521 807 -473 -838 -1272 -955 185 1462 1631 720 -83 -857 -1677 -1654 -110 400 1278
3792 1278 768 -49 -822 -1504 -1272 -93 1205 1665 1551 847 -426 -1228 -1258 -308 931 1324 1611 708 -377
3811 -377 -1146 -1173 -194 631 1274 1845 1470 -74 -1107 -1165 -841 -97 1014 1880 1197 117 -654 -974 -720
3830 -720 -306 1208 2025 1574 460 -377 -777 -1065 -508 1157 1707 1199 588 -163 -1251 -1476 -291 760
$$ packed form
3699f45O19Q76O26m50j191j439M0M53R78J182O52n9j355j235l62K49R39R89J028
3718A895m06j072j128l97K17L69J554R87j32q21j021q96k81O24J503Q82K20q45
3736A252j302q58l62K72J625Q00N87l62p40j412q86O53J014J054k1J78j400j211
3754a119m96J51J161J067O26o6n42j241q16Q7J146P85Q44J22r48j219q08n0N43
3773g73R09J178K07p14j280l65m34L17J140J277J69r11q03p74q20K3J544N10Q78
3792A278n10q17p73o82K32J179J298M60j14p04j273q02l0R50J239L93K87r03j085
3811c77p69k7R79Q25O43N71l75j544j033n8L24P44J111Q66o83j080p71l20K54
3830g20M14J514Q17m51j114q37m00k88N57J665N50n08o11p51j088k25J185J051
$$ plain form
3848 760 1694 1289 799 179 -1416 -1679 -622 552 1141 1123 866 -142 -1504 -1694 -571 -25 532 1390
3866 1390 1264 106 -1090 -1152 -612 -95 595 1869 1537 -280 -1126 -1424 -1223 -1036 376 1618 1168 -58
3884 -58 -597 -1092 -1056 -1083 390 1372 807 283 -153 -1254 -1655 -1323 393 1536 957 553 73 -1045 -1746
3903 -1746 -721 615 1237 1185 1545 562 -1225 -1903 -793 98 426 605 1258 231 -1370 -1607 -986 -131
3921 -131 27 1159 1550 612 -1385 -1545 -854 -1238 -252 1039 1361 102 -639 -892 -1112 -1207 71 1482
3939 1482 1214 461 -368 -370 -1648 -1520 -295 1519 1280 394 195 -180 -1568 -1616 226 1340 1095 1144 965
3958 965 -261 -1717 -1313 56 535 554 1129 1211 -543 -1753 -883 -114 180 642 1581 1431 -389 -1378 -606
3977 -606 -396 -440 680 1738 716 -672 -693 -543 -951 -299 1338 2041 1103 -380 -392 -896 -1176 -754 1247
$$ packed form
3848G60R34m05m90o20j595k63J057J174N89j8k57j008j362j90J123N46N57Q58
3866A390j26j158j196o2N40N17O90J274l32j817q46k98K01J87J412J242m50j226
3884e8n39m95L6k7J473R82n65n24m36j101m01L32J716J143n79m04m80j118p01
3903a746J025J336O22n2L60r83j787o78J110Q91L28J79O53j027j601k37O21Q55
3921a31J58J132L91r38j997j60O91l84R86J291L22j259p41k53k20r5J278J411
3939A482k68p53q29kj278J28J225J814k39q86j99l75j388m8J842J114k45M9j79
3958I65j226j456M04J369M79J9N75Q2j754j210Q70P69K94M62R39j50j820r89P72
3977f06K10m4J120J058j022j388k1J50m08O52J637P03r38j483j2n04k80M22K001
$$ plain form
3996 1247 1628 648 34 -190 -736 -1656 -695 1336 1462 692 624 583 -1060 -1756 -180 1134 961 793 617
4015 617 200 -1818 -1472 -94 648 633 1043 1531 315 -1302 -1261 88 78 74 1637 1612 -132 -1595 -958
4034 -958 -291 -907 283 1669 1368 -268 -1136 -313 -741 -1112 410 2068 1682 -59 -325 -669 -1225 -1186
4052 -1186 554 1522 776 -237 470 -337 -1372 -1104 886 1629 865 949 718 -640 -1933 -649 906
4069 906 995 674 1287 1050 -775 -1405 -201 781 621 1086 2040 1041 -774 -1036 -98 -22 134 1243 2056
4088 2056 553 -876 -559 -81 -462 45 1777 2106 978 -623 -443 -318 -1234 -244 1471 1606 451
4105 451 -108 255 -715 -1501 409 1801 1246 753 578 199 -1683 -1421 140 1034 615 612 784 -261 -1681
4124 -1681 -1487 164 754 622 1157 1245 -473 -1788 -859 -101 135 453 1253 841 -921 -1525 -843 -555 -550
$$ packed form
3996A247L81r80o14k24n46r20R61K031J26p70o8m1j643o96J576J314j73j68j76
4015F17m17k018L46J378P42j5M10M88j216j617M1J349j0mJ563k5j744j463O37
4034i58O67o16J190J386l01j636q68Q23m28l71J522J658l86j741k66l44n56L9
4052a186J740R68p46j013P07q07j035K68J990P43p64Q4k31j358j293J284J555
4069I06Q9l21O13k37j825o30J204R82j60M65R54r99j815k62R38P6J56J109Q13
4088B056j503j429L17M78l81N07J732L29j128j601J80J25r16R90J715J35j155
4105D51n59L63r70p86J910J392n55m93j75l79j882K62J561Q94m19lJ72j045j420
4124a681J94J651N90j32N35Q8j718j315R29P58K36L18Q00m12j762o04O82K88N
$$ plain form
4143 -550 445 1741 905 -786 -896 -455 -877 -958 556 1590 348 -831 -652 -829 -1470 -837 847 1414
4161 1414 450 -150 -77 -631 -1877 -537 1035 1034 48 392 103 -826 -1811 -690 699 470 627 764 507
4180 507 -1246 -1367 -74 597 450 829 1265 -76 -1278 -1447 -402 21 94 1093 1412 199 -836 -1056
4198 -1056 -182 -255 285 1787 1539 -19 -749 -505 -830 -1094 468 1612 938 40 -230 -473 -1202 -699 469
4217 469 1486 900 107 -25 -679 -1646 -1178 187 888 354 514 311 -735 -1508 -1102 170 660 328 988
4236 988 447 -851 -1290 -963 -30 154 617 1110 268 -1028 -1564 -424 -569 -183 1020 1217 512 -1017
4254 -1017 -1241 -773 -850 -333 886 1029 94 -591 -944 -926 -765 -231 936 1121 589 149 -645 -1365 -1110 -409
4274 -409 814 888 646 93 -726 -1000 -1283 -372 682 1069 766 879 -239 -1074 -879 -169 582 919 995 738
$$ packed form
4143e50R95J296q36j691j10M41m22q1J514J034j242j179J79j77o41O33J684N67
4161A414r64o00P3n54j246J340J572jr86L44k89r29r85J121J389k29J57J37k57
4180E07j753j21J293O71j47L79M36j341j202j69J045M23P3R99L19j213j035k20
4198a056Q74p3N40J502k48j558p30K44l25k64J562J144o74q98k70k43p29N03J168
4217D69J017n86p93j32o54r67M68J365P01n34J60k03j046p73M06J272M90l32O60
4236I88n41j298m39L27R33J84M63M93q42j296n36J140j45L86J203J97p05j529
4254a017k24M68p7N17J219J43r35o85l53J8J61N34J167J85n32m40p94p20K55P01
4274d09J223P4k42n53q19k74k83R11J054L87l03J13j118q35J95P10P51L37P6k57
$$ plain form
4294 738 109 -870 -1083 -283 221 592 1522 890 18 -528 -531 -212 -50 1215 1246 904 -323 -990 -591 -333
4314 -333 -64 977 1414 1193 205 -201 -779 -816 197 773 1267 863 349 -221 -872 -719 -490 429 1184 991
4334 991 598 -82 -685 -1188 -213 286 1075 646 619 117 -571 -1214 -646 4 639 802 822 -231 -551 -1367
4354 -1367 -698 -33 641 777 1242 176 -511 -632 -619 -494 425 1019 1036 306 -247 -824 -982 -391 399 955
4374 955 1041 140 -522 -867 -799 -555 67 1026 380 85 -428 -798 -729 -690 -56 674 833 771 79 -469 -986 -772
4396 -772 216 452 982 591 179 -671 -898 -848 -185 168 1238 884 596 -294 -891 -936 -583 131 523 782
4416 782 515 -470 -1067 -687 -351 125 1070 1150 752 107 -756 -757 -392 77 716 900 681 20 -578 -905 -369
4437 -369 -145 462 1044 903 145 -112 -709 -856 -400 495 974 668 1 -179 -1347 -1139 -594 649 677 822
$$ packed form
4294G38o29r79k13Q00N04L71R30o32q72n46lL19J62J265L1l42j227o67L99K58
4314c33K69J041M37k21r88m06n78l7J013N76M94m04n14n70o51J53K29R19P55j93
4334I91l93o80o03n03R75M99P89m29k7n02o88o43N68O50O35J63K0j053l20q16
4354a367O69O65O74J36M65j066o87j21J3J25R19N94J7p30n53n77j58N91P90N56
4374I55Q6r01o62l45O8K44O22R59o46k95n13l70O9L9O34P30J59o2o92n48n17K14
4396g72R88K36N30l91m12q50k27N0O63L53J070l54k88q90n97m5L53P14L92K59
4416G82k67r85n97L80L36M76R45Q0l98o45q63jL65M69O39J84k19o61n98l27N36
4437c69K24O07N82j41p58k57n97j47M56Q95M79l06o67j80j168K08N45J243K8J45
$$ plain form
4457 822 624 -190 -974 -1070 -755 152 605 1255 693 -23 -642 -1142 -656 -288 539 1046 603 -83 -550 -741
4477 -741 -837 -175 483 673 801 95 -712 -769 -1387 -515 504 533 671 -131 -385 -986 -1216 -608 471 577
$$ packed form
4457H22j98q14p84r6L15R07M53O50n62p16o19n00M86L68Q27N07m43o86m67j91
4477g41r6O62O58J90J28p06q07n7o18Q72J019K9J38q02k54o01k30O08J079J06
$$ [...]
8191B0
##END NTUPLES=NMR FID
##END=
