##TITLE=1H_SA_30.236.1.MeOHEt3N
 CDCl3, 108 sc, 
 17.12.2020
##JCAMPDX= 6.0         $$ Bruker NMR JCAMP-DX V2.0
##DATA TYPE= NMR FID
##DATA CLASS= NTUPLES
##ORIGIN= UXNMR, Bruker Analytische Messtechnik GmbH
##OWNER= root
$$ XWIN-NMR		Version 3.5
$$ Thu Dec 17 13:28:25 2020 Russian Standard Time (UT+4h)  she@DPX200
##.OBSERVE FREQUENCY= 200.1315066352
##.OBSERVE NUCLEUS= ^1H
##.DELAY= (6, 6)
##.ACQUISITION MODE= SIMULTANEOUS
##.ACQUISITION SCHEME= undefined
##.AVERAGES= 108
##.DIGITISER RES= 18
##SPECTROMETER/DATA SYSTEM= spect
##.PULSE SEQUENCE= zg30
##.SOLVENT NAME= CDCl3
##.SHIFT REFERENCE= (INTERNAL, CDCl3, 0, 15.7039)
##AUDIT TRAIL= $$ (NUMBER, WHEN, WHO, WHERE, WHAT)
$$ ##TITLE= Audit trail, XWIN-NMR		Version 3.5
$$ ##JCAMPDX= 5.01
$$ ##ORIGIN= Bruker BioSpin GmbH
$$ ##OWNER= she
$$ F:/spectra/data/she/nmr/H-F/1/audita.txt
$$ ##AUDIT TRAIL=  $$ (NUMBER, WHEN, WHO, WHERE, WHAT)
(   1,<2020-12-17 13:26:11.01 +0400>,<she>,<DPX200>,
      <continue with go, POWCHK disabled, PULCHK disabled
       configuration hash MD5:
       00 E9 B6 7A A2 85 ED C7 34 08 36 98 17 FE 4E 26
       data hash MD5: 16K
       28 BA 12 26 44 39 75 32 9F AB C3 A4 53 7B B7 CF>)
$$ ##END=
$$ 
$$ hash MD5
$$ 0C 7E 36 BE 34 D7 20 76 AA 2E 92 EF C8 03 63 99
##$RELAX= 
##$RELAX= 
##$RELAX= 
##$RELAX= 
##$RELAX= 
##$RELAX= 
$$ Bruker specific parameters
$$ --------------------------
##$DU= <F:/spectra>
##$EXPNO= 1
##$NAME= <H-F>
##$PROCNO= 1
##$TYPE= <nmr>
##$USER= <she>
##$AMP= (0..31)
100 100 100 100 100 100 100 100 100 100 100 100 100 100 100 100 100 100 
100 100 100 100 100 100 100 100 100 100 100 100 100 100 
##$AQSEQ= 0
##$AQ_mod= 1
##$AUNM= <au_zg>
##$AUTOPOS= <>
##$BF1= 200.13
##$BF2= 200.13
##$BF3= 200.13
##$BF4= 200.13
##$BF5= 200.13
##$BF6= 200.13
##$BF7= 200.13
##$BF8= 200.13
##$BYTORDA= 1
##$CFDGTYP= 0
##$CFRGTYP= 5
##$CHEMSTR= <none>
##$CNST= (0..31)
1 1 145 1 1 1 1 1 1 1 1 1 1 1 1 1 1 1 1 1 1 1 1 1 1 1 1 1 1 1 1 1 
##$CPDPRG= <>
##$CPDPRG1= <>
##$CPDPRG2= <>
##$CPDPRG3= <>
##$CPDPRG4= <mlev>
##$CPDPRG5= <mlev>
##$CPDPRG6= <mlev>
##$CPDPRG7= <mlev>
##$CPDPRG8= <mlev>
##$CPDPRGB= <>
##$CPDPRGT= <>
##$D= (0..31)
0 1.2 0 0 0 0 0 0 0 0.06 0 0.03 0 0 0 0 0.0002 0 0 0 0 0 0 0 0 0 0 0 0 
0 0 0 
##$DATE= 1608196748
##$DBL= (0..7)
120 120 120 120 120 120 120 120 
##$DBP= (0..7)
150 150 150 150 150 150 150 150 
##$DBP07= 0
##$DBPNAM0= <>
##$DBPNAM1= <>
##$DBPNAM2= <>
##$DBPNAM3= <>
##$DBPNAM4= <>
##$DBPNAM5= <>
##$DBPNAM6= <>
##$DBPNAM7= <>
##$DBPOAL= (0..7)
0.5 0.5 0.5 0.5 0.5 0.5 0.5 0.5 
##$DBPOFFS= (0..7)
0 0 0 0 0 0 0 0 
##$DE= 6
##$DECBNUC= <off>
##$DECIM= 32
##$DECNUC= <off>
##$DECSTAT= 4
##$DIGMOD= 1
##$DIGTYP= 9
##$DL= (0..7)
0 120 120 120 120 120 120 120 
##$DP= (0..7)
150 150 150 150 150 150 150 150 
##$DP07= 0
##$DPNAME0= <>
##$DPNAME1= <>
##$DPNAME2= <>
##$DPNAME3= <>
##$DPNAME4= <>
##$DPNAME5= <>
##$DPNAME6= <>
##$DPNAME7= <>
##$DPOAL= (0..7)
0.5 0.5 0.5 0.5 0.5 0.5 0.5 0.5 
##$DPOFFS= (0..7)
0 0 0 0 0 0 0 0 
##$DQDMODE= 0
##$DR= 18
##$DS= 0
$$ [...]
##$SUBNAM2= <"">
##$SUBNAM3= <"">
##$SUBNAM4= <"">
##$SUBNAM5= <"">
##$SUBNAM6= <"">
##$SUBNAM7= <"">
##$SUBNAM8= <"">
##$SUBNAM9= <"">
##$SW= 16.9725356469052
##$SWIBOX= (0..15)
0 0 2 0 0 0 0 0 0 0 0 0 0 0 0 0 
##$SW_h= 3396.73913043478
##$TD= 16384
##$TD0= 1
##$TE= 0
##$TE2= 300
##$TE3= 300
##$TEG= 300
##$TL= (0..7)
0 120 120 120 120 120 120 120 
##$TP= (0..7)
150 150 150 150 150 150 150 150 
##$TP07= 0
##$TPNAME0= <>
##$TPNAME1= <>
##$TPNAME2= <>
##$TPNAME3= <>
##$TPNAME4= <>
##$TPNAME5= <>
##$TPNAME6= <>
##$TPNAME7= <>
##$TPOAL= (0..7)
0.5 0.5 0.5 0.5 0.5 0.5 0.5 0.5 
##$TPOFFS= (0..7)
0 0 0 0 0 0 0 0 
##$TUNHIN= 0
##$TUNHOUT= 0
##$TUNXOUT= 0
##$USERA1= <user>
##$USERA2= <user>
##$USERA3= <user>
##$USERA4= <user>
##$USERA5= <user>
##$V9= 5
##$VALIST= <valist>
##$VCLIST= <CCCCCCCCCCCCCCC>
##$VD= 0
##$VDLIST= <DDDDDDDDDDDDDDD>
##$VPLIST= <PPPPPPPPPPPPPPP>
##$VTLIST= <TTTTTTTTTTTTTTT>
##$WBST= 1024
##$WBSW= 4
##$XGAIN= (0..3)
0 0 0 0 
##$XL= 0
##$YL= 0
##$YMAX_a= 6710942
##$YMIN_a= -6902817
##$ZGOPTNS= <>
##$ZL1= 120
##$ZL2= 120
##$ZL3= 120
##$ZL4= 120
##$ABSF1= 10
##$ABSF2= 0
##$ABSG= 5
##$ABSL= 3
##$ALPHA= 0
##$AQORDER= 0
##$ASSFAC= 0
##$ASSFACI= 0
##$ASSFACX= 0
##$ASSWID= 0
##$AUNMP= <proc_1d>
##$AZFE= 0.1
##$AZFW= 0.1
##$BCFW= 1
##$BC_mod= 2
##$BYTORDP= 1
##$COROFFS= 0
##$CY= 11.3945322036743
##$DATMOD= 1
##$DC= 2
##$DFILT= <>
##$DTYPP= 0
##$F1P= 15.9154993809931
##$F2P= -4.1035820241983
##$FCOR= 0.5
##$FTSIZE= 0
##$FT_mod= 4
##$GAMMA= 1
##$GB= 0.15
##$INTBC= 1
##$INTSCL= 1
##$ISEN= 128
##$LB= 0.24
##$LEV0= 0
##$LPBIN= 0
##$MAXI= 10000
##$MC2= 0
##$MEAN= 0
##$ME_mod= 0
##$MI= 1.114404
##$NCOEF= 0
##$NC_proc= 0
##$NLEV= 6
##$NOISF1= 3.799351
##$NOISF2= 2.8
##$NSP= 1
##$NTH_PI= 0
##$NZP= 0
##$OFFSET= 15.70392
##$PC= 1
##$PHC0= -10927.34
##$PHC1= 21.80095
##$PH_mod= 1
##$PKNL= yes
##$PPARMOD= 0
##$PSCAL= 0
##$PSIGN= 0
##$REVERSE= no
##$SF= 200.130013532006
##$SI= 16384
##$SIGF1= 3
##$SIGF2= 2
##$SINO= 400
##$SIOLD= 16384
##$SREGLST= <1H.CDCl3>
##$SSB= 0
##$STSI= 0
##$STSR= 0
##$SW_p= 3612.71676300578
##$SYMM= 0
##$S_DEV= 0
##$TDeff= 0
##$TDoff= 0
##$TI= <>
##$TILT= no
##$TM1= 0
##$TM2= 0
##$TOPLEV= 0
##$USERP1= <user>
##$USERP2= <user>
##$USERP3= <user>
##$USERP4= <user>
##$USERP5= <user>
##$WDW= 1
##$XDIM= 8192
##$YMAX_p= 0
##$YMIN_p= 0
$$ End of Bruker specific parameters
$$ ---------------------------------
##NTUPLES= NMR FID
##VAR_NAME=  TIME,          FID/REAL,        FID/IMAG
##SYMBOL=    X,             R,               I
##VAR_TYPE=  INDEPENDENT,   DEPENDENT,       DEPENDENT
##VAR_FORM=  AFFN,          ASDF,            ASDF
##VAR_DIM=   8192,          8192,            8192
##UNITS=     SECONDS,       ARBITRARY UNITS, ARBITRARY UNITS
##FACTOR=    0.0002944,     1,               1
##FIRST=     0,             0,               0
##LAST=      2.4114304,     0,               0
##MIN=       0,             -6902817,        0
##MAX=       2.4114304,     6710942,         0
$$ Real data points
##PAGE= N=1
##DATA TABLE= (X++(R..R)), XYDATA
0@%%%%%%%%Kj10K16k16K16k16L24m32N40p18Q26r72J182j396J618j837K118k494
26a349K912l344L781m252M811n474O208o984P825q780R827j0944J2141j3447J4899
41G830j6497J8243k0130K2185k4433K6895k9590L2527l5762L9367m3382M7861
53B5114n2878N8551o5025P2485q1190R1479j03854J19051j38151J62819j95834
64a07433K42107l11018M22708o29015J114391l850018j714549J1458821j0007051
73c381057K919188J732414k148302K802150o621890Q997183l386691p404809J3202756
82F710942q663008j149294P219763o209083L226400l236168L386657J405338q892267
91f200720J1202298m501148n846903J0508527o683660O07136J691018j632413
$$ plain form
0 0 0 0 0 0 0 0 0 0 2 -108 108 -108 108 -108 216 -216 324 -394 432 -540 642 -754 864 -973 1145 -1349
26 -1349 1563 -1781 2000 -2252 2559 -2915 3293 -3691 4134 -4646 5181 -5763 6378 -7069 7830
41 7830 -8667 9576 -10554 11631 -12802 14093 -15497 17030 -18732 20635 -22747 25114
53 25114 -27764 30787 -34238 38247 -42943 48536 -55318 63733 -74418 88401 -107433
64 -107433 134674 -176344 246364 -382651 731740 -3118278 -4832827 6625994 -3381057
73 -3381057 -461869 1270545 -877757 1924393 -4697497 4299686 912995 -6491814 6710942
82 6710942 -1952066 -3101360 4118403 -2090680 1135720 -2100448 1286209 2691547 -6200720
91 -6200720 5001578 500430 -5346473 5162054 -1521606 -914470 776548 -855865
99h55865L599683p118674O811467K16246q854784J0769937m391810l385153O013649
108B804696m155473K680901l151266J956727L448952r014009Q161377m83504p054487
117d806086Q119764l724368l41709J254920j669483M211334o480893M005090K983506
126C552075q500946P360639j151537l932630M464148k794803K367324k524801
134a160531J34747M691024p420804M463460J984499o173608N203994j633330n89364
143d99913R97328j945864M029226m521631J141205M097378o472346L900929P30504
152A456816l246670K870562j958043J924397j379394j230820M472013m952626
160b043765J536972K861852m508721K895740n43188n61308R87380k079660L288050
$$ plain form
99 -855865 2743818 -4374856 2436611 2652857 -6201927 4568010 176200 -3208953 2804696
108 2804696 -1350777 1330124 -1821142 135585 3584537 -5429472 2731905 2248401 -4806086
117 -4806086 3313678 -410690 -752399 502521 -1166962 3044372 -3436521 568569 3552075
126 3552075 -4948871 2411768 1260231 -2672399 1791749 -1003054 1364270 -1160531
134 -1160531 -1025784 3665240 -3755564 707896 2692395 -3481213 1722781 89451 -499913
143 -499913 497415 -1448449 2580777 -1940854 -799649 3297729 -3174617 726312 1456816
152 1456816 -1789854 1080708 -877335 1047062 -332332 -1563152 2908861 -2043765
160 -2043765 -506793 2355059 -2153662 742078 198890 -362418 624962 -1454698 1833352
169A833352k545256o43829L836435m168825J594310J283230k303090J833701j439127
178g19099J330039l05935j867587L446352k644739j03073K489068k772127J431301
187B84200j24429m60743R69282j780299K078687r01838j283335K696790k131043
196f52728L13391J092973j388020J146011r65737O22456L51905j608338K023173
205I35086j007337o59202J637742j418646N89654P0235m34724Q25631j206553
214f68114J018795k3250j142330J532738q99434j18857P33404p95441O60847m99762
224b01404J12039N38236j041815R24181k00041n97619R08997o66491K22125J21101
234A19309l58339N58022o06485L17081K37634o67135O44294k43849j81726L93636
$$ plain form
169 1833352 -711904 -1355733 2480702 -1688123 -93813 1189417 -1113673 720028 -719099
178 -719099 610940 305005 -1562582 1883770 -760969 -864042 1625026 -1147101 284200
187 284200 159771 -300972 668310 -1111989 966698 64860 -1218475 1478315 -652728
196 -652728 -339337 753636 -634384 511627 -454110 168346 520251 -1088087 935086
205 935086 -72251 -731453 906289 -512357 77297 147532 -287192 538439 -668114
214 -668114 350681 327431 -814899 717839 -181595 -300452 432952 -362489 298358 -201404
224 -201404 -89365 448871 -592944 331237 131196 -466423 442574 -223917 -1792 119309
234 119309 -239030 318992 -287493 29588 267222 -399913 244381 532 -181194 212442
244B12442m04503L12506j41577j07258L59536m53338K89371M0559l00653L47052
254A54137k17272L9134J05097j91676K26482j71991J1450J73794k49140J83039
264F3054l7735r3130J49714j36420R0950j5446p2717J15838r3748L6774L7502
275D4636r3417Q5019l4568j4359N0179o4847M9287k3356j0643L9136l5710J1428
287B785m747k951J7814j1331j0951J3632r619M937K537n388K028p080M075K115
301b144N110j1761N823q586Q805P311j6125R333o148J989K352O353r716P94M60
316f150K154P911j4153J3068o854r232K3244j1999l891J5274k8125K9454o702
329C999j4042L3953n5593N1206n051m6798P5771o1288J3441L0962n5943P5021
$$ plain form
244 212442 -192061 120445 -21132 -128390 231146 -222192 67179 107738 -192915 154137
254 154137 -63135 -24001 81096 -110580 115902 -56089 -44639 129155 -119985 63054
264 63054 25319 -67811 81903 -54517 36433 20987 -51730 64108 -29640 7134 44636
275 44636 -48781 36238 1670 -12689 37490 -27357 21930 -1426 -12069 27067 -8643 2785
287 2785 -1962 -4913 12901 1570 -9381 4251 -5368 -431 2106 -3282 -1254 -8334 -4259 -2144
301 -2144 2966 -8795 -2972 -11558 -2753 4558 -11567 -2234 -8382 -6393 -4041 2312 -7404 -6610 -6150
316 -6150 -3996 3915 -10238 2830 -4024 -13256 9988 -2011 -5902 9372 -18753 10701 3999
329 3999 -10043 23910 -31683 19523 14472 -32326 43445 -17843 -4402 26560 -29383 45638
341D5638o5855Q293O6975j17358J14280m0563o5025J25887j19639P2078l610p1792
353e0691J35819j57631Q6261O5542j88579J92829r6389l5344J31726j67582J59760
364G5721j05672l1030J99607k76995J85731K3470k11467K55023j70609N4357N5072
375E3208j78547K79977k59626N9521K26603l86141K89479m5441j52807K36494
385A22720k50642K19694r7086j47617L98069m28636J64744K00035m00756L48841
395A29366j64933N250J31425l05080M25757k99652q1596M57870n29841K61573
405C0139R7939k91713L16835l01970K49704l5506l30841N96000m73977O673M27452
416B90735n13353L11717q2601o1639K20193m37619N15329k22744l25620O86546
$$ plain form
341 45638 -20217 -11924 55051 -62307 51973 11410 -53615 72272 -47367 24711 21101 -50691
353 -50691 85128 -72503 13758 79300 -109279 83550 -12839 -48183 83543 -84039 75721
364 75721 -29951 -60981 138626 -138369 47362 70832 -140635 114388 -56221 -1864 53208
375 53208 -125339 154638 -104988 -45467 181136 -205005 84474 39033 -113774 122720
385 122720 -127922 91772 -5314 -152931 245138 -183498 -18754 181281 -219475 129366
395 129366 -35567 -30317 101108 -203972 221785 -77867 -159463 298407 -231434 30139
405 30139 128078 -163635 153200 -148770 100934 65428 -265413 330587 -143390 -136717 290735
416 290735 -222618 89099 6498 -55141 165052 -272567 242762 20018 -305602 380944
426C80944n58042J01644K73034l71052L36692l29342K41676J00547n64889P29441
436C40653l63818k61621O28627n30186K18281m380j24791L47334n96869N32944
446A86174j1462o15680Q06782m30684j18258L99790l91859L51068l49433J58098
456a5464L31907p85261P19802j05108n39432P02484m13521R0631N1808j87873
466a50027M70853o65046L95617K91878q33914P46558j69079l31811M39686l47845
476a53130L41466l27548P130N68582q77139N28657K21920p15559O24655k35406
486a6372j1108R0410k81364O00798o47232J41245N96697r11608N45359Q8728m29361
497b33808L98405l25667L61532k49732k25216P70406q18965K22070N02176p44192
$$ plain form
426 380944 -177098 -75454 197580 -173472 163220 -166122 75554 176101 -388788 340653
436 340653 -23165 -284786 343841 -186345 31936 27556 -97235 250099 -346770 186174
446 186174 174712 -440968 365814 -64870 -183128 216662 -175197 175871 -173562 -15464
456 -15464 316443 -468818 250984 145876 -393556 308928 -104593 -13962 37846 -150027
466 -150027 320826 -344220 51397 343275 -490639 255919 86840 -244971 194715 -153130
476 -153130 188336 -139212 -132082 436500 -440639 88018 309938 -405621 219034 -16372
486 -16372 -27480 62930 -218434 382364 -264868 -123623 473074 -438534 106825 195553 -233808
497 -233808 164597 -161070 200462 -49270 -274486 495920 -323045 -100975 401201 -342991
507c42991M59820r8703m3492J31762m01558O67436m98247j65570P87725q01850
517c05668K51600K91579m29883L18544k97632L34471j02633m43915Q32769o01266
527a52034j03911O47261o23657K52008N777n9558J86332m86360O21158k45763
537D1253m38901Q23280n69303j2804L73245l60017K67644l01464K68125R3541
547A84599o05169P53299l07876l49287O45575m46354J16218K8903q3407K84473
557B20974n40909M84114K4157n97056P12318l06014j79353L54457k77530K38033
567A33191k79523J45069K72561o47189N60049l0213m66039N33158k61120K0609
577a9447L9519j12836L33639m90126K76591K38555o10546N05186p6552k52085
$$ plain form
507 -342991 116829 18126 -25366 106396 -295162 372274 -125973 -291543 496182 -305668
517 -305668 -54068 237511 -192372 126172 -171460 163011 60378 -383537 449232 -152034
527 -152034 -255945 391316 -232341 19667 25444 -34114 152218 -334142 287016 41253
537 41253 -397648 425632 -143671 -156475 216770 -143247 124397 -177067 91058 184599
547 184599 -420570 332729 24853 -324434 321141 -125213 -8995 19908 -63499 220974
557 220974 -319935 164179 188336 -408720 303598 -2416 -181769 172688 -104842 133191
567 133191 -146332 -1263 271298 -375891 184158 153945 -312094 221064 -40056 -19447
577 -19447 20072 -92764 240875 -249251 27340 265895 -344651 160535 83983 -168102
587a68102K86265k10640K22139k22401r54L84261n72252L21005J66132m57595
597b52142L76307j34875n635N0701j74474L67099l83378P0592L58844n23145L01253
608E1147N4035k37404K19334j83794K03025j31334j32177M15460m26336J12478
618e5566K56685l78614K38513n9128j7365P2701k05763L24754k32323q0803L65269
629B28360l69658J24561J19556j92826J61208j50652J47005l1071j98276L52019
639A90226k53845k9292K52483k60846J30331k0473k9172R7812k05006K35028q7302
650A9944j57569K96976k22773K7368J14652j43225J27996j25358Q5678M4869k03485
661a34927K45152j12062q9531J96499j63479P1462m394m2825J07896j67613J37764
$$ plain form
587 -168102 118163 -92477 129662 -92739 -93693 290568 -281684 39321 205453 -252142
597 -252142 124165 -10710 -16345 34356 -140118 226981 -156397 -85805 273039 -250106 51147
608 51147 105182 -132222 87112 -96682 106343 -24991 -157168 258292 -168044 -55566
618 -55566 201119 -177495 61018 1890 -15475 57226 -148537 176217 -56106 -136909 228360
629 228360 -141298 -16737 102819 -90007 71201 -79451 67554 36483 -161793 190226
639 190226 -63619 -92911 159572 -101274 29057 8584 -20588 77224 -127782 107246 19944
650 19944 -137625 159351 -63422 -36054 78598 -64627 63369 -61989 23689 68558 -134927
661 -134927 110225 -1837 -91368 105131 -58348 13114 8720 -34105 73791 -93822 43942
672D3942K097j56930J98696j10026j7434Q9796r8823R0391p7047K2535P6605j54560
684i0758J36096k4944q9468J27043q9551L3373Q597m6436Q7592j00419N2250M1064
696D4439j10081J04457l7986k9642O2412o5094N6909l3790j2110O6966q8946N5858
708A3392J0435n9888O7412m1713R858J6504l8605N3139m3809P105L7263n9122
720b8029M5982r923k0277L3370l4229K3587o262j6157L4043l4420J2358J4615
732A4658k9082K6116j3009k187J3009j9963K0050j0945m558J5218j8337J1143
744B113M95j0203J1601q633K766L173p440Q472o133J39M872o563M814j508k063
759d098L629k075O20L65j899K548j468O26J177j958K105n38o92Q46K19p44J760
$$ plain form
672 43942 46039 -110891 87805 -22221 -39655 50141 -48682 41709 -35338 -12803 63802 -90758
684 -90758 45338 20394 -69074 57969 -31582 1791 10388 -36048 51544 -48875 3375 44439
696 44439 -65642 38815 829 -28813 33599 -31495 25414 -8376 -20486 46480 -42466 13392
708 13392 23827 -36061 31351 -10362 -504 16000 -22605 30534 -13275 -6170 31093 -28029
720 -28029 17953 8030 -12247 21123 -13106 10481 4219 -11938 22105 -12315 43 14658
732 14658 -14424 11692 -1317 -3504 9505 -10458 9592 -1353 -5911 9307 -9030 2113
744 2113 2608 -7595 4006 -4627 -1861 1312 -6128 2344 -3789 -3650 1222 -5341 -527 -2035 -4098
759 -4098 -469 -2544 -1924 -1559 -3458 -910 -2378 -1752 -575 -2533 -428 -966 -1658 -812 -593 -1337 423
776D23j69o07N36J003q58M53J497j804O65P04n87J043k059L041l42k417K675k922
794B75J706J273l215N201n010P53N642r293P850l556l776Q851r784O549r67p355
810d856J2661j3032O099O591j8099J8572j1593r59J2024j7808J8242j1945l797
823g900K0944k8229J9152J520k1733K7647k1189Q938N919k3154L6125l1220N979
836g201K5773m3415L4391q387j5657L0180l3252K9367j1954k1631N1560n3286
848b3512K2313K1140m6072M4587k6765O522J7725m3355N7863l9400j0914N9889
860D0021p0155L9082N959l5582M7285n0526M1129n186m8065Q4431o8549O509N2367
873C8720p2056N4285k3877m093L6892p2678Q0859l4797m3374R3928q4378K9144
$$ plain form
776 423 254 -353 183 1186 328 781 2278 474 1139 1843 1256 2299 240 3281 2939 522 3197 275
794 275 1981 3254 39 5240 230 983 6625 -2668 5182 1626 -2150 6701 -3083 3466 2499 -4856
810 -4856 7805 -5227 872 7463 -10636 7936 -3657 -4616 7408 -10400 7842 -4103 -7900
823 -7900 13044 -15185 3967 5487 -16246 11401 -9788 -850 5069 -18085 18040 -13180 -7201
836 -7201 18572 -24843 9548 1161 -14496 15684 -17568 11799 -155 -21786 29774 -23512
848 -23512 -1199 19941 -26131 18456 -8309 -1787 15938 -27417 30446 -8954 -19868 40021
860 40021 -30134 8948 14907 -20675 26610 -23916 17213 12027 -36038 48393 -20156 -13647 38720
873 38720 -33336 20949 -2928 -7021 29871 -42807 38052 3255 -40119 53809 -30569 -1425
885a425K4639n1321O0147o1968M2074J2695q1434J07967o1626k4673Q2105q3517
897c6337N1105j8829j3228N6774r4831Q4843j1236p7659J14118p6341N782M3523
909B7684o1939O8109o5569L0586M3498j11229J12238l6617n4303R5547p9374M1752
921A0383r547k6838P7434j06189P0126K3687j05290J15708n6985j3259N2565o7383
933c5588P5598o3983J1049P0584j21095R3536m148p4997R3489o6597L1866J222
945A0936m4045Q9093r7712M0580N2013j09327R4161l1426k7021N5424o5666O7164
957C4174m3623j8342Q4778j04995N7335K1098p4231P7383n1380J9356J5328n5226
969c8345Q2000o8053P999O1279r2515O4987j1186l0329N4908o2610M9852j5868
$$ plain form
885 -1425 23214 -28107 32040 -29928 12146 24841 -56593 51374 -10252 -34925 47180 -36337
897 -36337 14768 -4061 -17289 39485 -55346 29497 18261 -59398 54720 -21621 -15839 27684
909 27684 -34255 33854 -31715 -1129 42369 -68860 43378 6761 -47542 48005 -31369 10383
921 10383 836 -26002 51432 -54757 15369 39056 -66234 49474 -7511 -20770 31795 -35588
933 -35588 40010 -23973 -12924 57660 -63435 30101 25953 -49044 44445 -22152 9714 10936
945 10936 -33109 55984 -41728 -1148 50865 -58462 35699 4273 -22748 32676 -32990 34174
957 34174 -9449 -27791 56987 -48008 9327 30425 -43806 33577 -17803 1553 16881 -38345
969 -38345 43655 -24398 -16399 44880 -47635 17352 6166 -24163 30745 -31865 17987 2119
981B119l6114P7264p4261K9002K8612o3058O2428l7921L860K9734n5345O1076
993B7396l5685j2101N3507o4534M2917k947l1927M9632m6240K4894Q333l7001
1005b3756N0444m0723J0838K3382m5630M5853k1487j1178L4249l7803K7802r924
1017B067j0968K9516l7712K6849K503l1876L8692k3512M99J3435j7558J9937k0917
1030i045J1768J0386l3108L0476m074j9853K2554q473Q2n611N547Q905k4649K1055
1044E960M527k6953K0028K176j2902J548J0163j369j7718J9348K347k2034J6134
1057A255O914j6618L16J7338r468j4885K3422k850j9571J6459M758j3762j188
1070g880J8947q844j9155K8749o287k1626K3568j253j2423K225J2352l454k1595
$$ plain form
981 2119 -33995 43269 -30992 -1990 26622 -36436 25992 -11929 -8069 21665 -33680 27396
993 27396 -8289 -20390 33117 -31417 11500 8553 -23374 26258 -19982 4912 13245 -23756
1005 -23756 26688 -14035 -3197 20185 -25445 20408 -1079 -12257 21992 -15811 11991 2067
1017 2067 -8901 20615 -17097 9752 12255 -19621 19071 -4441 -3942 9493 -8065 11872 -9045
1030 -9045 2723 13109 -19999 10477 6403 -13450 9104 631 713 -4898 649 9554 -15095 5960
1044 5960 10487 -16466 3562 5738 -7164 -5616 4547 3178 -14540 4808 7155 -14879 1255
1057 1255 8169 -8449 -8133 9205 -263 -15148 8274 5424 -14147 2312 7070 -6692 -7880
1070 -7880 11067 2223 -16932 11817 5530 -16096 7472 6219 -6204 -3979 8373 4919 -16676
1083a6676K9349k163k9995L1886n143j7214J2752K631Pj7965K0810O139l6595
1096b2177L3188M06k9126K6019m050l537n544N004J5458l5153K5273J1519l8596
1109b1316L0334j924j5011J0417n449J4144k3395R383K1379l9817K4434Q599k7352
1122a5574K0686o233K452m575n348K6072l3735J2170K0647l4994K1772J314j2630
1135g976J0705j1179J8213j6255l915K9332l4741J3849J2893k3483J7859q004
1147b702M456M78j3450K5334k1387m38K4611k8261J3876K648j0421J1714j1851
1160e393J3432o957j1544K5183k0879L105J3782j6701J0817n475J107N689j4695
1173h529J7745r256n661J6942j6873P291K673o810P869r329O892O49j1207J5188
$$ plain form
1083 -16676 12673 10510 -19485 12401 7258 -9956 2796 5427 5434 -12531 8279 14418 -22177
1096 -22177 11011 11417 -17709 8310 4260 723 -4821 183 15641 -19512 5761 17280 -21316
1109 -21316 9018 7094 -7917 2500 -2949 11195 -12200 -2817 18562 -21255 3179 11778 -15574
1122 -15574 5112 -1121 1331 -3244 -8592 17480 -16255 -4085 16562 -18432 3340 4654 -7976
1135 -7976 2729 -8450 9763 -6492 -10407 18925 -15816 -1967 10926 -12557 5302 -2702
1147 -2702 1754 2232 -11218 14116 -7271 -7709 16902 -11359 2517 5165 -5256 6458 -5393
1160 -5393 8039 1082 -10462 14721 -6158 -3053 10729 -5972 4845 -630 477 6166 -8529
1173 -8529 9216 -40 -5701 11241 -5632 1659 4332 -2478 5391 -3938 2954 3603 -7604 7584
1187G584r682j178R374j1996Q357l264j790O496r633P914j602o570J0063q138
1201d065K478K725o050O522n068K446K096o508O997l184j464N951n363K631n77
1216d33k388L800l407K864L14l289M164k849Q54J896k878K306j144j59K033j639
1232D5K000n22j702J805j277J140j46j388J987j479O20N97j107J072p05K77M11
1249A628k128K410n84q43J400k496J580k57o34J525k329J283M09k635K263j291
1265f99M57J224k710K851k348l90K462m065L449j784j438M383m533K859p24j734
1281b740M532m917J779J869m341N384m228J295K182m898O594m441o13O267p926
1296d202N222l50l926O831p592O077k63o473J0848q848K105N865r496Q951n547
$$ plain form
1187 7584 -2098 -3276 6098 -5898 2459 -805 -2595 3901 -5732 2182 580 -5990 4073 -4065
1201 -4065 -1587 1138 -4912 1610 -3458 -1012 1084 -5424 1573 -1611 -3075 2876 -2487 144 -433
1216 -433 -2821 979 -2428 436 750 -2539 1625 -1224 -370 1526 -1352 954 -190 -349 1684 45
1232 45 2045 1523 -179 1626 349 1489 1343 -45 1942 463 1083 1680 573 1645 940 1217 1628
1249 1628 -500 1910 1326 483 1883 -613 967 710 76 1601 -728 555 964 -1671 592 -699
1265 -699 -242 982 -1728 1123 -1225 -1615 847 -3218 231 -1553 -2991 1392 -3141 -282 -1006 -2740
1281 -2740 1792 -3125 -1346 523 -3818 1566 -2662 -1367 815 -4083 2511 -1930 -2543 3724 -4202
1296 -4202 1020 670 -3256 3575 -4017 2060 1797 -4676 6172 -2676 -571 5294 -4202 4749 -798
1311g98P92N812j1629J2044n396n229J2432j2672P094R02p328J1242j1900P387
1325B753K042j2845J6850j1685m98J1371j4274J0974n754j599J0305j7078J5559
1338F121m182j1617K0759j6945N522M867j1848J4689j4417P935O227k0140K2271
1351I242j1052n851J6186j7555J3177n944m172J5280k2568J8106m99j8119K4997
1364A1228j7078K724Q768j4786J7915j6908P154J1497k6083K5278q767j0871K1439
1377A1510j9403J2061l533o452J8996k5207J7236L217k2565K7481j5424j366J1831
1390H382j5847J7757j5598M497J3987k8240K4600n246j5117K3542j8290Q895j871
1403A451o996J8429k5001J6444N414k5315K7335j3047l367J1830j4788J5815j5385
$$ plain form
1311 -798 -6 5806 -5823 6221 825 -4404 8028 -4644 2450 3352 -3976 7266 -4634 2753
1325 2753 4795 -8050 8800 -2885 -3383 7988 -6286 4688 -1066 -2665 7640 -9438 6121
1338 6121 1939 -9678 11081 -5864 -342 4525 -7323 7366 -7051 884 7111 -13029 9242
1351 9242 -1810 -7661 8525 -9030 4147 -1797 -5969 9311 -13257 4849 4350 -13769 11228
1364 11228 -5850 -3126 5642 -9144 8771 -8137 -983 10514 -15569 9709 942 -9929 11510
1377 11510 -7893 4168 635 -5817 13179 -12028 5208 8425 -14140 13341 -2083 -3449 8382
1390 8382 -7465 10292 -5306 -809 13178 -15062 9538 4292 -10825 12717 -5573 3322 1451
1403 1451 -5545 12884 -12117 4327 9741 -15574 11761 -1286 -4653 7177 -7611 8204 -7181
1416g181N998J3154k8333K3570l181j6922K1889j4840P238k452m114J6165k5065
1429a4074J6754O170k4856K4826r419n002Q554q165J2603j7230Q344J3133k8655
1442a7017K3164j37j7554J7214q038N344p140J356J4868k6137J8726N798k3965
1455a3518K0434m727n134M608l851J2943k0313J1456J1893k8219K0213J479j4681
1468g417J1443m921Q187j3277M513J7107k8908J6701P705k0984J3786k698k33
1481A004k272l090J6530k3241J0310J4625k6564J6533M42j0028N595m121J3114
1494H837j7481M806J7761k8061J4825P771j7481J0799l623M545o804k189J8651
1507A2356k3230O932J4734k1180J1512P05k426p58n881J7476j4948k465K0985
$$ plain form
1416 -7181 -1183 11971 -16362 7208 4027 -12895 8994 -5846 1392 -1060 -5174 10991 -14074
1429 -14074 2680 8850 -16006 8820 -599 -5601 2953 -5212 7391 -9839 -1495 11638 -17017
1442 -17017 6147 6010 -11544 5670 -2368 2976 -4164 -2808 12060 -14077 4649 10447 -13518
1455 -13518 6916 2189 -2945 1663 -2188 10755 -9558 1898 13791 -14428 5785 7264 -7417
1468 -7417 4026 -895 7292 -5985 -1472 15635 -13273 3428 11133 -9851 3935 1237 1004
1481 1004 -1268 -4358 12172 -11069 -759 13866 -12698 3835 4277 -5751 -156 -4277 8837
1494 8837 -8644 -3838 13923 -14138 687 8458 -9023 1776 -1847 2698 -4106 -6295 12356
1507 12356 -10874 -3942 10792 -10388 1124 1829 -597 -1355 -7236 10240 -4708 -7173 13812
1520A3812k3693Q746Q182j2129P062o258R465o328p284K2492k0808L095J4279
1533A0633j7987J0635l997J686L179j1761J7305j1458n564J9565j7747N207M639
1546D335q001Q523r935R017p85j0381J7138j1352j331J0060j1664O837l771P00
1560f10N623j2871J2716m432p294J4382j1875M061J827m889Q708r003L383L336
1574C062r724J1432o269j431O014p289O493m730j384Q629r761O393q66n157Q354
1589C766p070M619L13o485Q715o374J356L934n688L723j455p61M261o165M745
1604A434P82l417N542m252J55P38k157L251m383L648P04m451M699k105k82K624
1620B530l949K165o96k88K362k982K566p75j125J372o48j129K09R06M02j786J527
$$ plain form
1520 13812 -9881 -1135 7047 -5082 1980 -4278 5187 -1141 -8425 14067 -6741 -3646 10633
1533 10633 -7354 3281 -716 970 4149 -7612 9693 -1765 -7329 12236 -5511 -304 4335
1546 4335 -3666 4857 -5078 3939 3154 -7227 9911 -1441 -2772 7288 -4376 2461 -1310 -610
1560 -610 5013 -7858 4858 426 -6868 7514 -4361 -300 1527 -3362 5346 -3657 -274 3062
1574 3062 -6662 4770 -1499 -2930 3084 -4205 2288 -2442 -3826 4803 -4958 1435 569 -4588 3766
1589 3766 -3304 1315 1628 -4857 3858 -2516 -1160 2774 -2914 809 -646 -1407 2854 -3311 1434
1604 1434 2216 -1201 4341 89 244 982 -1175 2076 -2307 1341 2045 -2406 2293 188 -94 2530
1620 2530 -1419 746 50 -238 2124 -858 1708 933 -192 1180 532 -597 -388 518 920 -866 661
1637F61O55k522P46J397k197L38N17P51j248J346n03j806K86J006p74n61K772
1654H64j115j281J563J18j704J118o4j56r51J378q74j131K843q41p20Q50j89N05
1672B13o77o25Q3m85K217R6j343P5J88O58P90R6l29o42p71J676o77J04M06r81
1692G2J324j528R29p27N36J522j468K40l11o91j00J097L08O87k645J810r37l53
1710b35Q6j310R23N59m89J273l193J502J378k037J346p52k18K288j791k67N10
1727d27pR2p45J068q31n00J453j437M53l20L29J45r38J412J091k442K639k096
1745a061R85L8j453L498k750K2K721k483K427j167p06K339k765K298q21k025M327
1762C424l658m9K499k438K525k311M92K392p134Q915l171m483P660o364J652P57
$$ plain form
1637 661 1316 -1206 -460 937 -1260 -922 -405 346 -902 444 -59 -1865 -1579 -573 -1347 -1908 864
1654 864 -251 -1532 31 149 -1555 -437 -501 -657 -1608 -230 -1104 -2235 608 -233 -953 -103 -292 213
1672 213 -464 -1089 -1006 -1491 726 822 -521 -446 -258 400 1190 1286 957 315 -456 1220 543 647 1053 72
1692 72 1396 -132 797 70 606 2128 660 900 589 -102 -202 895 1203 1890 -755 1055 118 -235
1710 -235 -149 -1459 -536 23 -466 807 -2386 -884 494 -1543 -197 -949 -1167 1121 -670 -937 -427
1727 -427 -434 -342 -1087 -19 -850 -1350 103 -1334 -881 -1201 -872 -727 -1665 -253 838 -1604 1035 -1061
1745 -1061 -76 -38 -1491 2007 -743 -721 2000 -483 1944 777 71 2410 -355 1943 1122 -903 3424
1762 3424 -234 -283 2216 -222 2303 -8 484 2876 -4258 4657 1486 -2997 4663 -1701 -49 708
1778G08j280N362p410M507K250j0581J1169m954l968Q625p170M949m505R13P192
1793E807j3430J0669J074j1976J3177p175j06K888n761J1211j4218P707R537k2412
1807a3008J7586j391j1869J4063r736Q332p741j250J8037k6409J4270J0213k5728
1820a4631K1806o794l370O467j1842K1985k3288K202K7640l6662J9910P459k1402
1833a0520J7160j1854J3697r153j3204L7784l9135R823K6928l9589K3567j712
1845C792n694P408k0911L7213k8486j0698M8474m9540J3930K0948k9560K1367
1857H243j9095K2602q335k9539N8366m2821r621N1123m8313J6533M805p054J3327
1870A0221l7596N2603k2069l8194P2669n1290k492L6162l2231K1341k4708K4218
$$ plain form
1778 708 -572 4790 -2620 1887 4137 -6444 4725 -229 -4197 4428 -2742 2207 -2298 -1385 5807
1793 5807 -7623 3046 4120 -7856 5321 -1854 -1960 928 -4833 6378 -7840 -133 9404 -13008
1807 -13008 4578 3187 -8682 5381 -4355 3977 -3764 -5014 13023 -13386 884 11097 -14631
1820 -14631 7175 381 -2989 3478 -8364 13621 -9667 -7465 20175 -16487 3423 10882 -10520
1833 -10520 6640 -5214 8483 -670 -13874 23910 -15225 -5402 21526 -18063 5504 3792
1845 3792 -1902 5506 -15405 21808 -6678 -17376 31098 -18442 -4512 16436 -13124 8243
1857 8243 -10852 11750 3415 -26124 32242 -10579 -20200 30923 -17390 -857 3948 -3106 10221
1870 10221 -27375 25228 3159 -35035 37634 -13656 -16148 20014 -12217 9124 -15584 8634
1882H634Q295n9289P5141l0918l7502O9790m6173O222Q852q076K6836n8729N6509
1895A9592O0o9748Q7721l7826k5545M6888l2650K5996l3687K1827L0583q4201
1907e0990P8269o715o4324P5566l5468j169O328j2029M5402p5211M8355L2722
1919D0736r6734Q2683j1449m3069M6724k9470L1601l9690O715O2659j01753N9691
1931H644K9909q5858O8224j9285m092N650k5100O6217p8204J9444P0153j07515
1943e1813O1277J5026n2597M2984l2308M1294l4253j9640Q8577r9420K8681N9360
1955D7168q8853N3717r739l484R810m2674P8820o3504j4916R3274r6577L1177
1967e781L4071m9281L5020l5912M4071j6844n0856J00656p5819q052P5022p3022
$$ plain form
1882 8634 16929 -42360 32781 1863 -35639 34151 -12022 -5800 3052 -5024 21812 -36917 19592
1895 19592 19652 -50096 37625 -201 -25746 21142 -11508 14488 -19199 2628 33211 -50990
1907 -50990 27279 20564 -43760 31806 -3662 -4831 1497 -10532 34870 -40341 8014 40736
1919 40736 -55998 26685 15236 -27833 18891 -10579 21022 -18668 -11953 50706 -51047 8644
1931 8644 38553 -47305 20919 1634 -2458 3192 -21908 44309 -33895 -14451 55702 -51813
1943 -51813 9464 24490 -28107 14877 -17431 23863 -10390 -30030 58547 -40873 -12192 47168
1955 47168 -41685 12032 2293 -1191 8619 -34055 44765 -18739 -33655 59619 -36958 -5781
1967 -5781 28290 -20991 14029 -21883 22188 5344 -45512 55144 -20675 -28727 46295 -26727
1979b6727L0553j066n717K2181o0316P8027l2232n0419R7793p0280K295M1654
1991B5746m2247L3233l8317L4158J0124p3148R2210m1462l5997P3968n5301J8484
2003A451n94p944L3155o5402O1021k759o7465Q6469m1497j5552L9074l5912L3917
2016A7962l7682J8996L1545p7423O9735q362n0471O2637l7405J0530K505j7111
2028a4544M3074n7166L1056K5609o7787O0650j5642k2946L2099k8643K9087k5176
2040a0329r54M4675o5929L7318J6096m9053M5998k3200L163R154k4837M3014m0637
2053a5521P025L6845n5269L5926J099k4578K6975k4683K3578j2206j5798M4875
2065B8268m5000J3250K4021m1473L1164j2362N63J1021k5057L3107k2307q941
$$ plain form
1979 -26727 3826 2760 -2957 19224 -41092 36935 4703 -45716 52077 -18203 -15908 25746
1991 25746 -16501 16732 -21585 12573 22697 -50451 41759 297 -35700 38268 -17033 1451
2003 1451 857 -7087 26068 -39334 21687 18928 -48537 37932 -3565 -19117 19957 -15955 17962
2016 17962 -19720 -724 30821 -46602 23133 14771 -35700 26937 -10468 62 2567 -14544
2028 -14544 28530 -28636 2420 28029 -39758 20892 5250 -17696 14403 -14240 14847 -10329
2040 -10329 -11283 33392 -32537 4781 20877 -28176 17822 -5378 -2215 6939 -17898 25116 -15521
2053 -15521 -8496 28349 -26920 9006 10105 -14473 12502 -12181 11397 -809 -16607 28268
2065 28268 -16732 -3482 20539 -20934 10230 -2132 -1569 9452 -15605 17502 -4805 -13746
2077a3746L5979l8343J6821Q994k0162K0253j9253J3872R44k2415L4039k3423
2089f440j133K1987k6334J5608l245m739J3934k2218K0462n897j4541K5744k0140
2102f952M471R296j4588J3672j1809M454Q906j8463J8646q384q099J8464j4674
2115e060N758Q85n589J0663j4294R803K087j3477J5876p840j086O691q932R102
2129D587o074m72Q685j2417Q383r78o147R380o870K040L851p309P453n457J544
2144A99M106q154O295k092k376N488n272L441j212k154M531m843K320K287n647
2159c083M923k257o61K419l384L230j956n90L558m277K989o29k523L431k547R00
2175d57M44k316L110k086L08K066l094K850j171j085K007k175J563qj536L034
$$ plain form
2077 -13746 22233 -16110 711 9705 -10457 9796 -9457 4415 5359 -17056 16983 -6440
2089 -6440 -7573 14414 -11920 3688 443 -4296 9638 -12580 7882 1985 -12556 13188 -6952
2102 -6952 -2481 6815 -7773 5899 -5910 -1456 7450 -11013 7633 -751 -8850 9614 -5060
2115 -5060 698 1583 -4006 6657 -7637 2166 4253 -9224 6652 -1188 -2274 4417 -4515 4587
2129 4587 -1487 -1959 6726 -5691 2692 1714 -4433 4947 -1923 117 3968 -3341 4112 -1345 199
2144 199 4305 -3849 2446 354 -2022 3466 -1806 1635 423 -1731 2800 -2043 277 2564 -3083
2159 -3083 1840 -417 -1078 1341 -2043 1187 -769 -1359 2199 -2078 911 282 -2241 1190 -1357 -457
2175 -457 -13 -2329 781 -1305 -997 1069 -2025 825 -346 -1431 576 -1599 -36 -44 -1580 1454
2191A454k797J218O56k334K495r69N22J445k614K015m46l64J115k656J919J21
2207G80j955L832l887K687k21k727M358l940K081K12k777M121l331K25L015m309
2223a836L657j922n52L996o710N083m84l581N644n449K825R51m347N165n134K731
2239C7K282p530R269n095j244N259o815O279l692j562O878r434P263L74p932J0337
2255D674p470J781L773p225R416q741J999Q327j4437J0830j656o400R693r335
2269d771P302j991n786J4460j6419P535P032j6653J5916p445k66N508j1761J5682
2283H343j1134k256J7546k2438J2633L350j3139J4263j2601R480j794j2030K3496
2296A3719k0858L394J6616k3331J5690m115m069R968j8359K1198j0380j1164K8412
$$ plain form
2191 1454 -1343 -125 531 -1803 692 -277 245 1690 -924 1091 645 281 1396 -1260 659 780
2207 780 -1175 2657 -1230 1457 1236 -1491 2867 -1073 1008 1220 -1557 2564 -767 -542 2473 -1836
2223 -1836 1821 -101 -653 3343 -3367 1716 1232 -2349 3295 -2154 671 1622 -2725 2440 -2694 37
2239 37 2319 -5211 4058 -1037 -2281 2978 -3837 2442 -1250 -2812 4066 -5368 1895 2269 -5663 4674
2255 4674 -2796 -1015 2758 -4467 4949 -3792 -1793 6534 -7903 2927 1271 -5129 4564 -4771
2269 -4771 2531 540 -5246 9214 -7205 330 7362 -9291 6625 -820 -1086 4422 -7339 8343
2283 8343 -2791 -5047 12499 -9939 2694 6044 -7095 7168 -5433 4047 2253 -9777 13719
2296 13719 -7139 -3745 12871 -10460 5230 1115 -2954 7014 -11345 9853 -527 -11691 16721
2309A6721k6666P758J1350j8836J7378j4182Q865M075k2446L1811j9954p632K8427
2322A6669k7851J2920N65p460J5171k4924K4451m847k3941L8184k5464r51J9461
2335A1983k2097J8484j6586Q774J1939l5034L8468j2957k1387L6688k6439Q053
2347a11L218r836K1896l2934K4725O649l8579M3494j8360j1970K5113k2696J8807
2360I416j6828M193K3717m5611L6451J121l5318M0088k0963J749O393j4286K9335
2373A9457l7104J7995K2289n0461M0794n807k1763K6649k1351K0474j7436l768
2385a0032L6823n1825K8033J7095m4590L6547j3294q42O396j8628L6767l7360
2397a4910N533L7989n5020L1665O776k7217K4912k0039K1770j4603j5271M8499
$$ plain form
2309 16721 -9945 -2187 9163 -9673 7705 -6477 2388 6463 -15983 15828 -4126 -11758 16669
2322 16669 -11182 1738 2303 -5157 10014 -14910 9541 4694 -19247 18937 -6527 -7478 11983
2335 11983 -10114 8370 -8216 558 12497 -22537 15931 2974 -18413 18275 -8164 -111
2347 -111 3107 -6729 15167 -17767 6958 13607 -24972 18522 162 -11808 13305 -9391 9416
2360 9416 -7412 -3219 20498 -25113 11338 12459 -22859 17229 -3734 -1985 4408 -9878 19457
2373 19457 -17647 348 22637 -27824 12970 7163 -14600 12049 -9302 11172 -6264 -10032
2385 -10032 26791 -25034 2999 20094 -24496 12051 -1243 -2085 4311 -14317 22450 -14910
2397 -14910 -9377 28612 -26408 5257 12033 -15184 9728 -10311 11459 -3144 -18415 30084
2409C0084m9855J2144L1741m6456K9858p688k865J0627k5752M1347l0557j1634
2421a9006N0402n1058J6552J8213k7746K1878k0212K1954o602k8730N3650l9304
2433a0009m729M0566m2190K0509k799l461J3261l2163M0861j8904k6586N4585
2445B8941m0108K958K2089k3954K0331k3109K0077M811m0132N2224k5201j9015
2457b0088M2720l3010J1634J47n739J9358l7499L5730l185l7779N0310k5798q480
2470a1679K3240k0767J9813k1838J1552J6975m4290M1123p391k7989L7391k2739
2482f599O916R64r302K4445l5935K3532J2212m0589L9077j2862j2524J9600j6819
2495g884J8056j8100K288K6187m1714K7348N137k8295K8921j4870L655J743j1030
$$ plain form
2409 30084 -19771 -7627 24114 -22342 7516 -172 -3037 7590 -18162 23185 -7372 -19006
2421 -19006 31396 -19662 -3110 15103 -12643 9235 -10977 10977 4375 -24355 29295 -10009
2433 -10009 -14738 25828 -16362 4147 1348 -2113 11148 -21015 19846 942 -25644 28941
2445 28941 -11167 -8209 13880 -10074 10257 -12852 7225 12036 -28096 24128 -1073 -20088
2457 -20088 22632 -10378 1256 1403 -4336 15022 -22477 13253 10068 -27711 22599 -3199 -11679
2470 -11679 11561 -9206 10607 -11231 321 17296 -26994 14129 6738 -21251 16140 -6599
2482 -6599 317 1281 -8021 16424 -19511 4021 16233 -24356 14721 1859 -10665 8935 -7884
2495 -7884 10172 -7928 -5640 20547 -21167 6181 11318 -16977 11944 -2926 729 2472 -8558
2508h558K5217l0608J1727K0043l5510K5497k738j3903J7101j6876J6930j1625
2520c303m885K5911l0943J4346J1373k6020K1507q806K95N613j5146K3679j9289
2533e668n72K1769k8211J5072K913j2367J3767j4740J3929m775j0687K3736k1704
2546g538L492J2728j8828J4507n921j044Q240j4668J7142r780o511J7987j7092
2559g286P601L812q808R714j0871P054K329j3031J8174j1622q26J0639j2757P888
2573B010j389k271O404j0662R907j847r594J4699j0317J866N752r367R225o891
2587b475K336M584r948R965m068m222R179q734M453l9l481O799p636M808N55p012
2603d936Q674m589o87L984m204L831k238j425M558o280M660k90l987N528l443
$$ plain form
2508 -8558 16659 -13949 -2222 17821 -17689 7808 5070 -8833 8268 -8608 8322 -3303
2520 -3303 -8188 17723 -13220 1126 12499 -13521 7986 -820 -525 5088 -10058 13621 -5668
2533 -5668 -6240 15529 -12682 2390 5303 -7064 6703 -8037 5892 1117 -9570 14166 -7538
2546 -7538 -4046 8682 -10146 4361 -1560 -2604 5636 -9032 8110 -1670 -8181 9806 -7286
2559 -7286 315 4127 -4681 5033 -5838 1216 3545 -9486 8688 -2934 -3760 6879 -5878 2010
2573 2010 621 -1650 4754 -5908 3999 2152 -7442 7257 -3060 -1194 4558 -4809 4416 -2475
2587 -2475 -139 4445 -5503 4462 394 -3828 5351 -3383 1070 1031 -2450 4349 -3287 1521 2076 -4936
2603 -4936 3738 -851 -1538 2446 -1758 2073 -165 -1590 2968 -3312 1348 1058 -2929 2599 -844
2618h44R08J517l583M217l796N34L113n141M683k067j512L707l810K603m68k077
2634b016L285l142K207O31k856L406k776N10J377k443L093j513o77J808k503K888
2650A279r47r91J891k063Q66k44q34K141j965N20J674j948J886j863J134O55k622
2667a431K809o11j518K831k455J062o63j298L546l374R12J612k698K064n89j94
2683EO91j963L017k401j140L214l140K466m32k147L061k222J462j95j991L191
2699A476k503L6J755l322L690j830m54K498l817L581j279j958M526m453K801J0
2715G57l193M138m577L453N18m295M818k608l63L650n118N614l628r17N647q679
2731d783P210j061m631O836n784K359J620n694P470o103J218M504q050P708k463
$$ plain form
2618 -844 64 1581 -2002 2215 -1581 -1047 2066 -3075 1608 -459 -1971 1736 -2074 529 61 -2016
2634 -2016 1269 -1873 334 965 -1891 1515 -1261 -751 626 -1817 1276 -237 -914 894 -1609 1279
2650 1279 332 -659 1232 -831 35 -209 -1043 1098 -867 -347 1327 -621 1265 -598 536 1191 -1431
2667 -1431 1378 767 -751 2080 -375 687 24 -1274 2272 -1102 -190 1422 -1276 788 199 5
2683 5 696 -1267 1750 -651 -1791 1423 -1717 749 317 -1830 1231 -991 471 276 -1715 1476
2699 1476 -1027 -991 764 -2558 1132 -698 -1152 1346 -2471 1110 -169 -2127 2399 -2054 747 757
2715 757 -2436 1702 -2875 578 1096 -3199 1619 -989 -1352 2298 -2820 2794 -834 -1751 3896 -4783
2731 -4783 2427 1366 -3265 3571 -2213 146 1766 -3928 3542 -2561 -1343 3161 -4889 2819 356
2746C56l318P251p940P049k925m179Q937r164N839J166q387R943p255K539L256
2761C168q646J0670o992J16O731j0504Q376k647l587P777r749P616r70o875J2043
2776F527j0684K868N161j0115J0095o344Q35O808j1785J1540n261m697J1517j1919
2790e454O977No293J1102j1493O266K578j0411J3895r963J31Q650j2204J0677
2804D463n636k115J0286j3898R695n79q219J3656j1751M418K771r377J3720j1167
2818c733L004P434j4710J2959n142l760J0076j1938J0380m392o432J4003j3374
2831e625P423L184j1053J0960q640L568M442j1894J4262q253j859J1023j3252
2844e714P271j000l507R077j2891R747m9r471J3990j1353L066N157j0979R925
$$ plain form
2746 356 -2962 4289 -3651 3398 473 -3706 5231 -3933 1906 3072 -5315 4628 -2627 -88 3168
2761 3168 -5478 5192 -1800 -1684 5047 -5457 2919 272 -3315 4462 -5287 2329 1359 -5516 6527
2776 6527 -4157 -1289 3872 -6243 3852 -2492 -1657 5151 -6634 4906 -355 -5052 6465 -5454
2790 -5454 1523 1528 -4765 6337 -5156 1110 3688 -6723 7172 -2791 -2660 5990 -6214 4463
2804 4463 -1173 -3288 6998 -6900 2795 2216 -6003 7653 -4098 320 3091 -6286 7434 -3733
2818 -3733 -729 6705 -8005 4954 -188 -3948 6128 -5810 4570 178 -6254 7749 -5625
2831 -5625 1798 4982 -6071 4889 -3751 -183 4259 -7635 6627 -1626 -3485 7538 -5714
2844 -5714 1557 557 -2950 6127 -6764 2983 2934 -6537 7453 -3900 -834 4323 -6656 3269
2858C269o017J527O070j2020J0639k879p100J3562j1427M756J173m968Q949j1151
2872e617O187L949j2126J2270n202k405P051q297P847n323n95Q338j0973O336
2886A440L251j0288R183o073J447L038n778P911p311K236P178j2106P101J839
2900C068o634O199l922L253r19m983J0047r639J757P053r648N332j369o44K573
2915A524m123N834m532j326Q636r834K347N194o269L746k214J725O51m733O785
2930C411n417k613Q686o877J413K172k138L448n234M886r46n744R164m910l736
2945d435P232n330K368q15J599L69m929O391l78n900O290k268k822M770k094P78
2961H26l666L086J849n621N590J026o874N039j855q24K309p06K048m706K333K698
$$ plain form
2858 3269 -2748 -1221 4849 -7171 3468 589 -6511 7051 -4376 380 1553 -3415 5534 -5617
2872 -5617 570 4519 -7607 4663 -539 -2944 4107 -4190 3657 -1666 -2261 6077 -4896 1440
2886 1440 4691 -5597 3586 -2487 -1040 1998 -3780 4131 -3180 -944 6234 -5872 1229 3068
2900 3068 -3566 2633 -1289 1964 1045 -3938 6109 -3530 -1773 5280 -4368 964 -405 -1049 1524
2915 1524 -2599 3235 -1297 -2623 6013 -3821 -1474 3720 -2549 1197 -1017 708 1359 -3374 3411
2930 3411 -2006 -4619 4067 -2810 -1397 775 -1363 2085 -3149 1737 791 -4953 4211 -699 -4435
2945 -4435 2797 -2533 -165 -980 619 988 -3941 2450 2072 -3828 2462 194 -2628 2142 48 826
2961 826 -2840 246 2095 -3526 2064 3090 -3784 1255 -600 -1424 885 179 2227 -2479 -146 2552
2977B552o210N301M03m009L258j247K23j375N1L945o067K749K936n132K610N68
2993E56j967J317p14K035k796r1M534n377K026K932m785K722l7m36Q33k182L499
3010B069l467L85L125m235J400J944k483K185j971J687j029j769N323m791K04
3025a423M636m140R59O31j270J078j525K550j475k313M267k154n03J860q48k00
3041A30J26P83l78k022L045q09k335L566k700K43J250j305R45j204J523K8k411
3058a525K284q42j469L228k274J321j22r07P92j374J307j93k297K898j786N86
3074c73J506j854J865j180p31J773k385J641n26j33J230j764R97m61k84J259j224
3091f44R4J434j063N43q93J17R55q57J62N28p25Q05p88P43N90r99R30j086J83
$$ plain form
2977 2552 -3658 1643 2046 -1963 1295 48 271 -1104 -1053 2892 -3175 -426 2510 -2622 -12 556
2993 556 -1411 -94 -808 1227 -1569 -1660 2874 -2503 -477 2455 -2330 392 355 -81 752 -1430 2069
3010 2069 -1398 -1013 2112 -2123 -723 1221 -1262 923 -1048 639 -390 -2159 3164 -1627 -1423
3025 -1423 3213 -927 32 663 -607 471 -1054 1496 21 -2292 1975 -179 -682 1178 330 130
3041 130 256 1039 661 -1361 1684 875 -1460 2106 -594 -351 899 -406 539 -665 858 886 -1525
3058 -1525 759 -83 -1552 1676 -598 723 601 -306 486 -888 419 226 -2071 827 -959 -373
3074 -373 1133 -721 1144 -36 -767 1006 -1379 262 -264 -397 833 -931 66 -395 -679 580 -644
3091 -644 -550 884 -179 364 -529 -412 543 -314 -152 376 -349 456 -332 411 1001 2 932 -154 29
3110B9m7m88J247k38J37J93j910J708o97k60Q65j190O08P05j561Q98o45q6J728
3129I96j117k41N95N89j232l63J528j179q83J564j376Q03Q95l34m33n69N59j33
3147c31j804J931o92M86J113j625J052j08j142K528k030P20k33p27J137k92K98
3164B81P24j552J123j143N68K64j084J535j505J283K76j012J176j657N88K311
3180B176l337J404n8k19Q42j089J026q66l83K077j386p83J296o59J138o49j406
3197h76J626q27J187j016j315K623k217M33R86r07K397l119J02L305m025L094
3213A451j082k535K302q50K316k432K60L290m486K697n88p50J013j08p83Q74k089
3230a500L354l481J869J747m793K191J004j613J782j623K335k72l368O535o037
$$ plain form
3110 29 -18 -506 741 503 640 833 -1077 631 -66 -326 539 -651 -43 662 -899 -1 -646 -732 996
3129 996 -121 -362 233 822 -410 -773 755 -424 -1307 257 -1119 -316 579 245 -188 -757 -198 -331
3147 -331 -2135 -204 -896 -410 703 -922 130 22 -1120 1408 -622 98 -135 -862 275 -17 281
3164 281 1005 -547 576 -567 1 265 -819 716 -789 494 770 -242 934 -723 -135 2176
3180 2176 -1161 243 185 -34 808 -281 745 -121 -504 1573 187 -596 700 41 1179 530 -876
3197 -876 750 -77 1110 94 -1221 1402 -815 -382 604 -303 2094 -1025 -923 2382 -1643 1451
3213 1451 369 -2166 136 -714 1602 -830 -570 2720 -1766 931 343 -407 606 498 -285 589 -1500
3230 -1500 1854 -1627 242 1989 -2804 -613 391 -1222 560 -1063 1272 1000 -2368 4167 -1870
3245a870O06M099m629J599j60J87J128k898M401l346j249N870o266K079J227j671
3261h93K705m023L356n11l605P497o206n13N239m632J519k85J246K55m887O594
3277B856j459m631P323m873P43R05j350K276m569L702K653p803Q407m495k986
3292c301N373m466J681q17L81L126o580P257J32q537P095j748j095N92j278M737
3308B552p571M712M870j0645R049Q1p744O306j84R7m870K557N958r388M758M867
3324E405j0472P867Q9m009K298m211P630p198K94R261j1750N109L416o631M921
3339B019j896K46j302j586Q253j0085K440Q110j1023N394R35m907L923k697P465
3354E289q159k568J2628j0688R52Q560q689L152k038L433j337o052J2476q720
$$ plain form
3245 -1870 -1264 2835 -1794 -195 -355 -168 960 -1938 2463 -883 -2132 3738 -2528 -449 778 -893
3261 -893 1812 -2211 1145 634 -2971 4526 -1680 -2193 3046 -1586 -67 -352 894 1149 -3738 2856
3277 2856 1397 -3234 4089 -784 -41 864 -486 1790 -2779 923 3576 -4227 4180 -315 -3301
3292 -3301 2072 -2394 -713 -1530 -1149 1977 -4603 2654 2786 -5751 1344 -404 -1499 -907 -2185 2552
3308 2552 -5019 -307 4563 -6082 2967 3048 -4696 1610 1426 1523 -3347 -790 5168 -4220 538 5405
3324 5405 -5067 2800 2889 -1120 1178 -3033 4597 -2601 -2307 6954 -4796 313 3729 -2902 2019
3339 2019 123 369 -933 -2519 5734 -4351 -1911 6199 -4824 570 1505 -3402 521 -2176 5289
3354 5289 -2870 -5438 7190 -3498 -2546 6014 -2675 477 -1561 1872 535 -5517 6959 -1761
3368a761l760J2428q654J7L526l348K119m710P823k895r144J5699q607l669Q434
3383C498l359L38j006L346o71q943J1566m228p113J1445n200k911M894j429J721
3398A948p134Q326O20j2073J3450l701o752P883k493m24k540M114L630j0709R133
3413C278K380j2177R792k122k969L021j486L239p633N649M201j2253Q539L041
3427D500r661P187k226J688m508J563P273j1414N347O113j1715O856J821n196
3441b372K572j669N028o558N53R277j2876N493M662q362M219q7J447k562j864
3456c099Q984j0224J503Q617r819L751L250l837J09j682O326l835l822R622r181
3471c337J514O509o348J831j351J785K89m590P914n580l354R225p350J957J940
$$ plain form
3368 -1761 -5521 6907 -1747 -1730 1796 -1552 567 -4143 3680 785 -8359 7340 -1267 -4936 3498
3383 3498 139 477 -529 2817 2146 -6797 4769 541 -6572 4873 -327 -3238 1656 227 1948
3398 1948 -5186 3140 3760 -8313 5137 1436 -5316 2567 74 -350 -2890 1224 4854 -5855 3278
3413 3278 5658 -6519 3273 1151 -1818 1203 -283 2956 -4677 972 5173 -7080 1459 4500
3427 4500 -5161 2026 -200 1488 -3020 -1457 5816 -5598 -251 5862 -5853 1003 2824 -2372
3441 -2372 200 -1469 3559 -2999 -2446 6831 -6045 -552 4110 -4252 -33 -120 1327 -1235 -3099
3456 -3099 5885 -4339 -2836 5781 -4038 -287 2963 -874 -765 -2447 3879 44 -3778 5844 -3337
3471 -3337 -1823 4686 -1662 169 -1182 603 892 -3698 4216 -1364 -4718 4507 -2843 -886 1054
3486A054k553K537k513K977q82l958P609n916o60N046l892K050j412k80K856n050
3502b987N524k428m642P985k894j651K485l376K698k090J676J558n070N448k389
3517a53j902M400l361P1J534j444K977m378M069n44l803M412k523k79K539k657
3533a042K445k089pK819n184M566r80k695L967j934j08N78j637K576l127K106
3549B54J185k735K750p59j351L123k560J187j914R20J834k570N13R82k134J792
3565E17q26q55J790o13L15j195J09K717l090J955l75j787J841j658K086n46j751
3582a366K675j491Q5J428k015J753j008l94J049j713K150j118j152K420k074J335
3598E64p04J2J310j364j25p1r13K725k372o8R31o12J204K69k233K136j680J398
$$ plain form
3486 1054 -1499 1038 -1475 1502 620 -3338 4271 -1645 -2305 2741 -1151 899 -513 -793 2063 -2987
3502 -2987 2537 109 -4533 3452 558 -1093 1392 -1984 714 -1376 300 1858 -3212 2236 -153
3517 -153 -2055 2345 -1016 -945 589 -855 2122 -2256 1813 1269 -2534 1878 -645 -924 1615 -1042
3533 -1042 1403 -686 -693 2126 -3058 1508 528 -2167 1800 -134 -242 336 -1301 1275 -1852 254
3549 254 1439 -1296 1454 695 -656 2467 -93 1094 -820 100 1934 -636 -123 859 -1275 517
3565 517 -309 -1164 626 13 328 -867 -758 1959 -1131 824 449 -1338 503 -1155 931 385 -1366
3582 -1366 1309 -182 -97 1331 -684 1069 61 -333 716 -997 1153 35 -1117 1303 -771 564
3598 564 -140 -128 1182 -182 -307 -378 -1291 1434 -938 -1006 -75 -687 517 786 -1447 689 -991 407
3616D07K48j488J782j325R62K6j899K958k507L84J014j144O72q69L20K089k692
3633a062P23P11j596K917k824j31J420n31M69j031J368K92k943M245k228k54J549
3650A094k294J888l45q77K337m045L316k36k695L657k548L81J108r58K025l727
3666a919J356K838m618L845j243j736M041l740L329k052k211N379o081L194J637
3681B019m953M753k630N88J944m299O015m576l31N074p040N653j683k927L929
3696A536k895K789k004k561Q191p930J759M471p100O232k794l9L157o253P104
3711C663m217k429Q676q922K751K540n007P051o907M812N67p108R824p073n78
3726b357O923q472N539j897j274N141r069R398m119o014J2492r086K696K498n916
$$ plain form
3616 407 655 -833 949 -376 586 612 -1287 1671 -836 -452 562 -582 90 -779 -459 1630 -1062
3633 -1062 -339 372 -1224 1693 -1131 -1262 158 -373 96 -935 433 725 -2218 2027 -201 -455 1094
3650 1094 -1200 688 343 -534 1803 -2242 1074 838 -1857 1800 -748 -367 741 -217 1808 -1919
3666 -1919 -563 2275 -2343 1502 259 -1477 2564 -1176 2153 101 -2110 3269 -2812 382 2019
3681 2019 -2934 1819 -811 -223 1721 -2578 3437 -1139 -1470 3604 -3436 2217 534 -2393 1536
3696 1536 -1359 1430 -574 -3135 5056 -2874 -1115 3356 -3744 2488 -306 -345 2812 -3441 3663
3711 3663 -554 -2983 5693 -3229 -478 2062 -2945 4106 -2801 2011 2578 -4530 5294 -1779 -2357
3726 -2357 4566 -3906 1633 -264 -1538 3603 -5466 3932 -187 -6201 6291 -2795 -99 2399 -3517
3741c517O938q072N387L575j1459J1649m369m698R911p970M596l524l78P647j2363
3756f647R539M38j0459J3350p772q44N729p674R498q455L172P206j6153J2856
3770C784j470q814J2204r405N779k146m082J1479j3693N907O702j3940J2527m945
3784a13k677P032r496J0301p985m57J3377j7048Q288L763j1778J1792q006M010
3798A003K91o146J3176j3210J963J0606j5327J1375j789m569O992j0047J2255
3811F573p481m890J5471j5456M270O105j0041J0700q350M074K059j0947J5996
3824H083j1117k527J4510j5144P683Q3m623P241j0583J1119l770r257J7685j4356
3838d973J071J0883j2433Q997o146L161N134j4976J5654o010q280J6656j3128
$$ plain form
3741 -3517 3421 -4651 736 4311 -7148 4501 132 -4566 5345 -2625 1971 -1553 -1931 5716 -6647
3756 -6647 2892 3330 -7129 6221 -1551 -2395 3334 -4340 5158 -3297 -125 7081 -9072 3784
3770 3784 2314 -6500 5704 -3701 2078 -68 -4150 7329 -6364 -457 6245 -7695 4832 -113
3784 -113 -2790 4242 -5254 5047 -2938 -3395 9982 -7066 1222 4985 -6793 4999 -3007 1003
3798 1003 1294 -4852 8324 -4886 -2923 7683 -7644 3731 1942 -2627 4365 -5682 6573
3811 6573 -908 -5798 9673 -5783 -1513 4592 -5449 5251 -3099 975 3034 -7913 8083
3824 8083 -3034 -5561 8949 -6195 1488 1571 -3052 4189 -6394 4725 955 -8302 9383 -4973
3838 -4973 -3902 6981 -5452 3545 -2601 560 5694 -9282 6372 362 -7918 8738 -4390
3851d390L939K603n260P660j0062P570L389j3057J4050o804m726J0703r366O912
3865C161n942m05R878j5302J2637m52j0564J2483p495J754K669o273Q682r666
3879d835M115P138j5287J2688j728o782R225p344N375k928k624R465j2890P530
3893A118M798j2837J1122m823p27L356o143R249q407M49R969j3859Q145J124o668
3908d134P061n746M473q09n719J0369r292K036P169j0474O923j254k016L953o042
3923c502O956m296k941R245r346L239L871p017O800n245L214J213o792R196o272
3938a677k55O569p509L364P86k701L637n182N225k159l806Q657o903M86M645n420
3954b243L700l299J749L245o777P540l534l199O422m887J025K038k484K789m832
$$ plain form
3851 -4390 -451 2152 -3108 4552 -5510 2060 5449 -7608 6442 -362 -5088 5615 -3751 3161
3865 3161 -2781 -3186 6692 -8610 4027 3575 -6989 5494 -2001 -247 2422 -3851 4831 -4835
3879 -4835 -720 6418 -8869 3819 2091 -4691 4534 -2810 2565 -363 -2987 6478 -6412 1118
3893 1118 5916 -6921 4201 -622 -1349 2007 -4136 5113 -3294 -2845 7124 -6735 1410 2534 -4134
3908 -4134 2927 -2819 1654 845 -4874 5495 -3797 -1761 5408 -5066 1857 603 -1413 2540 -3502
3923 -3502 3454 -842 -3783 5462 -3884 -645 3226 -3791 3009 -2236 978 2191 -4601 4595 -1677
3938 -1677 -1932 4637 -2872 492 1278 -1423 2214 -2968 2257 98 -3708 4949 -1954 -1468 3177 -2243
3954 -2243 1457 -1842 -93 3152 -3625 3915 381 -2818 3604 -1283 -258 1780 -704 2085 -2747
3969b747L656J104n879O569l220k001L948l264L161j831j305M470o247M529r14
3984B9l550O130l294m64K310k451L162l281L08K387l276K917J095k821J645k033
4000a187J533l91j631L093k336Q42R62o69J562j629j358K492j738R20k354J670
4016b19K627l416J868j81k240L058j847k96J259j218K118l291Q97J418j613K445
4032A369l158O97K704j855l33J467j783K304k161M08J416j367J030o14N89l33
4048C80j820J995q10l69J608k138J421K8q92N33n35m39Q33N93K8j827J609l14
4066a16r74K165k014P4Q54q98J748j181l76J345j073J511j011j38K23q72J130
4083C97L28r29N50O83n35L98j506Q99L27j413J504r74p29J174o16O59j850J991
$$ plain form
3969 -2747 909 2013 -3866 2703 -517 -2518 1430 -1834 1327 -504 -1809 2661 -3586 943 29
3984 29 -3521 2609 -685 -1149 1161 -1290 1872 -1409 -1101 1286 -1990 927 2022 -799 846 -1187
4000 -1187 346 -45 -1676 1417 -919 -77 885 216 1778 149 -1209 1283 -455 465 -1889 -219
4016 -219 2408 -1008 860 679 -1561 1497 -350 -646 613 -605 1513 -1778 -881 537 -1076 1369
4032 1369 -1789 -1092 1612 -243 -576 891 -892 1412 -749 -341 1075 -292 738 124 713 380
4048 380 -1440 555 -255 -624 984 -1154 267 295 -597 -64 -599 -1038 -205 388 416 -1411 198 -116
4066 -116 -1090 1075 -939 -865 -11 -909 839 -342 -718 627 -446 1065 54 -84 139 -733 397
4083 397 725 -204 346 1029 494 892 -614 285 612 -801 703 -271 -1000 174 -442 217 -1633 358
4101C58J132k293J769J0j287Q74q70J317q83J65J642k886J790m43j579K386k226
4118a024J306l49m36J420k248R30J604k679J918K9j491K684k827J974q43j321
4134a353K666k514P84J604k552K014j389P83N33j352K533k232p47K649k891J977
4150E13J66j340J568k727K910m90k372M000k507n22K254k600J861k010J065J008
4166G77k813M114j962j912M385l393L62J217j594K159l113K820L6m014N548l220
4182f03r85L550l395K533j824P91J300m838M936l03m033O267l771L4J523k266
4198a084L437m715K628K041n524N101j958k220L618k408K172j366j390N064o862
4213c466L745J667n515N430k187p03K453l110M891n784J503N840q830N423M39
$$ plain form
4101 358 1490 -803 966 976 -311 563 -307 1010 127 292 1934 -952 838 395 -1184 1202 -1024
4118 -1024 282 -67 -503 917 -1331 -401 1203 -1476 442 471 -1020 1664 -1163 811 -32 -1353
4134 -1353 1313 -1201 -417 1187 -1365 649 -740 43 576 -776 1757 -475 -1222 1427 -1464 513
4150 513 679 -661 907 -1820 1090 600 -1772 2228 -279 -801 1453 -1147 714 -1296 -231 777
4166 777 -2036 2078 116 -1796 2589 -804 -442 775 -819 1340 -1773 1047 1083 -2931 2617 -603
4182 -603 -1588 1962 -1433 1100 -724 67 1367 -3471 1465 1162 -2871 3396 -375 -341 1182 -1084
4198 -1084 2353 -2362 266 2307 -3217 1884 -74 -2294 1324 -1084 1088 -278 -1668 3396 -3466
4213 -3466 279 1946 -3569 1861 -326 -1029 1424 -1686 3205 -2579 -1076 4764 -4066 1357 1796
4228A796m378M466l645L482k012k312P275p808J079O437p079K918K50j479K640
4243A630m389O493n695o22Q236r539L738L158n773M813k915K081l34n001Q768
4258D649p048j000Q322q645L999o37j815M505o013O551k011o382J1835q488N06
4273a672N629o379L930l262K721K406r345J0545m133n456J0420p719K229J172
4287A086k985M642p799O633J102r323J1173n265l206P096n324K985k826J395M938
4302D322j0477Q102K86p992J0331n336L65K531m482N647p250L228N941j2050J0754
4317C920j072o441O587n757M026k323r94P648j0169N615L609r626Q199l342j034
4332a154L040m769O906o821J307P232j1388O545K320o869O848m859K945j378l190
$$ plain form
4228 1796 -2582 1884 -1761 1721 -291 -2603 4672 -3136 -2057 4380 -2699 219 469 -1010 1630
4243 1630 -2759 3734 -1961 -2583 5653 -3886 -148 3010 -2763 2050 -865 1216 882 -4119 4649
4258 4649 -2399 -3399 4923 -3722 277 -360 -2175 2330 -3683 2868 857 -5525 6310 -2178 -1672
4273 -1672 3957 -2422 1508 -1754 967 3373 -5972 4573 440 -5016 5404 -2315 -86 1086
4287 1086 -1899 2743 -5056 1577 2679 -6644 4529 -736 -3942 3154 -2170 815 -2011 -616 4322
4302 4322 -6155 1947 2233 -5759 4572 -764 -399 2132 -2350 3297 -3953 -725 5216 -6834 3920
4317 3920 2848 -3593 2994 -2763 1263 -1060 -2054 5594 -4575 1040 4649 -4977 3222 -120 -1154
4332 -1154 1886 -2883 4023 -2798 -1491 5741 -5647 898 3218 -3651 3197 -1662 1283 -95 -3285
4347c285Q599r901K966O360r588O630j186k341M014n845P348l950l142Q915r586
4362c992L825L498o677O052m276K412J120o097R117p054q27P972q580M774j256
4377A1p01L471o367N968j597n139Q701o927R55M928o720M970k756Q88K622o820
4393d513P614k629l777P137o096K472P07k757M799n960M133N89n943P381l613
4408d56j458M664m944L927k363l61M066o443M443M07n192P042m719N92J753l498
4424b540M584l516P20L619o037N716k277k459M207l367K116q82m67M213n523K596
4440G03J338n820O223k704o04K350l242L104k369n67M254m831K802L47k823L513
4456A674l078K073l97j737L808l791Q87K174l332L177j631q47K270k953L203j692
$$ plain form
4347 -3285 5314 -4587 -1621 4739 -4849 1781 595 -1746 2268 -3577 3771 -179 -3321 5594 -3992
4362 -3992 -167 3331 -3346 2706 -1570 842 1962 -4135 4982 -2072 -2899 5073 -3507 1267 11
4377 11 -690 2781 -3586 2382 785 -4354 4347 -2580 -1625 3303 -3417 1553 -1203 -315 2307 -4513
4393 -4513 3101 472 -3305 3832 -2264 208 915 -1842 2957 -3003 1130 1719 -4224 3157 -456
4408 -456 -1914 2750 -2194 1733 -630 -991 3075 -3368 1075 1482 -3710 3332 -1387 -795 958 -2540
4424 -2540 2044 -1472 -752 2867 -3170 2546 269 -2190 2017 -1350 766 -116 -583 3630 -1893 703
4440 703 2041 -3779 2444 -260 -864 1486 -1756 1348 -1021 -1588 2666 -2165 637 984 -1839 1674
4456 1674 -1404 669 272 -1465 2343 -1448 -561 1613 -1719 1458 -173 -1020 1250 -1703 1500 -192
4472a92o17K097k952J687J113k622K371j760R08J138k924K801k394L81L466k778
4488b77P35j9k041K450j760P89K29j492L416l723M62K522k561J907j152M66P79
4505G30k121J913n4j352J691j535r4Q06q70J534k003J476K15r33K002j555k02
4522c52J363j683J324n06p36J032j191J463n20j022J585j198J082m05j291J792
4538G37r85j10J264j435R48n86n45J698j882J110n9q97J634j290M59K6o32J087
4556E42o54J46O14j391J156k60m88R33j340J031Pj069J335j227L91M70q88J066
4574C74r78L80Q83j325J474r91Q3P78j288Q37l71o99J359j188J025J52j534J746
4592G17j511P48Q58j607J667r61m52J258j487J419r11K4J066j466P91K7o56P52
$$ plain form
4472 -192 -809 1288 -1664 23 1136 -1486 885 -875 33 1171 -1753 1048 -1346 -965 2501 -277
4488 -277 458 439 -1602 848 -912 -123 106 -1386 2030 -1693 -1231 1291 -1270 637 -515 -49 730
4505 730 -1391 522 468 -884 807 -728 -822 -16 -886 648 -1355 121 336 -597 1405 -150 -352
4522 -352 1011 -672 652 146 -590 442 -749 714 194 -828 757 -441 641 236 -1055 737
4538 737 -248 -358 906 -529 419 -167 -712 986 -896 214 155 -742 892 -398 61 87 -545 542
4556 542 -112 34 648 -743 413 153 -335 598 -742 289 296 -773 562 -665 -274 196 -692 374
4574 374 -604 -224 659 -666 808 -183 -100 678 -610 227 -144 -843 516 -672 353 505 -1029 717
4592 717 -794 -46 812 -795 872 -89 -541 717 -770 649 -262 -238 828 -638 153 180 -476 276
4610B76j111R49L08j364J895j284k56Q80j518K046j107n63K008j985J371j12j012
4627e79J749j952P79R84k173K034j404K79J333k168J812q02j032K367k319J499
4643D07qj069J937k201J249j00j607K879j906P85J114k703K396j611k83J990k650
4660a381J823k81j360K168k168J740n2j652K536k477O60J657k413J998r87o01
4676g90K148k594K424j068r38K361k711J658K03j906K984k578M85J149j919K479
4692A387k096M84J285k392K125o84r09K088k894J978K50j985L209k705Q61N41
4708E43j610K678j897J15J166k584L100j521n76K527k858P02Q69j684K154j859
4724g35R23J196k711J794p77o88K513k697J627mj316L037m132J851P89k394K624
$$ plain form
4610 276 -835 114 422 -942 953 -331 -587 293 -1225 821 -286 -849 1159 -826 545 433 -579
4627 -579 1170 -782 -3 981 -1192 842 -562 -283 1050 -1118 694 -108 -1140 1227 -1092 407
4643 407 399 -670 1267 -934 315 215 -1392 1487 -419 366 1480 -1223 1173 -438 -721 1269 -1381
4660 -1381 442 161 -1199 969 -1199 541 489 -1163 1373 -1104 -444 1213 -1200 798 -189 -790
4676 -790 1358 -1236 1188 120 -818 1543 -1168 490 693 -1213 1771 -807 -322 827 -1092 1387
4692 1387 -709 -225 1060 -1332 793 109 -800 1288 -1606 372 622 -1363 1846 -859 2 543
4708 543 -1067 1611 -286 -171 995 -1589 1511 -10 -586 1941 -917 -215 654 -1030 1124 -735
4724 -735 188 1384 -1327 467 -310 -998 1515 -1182 445 441 -875 2162 -1970 -119 670 -1724 900
4741I00j916J682k87l007L460k610J608K125l963K591o57r59J986k305K184o80
4757A52o95K107k116R02K61j524J630j764O07J544k460K072j216N65N99j842J699
4774E21L36j802J578q50M42N83j896L065k206M86j18j003J482o27l68J967k627
4791a037J472o08j431K244k281K186k71k305K170j221m57K186j236J384k70j508
4807i83K538k116P70j99j109K358k627K154j392J3P96p66R84l71j415K278j402
4824d89j55J472j536P52N75j812Q64j30N91L56j505J840r76q3M79p11Q01j057
4842g24P03L3m94m74Q81J32k32j79j91L40l60J867j089o14M92q96R40p32L72J379
4862A154j878L6K87j97J161j68o26R61l55m01J25R60j089k28P80N6j714J925j609
$$ plain form
4741 900 -1016 666 379 -2628 832 -1778 -170 1955 -2008 583 -74 -1033 953 -1352 832 152
4757 152 -543 1564 -552 350 611 -913 717 -1047 -440 1104 -1356 716 -500 65 664 -1178 521
4774 521 857 -945 633 -217 225 808 -1088 1977 -229 257 139 -864 618 -9 -377 1590 -1037
4791 -1037 435 -173 -1604 640 -1641 545 274 -2031 139 -1082 -1539 647 -589 795 525 -983
4807 -983 1555 -561 209 10 -1099 1259 -1368 786 -606 -593 203 -563 421 50 -1365 913 -489
4824 -489 -644 828 -708 44 619 -1193 -329 -459 132 488 -1017 823 -153 -236 243 -468 333 -724
4842 -724 -21 12 -482 -956 -75 57 -175 -354 -545 -205 -565 1302 213 -401 91 -805 135 -597 -225 1154
4862 1154 -724 -688 -401 -598 563 395 -231 730 375 -26 99 1059 -30 -258 522 578 -1136 789 -820
4881h20J115J89o04O24n17o94J432p88k00o41O02K6p24J514j08p6m13r88J292
4900B21k08n4O07j185Q72K03o90J428k002K71O51o0j310P34rO50k61K65l71k63
4920e11J090o73N83k27p31P54n99N10L75K55l87L15o56N23o46J60r2j37L1L70
4940C07j79j25O99o15o4L32k84L0O69q69J151m32j800N22R42r11K11O16r29P42
4960A3j048O38M59p00P06N28o71n72J324jp65J194j545m01O02L88o27J001j169
4979f46R17J42N89o24k49j84k11J196j144j91M13J0J189r68R3o8j442J133n54
4998e99J087M64q31j079K89P71Q1n36J020l2j88L65o44o73J208n84l33N88n08
5017a34j4n55q8J761q97J46m44j24n43J369P9j89o46n2N56l52Q59q80N75m04m42
$$ plain form
4881 -820 295 484 -120 504 -13 -707 725 -63 -263 -904 -302 -276 -1000 514 406 330 -83 -1071 221
4900 221 13 -41 566 -619 253 456 -234 1194 -808 -537 114 54 -1256 -522 -531 119 -142 123 -248 -511
4920 -511 579 -94 489 262 -469 285 -314 196 571 826 439 754 98 621 -25 135 43 -94 -63 307
4940 307 128 3 702 87 23 355 71 101 770 -99 1052 620 -1180 -658 284 -627 -416 200 -729 13
4960 13 -1035 -397 62 -638 68 596 -75 -647 677 676 -89 1105 -440 -841 -239 149 -478 523 -646
4979 -646 271 413 1002 378 129 -55 -266 930 -214 -405 8 18 1207 239 332 264 -1178 -45 -599
4998 -599 488 952 121 -958 -669 102 183 -353 667 635 447 812 168 -505 703 119 -214 374 -134
5017 -134 -148 -703 -791 970 73 219 -225 -349 -892 477 556 367 -279 -331 225 -127 732 -148 427 23 -419
5038d19N40j429R83k21O38K59K39m57n59K86p08J528o83M28J46j067K21Q88J27
5057G40r97k15P95NM51j223O23L37k75o84j50R73L70r38R9J06m81P31j72rL69
5078D55r5j86Q4P0l1n6n59L96m2O14j249Q28l71M60L6o50L67J38J50o88Q51p41
5100b19K52j36M42p09K61K51J22k98R5N68j023k37J002l86k66K76M30n56j7M08
5120B60j49l71K57J85l23O4J06J08o85Q48k95k45R85k82p03J72J38m3k01P06p94
5141b62j79R03k66l31J58K24j06JJ48o2o71O87Q8n20O92j82o38p5M97k57j15M89
5163B23l77k51J032J53j160L18J44j74m51O09j58j64l8J87q94R71K77L56j200
5182e97J168j89o88L36N38p40o3J086j227O14K79j55p31N90J153j920M95N44p97
$$ plain form
5038 -419 121 -1308 -325 -546 92 351 590 133 -426 -140 -848 680 -3 425 571 -496 -275 613 740
5057 740 -257 -472 323 328 779 -444 179 516 241 -443 -593 380 750 -188 -89 17 -464 267 95 86 455
5078 455 360 174 258 328 297 241 -318 78 36 650 -599 229 -142 318 354 -296 71 209 359 -329 522 -219
5100 -219 33 -103 339 -370 -109 142 264 -34 61 629 -394 -631 371 -15 -281 -5 425 -131 -148 260
5120 260 111 -260 -3 182 -141 -77 29 137 -548 300 5 -240 745 463 -240 -68 70 27 -174 532 -262
5141 -262 -441 462 196 -135 23 247 141 142 290 228 -443 244 332 -188 504 322 -316 -391 106 -151 -266 223
5163 223 -154 -405 627 780 -380 -62 82 -92 -543 66 -92 -256 -294 -107 -1001 -30 247 603 -597
5182 -597 571 382 -306 30 568 -172 -235 851 -376 238 517 362 -369 221 1374 -546 -51 493 -304
5201c04P9M16q57L48J10J246j088m66J070j090P13N10m23J67q26P27r17q1Q99
5220B33j141L16J160m27j424J088N93m06J49%q07J15J072l26l75K80L43k90n89
5239d36R67l26j161J928j570K82O49n70k35K56N93n80r86K225j232o27J988j810
5257f45O37j44K08P3l32Q67m72r26J267l45r65J510o43m29Q1N15j85j060J455
5276D67p4j556J491k55l19O6M10k27l34P9J81j001J634o55j06J79N0O77j373L36
5296c30Q95j559J231M43j470J087o83O63o24M97O16j115P38O43k265K185o71j033
5314g52J94J16Q97j020M63M70r87Q98N12j367J212j036N99q02K96Q45j684O42
5332e04Q12r79j91O70J30n39J189O1p18k28J428j993J051O9p29Q47o51P39o40
$$ plain form
5201 -304 -225 191 -666 -318 -208 1038 -50 -516 554 -536 177 687 264 431 -395 332 -585 -666 233
5220 233 -908 -592 568 141 -1283 -195 398 -8 141 141 -666 -551 521 195 -180 100 443 153 -436
5239 -436 531 205 -956 972 -598 -316 333 -237 -472 -216 377 -203 -1189 1036 -196 -823 1165 -645
5257 -645 -8 -152 56 129 -203 664 192 -734 533 188 -777 733 90 -339 -258 257 72 -988 467
5276 467 393 -1163 328 73 -246 -180 230 3 -331 -252 -71 -1072 562 -93 -199 -20 30 707 -666 -330
5296 -330 565 -994 237 680 -790 297 -386 277 -347 150 766 -349 389 1032 -1233 952 281 -752
5314 -752 -558 -442 455 -565 -102 368 -619 279 791 -576 636 -400 199 -603 -307 538 -1146 -504
5332 -504 308 -671 -862 -192 -62 -601 588 649 -69 -297 1131 -862 189 258 -471 376 -275 464 -176
5351a76m16J370j365P49M45r05j83M18m90Q86Q9J67l82p74O21O06o42N42p8N19
5371A001j209m08L35m93O61o55P93K55j187j99J118k80J84j71K20O7k44O16j814
5390a410R41R73l69l01L75k86J062m45J80n26j316J043k14M54M8l5k13k34M96
5409B23k07m28N00Q5o89M17n23J083l94j43P4J56N22l15o30O19j160J616l17o64
5429a75R74j217O01q6N1J07k24q99J699P7l41l74l25N53J5j329J369j069J403
5448H10n44j117Q43J75l63J82J22L33j55r2l57j1J208r67m32J217p85R73j223
5467a83O0M83m97N54p20K60K14J50o53O39j225J085j16O67n00n26J103o29N65
5486G31o25n95O93k8m14Q94o27q8j36k53L86q56J440j92r87P99k80n8N2n86R98
$$ plain form
5351 -176 -592 778 -587 162 607 -298 -481 -63 -553 333 422 589 207 -567 54 660 18 560 482 1001
5371 1001 -208 -616 -281 -774 -113 -768 25 280 -907 -1106 12 -268 -84 -255 -35 32 -212 404 -1410
5390 -1410 -469 504 135 -166 209 -77 985 540 720 194 -1122 -79 -293 161 209 174 -39 -273 223
5409 223 16 -412 88 173 -516 -99 -622 461 67 -76 -2 154 676 361 -269 350 -810 806 489 -175
5429 -175 799 -418 183 97 148 255 31 -868 831 908 567 193 -132 421 436 -893 476 -593 810
5448 810 266 -851 -8 167 -196 -14 108 441 286 194 -163 -174 1034 67 -365 852 67 1040 -183
5467 -183 -123 360 -137 417 -303 -43 171 321 -332 307 -918 167 51 718 218 -308 795 166 731
5486 731 106 -489 204 176 -238 656 29 -59 -195 -448 -62 -918 522 330 -657 142 -138 -196 -144 -730 268
5507B68k70M53M9m16J03p84Q20p7k43M84n90L0N43n34j47K6L49O15m24m15J075
5528I15q83j66L82mj52r4m3l09n75P93q34J283j0j236J583q3o9n84k42J311k449
5549a466J006J204q34N23J73l55n09k81N56K39o7j17n74r4J018l66n8K52q66Q45
5569B29j623J275j80o07J478r02J347j205K41N5j205J459j98j244J794j059J053
5586G08k20q29O30l84n05J470j164N54l65k16R46q55O70m49J44q8k44L51k30K39
5606A63N28q97K51M72j151Q61l00k88L2j68J472r34p29J485j267P45L10j141J152
5625E96p29J080o51r98K141k451Q73J342k141P39K38K7L57j337R96j97n99J523
5643H09q79K27K70r49J40J41M81k36p40J051k72j205J703j298R22j149Q18P11
$$ plain form
5507 268 -2 451 500 84 187 -597 223 146 -97 387 -203 -173 370 -164 -311 -285 64 679 255 -160 915
5528 915 32 -134 248 244 92 -2 -45 -354 -929 -136 -970 313 303 -933 650 567 498 -86 -328 983 -1466
5549 -1466 -460 744 -90 433 606 251 -258 -539 17 256 189 72 -502 -596 422 56 -2 250 -616 229
5569 229 -1394 -119 -299 -906 572 -330 1017 -188 53 108 -1097 362 164 -1080 714 -345 708
5586 708 488 -341 289 -95 -600 870 -294 260 -105 -321 625 -230 440 -9 135 47 -197 154 -76 163
5606 163 691 -206 45 517 -634 227 -73 -361 -329 -497 975 41 -688 797 -470 275 585 -556 596
5625 596 -133 947 296 -702 1439 -1012 -139 1203 -938 -199 39 66 423 -914 82 -115 -714 809
5643 809 -70 157 427 -522 -382 -241 240 4 -736 315 43 -1162 541 -757 165 -984 -166 545
5661E45j646J286J54p98J104o17j51N53j120J124p61k40P13p91Q10L06j598R53
5679a74l53J61L03J404r59j222O0J089o17N88L17n90J467j388K04j202P14M91
5697B93j267J088l57j66J029j142J7Q70r47R66j052P21J266k202J747q40o41P93
5715A76j213J282R5o98M97j480J101J058j572J353r63N37o80j026L236k283J120
5732E40K00j855N76j66M96L30k6j319J359n33J422j738r6K491l130J647q37M67
5750a72L21q06K295k106n62Q56K44N5K11l24N16j284J610r46o97K141m85j338
5768d71Q64r43O58n76R26P27l133K444J66j351N48M09j021Q3J164q50q32P94L57
5787c7j796J880J3m06m0M04k34Q35p30P61j209M72Q55j530R72k43M8M03l36O8
$$ plain form
5661 545 -1101 185 339 -459 645 28 -123 430 -690 434 -327 -567 146 -645 165 471 -1127 -174
5679 -174 -527 -366 -63 1341 382 -840 -780 309 -308 280 597 7 1474 86 290 -912 -198 293
5697 293 -974 114 -243 -409 620 -522 -505 365 -582 384 -668 53 1319 -883 864 24 -617 176
5715 176 -1037 245 340 -358 139 -1341 -240 818 -754 599 -364 173 -507 -1533 1703 -580 540
5732 540 740 -1115 -539 -705 -209 121 95 -1224 135 -398 1024 -714 -810 1681 -1449 198 -639 -172
5750 -172 149 -657 1638 -468 -1030 -174 70 125 336 12 528 -756 854 -92 -789 1352 867 -471
5768 -471 393 -550 108 -468 458 1185 -1948 496 662 -689 -141 268 -753 -670 494 -356 -1188 -394 -37
5787 -37 -1833 47 60 -346 -386 18 -216 619 -111 650 -559 -87 768 -762 210 -33 15 418 82 150
5807A50L35q88J176j549J320o22L01n18o88K056k60j89M82q89J08Q77j217J430
5825A415j028r22P15m53J147j375m1J458j378J615m13j247j04R54q13J72M52N07
5843F61j752N7J424j926J572N06p89L50o04Q16o56N46J258j797K96N25j50N00
5861H37J97l0o90k97l57J440j009R52j595m18M48J207q5n13K48j257J038K011
5879B127j929k65n45L0J292p14j78P94q78j09K05Q0L22j246J361o00j010L013
5897A750k147N81j52l98K084j694K14Q57j636k63M17L01n13o75J462Q08k164R79
5915a89j579J845M49j006R21L35r17Q0l39k90P79M98j025m21O80L61N71l68j099
5934g14J4M52r91J459p20J320r20L13J86p78N99R0j174K16K69m16P03m38J263
$$ plain form
5807 150 485 -403 773 -776 544 -78 223 -295 -983 1073 813 624 1106 217 325 1202 -15 1415
5825 1415 387 -535 180 -273 874 -501 -542 916 -462 1153 740 -507 -611 343 -470 -298 154 661
5843 661 -1091 -1034 390 -1536 36 542 -247 103 -501 315 -341 205 1463 -334 -38 487 337 837
5861 837 1034 1004 314 17 -340 1100 91 1043 -552 -970 -522 685 600 87 335 -922 116 2127
5879 2127 198 -67 -612 -582 710 -4 -182 612 -266 -375 -170 -90 232 -1014 347 -253 -1263 1750
5897 1750 -397 184 32 -366 1718 24 238 1095 -541 -804 -387 -86 -599 -1274 188 996 -1168 -189
5915 -189 -1768 77 526 -480 441 776 -141 -61 -400 -690 89 587 -438 -859 -179 182 753 385 -714
5934 -714 -700 -248 -1239 220 -500 820 -100 213 399 -379 220 310 -864 -648 -379 -795 -92 -530 733
5953G33r24m25R86r41N01o9J90L6m43K39P08j23k78N9k39O76j26o39L82l91o8
5974a56J80K3N03o89L51p01O64o05L10N76r59O85k18l9K48l70J18L69j0N14r13
5995a19M7R57o44k03M51n97J93l46J56P48j024J204j216R1P90j539Q46O19o91
6014b77O07J2k01M46j115N03o62nJ044m90N44l01l28k24K0P21j20k27K02N39o62
6035B6O14j250Q40r81J073L25j276N63O52l50j63j7R8j50m35Q20q95P65ro52J060
6056F58o07k78Nk6R20j260L86M35n38M87L30l03q4n34J065l02o00O57j337P34
6076a92Q69j456J363no76J07q22J379q94K6R44j088M61r2k41Q62o72O6L68j001
6096f94J022o55j31J055j144P91j83k07K43p69J066j32j108J428r10L5O90o13
$$ plain form
5953 733 -191 -616 370 -571 -70 -139 51 87 -356 -117 591 468 190 249 10 686 560 -79 303 -88 -156
5974 -156 24 47 550 -139 212 -489 175 -430 -120 456 -503 182 -36 -75 173 -197 -79 290 280 794 -119
5995 -119 -72 885 241 38 489 -108 85 -261 -105 643 -381 823 -393 -302 488 -1051 -205 414 -277
6014 -277 330 342 141 587 -528 -25 -687 -692 352 -138 406 105 -223 -447 -427 294 174 -53 149 688 26
6035 26 640 -610 230 -751 322 647 -629 -66 586 236 73 56 154 4 -431 389 -506 259 250 -402 658
6056 658 51 -227 -222 -248 672 -588 -202 233 -305 182 512 209 125 -409 656 354 -246 411 -926 -192
6076 -192 677 -779 584 579 -97 10 -812 567 -327 -301 643 -445 16 -76 -317 545 -127 -61 307 -694
6096 -694 328 -327 -458 597 -547 244 61 -146 97 -672 394 262 -846 582 -328 -293 397 -216
6114b16L99p75M24Q33j414J008R3n66R16j124P72j87j84N50j324J405j30j424
6132i44J863j243K33J140j664R07p02O0J196j798J913j131p70J509p78m05N21
6149i3K51j51p08L65J324j187J8nK79P46j367J171q50l96J135j113P59O41j789
6168i70J350l24n05P42j017J552j174K3J009j474J068k32l46N35j097J075k34
6185a9k36J062j289J68R75j176R35p79K74Q21j448J275n03k42J031j373O15K14
6203C05q59J335j256P27K14j448J667q91P1R77j233P49m91j97J014j695J634l63
6221B60j326J451r50K15M83n80R64j282N20J100j772J388k73o96J241q32j11l33
6239e33K42J026j507P67M96j164J172r20R4Q34j392J098o28L05J054j723J332
$$ plain form
6114 -216 183 -592 -168 665 -749 259 352 -214 702 -422 350 163 -21 529 -795 610 480 -944
6132 -944 919 -324 -91 1049 -615 292 -410 -350 846 -952 961 -170 -940 569 -209 -614 -93
6149 -93 158 7 -701 -336 988 -199 -181 -186 93 839 -528 643 -207 -603 532 -581 178 819 -970
6168 -970 380 56 -449 293 -724 828 -346 -323 686 -788 280 48 -298 237 -860 215 -19
6185 -19 -255 807 -482 -314 661 -515 420 -359 -85 736 -712 563 60 -182 849 -524 91 305
6203 305 -554 781 -475 252 466 -982 685 -206 -135 842 -391 358 -133 -330 684 -1011 623 260
6221 260 -1066 385 -565 -350 133 -447 517 -765 -245 855 -917 471 198 -498 743 -89 -200 -533
6239 -533 -291 735 -772 -5 491 -673 499 -421 -327 507 -885 213 -415 -110 944 -779 553
6256E53o35n72R67m53N47p09J2J498j373J46O43j088J811r85k13j26j197J393
6274B19K7p70J494j373k02M63p68J412p04j42N49m83j16j98k46J328j763Q62P75
6293C64q70R67m59L5P08j566J581j096PK58J00O09r31M0M93j427J781o25o44J016
6313C41r41J294p49K43k48M78M36m11j269J015J018k119Q19r35J774p7n80J285
6331A374k572J167m14K3J203j546P69L60j344J581K47m92l70n11J479j140P48
6348E62k55N26k29q67J61l60p06J735r64Q16r61M78K24J625k017m02K64Q92J159
6367A681j614jJ76N4L63o39J255j110j60K16r1j63N16p28O43J24o31J5o95J421
6387F32r25J333l8j674N70K22j26M56k81j03p7L87m09L26o04k62m82R28M39o23
$$ plain form
6256 553 -82 -654 313 -140 407 -302 -290 1208 -165 -19 624 -464 1347 362 149 23 -1174 219
6274 219 246 -524 970 -403 -605 -142 -910 502 -202 -344 205 -278 -394 -592 -838 490 -1273 -411 364
6293 364 -506 461 2 37 745 -821 760 -336 -329 -71 29 638 -293 -253 240 -1187 594 -31 -675 341
6313 341 -600 694 -55 188 -60 418 854 443 -826 189 1207 -912 -93 -1028 746 669 89 1374
6331 1374 -1198 -31 -445 -422 781 -765 4 364 -980 601 848 356 -14 -525 954 -186 562
6348 562 307 833 604 -263 -102 -462 -1168 567 -397 419 -542 -64 160 1785 -232 -634 -370 522 1681
6367 1681 67 66 242 296 659 20 1275 165 5 221 130 -33 483 -245 398 522 -109 -94 -789 632
6387 632 -293 1040 1002 -672 -102 120 -6 450 169 66 -11 376 -33 293 -311 -573 -1055 -127 312 -311
6407c11K22m60L14k5p34R32m82O37k35l42J89k90O64k79n08J031o62rM09l2l78
6428c49K30Q4O64j312Q17J1q8P90r24l07N05p3M07m75j54O38m86k20L19m31P66
6449D12n18Q8J14k30KN24m81O8o6o0o2O4O42p74R4R5o44P52J18L4k54j18o5P67
6473E02k23K00p23J43K25R9k45K34N63p04M87j083O70o43J171p87L66p68O35l39
6493b20L81r73P47p57J297o68J55O24r57M72j139J197K36m92L98k73o72J000k46
6512A10l48j03J58J14N0l91K07l69K63J032q88J003r21n69L83L24K29o16J485
6531A153j043M68M28o92n48o56J380n01O31o27m85J21K62r04Q00Q46J512q28p71
6550E46j323J901j299M53J193j942O47M29o45J56R45r5r01p75N56L19j62o4J190
$$ plain form
6407 -311 -89 -549 -235 -260 -994 -62 -544 93 -142 -484 -295 -585 79 -200 -708 323 -339 -348 61 29 -349
6428 -349 -119 -35 629 -683 134 145 57 847 -77 -384 121 48 455 -20 -174 464 -22 -242 77 -354 412
6449 412 -106 -18 96 -134 -132 392 -89 -21 -87 -147 -209 -145 497 -277 -183 -88 -732 20 138 172 -82 -200 -265 502
6473 502 279 479 -244 -101 124 223 -22 212 775 71 558 -525 145 -498 673 -114 252 -516 119 -220
6493 -220 161 -812 -65 -822 475 -193 -38 586 -371 101 -1038 159 395 -97 301 28 -644 356 110
6512 110 -238 -341 -183 -69 -19 -410 -203 -572 -309 723 -165 838 -83 -652 -269 55 284 -332 1153
6531 1153 110 578 1006 314 -234 -890 490 -11 620 -7 -492 -371 -109 -1013 -213 633 2145 1317 546
6550 546 -777 1124 -175 278 1471 -471 176 605 -40 116 1061 966 65 -710 -154 165 3 -61 1129
6569A129q76j21J046j398L50J58j629J463N22l51m52O64k71J51p97J039o78n68
6587f19k46Q63l0J78J67K27o92J238n02n20O25j002R51j229P75J32M95j751J331
6606C91l63J558n55j703J014k67j23n4L14N12n00q90J079q34L25M76p20P17p14
6625c37M37l6j322K085j047K85r8k60M92n22N26L2k10L09k91K23M7j142J763j045
6645a11L82j3r45Q39J73k68O1M90n33O15j316M55N74j011J358o58M68j020P71
6664C11M40j734J368j594J263R21o93M26l98o35O39K77r74J396j594J970j765
6681c76l05P20j20m85K04R61J69j913R68J655k652J319r03J84J839j232O6l13
6699b14k78K025j619l80M17q88N51M4J094r07L11p4N57p45L74j60p05J391q87
$$ plain form
6569 1129 253 132 1178 -220 130 288 -1341 122 644 293 -159 505 234 385 -412 627 -51 -619
6587 -619 -865 -2 -32 146 313 540 -152 1086 584 64 689 -313 638 -591 184 316 811 -940 391
6606 391 28 1586 1031 -672 342 75 -48 -102 212 724 224 -666 413 -421 -96 380 -340 377 -337
6625 -337 100 64 -1258 827 -220 65 -33 -293 199 -323 203 235 25 334 43 266 313 -829 934 -111
6645 -111 271 258 -687 152 325 57 118 608 75 690 -626 -171 403 -608 750 92 560 -460 311
6664 311 751 -983 385 -1209 54 975 282 708 310 -325 314 591 -383 1013 -581 1389 -376
6681 -376 -681 39 -81 -566 -362 599 768 -1145 -177 1478 -1174 145 -758 -574 1265 33 99 -214
6699 -214 -492 1533 -86 -466 -49 -937 -386 -342 752 -155 156 82 639 -106 268 108 -597 794 -93
6718i3R90j417K76o67J87J388r30r21J353n09K27J149j311O66j212J012J31j215
6736h96J474k81M89j88r16L59n86J225j485N04L67k71n14R08r76P03j174O63J277
6755F82j837J473m63J24o81J128m19L53p81J15O29j26M26j036Q55O09r85J32M5
6774B43m16P6N32o12L5l36J339j63k032K038p38J571j928N8r85K97J153j720R53
6793f35L05P73p21P53N30j88j247l4k38J902r34n36N64p52O12m47M25p91N9J293
6813F93K51m4m23q12Q50M98j294o3J04K17L78o31l61O45j39K09P1j12J035j613
6833e41O46M1k16o6j81J42k1L62O73r14n61P44k39P62l62p41P75j244J659o26
6853I2j95N71r48N23k10m63N90J98l20N96m30q1j3L33K69q82R31k48l65J54m64
$$ plain form
6718 -93 897 -520 -244 -911 -724 664 -266 -1187 166 -343 -116 1033 -278 388 -824 188 319 -896
6736 -896 578 297 786 598 -318 41 -545 680 -805 -301 66 -205 -719 189 -787 -84 -1258 -595 682
6755 682 -1155 318 -145 -21 -702 426 7 360 -421 -306 323 197 623 -413 442 1051 66 198 243
6774 243 -173 -97 435 -177 -142 -478 861 698 -1334 704 -34 1537 -391 -333 -1318 -1021 132 -1588 -635
6793 -635 -330 443 -278 475 1005 817 -430 -464 -702 1200 266 -270 294 -458 154 -293 132 -659 -600 693
6813 693 944 900 477 -335 515 1013 -281 -344 -240 -23 355 -276 -637 8 -131 78 149 37 1072 -541
6833 -541 105 146 -70 -136 -317 -175 -196 166 839 -75 -636 108 -131 631 269 -472 303 -941 718 92
6853 92 -103 468 -480 43 -167 -630 -40 158 -162 434 4 -77 -90 243 512 -370 561 313 -52 102 -362
6874c62N17k98q0J07K1M88M70q15N73n37L8k98M69n11n05P3R45m32K19j3r07J078
6896B40r72N17j67R2P5O43k35J31j69Q9L57n54o12Q7P22k96N7r3L10j254J023
6917inj041P99j5R37j791J141m55K71J612l163K197m50n77O69r48J508m12J71
6936D39L57j515L96J441j588n19O68j510K335k94q11l52J387q4p86P31p32L95
6954d2K71P30J33r65K83n16k18m30J429q82Q28j38q73J4R31o06m59J135n24o27
6974e26Q29k25p77K19J28N7J40j46N31q55P67N60j356J010K11p88J86k01j60J79
6994b17J82M53j142N27K49l76n74J144o56n79K01L49M33p36J091j058J000J61
7012D52o29o28J048p63m13O87J536m46o77J004r21o42L22K49n25l57Q67l34K74
$$ plain form
6874 -362 155 -143 -223 -116 -95 393 863 48 621 84 122 -176 293 -218 -723 -650 295 -137 82 69 -838 240
6896 240 -732 -215 -382 -290 -215 428 193 324 155 244 601 47 -565 -478 244 -52 5 -88 222 -1032 -9
6917 -9 -14 -1055 -256 -271 666 -1125 16 -439 -168 1444 -1719 478 28 -549 120 -828 680 268 439
6936 439 796 -719 -323 1118 -470 -989 -321 -1831 504 210 -601 -953 434 350 -436 295 -437 -42
6954 -42 229 959 1092 127 410 -106 -324 -754 675 -207 621 483 -390 -376 555 -51 -510 625 101 -526
6974 -526 303 78 -699 -480 -352 -295 -155 -301 230 -625 142 702 -654 356 567 -221 -35 -236 -396 -217
6994 -217 -35 418 -724 -197 52 -324 -898 246 -410 -989 -788 -439 -6 -742 349 -709 291 452
7012 452 -177 -805 243 -520 -933 -246 1290 844 167 1171 250 -392 -70 179 -346 -703 164 -170 104
7031A04R20j173n62K218j899J040n11m77j11L51M83j99o93Q77n59K17p1o11J322
7050F66p88N0O53j029R54p77N51j039L12N46j61l96P95N79j082J52q61J306o5
7069C66j30l39J04J94P6r36N94n16O54k65N9j18P41J4p68L29M23l44M80l61n77
7090c20J26N89q37N88L21j241L30O81Q40q96l60n7J84M02M1j138O61j26j10o48
7110i70M00J281j017l78Q67Q4L67M9j151J105n28J4L50j162Q05l78J39j00O58
7129D35R0j343J213J22p40M73K81r88P36l81J116k84n84N3l00k39K30K15N53m26
7149B32n90O69j051J203o2m37O19q21R54m61n15J323o86j01m83K46R54j304R89
7168F78m61o33J256j155Q81l80N6M14j015K80O24p46Q4M76j53J7k68P04j835J203
$$ plain form
7031 104 1024 -149 -711 1507 -392 648 137 -340 -451 -100 383 184 -509 368 -191 26 -45 -656 666
7050 666 -122 -72 581 -448 506 -271 280 -759 -447 99 -62 -458 337 916 -166 -14 -875 431 366
7069 366 236 -103 1 195 271 -665 -71 -587 67 -198 -139 -257 484 498 -270 59 482 138 618 257 -320
7090 -320 -194 395 -442 146 467 -774 -444 237 1077 181 -179 -236 -52 350 391 -747 -86 -212 -322 -970
7110 -970 -570 711 -306 -684 183 267 634 683 -468 637 109 123 473 -689 116 -262 -123 -223 435
7129 435 525 -818 395 517 -223 250 531 -457 279 -102 1014 730 146 199 -101 -340 -110 105 658 232
7149 232 -358 311 -740 463 401 -36 583 -238 716 255 -260 1063 377 276 -207 39 993 -311 678
7168 678 217 -416 840 -315 566 186 242 656 -359 -79 545 -201 -117 359 206 223 -45 659 -1176 27
7188B7J90l15K58n29O70j90k21k95O23m21J30O34n13l29J73k06M84l73L34m87
7208c56K62l3N9N15l58k03N91o35J11L83l48j18j68N08l55o79J303p73L86L32
7228D24n68j56P0P4M3l11Q32o16m11L79K85l31R8k33J95N4K75K14o49O44m06k11
7250c05L20q5k01M04j36M3k52L79J25o86M44O7j96P2l05M58r7m51L92r3M7j91
7272b47L9M49k85K98k75n8R6l85K49L03m33J58M27n53P0l56L42P0J45K58p66N62
7294A08J18o93Q16m01p6K90n24O94m22J3O69p38K46k60j34L33k84L91J9o15Q97
7315D47l89l77O42q8j91o8J13j19J88k82N35n68P00j016M34K61J80m4m52Q24o85
7336D5J17Jj18j5j46j32O11q08L9M50j83M03l7l86R1k44J40J98k11N08q94M41
$$ plain form
7188 27 217 -98 160 -369 301 111 -110 -405 218 -203 -73 561 48 -281 -108 -314 170 -203 131 -356
7208 -356 -94 -127 -68 447 89 -114 477 -158 -47 336 -12 -130 -298 210 -145 -824 479 -294 92 424
7228 424 -144 -300 -230 -156 -113 -424 408 -208 -619 -240 45 -286 -188 -421 -226 -172 103 317 -332 312 -94 -305
7250 -305 15 -70 -271 133 -3 40 -212 167 292 -394 50 117 -79 -7 -312 146 49 -402 -10 -103 -56 -247
7272 -247 -208 241 -44 254 -21 -79 17 -368 -119 184 -249 -91 336 -217 -147 -503 -161 -91 54 312 -454 108
7294 108 226 -467 349 -52 -128 162 -362 332 -90 -77 592 -146 100 -160 -294 39 -245 146 165 -450 447
7315 447 58 -319 323 235 44 -24 89 -30 158 -124 411 -157 543 -473 -39 222 402 358 -94 730 45
7336 45 162 163 45 30 -116 -248 363 -445 -406 44 -139 264 227 -159 -68 -312 -172 26 -185 323 -571 -130
7358a30q9Nl69N22nl23L21J24p06n96J589l86k46K77k03P23m27q4k76Q4N13l85
7380f7L35m85J89K36J58r88J298j857J705M4r51P95o54j63m08M35O75k21L29m18
7400a3J35M10j85r06J009l61M3k14j19J89k67K27J48m19K04J22R9N3m07L06m43
7421c89L57L47l15j18K70q75L42L29J5M36o41L05M0r52J237j16k86J90j033J071
7441B14o32J20P64j293P31n81M71O16om74L63o63J14O29l36K2l37l51O65j25l75
7462d64K41R72l06r19R94r32J047q09o1R78q87L58k06O7J81j01J60j32r18O98
7482c9k23j82N24l52L30PM13n55j247Q98L36L00J20m82K41J7O98q51mR21q53j52
7504a35j03P47l14k86o29J747o03m62M65o23j51J112j029J0m01R44l28K23j34
$$ plain form
7358 -130 -219 -214 -583 -61 -66 -389 -68 56 -650 -1246 343 -43 -289 -12 -215 508 81 -3 -279 -195 318 -67
7380 -67 268 -217 -28 208 366 -622 676 -1181 524 568 -383 412 -242 -405 -813 -378 297 76 405 -13
7400 -13 122 532 347 -559 450 89 132 -82 -201 -12 -279 -52 96 -323 -119 3 102 155 -252 54 -389
7421 -389 -32 315 0 -118 152 -723 -381 -52 -37 399 -242 63 103 -849 388 272 -14 176 -857 214
7441 214 -418 -298 466 -827 -96 -677 -206 410 404 -70 293 -370 -256 373 37 59 -278 -629 36 -89 -464
7462 -464 -223 749 443 -476 518 -414 633 -176 -237 741 -146 212 6 73 254 153 313 181 -737 -39
7482 -39 -262 -444 80 -272 58 65 478 -77 -1324 -426 -90 210 330 -152 89 106 804 -47 -51 870 17 -135
7504 -135 -238 509 195 -91 -720 1027 424 -38 427 -196 -347 765 -264 -254 -655 289 -39 184 50
7523E0p94Q75l03rM12k43J52m60J62L90m28N80k93L10m33k48M02n76N36L73k78
7544A77j21K29q36k98R55p73Q71r4j823J071l79J3J289p68M89J63n5m13k55J105
7564E47p70k68O61L39L80j117K02k27kr70O44P60N57l02L00l38p27O27K77o1j15
7585C97n40Q67j102M51j441J047J0P42q58M95L71J85m81n89M28k9N27j060J467
7604H87n27j29K46L66k35n49p23O70p44L9J364o23m2l93R47q57O91j21P14r47
7624C4L69J178q37L19K9j383J250j326l08J414j552J479r53O02k2k28l52M57J87
7643C57q51J52L97p94P75j28j4l41J013k45o80K56M3r8l00m23R15L95J50r55N13
7664A37o09L80J029q22M7L34k455K862m27n24o7O51q06k87M87L97p08P51q24r46
$$ plain form
7523 50 -744 131 -172 -181 231 -12 140 -320 -158 232 -196 384 91 401 -32 -280 122 -454 82 455 177
7544 177 56 285 -551 -849 106 -667 204 110 -1713 -642 -1021 -1008 281 -487 2 165 110 -303 -558 547
7564 547 -223 -491 170 509 889 -228 -26 -253 -255 -1225 -581 179 736 434 734 396 -331 296 573 512 397
7585 397 -143 724 -378 73 -1368 -321 -311 431 -427 68 439 624 143 -446 -18 -47 480 -580 887
7604 887 360 231 477 843 608 59 -664 6 -738 -699 665 42 0 -393 554 -303 388 267 981 34
7624 34 403 1581 744 1063 1092 -291 959 -367 -675 739 -813 666 -287 315 293 65 -287 170 357
7643 357 -494 -342 55 -739 36 -92 -106 -447 566 321 -359 -103 -60 -158 -458 -881 34 429 579 -376 137
7664 137 -472 -92 937 115 162 496 -1959 903 476 -48 -115 536 -270 -557 -70 327 -381 370 -454 -1400
7684a400J923o69j70M3Q11L88j196K08j44L71L11o96K91Q22j867N72k44N04J07
7703c5N44k96M32j73j298P01r93J66J309m44o96J477j568K147j187j57P36M72
7721A137j382J082k0l6j032N81o18R4K70L9J77j315J243j067J345j073M58K21
7739A04k6l65N19n64K50K5q47J468r29J296L07q51P38l63r71P99j115J462p99
7758A38J92or4O16j782J542o94L48m11N46n79J219j401j26K046j244r02j9J112
7777E01j203O64J137j815k93R71N7J057j492J47M1J127j459J178j44k12k87O31
7795F06Nk96q74J75j78Q34j180J204K95r77O24o00N39n77N80J324k271J318l72
7814A79J33N3p65R14j90K6k99o0L21O0o65J573j611J33O79P9j159J95K65M90o83
$$ plain form
7684 -1400 523 -146 -316 -273 538 926 -270 -62 -206 165 476 -220 71 893 -974 -402 -646 -142 -35
7703 -35 509 213 645 472 -826 -125 -1118 -952 357 -87 -783 694 -874 1273 86 -71 665 1137
7721 1137 -245 837 817 781 -251 330 -288 -194 76 115 292 -1023 220 -847 498 -575 -117 104
7739 104 78 -287 232 -332 -82 -57 -904 564 -365 931 1238 387 1125 762 -209 590 -525 937 138
7758 138 330 324 230 846 -936 606 -88 260 -151 395 -184 1035 -366 -492 1554 310 -592 -611 501
7777 501 -702 -38 1099 -716 -1009 -38 19 1076 -416 -269 -228 899 -560 618 474 262 -25 606
7795 606 611 315 -559 -384 -562 272 -908 296 591 -386 238 -362 177 -400 180 1504 -767 551 179
7814 179 312 365 -400 514 324 350 51 -9 312 372 -293 1280 -331 -198 481 560 -599 -404 -139 351 -332
7835c32Q41k52j821L124j055n25L84M97Q5o05M83j845J572l51q68K2P98L18l64
7854A06M85p36Q94l56O53k14j335P83j69k05m90o84J959m52j566J355r40Q35l35
7873d12P47k18O19P3k83P9k80K79n23j72j21J879j166j79n33N74j188O04Q28O61
7893A268j724K68J55j46L13n20l77P47l96K51P47l74k74Q4lJ352j861J104j100
7912d86P19k06j194J422O8o29K49K3r9p23P98J10n5M6M5L31l00j43k27L50j33
7933c4K21j64K51J51k04o22j18M18N05q04O80m56k51R6J24J18N1J16M41o96N54
7954C77l93R27j477L4L11j58J374j079n5L00N6k18r3K38m88k36J318l36o4r24
7974e86J257J74p79N32j612R1N14J34K65m93M19Q3M1o40N4J167k85K50r37k8O10
$$ plain form
7835 -332 509 257 -1564 1560 505 -20 364 861 946 341 824 -1021 551 200 -668 -646 152 470 106
7854 106 591 -145 749 393 1046 832 -503 280 111 -94 -584 -1268 691 239 -1327 28 -912 -77 -412
7873 -412 335 117 736 809 526 605 325 604 81 -91 -212 1667 501 322 -211 363 -825 -221 607 1268
7893 1268 -456 -188 -33 -179 134 -386 -763 -16 -412 -161 586 212 -62 22 19 1371 -490 614 -486
7912 -486 233 27 -1167 255 323 -306 -57 -34 -133 -856 -58 52 -3 43 88 419 119 -24 -251 99 -34
7933 -34 187 23 274 425 221 -401 -519 -101 404 -400 280 -176 -427 -331 -207 -89 -38 78 519 -177 377
7954 377 -16 911 -566 -532 -221 -379 995 -84 -139 161 217 -1 -94 144 -344 -580 738 402 338 -586
7974 -586 671 845 66 598 -1014 -923 -409 -275 -10 -503 -84 -1 40 -600 -546 621 336 586 -351 -379 231
7995B31L86o09j01n00M68J05j76N54q03J217q25K28L6M1r88J42K44M16l00L20
8015H6l82R00o22j028R85J814j558r61J323p46M64n31O69r29N19K17o02O63q94
8034f13J219j181L95K22r04J476p93n4J98O47n55k9K47p90l35J64N37n9M51l14
8054g1K85j249K63R41m93K01o06O82j261N83J201j027L79K50N64p76K96p6j2M16
8074D90j34L09n50k89J07K71k30K34k25L46p1j38l5j073Q65K01Q0M43K1r4q07
8095b79l20N22O06l64Q52q02k31r23J308q22M46j149J818K37j045j18M16k66R04
8114G90j658m4R13Q90j405N49j25q4K15j186QJ780j095j537L173p59N39j834L14
8133e56j5r48R68J116o92n53J126m04J138j260K55r38M86K95r6o83J755r09L54
$$ plain form
7995 231 617 8 -93 -593 -125 -20 -196 358 -445 772 -53 175 211 252 -736 -594 -350 66 -234 86
8015 86 -296 604 -18 -1046 -61 1753 195 -766 557 -189 275 -256 413 -516 3 220 -382 281 -613
8034 -613 606 -575 -180 42 -862 614 -179 -233 -35 612 57 28 275 -515 -850 -686 -149 -208 243 -71
8054 -71 214 -1035 -772 169 -324 -123 -729 -47 -1308 -725 476 -551 -172 78 642 -134 162 86 74 490
8074 490 356 665 115 -174 -67 204 -26 208 -17 329 258 120 85 -988 -123 78 158 601 622 528 -279
8095 -279 -599 -77 529 165 1017 215 -16 -939 369 -453 -7 -1156 662 899 -146 -264 152 -114 790
8114 790 -868 -912 1 891 -514 35 -90 -174 41 -1145 -1137 643 -452 -1989 1184 425 964 -870 -556
8133 -556 -571 -1519 -551 565 -127 -680 446 42 1180 -80 175 -763 -277 18 -78 -761 994 85 439
8152D39r01N98J4n47M02K95K46o23L6k3l01J65N58j149J353M87j415N48P64k92
8172F54m64N16k1Q65k126j01R5O88l67j2M03j043P91j89j94M67K19l18N56
$$ plain form
8152 439 -462 136 150 -397 5 300 546 -77 -41 -64 -365 -200 358 -791 562 1049 -366 182 946 654
8172 654 190 706 685 1550 -576 -677 -582 106 -261 -273 130 -913 -122 -311 -505 -38 181 -137 419
8191D19
$$ Imaginary data points
##PAGE= N=2
##DATA TABLE= (X++(I..I)), XYDATA
0@%%%%%%%%J08k16K16l24M32n40O50p58J010j334J715k043K396k930L546m196
24b268M901n731O707p814R068j0442J1958j3657J5565j7682K0011k2584K5442
37A3474k8603L2056l5814L9914m4398M9318n4705O0584o6999P3996q1655R0026
49D7194r9163J09190j20238J32448j45983J61048j77898J96878k18461K43225
59A28240k71952L05770l46285L95849m58061N38791o48338Q06689j059068J545039
69I36674l940201P687618l836320n620082Q818380o164461L752803m054722L021827
78F01516L581687j1086020J0477851p52231r263038J1188983n386256o51947J945445
87F55990j843455M960982q359649N532997L646758j1435753J0387683j826096
$$ plain form
0 0 0 0 0 0 0 0 0 0 108 -108 108 -216 216 -324 326 -432 578 -756 959 -1084 1312 -1618 1928 -2268
24 -2268 2633 -3098 3609 -4205 4863 -5579 6379 -7278 8287 -9395 10616 -11968 13474
37 13474 -15129 16927 -18887 21027 -23371 25947 -28758 31826 -35173 38823 -42832 47194
49 47194 -51969 57221 -63017 69431 -76552 84496 -93402 103476 -114985 128240
59 128240 -143712 162058 -184227 211622 -246439 292352 -355986 450703 -608365 936674
69 936674 -3003527 4684091 847771 -4772311 4046069 -2118392 1634411 -2420311 601516
78 601516 4183203 -6902817 3575034 2822803 -6440235 4748748 -637508 -1289455 655990
87 655990 -1187465 3773517 -4586132 946865 4593623 -6842130 3545553 1719457
95A719457n520550O205628l583070K879684l360410N55857O089102j0564871O921476
104A342303K546836r087894P767568k274513j166471J463897k381099N610453
112C821080p081693K371680N945020j0132906O334473J100072n244505M458496
120A571717k717650K838703k528067j366014O898609q280099L003823M472774
128C893796p553443M798344o16696j059345J248714k894680N341915m660376n85439
137b087210O335583p256846K854987K255668l969492K892053k096736K233407
145A161414r84889k701814N979173n050178O8927M559063n094758K393705N9943
154C90586p83060J326968k930816M021200k157891k162288N253018m307712O05818
$$ plain form
95 1719457 -3801093 2404535 -1178535 1701149 -1659261 -1103404 4985698 -5579173 1342303
104 1342303 3889139 -5198755 2568813 294300 -872171 591726 -1789373 3821080
112 3821080 -3260613 -888933 5056087 -5076819 1257654 2357726 -2886779 1571717
120 1571717 -1145933 1692770 -835297 -2201311 4697298 -3582801 -578978 3893796
128 3893796 -3659647 1138697 522001 -537344 711370 -2183310 3158605 -1501771 -2087210
137 -2087210 4248373 -3008473 -153486 2102182 -1867310 1024743 -1071993 1161414
145 1161414 176525 -2525289 3453884 -1596294 -1527367 3031696 -2063062 330643 390586
154 390586 -392474 934494 -1996322 2024878 -133013 -2295301 2957717 -1349995 -744177
163g44177K300497k708677J938573j651134J414662K66746l046774M351908k414445
172b92821j299387L595810l030625J058044K44972o82856J422455k530898K468308
181I53002l39570k457149L532963k090550l28402J707197j680294J297926j129180
190e34057N51435R22945k433842K455990o54633j488779K252478j506112M08750
199b5825K31249o47381J239870j648129J075040M75446j840842J882061p22130
208A9359n40304J074203r82647P82367n63387k8836R70023j539281J095614R4983
218C82094j085688J214096o78144J05279K43763n50065Q50967q16897K30151O07138
228E02694j075502Q39976j56252m23321O19002n50839M06290j65037k34361O36139
$$ plain form
163 -744177 1556320 -1152357 786216 -864918 549744 816490 -2230284 2121624 -292821
172 -292821 -1592208 2003602 -1027023 31021 275993 -406863 1015592 -1515306 953002
181 953002 613432 -1843717 1689246 -401304 -729706 977491 -702803 595123 -534057
190 -534057 17378 940323 -1493519 962471 307838 -1180941 1071537 -434575 -25825
199 -25825 205424 -441957 797913 -850216 224824 700270 -1140572 741489 19359
208 19359 -520945 553258 -429389 352978 -210409 -239245 730778 -808503 287111 382094
218 382094 -703594 510502 -167642 -62363 181400 -368665 482302 -334595 -104444 502694
228 502694 -572808 267168 110916 -312405 306597 -244242 162048 -2989 -237350 398789
238C98789p02724L09704K56904n73728N08336k39541k2129K22814l64356M00732
248A94801k55023n3339L52671m32449K56088J5094k04946K56312k05690J06717
258C0236K4440j73268K57471j94374J9449J43403k08523J61687o0678l1167R3059
269F1735j28646J03989k6138n1904R4864r4700L7421L5691p3466P1046m7151N324
281a1935K9139m8329N0976k6117j0657J7669j1854J5503n022j6860J4446N32o317
294h826J1076j0616M030m266M865L215J970o984j506N739k905J4667j8786N251
308c076M179l317N955Q90l915n219R001l183Q726j1113K640O603j4917J8707j155
323A0806j8031J9187j4602M441K1138l7251L4441k7302J907M3884p2439N7231
$$ plain form
238 398789 -303935 5769 262673 -311055 197281 -42260 -64389 158425 -205931 194801
248 194801 -60222 -113561 239110 -193339 62749 77843 -127103 129209 -76481 30236
258 30236 54676 -118592 138879 -55495 -36046 107357 -101166 60521 -157 -31324 61735
269 61735 -66911 37078 10940 -40964 53900 -40800 -3379 32312 -41154 29892 -17259 -11935
281 -11935 17204 -31125 19851 -6266 -16923 746 -11108 4395 -627 -17487 -3041 -2509 -8826
294 -8826 2250 -8366 -4336 -8602 -3737 -522 1448 -5536 -7042 -1303 -4208 10459 -8327 -3076
308 -3076 1103 -2214 3741 4631 716 -4503 4498 1315 10041 -1072 1568 8171 -6746 11961 10806
323 10806 -7225 11962 -2640 1801 22939 -14312 20129 -7173 -5266 38618 -33821 23410
335B3410j0587m5094P0565n8130L2013L792o1160J00588q7642K4917O4553j35494
347g8269J25882m7798l8414R7331j23662J08551n0877n5577J68941j94807R0647
358A948O4887j70793J82274j16114K2262P0631j68877K29427j65603k3853K20446
369A46635k87331J80532J1745j51531K01135k04089J60654k0689j92515L54011
379A98557l09324M8611K30994l29849K48874j06490k5249J64191l05621L50375
389A65069j69286j81033M45206m15143J44233J43185k76564K84862k68607J86987
399E8909O3333l93002N30996l12770j19590M33497m32960K30599m1127r9179K77031
410A95737m52819M20656o3092m17762O28198m03303j7509K89339l38051L13940
$$ plain form
335 23410 12823 -32271 38294 -19836 12177 15969 -45191 55397 -32245 -7328 57225 -78269
347 -78269 47613 -185 -38599 58732 -64930 43621 -7256 -62833 106108 -88699 1948
358 1948 66835 -103958 78316 -37798 -15536 55095 -113782 115645 -49958 -73811 146635
369 146635 -140696 39836 51581 -99950 101185 -102904 57750 37061 -155454 198557
379 198557 -110767 -62156 168838 -161011 87863 -18627 -43876 120315 -185306 165069
389 165069 -4217 -185250 259956 -155187 -10954 132231 -144333 140529 -128078 58909
399 58909 122242 -270760 260236 -52534 -172124 261373 -171587 59012 17885 -81294 195737
410 195737 -257082 163574 100482 -317280 310918 -92385 -109894 179445 -158606 155334
420A55334k93352J43484K28297o09763O18659j70297l76061N90543m19141J41640
430I343K6265j66028M01390n76869L87002J73279o82377P01562k56301k20987
440b03721M00367l67303L50379l14055L2452M74465p95265N57314R4852o09197
450c79712O27420l13520M4404Q6442k70329N53833o26427K09030M83486q59976
460d45349O02910j0512l80082M12301l44264L57662k62602j58640O98712q25695
470c55559L16916M10116p36336N19259j47123l6788J29349l73270O55140n50237
480a68533p3773P44319q56373L54806K34254m49888L66814l26650L55417j42010
490C8383m08304Q59611p03739k643O37854p09289L52515m1048o2436K00198n11890
$$ plain form
420 155334 -138018 5466 233763 -376000 242659 72362 -303699 286844 -132297 9343
430 9343 35608 -130420 270970 -305899 81103 254382 -427995 273567 17266 -203721
440 -203721 196646 -170657 179722 -134333 -101881 372584 -422681 134633 229485 -379712
450 -379712 247708 -65812 -21408 65034 -205295 348538 -277889 -68859 414627 -445349
460 -445349 157561 147049 -233033 179268 -164996 192666 -69936 -228576 470136 -355559
470 -355559 -38643 371473 -364863 154396 7273 -29515 99834 -273436 381704 -168533
480 -168533 -242306 502013 -354360 446 234700 -215188 151626 -175024 180393 38383
490 38383 -369921 489690 -214049 -216692 421162 -288127 64388 23340 -39096 161102 -350788
501c50788O87722l42444l94908Q88264o97702P4875L78158m21745L23170l41557
511a96955L15915M7983o24457Q62723m34330l13887P22438n51750J63030L4171
521B4881q4886K81088n89721N91790n6121o33168Q45946m21588j68220M17391
531B07392l33414K69433l22789K06201K58266p37459P07985j10618n18638O60775
541B87134l56609M6151M7801j25584L84505o03668L94446K27494p36500O70668
551B35838j53409k89871L68030k74233K75225k89127L9721M44491p31137M65413
561I0941J56448n76530N07445j90145q751N4921j85940M41780n15278J50435M22992
572C48318o88251M26837N4508l17040K82809k14329K49113k02567j17567N21663
$$ plain form
501 -350788 336934 -5510 -400418 487846 -209856 -134981 243177 -178568 144602 -196955
511 -196955 118960 166943 -457514 405209 -29121 -343008 379430 -172320 -9290 24881
521 24881 -60005 221083 -368638 223152 167031 -466137 379809 -41779 -209999 207392
531 207392 -126022 143411 -179378 26823 285089 -452370 255615 144997 -373641 287134
541 287134 -69475 -23324 24477 -101107 283398 -320270 74176 301670 -434830 235838
551 235838 82429 -207442 160588 -113645 161580 -127547 -87826 356665 -374472 90941
561 90941 247389 -329141 178304 -11841 -20592 34329 -151611 290169 -225109 -74674 348318
572 348318 -339933 86904 141412 -175628 107181 -107148 141965 -60602 -178169 343494
582C43494n91656J93181L24156n15406L25936p0445k7359P4952k45689M37174
592B48338l55665o6701M94439n38616K01198J59128k71970K17357k00492K19472
602A06488q0053k54451N12563m01170j4279L67910l95113J94392k6019l0611J14592
613I4249k86341L70320j72223k14732M61744l58835M4364J85676k13532J71225
623H1915j77361J52052L3202l03618M05939k02643j38977L26151k58926R2571
633A0305L572m7915J43080k65239K49553k0935k59242L47247j89393m1438J58358
644H7953j54066J34846j35960O7141J12123k80526K65216n7358j69366K41464
654A11467j57960M8466J0434o6129J53118k06474J27411O7685k28859K23151p8900
$$ plain form
582 343494 -248162 -54981 269175 -246231 79705 9260 -18099 56853 -188836 248338
592 248338 -107327 -174028 320411 -218205 -17007 142121 -129849 87508 -112984 106488
602 106488 26435 -228016 284547 -116623 -130902 237008 -158105 36287 10268 -20343 94249
613 94249 -192092 178228 6005 -208727 253017 -105818 -61454 124222 -89310 81915
623 81915 -95446 56606 89808 -213810 192129 -10514 -149491 176660 -82266 10305
633 10305 13877 -34038 109042 -156197 93356 72421 -186821 160426 -28967 -70405 87953
644 87953 -66113 68733 -67227 -86 112037 -168489 96727 39369 -129997 111467
654 111467 -46493 1973 12407 -53722 99396 -107078 20333 88018 -140841 82310 3410
665C410o4981J21325j16859J08601q6248j36J33703k06228J39265J9998j41560
676h9710J51102q4811J9200K4425p1749J23845j23498L5631R1402j57504J17157
687C5490j6641n8534Q1379p7913O7895l3056l5934J04209j13596M8510M3305r4145
699d9031Q2733l9611M98L0353o0907P7882n4290q751O9133q3029M7384M535m0265
712b3366M9629m4698K8742Q21l7882N9650m9401Q677L3045m8602L6171j5564n483
725h261K2619l3423L0166j1239j6780L4300l1208J1435R505k1179K1663j5688
737h090N756O752j8017J9964j1216j775J2741j5032R465j005n339R794r809M966
751h45J545o035Q783n847J575K618m873M458j011j160J990k107K178J118k216
$$ plain form
665 3410 -61571 59754 -57105 51496 -34752 -34888 98815 -107413 31852 51850 -89710
676 -89710 61392 -23419 -4219 20206 -51543 72302 -51196 -15565 75837 -81667 35490
687 35490 18849 -39685 41694 -36219 31676 -1380 -37314 66895 -46701 1809 45114 -49031
699 -49031 33702 -5909 -5411 24942 -35965 41917 -12373 -21124 48009 -35020 12364 16899 -23366
712 -23366 26263 -18435 10307 11128 -26754 32896 -16505 -7828 25217 -23385 12786 -2778 -8261
725 -8261 14358 -19065 11101 -138 -16918 17382 -13826 -2391 7114 -14065 7598 -8090
737 -8090 -2334 4418 -13599 6365 -4851 -6626 6115 -8917 548 -457 -5796 3998 -5811 -845
751 -845 700 -5335 3448 -2399 -824 1794 -3079 1379 368 -792 1198 -909 1269 2387 171
766A71K317j589J441k31j104P79N14r01N84M16p41Q29r47J038l30J57n82n57N77
785A841m43m23j16L68J041k259J527n47k816L241l182J829J299m664O524o677
$$ plain form
766 171 2488 899 2340 2109 1005 1784 2298 1397 1981 2397 1656 2485 1538 2576 2246 2403 1821 1264 1841
785 1841 1398 975 859 1227 2268 9 1536 989 -1827 1414 -1768 61 1360 -3304 3220 -3457
$$ [...]
8191D
##END NTUPLES=NMR FID
##END=
