##TITLE=1H_SA_30.236.1.MeOH
 CDCl3, 108 sc, 
 17.12.2020
##JCAMPDX= 6.0         $$ Bruker NMR JCAMP-DX V2.0
##DATA TYPE= NMR FID
##DATA CLASS= NTUPLES
##ORIGIN= UXNMR, Bruker Analytische Messtechnik GmbH
##OWNER= root
$$ XWIN-NMR		Version 3.5
$$ Thu Dec 17 13:11:22 2020 Russian Standard Time (UT+4h)  she@DPX200
##.OBSERVE FREQUENCY= 200.1315066352
##.OBSERVE NUCLEUS= ^1H
##.DELAY= (6, 6)
##.ACQUISITION MODE= SIMULTANEOUS
##.ACQUISITION SCHEME= undefined
##.AVERAGES= 108
##.DIGITISER RES= 18
##SPECTROMETER/DATA SYSTEM= spect
##.PULSE SEQUENCE= zg30
##.SOLVENT NAME= CDCl3
##.SHIFT REFERENCE= (INTERNAL, CDCl3, 0, 15.7039)
##AUDIT TRAIL= $$ (NUMBER, WHEN, WHO, WHERE, WHAT)
$$ ##TITLE= Audit trail, XWIN-NMR		Version 3.5
$$ ##JCAMPDX= 5.01
$$ ##ORIGIN= Bruker BioSpin GmbH
$$ ##OWNER= she
$$ F:/spectra/data/she/nmr/H-F/1/audita.txt
$$ ##AUDIT TRAIL=  $$ (NUMBER, WHEN, WHO, WHERE, WHAT)
(   1,<2020-12-17 13:07:48.56 +0400>,<she>,<DPX200>,
      <continue with go, POWCHK disabled, PULCHK disabled
       configuration hash MD5:
       00 E9 B6 7A A2 85 ED C7 34 08 36 98 17 FE 4E 26
       data hash MD5: 16K
       42 E3 A1 91 3F 68 03 77 3C AB 6A 70 64 C5 18 8A>)
$$ ##END=
$$ 
$$ hash MD5
$$ 7B 07 D2 AE 3F 01 29 3B C0 B1 9A 71 14 FC AB A6
##$RELAX= 
##$RELAX= 
##$RELAX= 
##$RELAX= 
##$RELAX= 
##$RELAX= 
$$ Bruker specific parameters
$$ --------------------------
##$DU= <F:/spectra>
##$EXPNO= 1
##$NAME= <H-F>
##$PROCNO= 1
##$TYPE= <nmr>
##$USER= <she>
##$AMP= (0..31)
100 100 100 100 100 100 100 100 100 100 100 100 100 100 100 100 100 100 
100 100 100 100 100 100 100 100 100 100 100 100 100 100 
##$AQSEQ= 0
##$AQ_mod= 1
##$AUNM= <au_zg>
##$AUTOPOS= <>
##$BF1= 200.13
##$BF2= 200.13
##$BF3= 200.13
##$BF4= 200.13
##$BF5= 200.13
##$BF6= 200.13
##$BF7= 200.13
##$BF8= 200.13
##$BYTORDA= 1
##$CFDGTYP= 0
##$CFRGTYP= 5
##$CHEMSTR= <none>
##$CNST= (0..31)
1 1 145 1 1 1 1 1 1 1 1 1 1 1 1 1 1 1 1 1 1 1 1 1 1 1 1 1 1 1 1 1 
##$CPDPRG= <>
##$CPDPRG1= <>
##$CPDPRG2= <>
##$CPDPRG3= <>
##$CPDPRG4= <mlev>
##$CPDPRG5= <mlev>
##$CPDPRG6= <mlev>
##$CPDPRG7= <mlev>
##$CPDPRG8= <mlev>
##$CPDPRGB= <>
##$CPDPRGT= <>
##$D= (0..31)
0 1.2 0 0 0 0 0 0 0 0.06 0 0.03 0 0 0 0 0.0002 0 0 0 0 0 0 0 0 0 0 0 0 
0 0 0 
##$DATE= 1608195659
##$DBL= (0..7)
120 120 120 120 120 120 120 120 
##$DBP= (0..7)
150 150 150 150 150 150 150 150 
##$DBP07= 0
##$DBPNAM0= <>
##$DBPNAM1= <>
##$DBPNAM2= <>
##$DBPNAM3= <>
##$DBPNAM4= <>
##$DBPNAM5= <>
##$DBPNAM6= <>
##$DBPNAM7= <>
##$DBPOAL= (0..7)
0.5 0.5 0.5 0.5 0.5 0.5 0.5 0.5 
##$DBPOFFS= (0..7)
0 0 0 0 0 0 0 0 
##$DE= 6
##$DECBNUC= <off>
##$DECIM= 32
##$DECNUC= <off>
##$DECSTAT= 4
##$DIGMOD= 1
##$DIGTYP= 9
##$DL= (0..7)
0 120 120 120 120 120 120 120 
##$DP= (0..7)
150 150 150 150 150 150 150 150 
##$DP07= 0
##$DPNAME0= <>
##$DPNAME1= <>
##$DPNAME2= <>
##$DPNAME3= <>
##$DPNAME4= <>
##$DPNAME5= <>
##$DPNAME6= <>
##$DPNAME7= <>
##$DPOAL= (0..7)
0.5 0.5 0.5 0.5 0.5 0.5 0.5 0.5 
##$DPOFFS= (0..7)
0 0 0 0 0 0 0 0 
##$DQDMODE= 0
##$DR= 18
##$DS= 0
$$ [...]
##$SUBNAM2= <"">
##$SUBNAM3= <"">
##$SUBNAM4= <"">
##$SUBNAM5= <"">
##$SUBNAM6= <"">
##$SUBNAM7= <"">
##$SUBNAM8= <"">
##$SUBNAM9= <"">
##$SW= 16.9725356469052
##$SWIBOX= (0..15)
0 0 2 0 0 0 0 0 0 0 0 0 0 0 0 0 
##$SW_h= 3396.73913043478
##$TD= 16384
##$TD0= 1
##$TE= 0
##$TE2= 300
##$TE3= 300
##$TEG= 300
##$TL= (0..7)
0 120 120 120 120 120 120 120 
##$TP= (0..7)
150 150 150 150 150 150 150 150 
##$TP07= 0
##$TPNAME0= <>
##$TPNAME1= <>
##$TPNAME2= <>
##$TPNAME3= <>
##$TPNAME4= <>
##$TPNAME5= <>
##$TPNAME6= <>
##$TPNAME7= <>
##$TPOAL= (0..7)
0.5 0.5 0.5 0.5 0.5 0.5 0.5 0.5 
##$TPOFFS= (0..7)
0 0 0 0 0 0 0 0 
##$TUNHIN= 0
##$TUNHOUT= 0
##$TUNXOUT= 0
##$USERA1= <user>
##$USERA2= <user>
##$USERA3= <user>
##$USERA4= <user>
##$USERA5= <user>
##$V9= 5
##$VALIST= <valist>
##$VCLIST= <CCCCCCCCCCCCCCC>
##$VD= 0
##$VDLIST= <DDDDDDDDDDDDDDD>
##$VPLIST= <PPPPPPPPPPPPPPP>
##$VTLIST= <TTTTTTTTTTTTTTT>
##$WBST= 1024
##$WBSW= 4
##$XGAIN= (0..3)
0 0 0 0 
##$XL= 0
##$YL= 0
##$YMAX_a= 861750
##$YMIN_a= -240248
##$ZGOPTNS= <>
##$ZL1= 120
##$ZL2= 120
##$ZL3= 120
##$ZL4= 120
##$ABSF1= 10
##$ABSF2= 0
##$ABSG= 5
##$ABSL= 3
##$ALPHA= 0
##$AQORDER= 0
##$ASSFAC= 0
##$ASSFACI= 0
##$ASSFACX= 0
##$ASSWID= 0
##$AUNMP= <proc_1d>
##$AZFE= 0.1
##$AZFW= 0.1
##$BCFW= 1
##$BC_mod= 2
##$BYTORDP= 1
##$COROFFS= 0
##$CY= 11.3945322036743
##$DATMOD= 1
##$DC= 2
##$DFILT= <>
##$DTYPP= 0
##$F1P= 15.9154993809931
##$F2P= -4.1035820241983
##$FCOR= 0.5
##$FTSIZE= 0
##$FT_mod= 4
##$GAMMA= 1
##$GB= 0.15
##$INTBC= 1
##$INTSCL= 1
##$ISEN= 128
##$LB= 0.24
##$LEV0= 0
##$LPBIN= 0
##$MAXI= 10000
##$MC2= 0
##$MEAN= 0
##$ME_mod= 0
##$MI= 1.114404
##$NCOEF= 0
##$NC_proc= 0
##$NLEV= 6
##$NOISF1= 3.799351
##$NOISF2= 2.8
##$NSP= 1
##$NTH_PI= 0
##$NZP= 0
##$OFFSET= 15.70392
##$PC= 1
##$PHC0= -10768.42
##$PHC1= 19.20095
##$PH_mod= 1
##$PKNL= yes
##$PPARMOD= 0
##$PSCAL= 0
##$PSIGN= 0
##$REVERSE= no
##$SF= 200.130013532006
##$SI= 16384
##$SIGF1= 3
##$SIGF2= 2
##$SINO= 400
##$SIOLD= 16384
##$SREGLST= <1H.CDCl3>
##$SSB= 0
##$STSI= 0
##$STSR= 0
##$SW_p= 3612.71676300578
##$SYMM= 0
##$S_DEV= 0
##$TDeff= 0
##$TDoff= 0
##$TI= <>
##$TILT= no
##$TM1= 0
##$TM2= 0
##$TOPLEV= 0
##$USERP1= <user>
##$USERP2= <user>
##$USERP3= <user>
##$USERP4= <user>
##$USERP5= <user>
##$WDW= 1
##$XDIM= 8192
##$YMAX_p= 0
##$YMIN_p= 0
$$ End of Bruker specific parameters
$$ ---------------------------------
##NTUPLES= NMR FID
##VAR_NAME=  TIME,          FID/REAL,        FID/IMAG
##SYMBOL=    X,             R,               I
##VAR_TYPE=  INDEPENDENT,   DEPENDENT,       DEPENDENT
##VAR_FORM=  AFFN,          ASDF,            ASDF
##VAR_DIM=   8192,          8192,            8192
##UNITS=     SECONDS,       ARBITRARY UNITS, ARBITRARY UNITS
##FACTOR=    0.0002944,     1,               1
##FIRST=     0,             0,               0
##LAST=      2.4114304,     0,               0
##MIN=       0,             -240248,         0
##MAX=       2.4114304,     861750,          0
$$ Real data points
##PAGE= N=1
##DATA TABLE= (X++(R..R)), XYDATA
$$ [...]
2933c93J988k655K042j227Q11Q86j384k70L64O26j474o4K54O82r20m60Q30p01
2951a065L06K82j169O99M29l65J193l63j099K39J5r37J126j466J362J170j538
2968a181M96N58j769J348J313j95m53J288k013N57l4j89N02J59lO22j005J762
2986A763j734R95j9l33R7m04J46l96P82q42O20o89K61j80K027k438Q79j47J20
3005E08O16r71J73n72J882j386p28J100J367k385n40J53L11N93L10j16p73r31
3023a389J074j903K572l1Q58k017P19J143k080j444J11J531J291j98o85J3j9K83
3041a71q79P62r25J616q2j200N71K47k19Q65l83j468K055K77J09r4j902J11J131
3060D21P52n61m9L79K01l59l70J068q24J70J5L63O4j281J964j081l42l72K66j095
$$ plain form
2933 -393 1595 -1060 982 -245 566 1452 68 -202 162 788 -686 -750 -496 186 -734 -1194 -364 -1065
2951 -1065 -759 -477 -1646 -947 -518 -883 310 -53 -1152 -913 -898 -1835 -709 -2175 -813 357 -1181
2968 -1181 -685 -127 -1896 -548 765 570 117 1405 -608 -51 -85 -274 228 387 384 1006 1 1763
2986 1763 29 1024 1005 672 769 365 511 115 897 55 675 -14 247 67 2094 -344 535 388 508
3005 508 1124 153 326 -246 1636 250 -478 622 1989 -396 -936 -783 -472 121 431 315 -458 -1389
3023 -1389 -315 -2218 354 323 1181 -836 -117 1026 -1054 -2498 -2387 -856 435 237 -448 -435 -454 -171
3041 -171 -1050 -288 -1213 403 321 -879 -308 -61 -280 585 202 -1266 789 1066 1175 1081 -821 -710 421
3060 421 1173 612 563 942 1143 784 414 1482 658 828 843 1206 1270 -11 1953 872 530 158 424 -671
3080f71J129M83j34n33r14K371k81q9p91k35M28j860L82p98J875j047P22j149
3098a112P02r64J049n5j242N20j171J762%k19n39Q64P80j293n77m71J252N90j131
3117a255J881o73m82Q11k30M20j259N31n12l47Q83n3J392R0j532J949j206ol70
3136C2N15n94O17j46o64R35l19O58n41N3R78j038P05m68j99o43k49N9J255p28
3156B18P33r31l05Q55j217J087j021M65M13j11n44M08q55j74J051q5j41Q60j104
3175c98K02q10k57K21m12J43J903j146k74k31j360K431n44m51O25N10k08p40J111
3194C15j219J260lk97N55K76r39n82P21Q0j37K0j006J614p60N16K88m4j75N36
3214A019p84Q73n20Q8p9J65p15K31Q18q73m2J62l06R01m50o99R07K13l69q15R74
$$ plain form
3080 -671 458 941 807 274 -640 1731 1450 1361 570 335 763 -1097 -715 -1513 362 -685 37 -1112
3098 -1112 -410 -1374 -325 -380 -1622 -1102 -2273 -511 -511 -730 -1269 -405 375 -918 -1495 -1966 -714 -124 -1255
3117 -1255 626 -47 -529 282 52 472 -787 -256 -768 -1115 -232 -285 1107 1197 -335 1614 408 402 32
3136 32 547 -47 570 424 -240 695 376 1034 493 546 1524 486 1191 723 524 -119 -368 -309 946 218
3156 218 951 20 -285 570 -647 440 -581 -116 297 186 -358 50 -805 -979 72 -13 -154 706 -398
3175 -398 -196 -1006 -1263 -1042 -1454 -1311 592 -554 -828 -1059 -2419 12 -532 -983 -358 152 -56 -796 315
3194 315 -904 356 353 56 611 887 -52 -634 87 167 30 50 -956 658 -102 414 702 658 483 1019
3214 1019 235 1108 588 676 597 762 47 278 1096 223 181 343 37 938 488 -211 696 909 540 -275 699
3235F99J21p79J30J47l39M11j043P06m09o2r75q58J280J339j791J20P01J098j943
3254a447N04R19P63k185J106J564j181o85l92K66O53n61O1O69Q77k015M58l78
3272a004K2K76K34r00L43J244n75J949j907J114j208m19K93p04K252m73J052k490
3290i01J824k117J022J330%r47jR92p25j723R58J481j286N56L53n10l72K057r22
3309A069r14o62K69o8J307j690R51n1Q13j493M78q88O83L95j77j259J520j080
3327g97q66J370j137K710k437J272m60N6J95j274n05K068r23j45RJ362j571R68
3345a05L45l00m35j33P44m81M34l05K92k01M29M89n23m57M97J015J63j187L03
3364E84J495j299p83N71j026q20J688l90J434n44j072M9P06P33j877P64M67j164
$$ plain form
3235 699 820 41 171 318 -21 390 -653 53 -356 -418 -1393 -2251 -971 368 -1423 -1303 -602 496 -1447
3254 -1447 -943 -24 739 -1446 -340 1224 43 -642 -1034 -768 -115 -676 -615 54 931 -1084 -626 -1004
3272 -1004 -982 -706 -472 -1372 -1029 215 -360 1589 -318 796 -412 -831 -538 -1242 1010 537 1589 -901
3290 -901 923 -1194 -172 1158 1158 211 210 1202 477 -1246 -288 1193 -93 463 816 306 -66 1991 1069
3309 1069 155 -507 -238 -306 1001 -689 262 211 1024 -469 9 -879 -196 199 22 -1237 283 -797
3327 -797 -1663 -293 -1430 1280 -1157 115 -345 -289 -94 -1368 -1873 195 -728 -873 -864 498 -1073 -105
3345 -105 240 -60 -495 -628 116 -365 69 -236 56 -145 284 773 250 -207 290 1305 1468 281 584
3364 584 2079 780 -3 568 -458 -1278 410 20 1454 910 -162 -113 593 1326 -551 213 680 -484
3382d84o40J490J671l034Q89j1p98m87J414L19m22O56j745q88J926k07r93L39
3400a005k21J441k070J171P90L52n63O6j702J297k44j94J39R60j29o86J412N0
3418H64j101m60R08j79L09k051J921n54J425r46K84j246N92P07O0k50j65O45l32
3437D31N02J9R40j001j228Q39r31J14N14j24K17Q6K02M5Q95j318L04l53o69N05
3457a1O91L51j741J5J027K70q38n1O33n15L39o63J024o89p35K5M98j59O81j146
3477i94j052J095k86j89L4O29o4J043j950J590j73J32M92j849J942n90J032q29
3495A3J13j25P20j304O69P59m46J28M18j06n67l20R21j48q43M75P01r02k14Q35
3515G77p9j57o01J811k415J247r21J012o47p25O96M82p40K40L02m44Q56n79j49
$$ plain form
3382 -484 -1124 366 2037 -997 -108 -119 -917 -1404 10 329 -93 563 -1182 -2070 -144 -351 -1344 -1005
3400 -1005 -1226 215 -1855 -684 106 458 -105 -39 -1741 -444 -688 -882 -743 217 88 -598 814 864
3418 864 -237 -697 211 32 341 -1710 211 -343 1082 136 420 -826 -234 473 533 283 118 763 431
3437 431 933 952 1892 891 -337 502 -429 -315 199 75 292 378 580 625 1520 202 506 153 -516 -11
3457 -11 680 1031 -710 -695 332 602 -236 -287 346 -169 170 -493 531 -158 -893 -868 -370 -529 152 -994
3477 -994 -2046 -951 -1237 -1426 -1392 -763 -827 216 -1734 -144 -317 -185 307 -1542 400 -190 842 13
3495 13 126 1 721 -583 86 845 399 527 945 839 272 -48 873 725 -118 357 1058 156 -58 777
3515 777 698 541 -60 1751 -664 583 -338 674 27 -698 -2 480 -260 -20 282 -162 694 115 -34
3534c4J08O35m58m18l56P53pJ86j554J744n26n83Q03q14l90j19P81r24J428n09
3554b54J071n35P6j845J252j80q4n12O24m4L59p84Q90R83o69k18o0kn4J68j114
3575i32Q25L10J05o30N91q3N07K05j7j212J47J166q43O42L73j180J66P72k99J20
3595G33j059K33N20O43o17o54M5M01J35q96Q20J047j227j56l72L32L37k10l96
3614c41j43k20J144J42k49p32O54m57o69n81N88J99P1R9l39R69j281P46j064O29
3634h35P19j017J245L11r94K25N80j267Q88L04n59Q6l63J121o98M86L21m64j68
3653g9P67p74J15M99p33P96J005j829j98J312J216k225J039j076O37p9l59l37
3671c03O73j19K35K64J87K94q04K85n39J316j676K35L60p60N15M03j848P98L85
$$ plain form
3534 -34 74 709 251 -167 -523 230 223 409 -1145 599 73 -510 293 -521 -911 -1030 -249 -1173 255 -254
3554 -254 817 282 358 -1487 -235 -415 -499 -1011 -387 -431 -72 -856 34 1017 348 130 70 68 14 182 -932
3575 -932 -107 203 308 -322 269 186 693 898 881 -331 -184 982 139 781 1154 -26 140 912 613 733
3595 733 -326 -93 427 1070 453 -201 -156 245 380 -516 304 1351 124 -32 -404 -72 265 55 -341
3614 -341 -484 -704 440 582 333 -399 255 -202 -871 -1452 -864 -665 -594 -495 -834 135 -1146 -400 -1464 -835
3634 -835 -116 -1133 112 423 -571 -346 234 -1033 -145 159 -400 -314 -677 444 -254 232 553 89 -79
3653 -79 688 -86 29 528 -205 591 1596 -233 -431 881 2097 -128 911 -165 472 393 34 -303
3671 -303 370 251 486 750 937 1231 427 712 173 1489 -187 48 408 -352 163 566 -1282 -484 -99
3690i9j85l67J717k127J156L55J1K12N74j618K3J229j751J103j47j72M00j532
3708a218J614r44J83N77k27N82j040q7L0j10L88J412j69n63P15j252o92M64K75
3727f2L29j056J057K21k85L53n32L7L76J414n29q52q6J093q54l80J03J096k43
3746A200j160N13J61J75j269L5K97P25n58J138Q9k026M49L69N26l22J83J11j78
3765D58j545M43J355j114p99M54j28o93Q77l44J695j575M79r3R91j932Q79o41
3783a233M71m2L24j367N47R85P29K64k262J331N01q77R32n26K41l08l31J689q94
3802A74j274J34J611L48p60o55R59j106M19o55K71J617m66m41L64j274J323J71
3820G60q48R81k53k15l1L4k50k62j422J127o10J713K29P07k470P56o89J031K67
$$ plain form
3690 -99 -284 -651 1066 -1061 95 450 461 673 1247 -371 -348 881 -870 233 86 -86 314 -1218
3708 -1218 396 -548 -365 212 -15 567 -473 -560 -530 -640 -252 1160 991 428 1143 -109 -801 -337 -62
3727 -62 267 -789 268 489 204 557 25 62 438 1852 1323 471 385 1478 624 244 347 1443 1200
3746 1200 40 553 714 889 -380 -345 -48 677 119 1257 1346 -680 -231 138 664 342 525 636 458
3765 458 -1087 -644 711 -403 -1202 -748 -876 -1569 -692 -1036 659 -916 -437 -530 461 -1471 -592 -1233
3783 -1233 -762 -804 -480 -1847 -1300 -315 414 678 -1584 -253 248 -629 303 -223 18 -290 -621 1068 174
3802 174 -1100 -966 645 993 233 -422 537 -569 -150 -805 -534 1083 617 176 540 -734 589 760
3820 760 -88 893 640 425 394 428 178 -84 -1506 -379 -989 724 953 1660 -810 -54 -743 288 555
3839E55j803J703J62q74M45n20q78J831j432Q04j416J563n95j89M99k96J17q5
3857d09n29r11J737j994K960n86r13M59l49R7J60K31L10j044M08k03Q67n0r81
3876g40O18Q56p01Q56j181J482K60n32l34q85Q70j88q4kO58p44r0L44N21k18o65
3897A01K29l74O08M2j043J090M24j294P51K3j391L20L03k15j50J096M01r01r83
3916i63L09Q0J365j288j12K13N70j124Q82k41M31J96j507J711r39k89J072j882
3934a516J653p40J195j321K99K88n9J63j84q13J55J35M3P79j84P61k15j099J599
3953I39K47k313R67R43n56J894j814q56P14L21J974k272K0J836k274J65J286q60
3971C61m09k95P81j59K32n77N88l65J77m22n13O28P61j574P70j42Q4Q60K4p39
$$ plain form
3839 555 -1248 455 617 -257 188 -332 -1210 621 -811 -7 -1423 140 -455 -644 -145 -441 -324 -409
3857 -409 -938 -1849 -112 -2106 854 268 -645 -186 -535 -438 -278 -47 263 -781 -373 -576 291 241 -740
3876 -740 -122 734 33 889 -292 1190 1450 918 584 -301 569 381 297 295 953 209 119 463 984 766 101
3897 101 330 -44 564 606 -437 653 1077 -217 534 557 -834 -514 -211 -426 -576 520 921 20 -963
3916 -963 -654 -574 791 -497 -609 -396 174 -950 -68 -309 122 318 -1189 522 -417 -706 366 -1516
3934 -1516 137 -603 592 -729 -430 -142 -201 -38 -222 -1035 -880 -745 -702 77 -107 654 439 -660 939
3953 939 1186 -1127 -160 783 227 2121 307 -549 165 486 2460 188 208 2044 -230 -65 1221 361
3971 361 -48 -343 438 279 511 -66 522 157 334 -88 -601 27 788 -786 -16 -158 -74 786 810 71
3991G1O05j197R85r98J157j763L11L33J465k85j580J571j194J022m17l41n4L63
4009E4K22J46j556Q67N68j030k85J046l4J32j479J024P78q4o12O67r36K7R83j198
4029g00J841j836R92j839K547j9p25q11J42k25N80n02j15K44L10O27N18j050l21
4048c42J013J0n05L62n49k60P25m37J468n7j297j45k11O4r49J313o42N16k27M86
4068C36j399J840m56j65o7r98J273l76j51k09L46j552J164m13J067m1l43k56r0
4087d90j96R64q85M62O6j074J87J022j78L35O62p72q35J496o2m65k38M06k68o46
4107e09N83m72N5J69J176m45L98o60j519J494k66Q98J5o02J71J8q29k78m8j19
4127g70K219j625J477q09M38p51Q45m36o86J66l14o8K10L01k38K22j358J338n42
$$ plain form
3991 71 676 -521 464 -534 623 -1140 -829 -496 969 684 -896 675 -519 503 86 -255 -309 54
4009 54 276 422 -1134 -267 301 -729 -1014 32 -2 130 -1349 -325 453 369 -243 424 -512 -485 498 -700
4029 -700 1141 -695 297 -1542 1005 986 261 -550 -408 -633 -53 -555 -670 -426 -116 511 1029 -21 -342
4048 -342 671 681 176 538 -11 -271 454 17 1485 1428 131 -14 -225 -161 -1110 203 -439 77 -150 336
4068 336 -1063 777 321 156 89 -909 364 -12 -163 -372 -26 -1578 -414 -827 240 199 -144 -400 -490
4087 -490 -686 278 -607 -145 -79 -1153 -966 56 -122 213 875 103 -732 764 702 237 -1 405 137 -509
4107 -509 74 -398 -343 -174 1002 557 955 295 -1224 270 4 902 917 315 486 504 -325 -603 -651 -770
4127 -770 1449 -176 1301 492 930 179 1024 588 -98 68 -246 -314 -104 197 -41 181 -1177 161 -381
4146c81N05n58k10N02O88p84J273o76k74k89N30r06J296j751O14j34P42Q81k123
4165a055J002O44q60O50l8n94L49K30l24M15o5q40J793k150J394K95l24m50O03
4184F75o46J159o45j105J565p12n96l11J332R04k325Q96Q33j011O43r24M7Q7R75
4203H41j203j5J146j802J490K28n32J467j566m04l20K096j788K03N05j803P13
4220g44j85K068j128o47q38P37m0K27M48j670J954j234J990p46j75n25n8N50K48
4239B32J26j218R31j231J131q61R09R68k107J207J59j28k28R11l04L95q03o38
4257e49J414j093K47j95O80j58K73k70o46J357Oo96L88M8o87O6l71O78k83o12
4277d03j4L71o27P10j544K435j85n22K48o54L75K41q96K82M48o87j44M76M38l69
$$ plain form
4146 -381 124 -434 -644 -142 546 -238 1035 359 85 -204 326 -580 716 -1035 -421 -555 187 1068 -1055
4165 -1055 -53 591 -269 381 343 -251 98 328 4 419 354 -486 1307 -843 551 846 522 72 675
4184 675 29 1188 543 -562 1003 291 -305 -616 716 1620 -705 191 1024 13 656 -268 -221 -134 841
4203 841 -362 -377 769 -1033 457 685 153 1620 54 -350 -670 1426 -362 -159 346 -1457 -744
4220 -744 -929 1139 11 -636 -1474 -737 -777 -550 -102 -1772 182 -1052 938 192 17 -508 -566 -16 232
4239 232 358 -860 71 -1160 -29 -890 19 987 -1120 87 246 118 -110 801 497 892 89 -549
4257 -549 865 -228 19 -176 504 346 619 349 -297 1060 1066 370 758 806 119 185 -186 492 209 -403
4277 -403 -417 -46 -673 37 -1507 928 743 221 469 -185 190 431 -465 -183 265 -422 -566 -90 348 -21
4297b1K31K52k90r54N28O99j538N37l27J219l74j036N40R22j64o59J787k128K68
4316e08M29r21P79N0N03O9n16M24M98p57j03n80J552j837P41N78n95J117P72j610
4336H5q57J584l5o52j20l35J192n79q16Q68k75O04P40j285N62m59K13j79j005
4355g49M45l58o0m54Q63o67J77j35J383j841N76J270n71L89n73r89R89O60k0j53
4375A82j84n2j68j44J344p10p22P94j07M55p10J230j821j511J609Q69o50Q14j020
4394e02J161q61J91M01K88j03M6q61m80l2L53P88j116l34J381K9O8P34j085p68
4414g02J176r25O45p30j56O61Q46J22l65j384P78k38J020m56J001j388o04J547
4432H48j475J642j060J98j14r99K41J163m99j34J261o25N69p41j371J118n78p94
$$ plain form
4297 -21 210 462 172 -782 -254 445 -1093 -556 -883 336 -38 -1074 -534 388 224 -435 1352 -776 -508
4316 -508 -79 -1000 -221 -171 332 401 -115 309 807 50 -53 -633 919 -918 -177 401 -194 923 1695 85
4336 85 -772 812 777 125 5 -330 862 283 -533 335 60 664 1404 119 681 222 435 256 -749
4355 -749 -304 -662 -722 -1176 -313 -980 -803 -938 445 -1396 -820 450 -121 268 -305 -1294 -305 355 335 182
4375 182 -2 -54 -222 -366 978 268 -454 340 233 688 -22 1208 -613 -2124 -515 354 -296 518 -502
4394 -502 659 -202 -11 390 678 575 621 -240 -720 -752 -399 389 -727 -1061 320 349 417 1151 66 -702
4414 -702 474 -451 194 -536 -692 -31 815 937 572 -812 -34 -272 748 292 1293 -95 -699 848
4432 848 -627 1015 -45 153 39 -960 -719 444 -55 -189 1072 447 1016 275 -1096 22 -556 -1350
4450a350J254j678J698r89J209Q52k47L80r60r64j06J428n48J298k542O13m28
4467a080J143m78J07m18O68O28R53r63j516j33J610M15K6j230N77L20j481R03
4485E1l59Q1l02J122N50j612L27R89j788K139j512Q76k84O6L96j535Q45R08j91
4504G67l71K01p71j68m86K33l5O53o45P88L7j227Q43l12J061p89l81l96R89j125
4524a134J210M69j116L44J021q90m28O63o20J013j444K02L69l89J058m56l56l98
4542h82P65n11J00l3M6L88p35J55J108k67N6J140j277L31k02m40J286j700N16
4561a56P89P82q34M57lp75J23K02M93r28k29L30r78J224R45p83n02M28r50J754
4581A389j610N30l74q3J005r61J207j427k70j406K381j0j83k345K191k18k35J011
$$ plain form
4450 -1350 -96 -1774 -76 -1065 144 996 749 1129 169 -795 -901 527 -21 1277 -1265 -652 -1080
4467 -1080 63 -415 -308 -726 -58 570 1523 560 -956 -1089 521 936 962 -268 309 629 -852 51
4485 51 -308 -227 -529 593 1143 -469 -142 847 -941 1198 -314 562 278 344 740 -795 50 958 767
4504 767 396 597 -174 -342 -828 -595 -630 23 -622 166 203 -1024 -181 -493 568 -221 -602 -998 -9 -1134
4524 -1134 76 545 -571 -227 794 -96 -524 139 -481 532 -912 -710 -341 -730 328 -128 -484 -882
4542 -882 -117 -628 -528 -561 -515 -127 -862 -707 401 134 190 1330 53 384 182 -258 1028 -672 -156
4561 -156 633 1415 581 1038 1035 260 383 585 1078 150 -79 251 -727 497 1442 659 157 585 -365 1389
4581 1389 -221 309 -65 -148 857 -104 1103 -324 -594 -2000 381 371 188 -2157 34 -184 -419 592
4599E92j160o21J627o92J133j225j74J183j81q57K98j100K95o4L82K78K95P30
4617G39k22o24l37K085j394J06q34N14Q91j78j684l45O47R32P02m70j00K00r36
4636c08J219p83J141j004n04K57j70N71O0L5j382O54J863r49j469J14Q87j139
4654i07J884j470k37J326j062N61o82J19p80R62k19k53J238j313M88P2p08Q66
4672a15Q33j154P48j679Q32P90K68j060m14O51O72l01l86j135J861m66j017P42
4690c30J350j108J429p29q76J197n43M4j253J875j659J382j433J375j172P61O12
4707I22j25j341P03m8k12N15R48k787J047o63J047j410K868q76r87P92n43R58
4725H08j760j19J628j088M09O60k72l43j29P4R9k37k73P79L1L20q47k27J7j48
$$ plain form
4599 592 -568 -1189 438 -254 879 -346 -520 663 482 -375 -77 -1177 -882 -946 -564 -286 9 739
4617 739 517 -107 -444 1641 247 353 -481 33 924 746 -938 -1283 -636 296 998 528 428 628 -308
4636 -308 911 128 1269 265 -239 18 -152 419 479 514 -868 -214 1649 700 -769 -655 232 -907
4654 -907 977 -493 -730 596 -466 95 -587 -468 -1248 -286 -505 -758 480 -833 -345 -273 -981 -115
4672 -115 718 -436 312 -1367 -535 255 523 -537 -951 -300 372 71 -315 -1450 411 -55 -1072 -330
4690 -330 1020 -88 1341 612 -264 933 390 434 -819 1056 -603 779 -654 721 -451 310 922
4707 922 797 -544 159 111 -101 414 1362 -1425 -378 -1041 6 -1404 1464 588 -399 393 -150 808
4725 808 -952 -1071 557 -531 -122 538 266 -77 -206 -132 -33 -270 -543 236 267 587 -260 -487 -470 -618
4745f18M39M52j425J429j71M24J3p07n1k85j11L07Rj69L74K71o27J00L27j80O00
4766D01n23m98O59m70Q81L88j286L94N05p41j96J088M58j917R62L09m05M04k61
4785A52M60N2k40n98K41P69j293J009l11j732K110q96L63J22o25M43O29n12J747
4804A890j754k50Q03j372O05j51N25q25R7P66m60j36J02K42K68j260J309k29k17
4823d7p79P64m54R9Q94J17o1j128L46J14n04J79J329l24j852J047Q18k59m8j35
4843A16p04r5J143o12O08n65M53J50o80M1J42p76N61j235J387M55o55Q37K92j55
4863G08j916J304J474j958Q9J64J017n28J08k79J73q71J035j81n59J069p27N64
4881F86j281O49K34m64K6K50r00K05J077r53K1J48n15R54j76k15J382j173q54
$$ plain form
4745 -618 -179 273 -1152 277 106 530 543 -164 -215 -500 -611 -304 -295 -464 -90 181 -446 -346 -19 -199 401
4766 401 -122 -620 39 -431 450 838 -448 -54 451 -290 -486 602 1060 -857 105 414 9 413 152
4785 152 612 664 424 -174 67 836 -457 552 241 -1491 619 -277 86 208 -417 26 655 143 1890
4804 1890 136 -114 689 -683 -78 -229 296 -529 -432 334 -126 -262 -160 82 350 -910 399 170 -47
4823 -47 -826 -62 -516 -417 477 594 533 -595 -249 -135 -639 -460 869 545 -1307 -260 558 299 251 116
4843 116 -588 -683 460 -152 456 -109 344 494 -186 -145 -3 -779 -218 -1453 -66 389 -266 571 863 708
4863 708 -1208 96 1570 -388 -299 -135 882 354 462 183 356 -515 520 339 -220 849 122 686
4881 686 -595 54 288 -176 -150 100 -800 -595 482 -471 -450 -302 -817 137 -39 -254 1128 -45 -899
4900h99Q23L73m26l14k41M20P10n20J20J0J8kp63K16J044q70k90k65N30n47J054
4921A81j93L72J39q90J155k32M94p67n33M65l31K05N28j16j35n86m00J473p88
4940D1N14l06K40m9M51m84m83L73j73k54o23N74P60m07K34N5j437Q41N72l96Q39
4961H82q00R56j216k10m34k49K061k210J426l14K07n84j74R63q83L20j077J832
4979D96j284P77P2O2K41k59k77J16m52l27j03J238m3J79M98L34j982P13M34K72
4999G05l22o94J297o9j527O73K95p3J268m65k367P04L9m19J679p75J194J81r24
5018D00J148k097M62R7L73j93j067J509r14q99M84O05p70J102j26N45j689J254
5036B24m28L11L95k95j59q34M21K07o22M58o53O22O67m44J91p09N03R06j04p64
$$ plain form
4900 -899 -76 297 -129 -443 -684 -264 446 -74 46 56 74 72 -691 -475 569 -301 -591 -856 -326 -873 181
4921 181 -12 360 499 -391 764 532 1026 259 -274 191 -140 65 593 477 342 -244 -644 829 41
4940 41 555 249 489 440 891 407 -76 297 124 -130 -753 -179 581 174 408 463 -974 -133 439 43 882
4961 882 82 1038 -178 -388 -822 -1071 990 -1220 206 -108 99 -485 -659 304 -579 -259 -1336 496
4979 496 -788 -11 61 123 364 105 -172 -56 -508 -835 -938 300 257 436 934 1268 -714 -1 433 705
4999 705 383 -311 986 917 -610 63 358 285 1553 1088 -1279 -575 -536 -955 724 -51 1143 1324 400
5018 400 1548 -549 -87 10 383 190 -877 632 -282 -1181 -697 -92 -862 240 114 659 -1030 224
5036 224 -204 107 502 207 48 -786 -365 -158 -780 -322 -975 -353 314 -130 61 -648 -145 761 657 -107
5056a07N33n50j92J52j58N0r4l57J034j39j425J042N68n78Q28r79N52k61j41N56
5076C34J47L12j28L60j661N84L44l43j80k15J231p95R04j126k11J013R8o8p5Q9
5096F14j09j51j70M36j012Q8P99j75o96L63J57J47j63M67o73l14P18l60P65j147
5116d16J260j054J115j353N88o76J154j746M40J58L59K30Q2L3N82q70j25o62J032
5135A31j08R28j017J44j2p75K60J029m44J69j788K686j669O89j243J722J49k6
5153H25o98j85j542K182j483Q88J244o19M72j200N52j258R79N77p83m16J141m88
5171A88O11l85L28p67R29k534K206o26j07m27M38J314n05q27N40n14R7k4r60J107
5191H2n6r12P31M39j204P55M58O7m81j642K144j179J129N53k055n75J648n93M73
$$ plain form
5056 -107 426 -124 -316 -164 -322 -272 -366 -723 311 172 -1253 -211 357 -221 607 -372 180 -81 -222 334
5076 334 481 793 665 1025 -636 -52 292 -51 -231 -446 785 -10 894 -232 -443 570 668 600 525 614
5096 614 505 354 184 620 -392 -304 495 320 -376 -13 144 291 128 595 -78 -392 326 -34 731 -416
5116 -416 844 -210 905 -448 140 -536 618 -1128 -688 -530 -171 59 141 174 756 -114 -239 -901 131
5135 131 23 951 -66 78 66 -709 -449 580 136 305 -1483 1203 -466 223 -1020 702 851 825
5153 825 127 -58 -1600 582 -901 -13 1231 612 1084 -116 436 -822 157 734 -49 -465 676 188
5171 188 799 414 742 -25 904 -1630 576 -50 -157 -584 -146 1168 663 -164 376 -138 -41 -65 -1025 82
5191 82 26 -886 -155 284 -920 -165 293 360 -121 -1763 381 -798 331 884 -1171 -1746 -98 -691 -218
5210b18J106k508J268K69j73R93n46j95k39N0P45O91o77p92J577j225n16P97j241
5229h34J855j621j22j52J384l39n03n44J944j390Q12r18J015p36n6r23J807j052
5247c73l69Q10m33J920k193K66J115N02j031J05j119P89Q29r58O01r42j66m68
5265a115J897j038j82N55l44N53j94m3r27N38J19R74p76j448J156N15n78J139
5283H01p74J89q55N9j49J170k50k62P82N0j307J071M38j128K23J875k515n12L50
5302g44J74J423j858N90J802j918r99J906J389j378n88n62L58J442m49j13p25
5319b50J212j087Q7K75M02J16k55m21L65o88N92q32N34R57k158N84P96P64j673
5338f80M82l8n28p39J702m15K41j41o08Q76ll38k93LJ137j592M70L61N9o24J00
$$ plain form
5210 -218 888 -1620 -352 -83 -256 737 191 -4 -243 -193 552 1243 566 -226 1351 126 -390 407 -834
5229 -834 1021 -600 -722 -874 510 171 -332 -876 1068 -322 490 -428 587 -149 -205 -1128 679 -373
5247 -373 -742 68 -365 1555 -638 -372 743 1245 214 319 -800 -11 818 -140 461 -481 -647 -1115
5265 -1115 782 -256 -438 117 -227 326 132 89 -838 -300 -181 793 17 -1431 -275 240 -338 801
5283 801 27 216 -639 -580 -729 441 191 -71 711 761 -546 525 963 -165 58 1933 -582 -1094 -744
5302 -744 -570 853 -1005 -415 1387 -531 -1530 376 1765 387 -201 -763 -405 1037 588 475 -250
5319 -250 962 -125 -38 237 639 755 500 79 444 -244 348 -484 50 1007 -1151 -567 229 993 -680
5338 -680 -198 -236 -764 -1503 199 -216 25 -116 -724 152 149 -189 -482 -479 658 -934 -464 -103 -44 -668 -568
5359e68l6O82J042j971O64n45M45J526j050Q31o04o05j02N60n58J000j731R67
5377e3M99k88k7j060j282K650K18m77j5P06j009P32j047K75P79K71n59j689J841
5396D65j989J293j085K074K00p32m09J007n78Q27o80k33q43j340L260k362M88
5413f37M56l0K32k17j81j019J363j242K152m99k79j094J046J49k67M72o11J16
5431i0m71K97O06o48j14P44P81j013J061r68q09K344k069M91j13j0L55j183P32
5450g7J43N93j147P6J308o47n53M09O61j238O46K30N03j231P61j55o94k19K21
5469d10J260j547R75k91N08L35m37o00K4R04m92n96J2M56q42o5J267j301R95l75
5489b20J007l77N52j099m33P01P39O2Rj78n14m24k86Q83q7j220K37J250m95p12
$$ plain form
5359 -568 -604 78 1120 -851 -187 -732 -287 1239 189 1020 416 -189 -291 269 -289 711 -1020 -53
5377 -53 446 158 131 -929 -2211 439 657 180 165 871 -138 594 -453 -178 601 872 313 -1376 465
5396 465 -1524 -231 -1316 758 958 226 -183 824 246 1073 393 160 -683 -2023 1237 -1125 -637
5413 -637 -181 -211 21 -196 -377 -1396 -33 -1275 877 378 99 -995 51 200 -67 405 -206 -90
5431 -90 -561 -264 342 -306 -420 324 1105 92 1153 185 -624 1720 -349 142 29 19 374 -809 -77
5450 -77 66 659 -488 -412 896 249 -304 105 766 -472 174 404 907 -324 437 282 -412 -631 -410
5469 -410 850 -697 278 -13 495 830 393 -207 -183 721 229 -367 -355 101 -741 -806 461 -840 155 -220
5489 -220 787 410 962 -137 -570 131 870 932 941 763 249 -175 -461 422 335 -885 -648 602 107 -605
5509f05K02J056K39n93o70J160p15L21j250O10o69R21K07N70k101J162J643J31
5527A619m08j016m54n6P89J27M2j032K029p21r56J265q7l85j031N75m00N22J93
5546F15O30k128J459n96M97k83l68P4Q35j699K227l03p10L12m02J39p33k04j17
5565g55K30l84K08k84Q96q27l15J040J299p71m06q94J894m71r87P97J272k521
5583i79J80J503k181N15P86m80M53J212o46J243q54q43R61j86O13k070O02o91
5601h62R30j12M91l37p38M47P10q54J402m03j105O74n86m17J607j381J177N02
5619A145j336J121n95L38J2j16J84j185O99j032j11Q12K73J86M75m6q29j39J79
5638C5j89j06N15k79J082k72j943M63J653J40j022J89j163J580j033m41N26L40
$$ plain form
5509 -605 -403 653 892 299 -371 789 74 395 -855 -245 -914 7 214 784 -1317 -155 1488 1619
5527 1619 1211 195 -259 -315 474 601 643 -389 1640 919 -37 1228 1141 756 -275 300 -100 422 615
5546 615 1245 -883 576 -20 477 194 -174 -100 735 -964 1263 960 250 562 160 299 -434 -638 -755
5565 -755 -525 -909 -701 -985 -89 -916 -1231 -191 1108 337 -69 -963 931 460 -527 270 1542 -979
5583 -979 -799 704 -1477 -962 -176 -656 -203 1009 363 1606 752 -91 870 684 1297 -773 -171 -862
5601 -862 68 -44 447 110 -628 -181 529 -325 1077 674 -431 243 -343 -760 847 -534 643 1145
5619 1145 -191 930 335 673 685 569 753 -432 267 -765 -876 -64 209 395 870 824 -5 -144 35
5638 35 -154 -260 255 -24 1058 786 -1157 -694 959 1099 77 266 -897 683 -350 -791 -265 75
5656G5n2r24P49n84Q95o2k32J075r89J074l89p37q08M34Q51k79P66o53o79j30
5676e99J169q19K7N42k69R3j178R98J340o81l77m79M38q34N30N46m80K13q05K89
5696c36m50J173r60J183p89m87J747j630k75J584k280J267J352l14j197J161r78
5713b29J81R56j798N33M60l74O17M01j295q56L55Q02R20r15l91N07J176j785k56
5732i91J659q60K6L78j61L58q39J035q01j50P44l74O75j91N5q16M4J70J432j397
5752dj339r6R06o52J270L49M20m91k07K52j0k86N77q01O3J2k04l56J387j109J381
5773A062p21R16K36k954R89Q5J835o95l48j659J300r52R12K54J467k009J564j759
5791d77J066j003l52Q08p07M41R64l09k406K240M0k06o92o0l7P76l37K67q4m65
$$ plain form
5656 75 23 -901 -152 -736 159 97 -135 940 -49 1025 636 -101 -909 -475 376 97 863 210 -469 -599
5676 -599 570 -249 -222 320 51 144 -1034 -36 1304 623 246 -233 205 -629 -99 447 -33 180 -625 -336
5696 -336 -786 387 -573 610 -179 -666 1081 -549 -824 760 -1520 -253 1099 785 -412 749 -229
5713 -229 -48 908 -890 -357 103 -271 346 747 -548 -1404 -1049 -247 673 -242 -633 -126 1050 -735 -991
5732 -991 668 -192 -166 212 51 409 -430 605 -196 -346 398 24 699 508 563 -253 -209 -39 1393 -4
5752 -4 -1343 -1439 -533 -1185 85 434 854 363 156 408 398 112 689 -112 -49 -37 -241 -597 790 -319 1062
5773 1062 341 1257 1493 -1461 -472 -387 1448 753 405 -1254 46 -906 6 260 1727 -282 1282 -477
5791 -477 589 -414 -766 42 -665 -224 740 431 -1975 265 305 99 -593 -653 -690 86 -251 16 -68 -533
5811e33K29N49j42l60M96k05j065N48p7R49o40J382j240K4O82j57R5j73j107O74
5831g1M47j568J562j139L41J168m71k13J76L49o81Q03r8j070L71J42R18o74L55
5850F47n57J09j94N38k67L0J22M10j20L69j965N38L8J05N74j223J440r90R29r65
5870d32o08J361m70j78l20J102o11n19P90r10N12L20j403M40O03p41J02J921j116
5889a57l11Q51p02o27J321M25j640N51N82K86o23N95o13J68R52k11r71m7Q10r30
5909b91M60j65m51M93K45M8j368J465L21M0r07P22q72j81k29O72L49L27r16N63
5929C25O74j453Q51n11j82J362q34o79o24q97N17K297p03N15j803M63J285q33
5947b30k85O68M90n95J0J356j237q20J285j249p79J630j60J334j491Q32r52R45
$$ plain form
5811 -533 -304 245 103 -257 239 34 -1031 -483 -560 389 -251 1131 -109 -85 597 440 535 362 -745 -71
5831 -71 376 -1192 370 -769 -428 740 269 56 232 581 -100 703 605 -465 -94 48 966 292 647
5850 647 90 199 5 543 276 306 428 838 718 1087 -878 -340 -302 -197 377 -846 594 -396 533 -432
5870 -432 -1040 321 -149 -327 -647 455 -156 -675 115 -795 -283 37 -1366 -926 -323 -1064 -962 959 -157
5889 -157 -468 383 -319 -946 375 800 -840 -289 293 579 -44 551 -62 106 1058 847 -124 -171 639 -291
5909 -291 169 4 -447 46 291 339 -1029 436 757 797 -110 612 -260 -441 -670 2 351 678 -238 325
5929 325 999 -454 397 -114 -296 1066 232 -447 -1071 -1968 -1451 846 143 658 -1145 -682 603 -230
5947 -230 -515 153 643 48 58 1414 177 -643 642 -607 -1386 244 84 1418 -73 759 -193 752
5965G52j30n75j2j17j636J189N20Q11r99R34p58P99n69m70R32M46j013Q40l89
5984E55j643N32J284j08j308R2J081n80j216J366Q90J99j119n41O05P9j154K04
6002g82p57K660j031k42m88K10m42j42J496P61j381R78r04q60K228p12L08j056
6020a56L72k1m05M16k37N65j499L61J069j382J795j880P67m23R9J125k66r17K23
6039c94O72L26j111K94J44j039J560k91m85j2R7P8K85J122j371n04J183L9o47
6058e4J081j800J789q67p19J136k5M50O1j053O9m39M70O83j681J702K47j039j52
6077a41m62J324j669J338q13J260n26j802R48P5j95Q81n51K07l71j08l84n6J038
6096gr70P12O66N22j631J5P61q12P54N8r6j65K88J023o26q28K46J10k84J128j522
$$ plain form
5965 752 622 47 35 -82 -1718 -529 -9 802 -197 737 -21 778 209 -261 671 1117 104 944 555
5984 555 -1088 -556 728 620 -688 -596 485 -95 -1311 55 945 1144 25 -516 89 168 -986 -782
6002 -782 -1539 1121 90 -152 -640 -430 -872 -1014 482 1243 -138 840 -64 -924 1304 592 900 -156
6020 -156 216 195 -210 206 -31 534 -965 -604 465 -917 878 -1002 -235 -658 -559 566 300 -617 -394
6039 -394 278 604 -507 -213 -69 -1108 452 161 -324 -336 -239 -161 124 1246 -125 -629 554 593 -54
6058 -54 1027 -773 1016 149 -570 566 541 991 1052 -1 68 -371 99 782 -899 803 1050 11 -141
6077 -141 -603 721 -948 390 -423 837 311 -1491 -543 -468 -663 218 -333 -126 -497 -605 -989 -1045 -7
6096 -7 -977 -265 401 923 -708 -693 68 -744 10 68 -28 -193 95 1118 492 -336 -90 20 -264 864 -658
6117f58J255M73j067J703j752n17J495q66J005k346J380k56j17P02O6q78r94J250
6135a22J27N24n43J395n89k27m54p39O0J354j370J092Q49l45j098J44j065L18
6153f89P86r82R7J179M22q08R29j326J328j145O38J94P0J03j355J457j282M6Q36
6172D98n43L50N01L49k145O52j09P33r7J27j43k63O59j46n4l04o1Q69k162J739
6192D50P10r56M43j088P61L51n8o87P97j164p9K98l72J080O8Q78j44j394R72l42
6212E24J96j87K3j509P21Q69j060J014m12r40O63K16l34o72N61R72j05j280J36
6231f04J181j477l08K134J47r25m58m16O00L53k13Q15j463J51N16J130j713J174
6249F24k279j25K362r03m83P68L43k69L84l29j029M00L1j60N79j41J146j136L4
$$ plain form
6117 -658 597 1070 3 1706 -46 -563 932 66 1071 -1275 105 -151 -268 434 500 -378 -1372 -122
6135 -122 5 529 -14 1381 792 565 111 -628 -568 786 -584 508 1357 1012 -86 58 -1007 -689
6153 -689 97 -885 -788 391 813 5 934 -392 936 -209 429 623 693 796 -559 898 -384 -338 498
6172 498 -45 305 806 1155 -990 -338 -447 286 189 316 173 -90 569 423 369 65 4 873 -1289 450
6192 450 1160 204 647 -441 320 671 613 -74 723 -441 -520 -222 -594 486 554 1432 1288 -106 866 524
6212 524 720 533 556 -953 -232 637 -423 591 179 -761 -98 118 -216 -888 -327 645 540 -740 -604
6231 -604 577 -900 -1208 926 1073 148 -310 -726 -126 227 14 829 -634 -483 33 1163 -550 624
6249 624 -1655 -1780 582 -321 -804 -36 307 38 422 93 -936 -536 -505 -665 -86 -227 919 -217 -183
6268a83N31J47l89p91N96o85J030j183J530j361k77K218L53j482O95j759K029
6285A019Q83k465P55o5k80p7N1J05r11J484j630R99m07K08R71j253r9R17q75J620
6305I50j170k55j121J728p17N06L97n19k93O12R02j166L47M8k45n44J05J220r62
6324a77J341j325M04o33N11j246p59K311j935J719r50J112j355J086o2P93l58
6341D77p88O31K14k89j399j90Q50j293J215J217k07M43m77k53J526j865O06j442
6359a024R98m8J015p02j137K73K94k53J527o59q36J354j001Q77q37P92J8k22J178
6378A607k542N21J161k51j498J189J26j343Q77j084J703n12l81J392r78p95J187
6395C79p56Q60j898J906j834Q95K58j42J7M25j481J407N81j556Q45o12J184j74
$$ plain form
6268 -183 348 495 106 -685 -89 -774 256 -927 603 -758 -1035 1183 1536 54 749 -1010 1019
6285 1019 1902 -563 192 127 -153 -230 -179 -74 -985 499 -1131 -132 -539 -331 640 -613 -712 205 -670 950
6305 950 -220 -475 -1596 132 -585 -79 318 -201 -494 118 1020 -146 201 249 4 -540 -435 785 -177
6324 -177 1164 -161 243 -390 121 -1125 -1884 427 -1508 211 -739 373 -982 104 42 835 477
6341 477 -311 320 534 245 -1154 -1344 -494 -1787 -572 645 438 881 404 151 1677 -188 418 -1024
6359 -1024 -26 -74 941 239 -898 -625 -331 -584 943 284 -552 802 -199 678 -159 633 651 429 1607
6378 1607 -935 -414 747 496 -1002 187 313 -1030 -153 -1237 466 -46 -427 965 -13 -808 379
6395 379 -377 483 -1415 491 -1343 -448 -190 -332 -315 110 -1371 36 617 -939 -94 -706 478 304
6413C04j34M60j175R8J174j021J823p62j454J648q5q28qK35R39k67j741J254j545
6432a085J074P61m21j206J987j773J417J077j949L08J306k177L22R31j68J69n82
6449iN65J50Oj336J88J55J598J37m17p6m43j54o44J511j320O5p47L23Rm11M32
6470d18J089j227qR38p9k49l67N49K17j144K699j390J30q91q12L52r0M55J05q37
6490i78J777K56j452M15l64M92l45q4J005k13j07j151J005m85m4J96R22o2j358
6509e75Q37M30j073J539j811K81p47J664K22R46j456J143j120J71j158L93j34
6526d48Q40r91L89P10k4j019K91O56k43k51O24p81k70J249P21j001j802M32O28
6545b90L82M50rj4j073M57N16l47l12R37j855R37l08K93o60O49n02M42o05J179
$$ plain form
6413 304 170 630 -545 -447 727 -294 1529 767 -687 961 876 48 40 275 1214 947 -794 460 -1085
6432 -1085 -11 750 329 -877 1110 -663 754 1831 -118 190 1496 -681 -359 572 404 573 -9
6449 -9 556 706 712 -624 -436 -281 1317 1454 1037 961 518 364 -280 1231 -89 -24 -771 -448 -439 -850 -418
6470 -418 671 -556 -564 374 295 46 -321 228 445 -699 2000 610 740 -151 -963 -611 -701 -246 -141 -978
6490 -978 799 1055 -397 18 -346 146 -199 -283 722 509 402 -749 256 -229 -273 -77 845 783 -575
6509 -575 262 692 -381 1158 -653 -372 -1119 545 767 1713 257 1400 280 451 -707 -314 -448
6526 -448 392 -599 -210 500 476 -543 -252 404 161 -90 534 -247 -517 732 1453 452 -1350 -918 -290
6545 -290 92 542 533 519 -554 -97 419 72 -240 697 -1158 -221 -529 -236 -896 -247 -749 -307 -912 267
6565B67p23L76q6O5l76j52R42j469J517R31j264j76q9P4P9K08O91j368M39j49
6585b63k29M27J44n38J95K71m67j4J33l53J004N0J6n49J40l86j001K295N38j580
6605a67k09P10j9p73Q40k27J0K33r43k24n37J458j305K552n32Kj437P05P01o39
6625A99j532K444L8O4j275R22j000j1N43o63o08j775K615k20P61j821J401j039
6643i57J379J89P63r87q69q83j77K461m73j35N57j361M24Q84k16o88l47J340l42
6662E62Q0o38j152J479L19m04j065Q83p94J343j528K369j185j218J773p38M42
6679E28P6l17q75J669p44n47R54p15K84j159J155j047J648q03q6q10J084o39m0
6698c84l34O69p78r4P01k19M21L23K82n13l71L94L91j250O49l43J847k796J094
$$ plain form
6565 267 -456 -80 -166 -101 -477 -629 313 -1156 361 1292 28 -148 -237 -163 -84 124 815 -553 -114 -263
6585 -263 -492 -65 79 -459 -264 7 -460 -474 -341 -694 310 360 376 -173 -33 -419 -1420 875 1413 -167
6605 -167 -376 334 315 -458 382 155 165 398 -545 -769 -1306 152 -1153 1399 867 869 -568 137 838 199
6625 199 -1333 1111 1149 1213 -62 860 -140 -151 392 -271 -879 -2654 -39 -259 502 -1319 82 -957
6643 -957 422 611 1374 387 -482 -1365 -1542 919 446 311 868 -493 -69 815 599 -89 -436 904 562
6662 562 642 4 -1148 331 650 246 -819 64 -730 613 -915 1454 269 -949 824 86 528
6679 528 604 287 -588 1081 337 -210 744 29 313 -846 309 -738 910 107 21 -789 295 -344 -384
6698 -384 -718 -49 -827 -921 -220 -439 -18 305 587 74 -297 97 488 -762 -113 -456 1391 -1405 -311
6717c11j212K290j931J48J347J22j691Q59L30P9R69L87j590p15J617l73J75j62
6735C38j08j61j06r01N59j016J996o97p72R76r80J400J92j32j89j07k99L67O5
6754D25q78L76J291j763p3R37p50J13K39O18P9m36K24l69l04O5M94k50j39n13
6774f14M50J56J15M64j482J064j88P37n82rN18j164P00n69l58N86j51J51M16K12
6794D52n83M55o17L40l4O3K33Q19j460J49M28q8K13r4j5K10O65j084L95p4k0J66
6816E19m14J023j819O95J248j235K56J088j581N22K66l01Q85k140J318j42o46
6833d58J230m62P3o86m81l18J943j034k65O16j053N04J406j713N42L08p14J055
6851D93j422P16m4M04k68Q51k08j357J22P11j260J865l70k28O46j527R04lL83
$$ plain form
6717 -311 -1523 767 -1164 -1016 331 453 -1238 -379 -49 30 999 1386 -204 -919 698 325 500 338
6735 338 230 69 -37 -938 -379 -1395 601 -96 -868 108 -872 528 720 588 399 292 -7 360 425
6754 425 -453 -77 1214 -549 -622 315 -435 -322 -83 535 614 178 402 33 -271 -206 288 38 -101 -614
6774 -614 -164 -8 107 571 -911 153 -35 702 120 111 629 -535 165 -404 -762 -176 -327 -176 240 452
6794 452 -131 324 -293 47 13 76 309 1128 -332 -183 245 157 370 276 261 471 1136 52 447 373 353 519
6816 519 105 1128 -691 4 1252 17 273 1361 -220 302 568 267 1152 -988 330 188 -458
6833 -458 772 310 383 -303 -784 -1102 841 -193 -458 158 -895 -391 1015 -698 -156 152 -562 493
6851 493 -929 -213 -257 147 -121 730 522 -835 -713 -2 -1262 603 233 5 651 -876 28 25 408
6870D08l38J82K02p84J179j440M14L56k50q6j65R76o54p93J48R77n50J37Q60j682
6890i03J797J251j239m41l70k83O91n05l49K54Q1j99K75J52O73j160L66p12q4
6909g05J347n27n79r5M97J02j51l4J054k482J090K66r6m41L52j59L47O40Q69j671
6929c76J378j088n76J304j598L09L56K028k388K77O6O94R03p33n91n51J87m4l54
6948g97J629m05n81K61kk7k64j34P80L37l15j028K23OO65K38j435O30O23k06m16
6969b18N50j130R18J197j435k5j56K21l4m20l3r38J520l3l89R9l35k19J86L45
6989c29N4M41p28J415j576L0Q90m66k91J063n33J11l83J136j278J021l05m60m27
7008f15Q8O74Q7k01j69m9Q60j268n33J071lQ05l67n58j47O36J31O20l81p24O26
$$ plain form
6870 408 70 252 454 -330 849 -591 -177 179 -71 -157 -322 654 0 -793 -645 332 -218 -81 779 -903
6890 -903 894 2145 906 465 95 -188 503 -2 -351 -97 -16 -215 60 212 885 -275 91 -621 -705
6909 -705 642 115 -464 -559 -62 40 -111 -145 909 -1573 -483 -217 -313 -754 -402 -561 -214 426 1295 -376
6929 -376 1002 -86 -662 642 -956 -647 -291 1737 -651 -374 -308 386 1289 556 -35 -586 -399 -443 -797
6948 -797 832 427 -154 107 105 78 -186 -320 460 797 482 -546 -323 -317 348 586 -849 -219 404 198 -218
6969 -218 332 -798 120 1317 -118 -143 -299 -78 -112 -532 -565 -1503 17 -16 -405 -306 -641 -860 -674 -329
6989 -329 -275 166 -562 853 -723 -693 197 -269 -560 503 -30 81 -302 834 -444 577 272 -188 -615
7008 -615 -527 147 234 33 -136 -185 675 -593 -1126 -55 -58 747 380 -178 -325 311 442 1062 681 -43 583
7029E83k94O02j932N19J86P06m21n15J463o12o69M95Rp29O08J6J4j10j38M9O40
7050D70n09N23k21p02j31R73L63j535J237j00j01m68J22m62l34J553l68J62p18
7069b46O77o97Q55o76n7p26J300m36M05K48j226k28K090J27j958J071n90q10R84
7088A07kR27j132p26N71J945m31p82p48N57R25j564l92J927p81pj252Q03K36K14
7108C95j303J20J198O2q99P95N99j418J675p01j237j62K87R00j279J925q87r7
7126b7L76Q3P37k955K289p14k57P59j704K072o04j97O44k16P97j181J030k353
7144a421R11R35n62m75J496o80K87K40q41j76p39J939j787J410n45K60n95JO57
7163C15j175O63O4J237r7r44q09K021j514j30O07k014N94J404q01Q97L1m45m39
$$ plain form
7029 583 289 891 -1041 -522 -336 370 -51 -566 897 285 -384 111 120 -609 -1 15 29 -81 -219 -170 470
7050 470 -39 484 263 -439 -570 403 766 -769 468 368 267 -201 -79 -541 -875 678 310 472 -246
7069 -246 431 -266 589 -87 -144 -870 430 -6 399 647 -579 -807 1283 1410 -548 523 -67 -877 107
7088 107 105 1032 -100 -826 -255 1690 1259 477 -271 286 1211 -353 -745 1182 401 394 -858 -55 181 395
7108 395 -908 -788 410 472 -427 368 967 -451 1224 523 -714 -876 -589 311 -968 957 70 -27
7126 -27 349 432 1169 -1786 503 -211 -468 291 -1413 659 55 -142 502 286 1083 -98 932 -1421
7144 -1421 -510 425 -137 -612 884 204 491 731 -110 -286 -1025 914 -873 537 -8 252 -343 -342 315
7163 315 -860 -197 -133 1104 1007 63 -746 1275 -239 -369 238 -1776 -1182 222 -579 318 349 -96 -535
7182e35J331j449J092N24k422J618q36L73M5m19N38K46M56l36P61j563Q65K23
7200E12J42m34l27J587j345N58j163R25j53j81l56J362J0j373J181j441O85m17
7218b28J185j232l08K339j717n02J553m96j608J474m63k78K59p62Q59L85j596
7235a136J316o74J50j823J890r1O37j55m14L76K3L07J169j167m42M04Q32k220
7253a018n49K44K218k091K002J00j0j313K02L34n5K18j045J020K22j295M19q93
7271a290R84j63M23M64j451K90Q34M47m57k55P86j56o52M30m63j453K629j239
7289b92O09n55J078p15r35l89L99M93P38M8q19k14P69K87r50P92k63n3J19k64
7309a17l07J171r51R6J101q60o72Q45o87O17m50o67J156n03R4J228j895J129j88
$$ plain form
7182 -535 796 -653 439 963 -1459 159 -677 -304 -259 -678 -140 106 562 226 987 -576 289 512
7200 512 654 220 -107 1480 135 693 -470 455 302 121 -235 1127 1137 -236 945 -496 189 -228
7218 -228 957 -275 -583 1756 39 -463 1090 594 -1014 460 -3 -281 -22 -784 75 460 -1136
7235 -1136 180 -494 -344 -2167 -277 -368 269 114 -300 76 99 406 1575 408 -34 370 1202 -1018
7253 -1018 -1567 -1323 895 -1196 806 906 896 -417 -215 119 64 282 -763 257 479 -816 -397 -1290
7271 -1290 -306 -469 -46 418 -1033 -743 91 538 81 -174 612 456 -196 234 -229 -1682 947 -292
7289 -292 317 -238 840 125 -810 -1199 -800 -307 431 479 -340 -554 215 502 -448 344 81 28 147 -117
7309 -117 -424 747 -204 -108 993 133 -539 306 -381 236 -214 -881 275 -228 -134 1094 -801 328 140
7328A40j49l46P18l32j236J294Q67L09o91j865J033j27N86K24j40j228M50J699
7346A206j075k94P99j471M68o17K43J114j019K238k775K122l27q37J38r42J076
7363D7N39J176j435p82l92J623p75j65M73n36p47J136o61R33o88N54O18q62N97
7382F53n6j033P99p17l32Q24P91j657Q06n93Q21J56j57J72l55O23m16k43j595
7401a509J606L14l02J47Q4l44O77j353J099o52M93l04m48J90J09P06k51K90j600
7420a048J588j088R78n01p8L68j49l91J66Q14o82k27l57M50J471k101L65J8N82
7439A78l31Q43r95j71J03Q60k49n48L79o57L45RP84j009J176K11o01k96Q51j454
7459e72j324J627J001R0j205K35o54M93P50j73l62r9k57n0k85J528p59m26N63
$$ plain form
7328 140 -9 -355 363 31 -1205 89 956 1265 574 -1291 -258 -385 201 425 285 -943 -493 1206
7346 1206 131 -163 636 -835 -367 -984 -741 373 -646 1592 -1183 939 612 -225 -87 -1029 47
7363 47 586 1762 327 -455 -847 776 1 -164 309 -227 -974 162 -499 434 -254 300 918 56 653
7382 653 597 -436 363 -354 -686 138 929 -728 78 -515 306 462 305 477 122 745 329 86 -1509
7401 -1509 97 411 109 256 340 -4 673 -680 419 -233 260 -44 -492 -302 -193 513 262 552 -1048
7420 -1048 540 -548 430 -71 -149 219 70 -321 -155 659 -23 -250 -607 -157 1314 -787 -422 -404 178
7439 178 -153 690 -305 -476 -373 487 238 -310 69 -588 -243 -234 550 -459 717 928 327 31 882 -572
7459 -572 -1896 -269 732 822 -383 -148 -802 -309 441 268 -94 -193 -450 -500 -785 743 -16 -442 121
7478A21m6m65m5P47o23j29K48N1O38q5J162j464J40K16j199N36L05q62N42O50
7498D38k53l33q89J838j313N22k18q57J357m66o45J240p19J41j01J99P97j434
7516f96j44J424m09r9N4m54J00QK4J057K9m41N27j286P38q85J46M26j80l93J575
7537A121p50k97j80O50p87K28j8j86p3P97O21k696J569M03J01j265J431j095O07
7556A81q09o5O77k42M58M03m32O70K86m79n06M9j204K302j452K83o99OJ337n12
7576B52r2O30j432J523p08n80M55l30K224k360K16j249O28M45J769j247N23j93
7594D74m23N79k43m15o3q96M81J943j37j832j90R01j044J918j614K104k682J206
7612F7N75j025O63j277J606M05j071o83O81j066J027J12l09J628k76j600O63o15
$$ plain form
7478 121 75 -390 -435 312 -311 -440 -192 -141 497 412 1574 110 250 466 -733 -197 108 -754 -212 438
7498 438 185 -148 -1037 801 -512 10 -208 -1065 292 -174 -819 421 -298 -157 -258 -59 738 -696
7516 -696 -840 584 175 76 130 -324 -224 -216 -192 865 894 453 980 -306 432 -453 -307 119 -61 -454 1121
7537 1121 371 74 -106 544 -243 -15 -33 -219 -292 505 1126 -1570 -1 402 503 -762 669 -426 181
7556 181 -628 -693 -16 -258 200 603 171 841 1127 648 142 191 -1013 1289 -163 120 -579 -573 764 252
7576 252 160 790 -642 881 173 -407 48 -282 1942 -418 -202 -1451 -823 -378 1391 144 667 474
7594 474 51 630 387 -28 -91 -987 -506 1437 1300 -532 -722 179 -865 1053 -561 1543 -1139 67
7612 67 642 -383 280 -997 609 1014 -57 -740 -59 -1125 -98 14 -295 1333 1057 -543 120 -495
7630d95J227L45k66r21J59O24j297O61l53M92K56k86K62r84Q6O50K00j808P55
7649f93N23r1R04j011N45P86l77j073P30m17J067j323R29j69l89J39o89J65O43
7668A99n51j77J345K62k22q78P61K64j389m03J58R41p40L38q18K44m5J276j101
7687e36J007o80O67l18l63l3L49P70p62O13m2Q03k783J859p58O08n29K21M41j11
7707D23q60Q37K71n38N31o9j93m9j88K2m43R76j519J678j038m19J384j292R45
7726D59k55q67L09J24l5O17o99J71N9K8M84r56m70J580m61r78M46J467j216N8
7746a35K69q33O57J74j489Q55M28l61J012J78k08m77l65k45k0n1J20P82m57k63
7766d29K36L63m61o78O1J488p00O73p13P7l32l60M49J368j781p4L37m49J425o39
$$ plain form
7630 -495 732 1077 811 -110 49 673 -624 37 -316 176 432 146 408 -576 -490 160 360 -1448 -693
7649 -693 -170 -261 643 -368 177 963 586 -487 243 -174 893 -430 499 330 -59 80 -609 -444 199
7668 199 -352 -529 816 1078 856 -22 739 1003 -386 -789 -631 310 -430 -92 -910 -666 -711 565 -536
7687 -536 471 -209 458 140 -223 -256 93 863 101 714 672 1475 -1308 551 -207 401 -128 93 534 423
7707 423 -437 400 671 133 664 595 402 353 165 187 -256 720 -799 879 -159 -578 806 -486 459
7726 459 204 -663 -354 -230 -265 352 -347 -176 -117 -89 395 -561 -1031 549 88 -890 -444 1023 -193 -135
7746 -135 134 -699 -42 132 -1357 -502 -74 -435 577 755 547 70 -295 -540 -560 -611 -491 291 -166 -429
7766 -429 -193 170 -291 -969 -908 580 -120 553 -160 -83 -415 -775 -326 1042 -739 -813 -476 -925 500 -139
7786a39K41k33M20L4o14O65o18J013m13M03j336J227q63P39n65j289J189J093
7804I54r36m9P4k47O98j57n60R30j398L47P52P79m08j464R16j241J510j378N76
7823c02J602j085j412N29P26l31j75J967l741K347j06L00J1P56j842O60K7k2j500
7842a591K720N4j807J261j212r0J688m09j335R79o76p28K45Q25M42P2k106J665
7860cL65l4K54O8j002j45L14J201k34P10j179j224K13M34N89r24L39J089k223
7879a392R16O02Q25j339j390J598m24P22j784J644o84R88j481J803j65l74j162
7896a097J248M61q06R50j465O15K71R96j085N9Q4j041P11O09j274p88J117k70
7914g05R18p36j49Q87l62j055Q68L6m78M06R37n73K23Q01o77k98P54l00j092R25
$$ plain form
7786 -139 102 -131 289 323 -291 374 -244 769 356 759 -577 650 -213 526 -39 -1328 -139 954
7804 954 18 -31 43 -204 494 337 -223 707 -691 -344 408 1187 779 -685 231 -1010 500 -878 -302
7823 -302 1300 215 -1197 -668 58 -273 -448 1519 -2222 125 19 319 330 1086 -756 -96 -69 -91 -1591
7842 -1591 1129 1183 -624 637 -575 -665 1023 614 -721 258 -418 -1146 -901 -76 366 438 -1668 -3
7860 -3 362 328 582 650 -352 -497 -183 1018 784 1494 315 -909 -696 -262 327 -597 -258 831 -1392
7879 -1392 -476 126 951 -388 -1778 -180 -604 118 -1666 -22 -706 282 -1199 604 439 65 -1097
7896 -1097 151 612 -194 756 -709 -94 177 1173 88 147 231 -810 -99 510 -764 -1552 -435 -705
7914 -705 213 -523 -672 215 -147 -1202 -334 -298 -776 -370 567 -6 217 1018 341 43 797 497 -595 330
7934C30J3M31r53l31J498j074m26J65R79p61J00P32m23j007J197Lr27J1P27j482
7954a198J311o99m27J690q63O86j122nK46K75l84J120p80L16l88J60l64p08OJ867
7974G39j728J085l6j314J044P43N70p7K13j892l42J832l85o21M18K46j34n61J066
7993H66O93k385M42J098r87K47m71J649j473N81n26P62Pk99Q6k39O35j017N44
8012B13k30k59J139j878P98K78o21J0L39k88P82q94K65P19N2K0j34p27Q04n93
8032b05Q03p83J448r71J39o63M79j28r13J071j24j143J432Q3K09K89n34j073J69
8051d15j48P14k40L31O86j287l22O73J64N86J35r09L62p02j65J17P50j237N00
8070d07N10K13k60J170j228q39L39Q91j157L70M49L12l43j97L23O17J28j259J063
$$ plain form
7934 330 343 774 -179 -510 988 -86 -512 -347 632 -129 -29 703 280 -727 470 473 -454 -443 284 -1198
7954 -1198 113 -586 -1013 677 -186 500 -622 -627 -381 -106 -490 630 -150 166 -222 -62 -426 -1134 -1128 739
7974 739 -989 96 60 -1254 -210 533 1103 1026 1239 -653 -995 837 452 -169 249 495 361 -200 866
7993 866 1559 -826 -384 714 -273 -26 -497 1152 -321 260 -266 496 503 204 290 51 686 -331 213
8012 213 -17 -276 863 -1015 -217 61 -560 -550 -211 -499 283 -611 -346 373 425 445 311 -416 388 -205
8032 -205 598 -185 1263 292 431 -232 247 119 -794 277 153 -990 442 525 734 1023 489 -584 -415
8051 -415 -563 151 -89 242 928 -359 -681 -8 156 742 877 -32 330 -372 -537 -420 330 -907 -407
8070 -407 103 316 56 1226 -2 -841 -502 389 -768 -398 51 363 20 -177 146 763 891 -368 695
8089F95K88J11q53o79Q24K43j206J384j539J174L1j037Q22j491K73O78J95J121
8107A034j961J607l05j684K30k92J870j35j094J042Oq31K77J26L45q48n56M44
8125g25J386l44j461J388j65o59j318J203J401r50Q58l27j75j077J214r46J754
8142A057r57O40R52j745K97k73J212r70J517j968k52K49J056j1q19N92m64l74
8160b61p26K167k100O98J012J44j503j02K564j650p06L90p49O99j267K356m25
8177E41k95M45k49m52N44l61J013r01m36o13J016o67L29J98
$$ plain form
8089 695 983 1094 241 -438 386 629 -577 807 -732 442 473 -564 258 -1233 -960 -282 -87 1034
8107 1034 -927 680 375 -1309 -1079 -1371 499 364 -730 312 318 -513 -236 -110 235 -613 -1169 -725
8125 -725 661 317 -1144 244 79 -580 -1898 -695 706 -244 614 287 112 -965 249 -697 1057
8142 1057 100 740 1692 -53 244 -29 1183 213 1730 -238 -490 -241 815 804 -15 577 113 -261
8160 -261 -987 1180 -920 -222 790 934 -569 -671 1893 243 -463 -73 -822 -123 -1390 966 541
8177 541 246 691 442 -10 534 173 1186 285 -151 -764 252 -415 -86 112
8191A12
$$ Imaginary data points
##PAGE= N=2
##DATA TABLE= (X++(I..I)), XYDATA
0@%%%%%%%%%%%%%%%%nJ12k15K16k16K16l23M30m31N35o42O96q04R65j076J189
32F47j402J617j831K048k283K579k897L237l616M015m466M961n495O081o719P414
48C890q177R005r922J0937j2050J3283j4658J6190j7920J9884k2133K4754k7838
61a4755L1538l6075M1785m9264N9545p4696R9867j52718N21283n72694j9087N93770
73D28499j68983k1777m11225j4726L47334J39138l68161j70347J79423L23707
83B62882k98331K1296m7982m0751K36406l2516j66150o5095J93285J2480k3184
94E2340r5007m8892J31137L5086l7090j71688J18295O1167l8943m8314O0289q6303
106f7923N4194J05944j39159M9860p5279J11334K4050q5220L284k9448J13915
$$ plain form
0 0 0 0 0 0 0 0 0 0 0 0 0 0 0 0 0 0 -5 107 -108 108 -108 108 -215 215 -216 319 -323 373 -431 534 -542 647
32 647 -755 862 -969 1079 -1204 1375 -1522 1715 -1901 2114 -2352 2609 -2886 3195 -3524 3890
48 3890 -4287 4718 -5204 5733 -6317 6966 -7692 8498 -9422 10462 -11671 13083 -14755
61 -14755 16783 -19292 22493 -26771 32774 -41922 57945 -94773 426510 -146184 -165271 428499
73 428499 259516 237739 -173486 -188212 159122 298260 -69901 -240248 -60825 262882
83 262882 -35449 -14153 -62135 -102886 133520 101004 -65146 -130241 63044 75524 52340
94 52340 -42667 -91559 39578 74664 37574 -134114 -15819 45348 6405 -41909 18380 -67923
106 -67923 -13729 92215 -46944 2916 -72363 38971 63021 -22199 -18915 -48363 65552
117F5552K4730j43244m924J64818r6809K6482m8510K895R5088r3792L5749j2334
129A5701K2470k1937K131K0110J9710o8676j305J03709o1948k2013l0976P6511
141E3487J0235n3336l0901L4728N7248n1888l7423k449Q8213o6502j6849K0050
153D613n953K2724l3943O609N8M717j3744K2381l6909K1759j3231j297M0978p7793
167e9031L2444L5765k2753l7262K6479J3894Q483l6858m510N4263l2951J0058
179a1979l0768L6938K7933n2013q692N9406r690m5416K9255J21M0377n4608K424
192a6712L2062J883j123m2817L6933K9069k5950l9299N9466j7627j667j246q767
205D205L2387l3407J9944j2900J4288p968j61j736J5851j8247k0866N4627m3482
$$ plain form
117 65552 90282 -52962 -57886 106932 10123 36605 -11905 -9010 86078 -7714 28035 15701
129 15701 38171 16234 18365 38475 58185 -10491 -11796 91913 29965 7952 -23024 53487
141 53487 63722 10386 -20515 14213 71461 19573 -17850 -20299 67914 1412 -15437 4613
153 4613 -1340 21384 -12559 -5950 -5892 -1175 -14919 7462 -29447 -7688 -20919 -22216 18762 -59031
167 -59031 -26587 9178 -13575 -50837 -24358 -10464 -1981 -38839 -43349 10914 -22037 -11979
179 -11979 -42747 -5809 22124 -29889 -38581 20825 11135 -34281 -5026 -4905 35472 -19136 -16712
192 -16712 15350 17233 16110 -26707 10226 39295 13345 -25954 33512 15885 14218 12972 4205
205 4205 36592 3185 23129 10229 24517 16549 16388 14652 30503 12256 -8610 46017 2535
218B535Q729q677J7583n663j7257M325P561P458l3622K7382k0222L0163l7601
231a7306j829L8683k8465l724j2036L2309j5721o345j9812L6827q099j8064P155
244a6427j6160M8054m4627O717M658J2284q230p260Q124j562J4253k9050L5423
257F197k5581J5231m893J15J7490k7313K0080m297J6601k3459J3345n445J6324
270A4395m234j7396K6582k1784K5462j6843N525m466P864q07J950O56k2741L3898
284B8061j4189J0327l0500J3920K2360j5459p699j1838K6376n924L03k9424K5382
297A1696M250j1224j094j3721K6244j9796O778o216K590p378O786Q26o645L012
311c892k1007L1171j5029k922o495N401J1797j2352j207o360J6092q977P535j7174
$$ plain form
218 2535 11264 2587 20170 14507 -2750 1575 9136 16594 -17028 10354 -9868 20295 -17306
231 -17306 -19135 19548 -8917 -12641 -24677 7632 -8089 -14434 -34246 2581 -5518 -23582 -16427
244 -16427 -32587 15467 -29160 -22443 -17785 -5501 -13731 -20991 -12867 -14429 -176 -29226 6197
257 6197 -19384 -4153 -9046 -8931 8559 -18754 1326 -2971 13630 -9829 3516 -1929 14395
270 14395 10161 -7235 19347 -2437 23025 6182 11707 7241 15105 14298 16248 16904 -5837 28061
284 28061 13872 24199 -6301 7619 29979 14520 6821 -5017 21359 15435 15738 -13686 11696
297 11696 15946 4722 3628 -10093 16151 -3645 3133 -3083 -493 -7871 -1085 -259 -6904 -3892
311 -3892 -24899 6272 -8757 -11679 -18174 -12773 -976 -13328 -14535 -20895 -4803 -13780 -6245 -23419
325b3419J0544M100m644J0478j7321R955L987Q041j4395J023M333J3325n552j5330
339a4875J5576j812J1829j3894J21R796J087k673j151K937k327P579q105J1013
353A5101p902n63N362J226M143j4064O010P473M20j3707N161K461N073l926j2764
368d96R057k01M730r979k732M664M413q007j946N13j687Q350j2673K302k461K623
384c530P78m510m111M868K350p431L125p302J1973p578j932N208l987J044l29
399a1364J272j912M959q397R494j766R61k036k769J2364o483n6k172Q104n34n73
415i08m179N242N192o286L914m156R451k844M3j85K082K171m373N032m967P263
431A2492o475N769j197l387K887k123L904m588K369l902L877l772L642l401j830
$$ plain form
325 -23419 -12875 -8775 -13419 -2941 -20262 -10307 -6320 1721 -12674 -11651 -7318 6007 455 -14875
339 -14875 701 -1111 10718 -3176 -3055 6741 7828 5155 4004 6941 4614 12193 4088 15101
353 15101 7199 6636 11998 13224 17367 3303 9313 16786 17206 3499 8660 11121 16194 12268 -496
368 -496 8561 8360 13090 3111 379 5043 9456 1449 -497 16 -1671 6679 -5994 -3692 -6153 -3530
384 -3530 -2752 -7262 -11373 -6505 -4155 -11586 -8461 -15763 -3790 -11368 -13300 -8092 -12079 -11035 -11364
399 -11364 -10092 -12004 -7045 -15442 -5948 -7714 -6753 -8789 -11558 806 -5677 -5733 -7905 199 -335 -908
415 -908 -5087 155 5347 -939 2975 -1181 8270 5426 5469 5284 7366 9537 5164 10196 5229 12492
431 12492 6017 11786 10589 7202 10089 7966 11870 7282 9651 5749 9626 5854 9496 6095 4265
446D265M180o531M326n844L008j132J512l638k981J964k110L930j0956P624m329
461f712K662k694l330N495m206J970n127O489m641J462k807L913K10n510N856
476f970l055O285p204K200K021R88Q84l680M078M20N439p907N100N82J847J659
492B687m273L198l17P220p277M584l438M904L56l292L673j595M500m176R80M76
508H210K693l113J582j32l285N462n669M220n023J994Q95l064K266k795j262m88
524B491L070m643P59m182M461k63n799J925j741K419m052j051p68L497j330k986
540h193NL63K267m356M67J669K72m79O68j164L64J884k589L224k244L209q96J051
558d478Q55j074R84J730O16L94M96j470L056k47K860j864J373O63M99P74j012
$$ plain form
446 4265 8445 1914 6240 396 3404 2272 3784 146 -2835 -871 -2981 949 -10007 -2383 -6712
461 -6712 -4050 -6744 -10074 -4579 -8785 -6815 -11942 -5453 -10094 -8632 -11439 -7526 -7316 -12826 -6970
476 -6970 -10025 -3740 -10944 -8744 -6723 -5735 -4851 -8531 -4453 -4033 1406 -6501 -1401 -819 1028 2687
492 2687 -1586 1612 1295 8515 1238 5822 2384 7288 7644 4352 8025 6430 10930 6754 7734 8210
508 8210 10903 7790 9372 9240 5955 11417 5748 9968 4945 6939 7834 4770 7036 4241 2979 2491
524 2491 5561 918 1677 -2505 1956 1693 -4106 -2181 -3922 -1503 -5555 -6606 -7374 -3877 -5207 -8193
540 -8193 -8188 -7825 -5558 -9914 -9447 -7778 -7506 -7985 -7317 -8481 -8117 -6233 -8822 -5598 -7842 -4633 -5529 -4478
558 -4478 -3623 -4697 -3713 -1983 -1367 -973 -477 -1947 1109 862 3722 1858 3231 3894 4393 5167 4155
575D155J471O15p7n63J74L360k92j356j626K209m80L80l90L66j05j56j168j569
593D948K312k915n11M72m09o77p65r23r48M26j312M53j887O34j326r15J5j896
611e224N59j070O37l41l38k478Q10p7K9o20r93K464r62R93j214k6L124o26j9j862
631g234L242l67K110l618K244J408J254l39j310K537P53J748l356M427r87J270
647C782k28J21K583k073K256j715J467R27J52j786L81K931k170K78j471L646l246
664E835J131r9l22q00j939O20n62O20k309M03j249j88J041l544J940k223J833
681A88k228q65L54j471o54K84j44k585K829l541J905n49M81j643R75P89j979J930
699e924j805L404k354J250l92l96L617k261P99m71K377j004J486p57J924J164
$$ plain form
575 4155 5626 6241 6164 5601 5775 9135 8843 7487 5861 8070 7590 7970 7580 7946 7841 7685 6517 4948
593 4948 7260 4345 3834 4306 3897 3220 2455 1532 584 1010 -302 151 -1736 -1102 -2428 -3343 -3328 -5224
611 -5224 -4665 -5735 -5098 -5439 -5777 -8255 -7445 -7522 -7493 -8113 -9106 -6642 -7604 -6611 -7825 -7851 -4727 -5353 -5372 -7234
631 -7234 -3992 -4359 -2249 -5867 -3623 -2215 -961 -1300 -2610 -73 680 2428 -928 3499 2512 3782
647 3782 3554 3675 6258 4185 6441 4726 6193 7120 7272 5486 5867 8798 6628 6906 5435 9081 5835
664 5835 6966 6867 6545 5745 3806 4426 3864 4484 2175 2578 1329 1141 2182 -1362 578 -1645 188
681 188 -2040 -2905 -2551 -4022 -4676 -4392 -4536 -7121 -4292 -7833 -5928 -6477 -5996 -7639 -6664 -5875 -7854 -5924
699 -5924 -7729 -4325 -6679 -5429 -5821 -6217 -2600 -4861 -4062 -4533 -2156 -3160 -1674 -2431 -507 657
715F57q16R38m37K352j110J527q51J676J90kJ457j173J458L13k48k74M54m0l71
734E700J314n32P28k120J334j436J130j738L43J369j971M15k112J077j201k93
750B007m84Q4q36j760Q39j458J277k540Q71j123o79Q85j968j98j750J620j012
767f225J009q73J16K81j368n11Q21P94m71J557n50%Q17k38K93J740O67j862N73
786c430Q23J399m01P34J093Q29M99j44J67R50J932j601R32O0J463p98J4J036n39
805E018J823j245L72n28J090j06j445P33o34M83j161j86N47n95j294N49j093P28
823C056j385j4P37j915L86k173J166j035r10k75q78J294k816J827k211Q63R97
840c286j841K4p43J410j626J869k116J424j626RQ43pJ030k49Q43O87K22l15J411
$$ plain form
715 657 -159 779 342 2694 1584 3111 2260 3936 4126 4124 5581 4408 5866 6179 5931 5657 6111 6071 5700
734 5700 7014 6482 7210 5090 6424 4988 6118 4380 4723 6092 4121 4536 2424 3501 2300 2007
750 2007 1523 1607 771 -989 -150 -1608 -331 -2871 -2000 -3123 -3802 -2917 -4885 -5083 -6833 -5213 -6225
767 -6225 -5216 -6089 -5973 -5692 -7060 -7571 -6750 -5956 -6427 -4870 -5420 -5420 -4603 -4841 -4548 -2808 -2141 -4003 -3430
786 -3430 -2607 -1208 -1609 -875 218 1047 1546 1402 1569 2519 4451 2850 3782 3842 5305 4507 4521 5557 5018
805 5018 6841 5596 5968 5440 6530 6424 4979 5712 5078 5561 4400 4214 4761 4166 2872 3421 2328 3056
823 3056 1671 1657 2394 479 865 -1308 -142 -1177 -2087 -2362 -3240 -1946 -4762 -2935 -5146 -4283 -3286
840 -3286 -5127 -5103 -5846 -4436 -6062 -4193 -6309 -4885 -6511 -6502 -5659 -5666 -4636 -4885 -4042 -3355 -3133 -3448 -2037
859b037r32N02K295j389K441k174K823l55p34J601j7m73P11R42n51J329j736K763
877E009L16q90q1K91R32k11l93l02P06L65j403J070j490J744n22n99j224J179
895D497o36k470J116j695O48j647R99q54K95j680J091j586q0J14j644L69j501
912d664O36k55n25M19j296J565k99m96j82k13q2k37R03l54J365j048j005J622
930d146J669j555K279m90k32Q47r80J777j9J286n9k30J411O95J90r70J959J45
948C577j1q41L45K183j438j42j057L350k543J504n42M67n74L73k01J84o75q92
966C067J476Q5j096j567O37J303j887m35p40L44j238J55o75j233O78j71k78j334
984b909k15k30p4r2q83L3J563p51j955K065j815J765l49j817J460n94m6j623K953
$$ plain form
859 -2037 -2969 -2467 -172 -1561 880 -1294 1529 1174 440 2041 2024 1551 2262 3204 2653 3982 2246 5009
877 5009 5325 4435 4354 4645 5577 5366 4973 4671 5377 5742 4339 5409 3919 5663 5141 4542 3318 4497
895 4497 3861 1391 2507 812 1460 -187 812 -42 253 -1427 -336 -1922 -2002 -1888 -3532 -3163 -4664
912 -4664 -4028 -4283 -4808 -4389 -5685 -4120 -4419 -4915 -5097 -5310 -5392 -5629 -4726 -5080 -3715 -4763 -5768 -4146
930 -4146 -2477 -4032 -1753 -2243 -2475 -1628 -2608 -831 -850 436 377 147 1558 2253 2443 1473 3432 3577
948 3577 3566 2725 3070 5253 3815 3673 2616 5966 3423 4927 4385 4852 4278 4651 4450 4634 3959 3067
966 3067 4543 4628 3532 1965 2602 3905 2018 1583 843 1187 -51 104 -571 -1804 -1126 -1297 -1575 -2909
984 -2909 -3124 -3354 -3428 -3520 -4403 -4370 -2807 -3558 -5513 -3448 -5263 -3498 -3847 -5664 -4204 -4798 -4844 -6467 -3514
1003c514j067J157O4o09J621k7J08L42J725j588K479l96O49j184J426O49K77K65
1021B377K14R61j400J553p39N67J10l88J282q30K99J97m40Q45q13J519r49K19
1039D584q80K88j350m33R48o16m84k52J35k613Q03r07J381j595n16J039j490O71
1057a287o93o54R46p33j361J345j860K85L63m55l77k4M86j050K300j927R09j152
1075d939J007J414j558R22j029J060R10M16N8K58O49n96J350n86J395o22R95o23
1093D81J152N16NJ035k09P90j348J403m15L50m82l58O45j57J561j825J076l97
1111C823N58n89j305K023j335K63j454P7m56J699k259Q79l41j492N88k096J550
1128A33k012J594j097p71M75k28Q59k321N4k00O99l22r6j117K81N73j29m5p66
$$ plain form
1003 -3514 -4581 -3424 -3360 -3969 -2348 -2375 -2267 -1925 -200 -1788 691 295 944 -240 1186 1835 2112 2377
1021 2377 2591 3552 2152 3705 2966 3533 3643 3255 4537 3707 4006 4203 3763 4608 3795 5314 4365 4584
1039 4584 3704 3992 2642 2209 3157 2541 2057 1805 1940 -673 130 -777 604 -991 -1507 -468 -1958 -1287
1057 -1287 -1980 -2634 -1688 -2421 -3782 -2437 -4297 -4012 -3649 -4104 -4481 -4505 -4019 -5069 -2769 -4696 -3787 -4939
1075 -4939 -3932 -2518 -4076 -3154 -4183 -3123 -2213 -1797 -1739 -1481 -832 -1428 -78 -664 731 109 1104 481
1093 481 1633 2149 2154 3189 2980 3770 2422 3825 3410 3760 3278 2920 3565 3408 4969 3144 4220 3823
1111 3823 4381 3792 2487 4510 3175 3438 1984 2061 1605 3304 1045 1924 1583 91 679 -1417 133
1128 133 -1879 -285 -1382 -2153 -1678 -1906 -1047 -3368 -3314 -3514 -2815 -3137 -3233 -4350 -4069 -3496 -3625 -3670 -4436
1147d436J695j371J091n27L2J265l79M91j169J312Q82n53M57k38Q1J067R15r88
1165c73R35j78P30J165NM72o80Q75p84J181l70m09M01J282k01o49O10j029P45
1184C728k52L02j081J799j874P14r40k75J072j076K5j064J575j840p62R18m96
1201D73L20j731K71k49M92j773J06l17o07R95m00L69j760M87k78p28k04J050o08
1220d092m28M70R68j034j027K944j550J235N3M37N1J66K53K00R52j045Q94J80
1238c73N79K47O67j79L13M52m23J67%Q24KJ82k43R28n19L39P47n81K044k402J141
1259C912P85j621O78l84o44m62J361j867R99j090m50J941l621K516q64l18R14
1276A785k912Q90j255M50K31j215P68j988P28n61l76J544J278k667J340j069J083
$$ plain form
1147 -4436 -2741 -4112 -3021 -3548 -3516 -2251 -2630 -2139 -3308 -1996 -1114 -1667 -1210 -1448 -1367 -300 615 -373
1165 -373 562 384 1114 2279 2284 2756 2076 2951 2167 3348 2978 2569 2970 4252 4051 3402 4012 2983 3728
1184 3728 3476 3778 2697 4496 2622 3336 2396 2121 3193 2117 2142 1078 2653 813 51 969 473
1201 473 793 -938 -667 -916 -424 -2197 -2091 -2408 -3015 -2020 -2420 -2051 -3811 -3324 -3602 -4330 -4534 -3484 -4092
1220 -4092 -4520 -4050 -3082 -4116 -5143 -2199 -3749 -2514 -2461 -2024 -1973 -1807 -1554 -1354 -402 -1447 -553 -373
1238 -373 206 453 1120 941 1254 1706 1283 1450 1450 2274 2276 2458 2215 3143 2624 2963 3710 3129 5173 2771 3912
1259 3912 4697 3076 3754 3370 2726 2264 3625 1758 2757 1667 1217 3158 -463 2053 1189 871 1785
1276 1785 -1127 -237 -1492 -1042 -811 -2026 -1258 -3246 -2518 -3079 -3455 -1911 -633 -3300 -1960 -3029 -1946
1293a946j093q55J452j632J413n87P58n51O92m24J189M97j393J432n94N13r12
1310b041J392R95Q73r63L78j597J221K106j130N52r0P2j2K58J59J136r13J098
1328C494Q54p98q40J156j162k41RJ95O19n01j387J938p22p73N44n9m13q18k44
1347H51q01N76j388R41P25k687J497r99L7R65k291J071Ml25Q91l328J892j082
1365c451J250m33j77p75M4J252m50J204j019J546j694J564p59N66j322L44r33
1382c243K231p08M48K182j301R20K0L36L87j384J579m57Q37N78R63k098J231q6
1400B435L0N85o76K235k576O12o95M38n8J063j674J680K03q40j770N20M5K5P21
1419B303j135r54Q21j858R6K74O74j30M31k227P96q06J10K76j079l6J430j365
$$ plain form
1293 -1946 -3039 -3894 -2442 -4074 -2661 -3248 -2490 -3041 -2349 -2773 -1584 -1087 -2480 -1048 -1642 -1129 -2041
1310 -2041 -649 346 1219 256 634 -963 258 2364 1234 1786 1696 1768 1756 2014 2173 3309 2396 3494
1328 3494 4348 3550 2710 3866 2704 2463 2472 2667 3286 2785 1398 3336 2614 1841 2385 2326 1913 1095 851
1347 851 50 626 -762 179 904 -1783 -286 -1285 -1248 -283 -2574 -1503 -1499 -1824 -933 -4261 -2369 -3451
1365 -3451 -2201 -2634 -2811 -3586 -3542 -2290 -2740 -1536 -2555 -1009 -2703 -1139 -1898 -1332 -2654 -2310 -3243
1382 -3243 -1012 -1720 -1272 910 -391 529 549 885 1272 -112 1467 1010 1847 2425 3388 1290 2521 2435
1400 2435 2465 3050 2374 4609 2033 2645 1950 2388 2330 3393 1719 3399 3602 2762 992 1512 1557 1582 2303
1419 2303 1168 214 1035 -823 -727 -453 221 91 522 -1705 -909 -1715 -1605 -1329 -2408 -2444 -1014 -2379
1437b379k53N11j270l1K383r38j164l23J242l70j38r58K148j287m16J115m97J146
1455a479j023M95N71K22l38L97N86M84R42r13O25J029n80P22r3J473j227J087
1473B980p99L12K62P95p00o31R25L8l85l12O63r69k11L43N71p34n1l9j638J424
1493A844m42p19P45k72K98p42J06n12j371k36J585k026J475j527m18O27rj04j115
1512b813P47m63K97k18m05L89q27O95J147q33L52p93J77J19Q52l03J721j849J400
1531f08o82L40q75J408R11j185R11L37N21k79J32J76J259j897J714k18J18K32
1549B315n64J473j089k85K89J912j168P57j549J309j321q23J369j346N38Q35L46
1566B998k196N48J13M90j626J139j741N10m1K66j328J91j063M25j45L22J81j003
$$ plain form
1437 -2379 -2632 -2121 -3391 -3422 -1039 -1977 -3141 -3464 -2222 -2592 -2730 -3688 -1540 -2827 -3243 -2128 -2625 -1479
1455 -1479 -2502 -2007 -1436 -1214 -1552 -1155 -569 -85 857 -56 569 1598 1018 1740 1647 3120 1893 2980
1473 2980 2181 2493 2755 3550 2850 2219 3144 3182 2797 2485 3148 2179 1968 2311 2882 2148 2097 2058 420 1844
1493 1844 1402 683 1428 1156 1454 712 818 306 -1065 -1301 284 -1742 -267 -1794 -2212 -1585 -1594 -1698 -2813
1512 -2813 -2066 -2529 -2232 -2450 -2855 -2466 -3293 -2598 -1451 -2284 -1932 -2725 -2548 -2429 -1577 -1880 -159 -2008 -608
1531 -608 -1290 -950 -1825 -417 494 -691 220 557 1078 799 931 1107 2366 469 2183 1965 2083 2315
1549 2315 1751 3224 2135 1850 2139 4051 2883 3640 2091 3400 2079 1256 2625 1279 1817 2652 2998
1566 2998 802 1350 1463 1953 327 1466 -275 235 194 460 -868 -677 -1740 -1315 -1460 -1138 -957 -1960
1584a960m44j028J518L09r29j006J528n43P57r64M51n8J148j394Q60n6j6R87p77
1603a617K76N3N04l71M75R04k93q6K2L12l22o68P49J347o05N13L09k5O79n18J372
1624C010m13p50J51l69J21N98o4j11M99J87j29p31P36N55q99p84j46M6m59P71
1644A819n13r67j63k06o7o8O69o18k54k0j456N2j049J161q33N84j04n66Q40r61
1664b720l77M40j84K02j97J10N08q50Q52m49J32P74N28j97K49O38q97l82M4J203
1684e73O56p33P72J17J047p60J75j022J848m51R44O23o15Q5k59R58P73o66l29
1703B590j361J615R45j233Q20j511l14J112q79l14r3l03L67M4J219k058l45j56
1721A45M43q4J50j099j88O16j194J960j513J67j729R82N04r85l67J823j890j309
$$ plain form
1584 -1960 -2404 -3432 -1914 -1605 -2534 -3540 -2012 -2555 -1798 -2762 -2311 -2369 -1221 -2615 -1755 -1811 -1827 -840 -1617
1603 -1617 -1341 -1288 -784 -1155 -680 224 -69 -155 -133 179 -143 -811 -62 1285 680 1193 1502 1477 2156 1638 3010
1624 3010 2597 1847 1998 1629 1750 2348 2284 2173 2672 2859 2730 1999 2735 3290 2391 1607 1461 1507 1048 1819
1644 1819 1306 339 176 -30 -97 -165 504 -114 -368 -388 -1844 -1792 -2841 -1680 -2513 -1929 -2033 -2599 -1759 -2720
1664 -2720 -3097 -2657 -2841 -2639 -2836 -2726 -2218 -3068 -2216 -2665 -2533 -1759 -1231 -1428 -1179 -541 -1438 -1820 -1776 -573
1684 -573 83 -650 122 239 1286 526 701 -321 1527 1076 2020 2643 2028 2113 1854 2812 3585 2919 2590
1703 2590 1229 2844 3789 2556 3376 1865 1551 2663 1784 1470 1377 1074 1441 1485 2704 646 301 145
1721 145 588 504 654 -445 -633 -17 -1211 749 -764 -597 -2326 -1344 -840 -1825 -2192 -369 -2259 -3568
1739c568J222k96L34K47j06o91L62K46p62J215j8n50Q67M60L26q34K62L37J583
1758F36p68O0M61j296J576k40m6K84O45j026J833j623J041n02J683j298R84m83
1776A921M5n88R7J850n06j045J97o98R19O04m87j061K4O44k24j236M30J58Jj092
1796d7PK04J22n92l22L31j233Q63Q55j431k2k09o40L68o72N1Q20j219R44r01R79
1817a744m47M24j468R45r7J367l25p94M04N91j96o58R72K25L36J2O7mk51J181
1837E40k06k61L88P19q82K67J818R8j013L06l39L98j19P07p21N61O87o08K7n60
1857A807J286j262l27O05q88J23J16p39J35M7k33m62M82r48O4M15O75j588O93
1876Aj135N26j233N49J80L05k08k07J012p76o17r61J073o99O64l18j43R36j8J37
$$ plain form
1739 -3568 -2346 -2642 -2308 -2061 -2167 -2858 -2496 -2250 -3012 -1797 -1815 -2365 -1498 -1038 -712 -1546 -1284 -947 636
1758 636 -132 -72 389 -907 669 429 383 667 1312 286 2119 496 1537 1035 2718 1420 2404 1921
1776 1921 1966 1378 1475 3325 2819 1774 1971 1273 2192 2796 2309 1248 1272 1916 1692 456 886 1044 1045 -47
1796 -47 -40 164 286 -306 -628 -297 -1530 -667 188 -1243 -1265 -1474 -2114 -1746 -2418 -2367 -1547 -2766 -1822 -2723 -1744
1817 -1744 -2191 -1767 -3235 -2290 -2387 -1020 -1345 -2139 -1735 -1144 -1340 -1998 -1026 -801 -465 -453 -386 -390 -641 540
1837 540 334 73 461 1180 298 565 2383 2481 1468 1774 1435 1833 1714 2421 1700 2261 2948 2340 2367 1807
1857 1807 3093 1831 1504 2109 1221 1344 1460 721 856 903 670 208 690 -258 -194 221 896 -692 1
1876 1 -1134 -608 -1841 -1292 -1112 -807 -1015 -1222 -210 -986 -1603 -2564 -1491 -2190 -1526 -1844 -1987 -1051 -1069 -932
1896i32o50l66O1J142j14O40k41j730J649L0p58j98K217j083N26J72n72J086n1
1915H28p71m82K285q19M62r5P30J601k716R41l15J528j342n14P08j069K42J182
1933B384K88j038n27M82Q34r96p34M11J73j086n71J260p21p61K14l67J145o46
1951b56n77J89L69K42o99k91l72Q21j600P09Q17k01j289O04k99l99N10k72Q47
1970a147J13j384J046k55N17l75K02j13O10k0L35J31k1n16J51J696j044O66o02
1989a0J034j121K79J070L02O6M0m04j78Q75p55J76P84j537J254L32p85j103J357
2008A676J17qj14n59l95J295j2j209P50j278q63J226P27j253l13M97L67n60j651
2027a560J546p13k84k18K54K17m74M7j178J718j309L55n51O03K27n7m78R30j038
$$ plain form
1896 -932 -1582 -1948 -1887 -745 -859 -219 -460 -2190 -541 -511 -1269 -1467 750 -333 193 365 -207 879 828
1915 828 57 -425 1860 1041 1503 1408 2138 3739 1023 1964 1649 3177 1835 1321 2029 960 1202 2384
1933 2384 2672 1634 1107 1589 2423 1427 693 1104 1277 191 -380 880 159 -602 -388 -755 390 -256
1951 -256 -833 -644 -275 -33 -732 -1023 -1395 -574 -2174 -1465 -648 -849 -2138 -1534 -1833 -2232 -1722 -1994 -1147
1970 -1147 -1034 -2418 -1372 -1627 -1110 -1485 -1283 -1396 -786 -806 -471 -340 -361 -877 -726 970 -74 592 -10
1989 -10 1024 -97 182 1252 1554 1620 1660 1256 1078 1953 1198 1374 2158 621 1875 2207 1422 319 1676
2008 1676 1793 1785 1671 1112 717 2012 2000 791 1541 263 -600 626 1353 100 -213 284 651 91 -1560
2027 -1560 -14 -727 -1011 -1229 -975 -758 -1232 -1185 -2363 -645 -1954 -1599 -2150 -1547 -1320 -1377 -1855 -925 -1963
2046a963m25J211q7L51K51m79K74P47j06l56L03O37o35l86K532k192L10J081p47
2065C21O45o90O67j56N37n49K14L37j73N58k00L25K89j12r09P51j533O29M01q53
2085D99J575l06k35J16Q54j892Q37j361J006j45j205K66P79j030p82L9Q47o84
2103h22j89J233j128m99M60j49O08o5j484J207j379J553p20o69P75O93k54L13
2121e16j497J13Q47p38J138p68J481j464J094l142L518P98p01j112M84K82K77
2138I4R7o66J587P4n28K02o40M10R13M63m53R0l73m9Q97j441n86M02O45R17k151
2159i6J199J797j798m80M41m79J324n28m36j019P37o60k02L79L93Lj208n8J250
2178E59k094K55R76p61k85L56j24O56q47L70k31j31J28l32J571k499J28R43P36
$$ plain form
2046 -1963 -2388 -1177 -1264 -913 -662 -1141 -867 -120 -226 -582 -279 358 -277 -663 1869 -323 -13 1068 321
2065 321 966 276 943 787 1324 775 989 1326 1153 1711 1511 1836 2125 2013 1104 1855 322 951 1352 499
2085 499 2074 1768 1533 1649 2503 611 1448 87 1093 948 -257 9 788 -242 -1024 -985 -138 -822
2103 -822 -1011 222 -906 -1405 -945 -1094 -486 -551 -2035 -828 -2207 -654 -1374 -2043 -1268 -575 -829 -516
2121 -516 -2013 -1900 -1053 -1791 -653 -1421 60 -1404 -310 -3452 66 864 163 -949 -465 -183 94
2138 94 191 -475 1112 1186 658 860 220 630 1543 2006 1553 1643 1270 1221 2118 677 91 493 1138 2055 -96
2159 -96 1103 2900 1102 622 1063 584 1908 1380 944 -75 662 2 -200 179 572 575 -633 -691 559
2178 559 -1535 -1280 -304 -1065 -1350 -994 -1118 -462 -1309 -939 -1170 -1301 -1173 -1505 66 -2433 -2305 -1362 -626
2197f26l26j081J044Q88n27j8N65r84J141l07L2N4K85L26o23K8N27J61Q01j409
2217d9J534j012M3J233r41j03J241j051J482j140K58M9o04Q27l48N72o58K32j131
2236D34J179N6o87n90N6J176j300Ln79M31l37M25p97P30p49J18J030o88m28j216
2256a733J337q74o15K26r43J235l7M58p68J215r07j79J045n46r6j53Q00k51m96
2275a282Q8J207n6j03J20j017Q55m79m19R11J463q65q61J290K03o98j008J843
2293A192l60L96o48J77M51K41J02N8J005k030N29J463k442J995j612J011k40R69
2311B257n54j224J099j123P14k75O9m61N3p27R2J57J20k53P1N83j212n71J125
2330f0p78p31N21O57q05R9q21R81j151J196j109J473o81m14M87pO49j38j01m9
$$ plain form
2197 -626 -952 -2033 -989 -101 -628 -646 -81 -1065 76 -231 -199 -145 140 466 -157 -129 398 559 1360 -49
2217 -49 1485 473 516 1749 808 705 1946 895 2377 1237 1495 1544 940 1767 1419 1991 1333 1565 434
2236 434 1613 1669 982 392 448 1624 324 327 -252 179 -158 267 -530 200 -549 -431 599 -89 -517 -1733
2256 -1733 -396 -1270 -1885 -1659 -2602 -1367 -1404 -946 -1714 -499 -1406 -1585 -540 -1086 -1182 -1335 -535 -786 -1282
2275 -1282 -1194 13 -43 -146 -26 -1043 -188 -667 -1086 -175 1288 423 -438 852 1055 357 -651 1192
2293 1192 832 1228 580 757 1208 1449 1551 1609 2614 584 1113 2576 134 2129 517 1528 1288 2257
2311 2257 1703 479 1578 455 1169 894 963 502 555 -172 -80 77 197 -56 15 598 -614 -1185 -60
2330 -60 -838 -1569 -1048 -391 -1196 -1097 -1918 -937 -2088 -892 -2001 -528 -1209 -1623 -1136 -1143 -494 -632 -733 -782
2350g82j91J87l02M56J100j105J194p59P19j721J941l55R22j929J153O3J05m09
2368B87j20j82K283j88j006K79l01J028o28O72j338Q59p29O98l96L10j123L74
2386G79M59J073k220J45J020j392J206p55O77k80j091J753j957J06J48k19K44
2403c04j483J958j375N14l05o69m65N97P17N91j568J150j220M17J423j153j065
2420b240J925r31j14J739j124J145R5j175r37J420o88j52L84J188P72m93p80M09
2438D43N67N98r50j78O63l39J36o08O92Q9P83l51j262J282k0J034j407L47k33
2457A286M11N02r69n41l28J018j658J585q60P00k87j230J022o31l37n2J46J125
2475I02j37j810M08N64j97K80n36K49j243M19o45P37K16q40R93k9j67j364J842
$$ plain form
2350 -782 -973 -786 -1088 -632 468 -637 557 -202 517 -1204 737 382 1304 -625 528 591 696 287
2368 287 167 -15 2268 2080 1074 1353 1052 2080 1452 2124 786 1645 916 1614 1218 1528 405 779
2386 779 1238 2311 91 236 1256 -136 1070 315 992 712 -379 1374 -583 -477 -329 -548 -304
2403 -304 -1787 171 -1204 -690 -995 -1664 -2129 -1532 -815 -224 -1792 -642 -1862 -1445 -22 -1175 -2240
2420 -2240 -315 -1246 -1360 379 -745 400 495 -680 -1617 -197 -885 -1037 -653 535 1307 814 34 443
2438 443 1010 1608 658 480 1143 804 940 332 1024 1113 1896 1545 283 1565 1545 2579 1172 1519 1286
2457 1286 1697 2199 1230 689 361 1379 -279 1306 446 1146 859 -371 651 20 -317 -369 -223 902
2475 902 765 -1045 -637 -73 -270 10 -526 -277 -1520 -1101 -1746 -1009 -793 -1633 -640 -669 -836 -2200 -358
2494c58p86M39l78p4R61o76Q38j347J736j864J205j35m94M09J23J73n99J397K41
2513H11K16q11M68n07R53M03j321N57K45%m44J265m40M6Q3J45r45N88L54K75q97
2534A044q29O01M62l11K4r85J043l13j413J708m42p50L63r61k8J122j348j25O86
2553d52P90r45M57n66M2k54K22k02l6N53p63m82J022l67q19K05r24O18R06M37
2573e58j308J07L68J9J3K07M10J526j384M46R52n11J77l74r4J51O49p22R59r51
2593H2J099l7o82R28m4P7j69p04L96K24k67J78l13M43M87j42j309l38J585o08
2613H86j34q69M61j59k37Q77m38j64j660J404L99p59l72J141n23n49L5p5j66l99
2633a301pO81K50n07j702J842p40k69L07N04K95m41l22J041m30j134K223j428
$$ plain form
2494 -358 -1144 -705 -1083 -1157 -196 -872 -34 -1381 355 -1509 -304 -439 -933 -524 -401 -228 -827 570 811
2513 811 1027 216 684 177 1130 1533 212 769 1014 1014 570 1835 1395 1441 1524 1669 724 1312 1666 1941 1044
2534 1044 215 816 1278 967 991 6 1049 736 -677 1031 589 -161 202 -759 -787 335 -1013 -1138 -452
2553 -452 338 -607 -150 -716 -674 -928 -706 -908 -944 -391 -1154 -1636 -614 -981 -1800 -1595 -2519 -1901 -995 -558
2573 -558 -1866 -1759 -1391 -1372 -1359 -1152 -742 784 -600 -154 798 287 464 90 -4 147 796 74 1033 82
2593 82 1181 1144 462 1390 1346 1423 1254 550 946 1170 903 1081 768 1211 1698 1556 247 -91 1494 886
2613 886 752 -117 344 185 -52 825 387 223 -1437 -33 366 -393 -765 376 -147 -696 -661 -736 -902 -1301
2633 -1301 -1308 -627 -377 -884 -2586 -744 -1484 -1753 -1446 -942 -647 -1088 -1410 -369 -799 -1933 290 -1138
2651a138O01R90k308J096M82l5k22J256m90M6l07P96k87k23m16M64Q71j91K18
2670A203j103J922j205Q03j783J071N88p54J134j634J402j47j482J271j158j22
2686FP13J283p10L5j126m70l68N97j0n26J374k085N63j50K48K12l28J59j376K624
2706F65j459l42Q80q27Q86l59l02j56O25o32p41J446j231k52J579m94k34q14L33
2725a429J378n97j01J531p49j204L96J040N07k42j75k82R86K69l10j735J744m69
2743E58R53j259P49n68N37j26M75L02j720J217o59J67J27Q55N22k288J181o39
2761C84J174j472J152k75j061m22P82M5j003J119r88n57J52J403N51O0p76j59
2779A09m71r17L38m78M00J00K02l8o07r32O76J25J417J63k192R98K44m97J420
$$ plain form
2651 -1138 -537 453 -1855 -759 -277 -312 -534 722 232 278 -29 767 480 257 -159 305 1176 985 1203
2670 1203 100 2022 817 1620 -163 908 1496 742 1876 242 1644 1497 15 1286 128 6
2686 6 719 2002 1292 1327 201 -269 -637 -40 -50 -576 798 -1287 -724 -874 -626 -414 -742 -583 -1959 665
2706 665 -794 -1136 -256 -1083 -197 -556 -858 -1014 -389 -1021 -1762 -316 -1547 -1799 -220 -714 -948 -1762 -1429
2725 -1429 -51 -648 -749 782 33 -1171 -775 265 772 530 355 73 1059 1328 1018 -717 1027 558
2743 558 1511 252 1001 433 970 844 1319 1621 -99 1118 459 626 753 1608 2130 -158 1023 384
2761 384 1558 86 1238 963 -98 -520 262 307 -696 423 -565 -1122 -970 433 984 1044 268 109
2779 109 -362 -1279 -941 -1419 -1019 -919 -717 -755 -1362 -2294 -1618 -1493 -76 87 -2105 -1107 -863 -1360 60
2798F0m10j737J687P56p34l97N54K44m0o73R73l99R21q19O60m11k84j58N09J072
2818A374m37p02N88K02K11P33j583J016o32k36L10k94J661j414N21q58N70j54
2836H76K64j411j61Q98m85J064j678j75Q60N03N1o12N57m06m4K46P52k456R8J097
2856a62j182J480M04k287N22l79O04k23K45m52M2O10j002R77m57N65L43J603j314
2875f3K42J96m25n58P52J07J160k041P42K09j370P38N98J033K16m49m34j20Q65
2894A398l6k25m87J031j368q14P30k49P42N07j062l15K368k481J193j62o98l29
2912b57R63n22o01J358q99O23j178n32J370l11o33k90R15j532J848j227j447R4
2930b258J937m34J84o73N87P2j358M93K17L19l24J07O28N97m72m88L79n36M8O68
$$ plain form
2798 60 -350 -2087 -400 356 -378 -775 -221 23 -17 -690 283 -116 805 -14 646 235 -49 -207 302 1374
2818 1374 937 235 823 1025 1236 1969 386 1402 770 534 844 550 2211 797 1318 460 1030 876
2836 876 1140 -271 -432 466 -19 1045 -633 -808 52 555 606 -6 551 145 101 347 1099 -1357 -1259 -162
2856 -162 -1344 136 540 -1747 -1225 -1604 -1000 -1223 -978 -1430 -1388 -778 -1780 -803 -1260 -695 -352 1251 -63
2875 -63 179 375 -50 -608 144 251 1411 -630 112 321 -1049 -311 287 1320 1536 1087 653 533 1398
2894 1398 1362 1137 650 1681 313 -501 229 -20 722 1229 167 -148 2220 -261 932 770 72 -257
2912 -257 706 184 -417 941 42 665 -513 -1045 325 14 -619 -909 6 -1526 322 -905 -2352 -2258
2930 -2258 -321 -755 -571 -1244 -657 -585 -1943 -1450 -1233 -914 -1238 -1131 -503 94 -378 -866 -487 -1023 -975 -307
2950c07p49J15L16Ro39Q11n01Q60J120j698J547l72m61MO73j163J062k38q28R21
2970D82r44J484k64k06j048L06K031j377k59j91J652q54N65j178p3J095J54m10
2988I65j239J224m08K32r29j64N80N70o60K87j584K056r94O28n01n69p12J808
3006E90K90j144j337J958j116k415K992r72j1L26r5m02M41j302K297p5O10j337
3024g02N10l9r60J577k84J69j039R75k04p71R50R19k94j723J581o06j61L41j84
3043E5R50l66R33m52j989J330K090k404J767j328P61M82r91R10j172M10l34M5
3061F97K28j97j086J65P34N38j306O38L94j984J419j016M15l59J083o15Q66o52
3079c8m13Q28j129o75J57J089n52k29K442k155r55K130j281j618K961j580N44
$$ plain form
2950 -307 -1056 -941 -625 -616 -1255 -444 -945 -85 1035 -663 884 512 51 55 728 -435 627 389 -439 482
2970 482 -462 1022 758 552 -496 -190 1841 464 205 14 1666 812 1377 199 126 1221 1375 965
2988 965 -274 950 542 774 -155 -319 261 831 171 458 -1126 930 -64 564 63 -506 -1218 590
3006 590 880 -264 -1601 357 -759 -3174 -182 -1154 -1165 -839 -934 -1336 -895 -2197 100 25 635 -702
3024 -702 -192 -231 -1191 386 102 271 -768 207 3 -768 182 1101 807 -916 665 59 -102 239 55
3043 55 1005 639 1572 1120 -869 461 2551 147 1914 586 1347 1829 838 1748 576 986 652 697
3061 697 925 728 -358 -193 541 1079 -227 411 805 -1179 240 -776 -361 -720 363 -252 614 -38
3079 -38 -451 377 -752 -1427 -1270 -181 -733 -962 1480 -675 -1630 500 -781 -2399 562 -1018 -474
3096d74P26k18n24m00K184j392j199k47J066p25N14N07K98P21j38j216J687j901
3114g31L83O73P60m1M0j405R06k23k9Q24k64O47l94J365j995n28j97J46N86p23
3134b00J23O13J132j828K95m21K04j46L59J64k33r9K61M26j692J373j623J013
3152b79j58j89j04oP66o70J36j07L90o18P33M5m92L84p81J36k28L38o0M66n49
3173h47J248j679J135J272j588M30L24qJ2k62K9K32k64P02J38j662R63o5Q65k61
3193G14n58O87j147O41K64k26K44M60p97M03M83o82L61o32Q19j843M16J071M31
3212A109n64j96k79q54P75n1Q47n00j18M1o17p30J814m21q73J02l16Q73m89N87
3232A40p65n49J49M53o39j60R51o42Q70n75K7K63l40r69J575Q30j589M9L41m46
$$ plain form
3096 -474 252 34 -490 -890 1294 -98 -1297 -1544 -478 -1203 -689 -182 116 837 699 -517 1170 -731
3114 -731 -348 325 1085 1044 1084 -321 585 362 333 1157 893 1540 1146 2511 516 -12 -209 -63 523 -200
3134 -200 -77 536 1668 -160 135 -286 -82 -228 131 295 62 -37 224 650 -1042 331 -1292 -279
3152 -279 -437 -626 -730 -736 30 -640 -504 -611 -221 -839 -106 -61 -553 -169 -950 -814 -1042 -704 -764 -298 -847
3173 -847 401 -1278 -143 1129 -459 -29 295 287 299 37 66 298 34 736 874 -788 175 110 975 714
3193 714 156 843 -304 337 601 375 619 1079 282 685 1168 486 847 215 1034 -809 -393 678 1109
3212 1109 545 349 70 -784 -9 -60 787 287 169 210 -407 -1137 677 256 -617 -515 -831 42 -447 140
3232 140 -625 -1174 -1025 -572 -1211 -1371 -420 -1062 -192 -767 -740 -477 -817 -1786 -211 619 -970 -921 -580 -1026
3252a026R37l42O5O06J064j631O65j221N22N52N00K40j132q3O76k36j184Q59J371
3271A202o20K14km35K1r79J659J89K3J47k6j590l18J357J73K51l33r74J231q85
3291C05p47n5k3P68K77j320J405m12k74k84m75LJ767j627J399j034M4j19j027
3310a429R12O33j385P21j37K25j26R23p03M49j50J07j652K026j174N20L51m37
3328c26J41l10J102j394J26N62l74O76l05J6P2j4r72J765L3q85J037r74N44L3
3348E53P93j445J005N6N1j210Q12P15k03n55N7l11L4l43K77l71J39L26R71j639
3368b88P09j035J948k227p64J582k38p02M33K48j09L24j574J538j887L38K029
3385C25k54j100N51J441k175O52q38J006J692j871P5j75J09m81J754j842Q20k26
$$ plain form
3252 -1026 -89 -431 -366 240 1304 -327 338 -883 -361 191 691 931 -201 -284 392 156 -1028 -169 1202
3271 1202 582 796 794 359 380 -599 1060 1249 1272 1419 1393 -197 -515 842 1015 1266 933 -41 1190 305
3291 305 -442 -497 -520 248 525 -795 610 198 -76 -360 -835 -832 935 -692 707 -327 -283 -402 -1429
3310 -1429 -517 116 -1269 -548 -685 -460 -586 337 -366 83 -67 40 -1612 414 -760 -240 111 -326
3328 -326 -185 -495 607 -787 -661 -99 -473 203 -102 -86 -14 -28 -1000 765 798 -87 950 -24 520 553
3348 553 1346 -99 906 962 1013 -197 615 1330 1127 572 629 318 352 9 286 -85 54 380 1351 -288
3368 -288 421 -614 1334 -893 -1657 -75 -313 -1015 -582 -334 -443 -119 -1693 -155 -2042 -1704 325
3385 325 71 -1029 -478 963 -1212 -560 -1398 -392 1300 -571 -496 -671 -562 -1043 711 -1131 -311 -537
3403e37J995q88O2n73r01Q63J36j170M85M44Q78j699K221q45n27R13K03j210K254
3422B104j477j37M80k9j39N1K13j349m78O94J381j198j04R93r57K272j207p31
3440C82j504O47J793j185J033k188J479j345r0O50j69r21K025j224k62L36J012
3457D69j085J487j176m26N6m3J540k080j62O44K86Q2q69M17l93P11m32P31o25
3476h68J40J229m78M54l2L58j171L19n1O86k0J58k99k46L93o49J637n96r90R80
3496I54j245J519K8j061L07J185k062n44J344p88O00q9J011j383L64q76J374j116
3514d78K13O71r53M95r5L11Q74j735J72J150j19p91l86M53M66o38m12J334k292
3533a760R85n2J51N50l72J16j19j72J282r86j269J979j033k69N62P51j082L00
$$ plain form
3403 -537 1458 570 632 59 -842 21 157 -1013 -528 -84 794 -905 1316 471 -56 857 1060 -150 2104
3422 2104 627 490 970 941 802 853 1066 -283 -761 -67 1314 116 12 1005 48 2320 1113 382
3440 382 -1122 -475 1318 133 1166 -1022 457 -888 -978 -328 -497 -1418 607 -617 -879 -543 469
3457 469 -616 871 -305 -731 -675 -718 822 -1258 -1420 -776 -490 -408 -1277 -860 -1253 -542 -974 -243 -868
3476 -868 -728 501 23 477 445 803 -368 -49 -100 586 566 724 425 179 572 -77 1560 964 -26 954
3496 954 -291 1228 1256 195 502 1687 -375 -919 425 -363 237 148 1159 -224 140 -736 638 -478
3514 -478 -265 406 -547 -52 -147 164 1038 -697 -525 625 506 -285 -671 -218 248 -390 -802 532 -1760
3533 -1760 -775 -827 -676 -126 -498 -382 -501 -673 609 -377 -1646 333 -700 -969 -407 344 -738 -438
3551d38J029k04j59M66L92j511K82q9L56J101q78o55N73k96N01L54q29n6P07J46
3571G92K53j142M96j04m20P14n6j08O5k76n62R84q58N05l6N98j128L96o96J060
3591D77j655J196R57q11j052j70J281j313J498j19j62p92J789j000L34j808Q56
3608d94Q75m29L17q33R94O0q32J037j456M12M00q15J031j509P56k34j43J183k05
3627A15K32r25L77PN81k21O6L33L87j200J326p49J93J000j045q77P23m17Q89O4
3647H59j157N84m24J397j011RL48N12q91m42J216m19n07M12j218L84O29L15q8
3666E08j049J61K06P60j133j31Q48r41j49J423j211J53j32q2J693j062m09j536
3684b083J819L40p98L37j01J18O19n5J05j455l35P56m89L06K149k087R6J158n14
$$ plain form
3551 -438 591 387 228 694 1086 -425 -143 -232 124 1225 347 -308 265 -31 470 824 -5 -61 646 792
3571 792 1045 -97 399 295 -125 589 533 425 490 214 -348 636 -222 283 247 845 -283 113 -583 477
3591 477 -1178 18 975 164 -888 -1058 223 -1090 408 289 127 -665 1124 124 458 -1350 -494
3608 -494 381 -48 269 -564 430 490 -342 695 -761 -349 51 -764 267 -1242 -486 -720 -863 320 115
3627 115 347 -578 -201 -194 387 166 232 565 952 -248 1078 329 522 1522 477 -400 323 -94 795 859
3647 859 -298 286 -138 1259 248 257 605 1117 226 -216 1000 581 74 486 -732 -348 281 596 508
3666 508 -541 -380 -174 586 -547 -678 170 -771 -920 503 -708 -555 -687 -769 924 -138 -547 -2083
3684 -2083 -264 76 -722 -385 -486 -368 251 196 301 -1154 -1489 -733 -1222 -916 1233 -854 -758 400 -114
3703a14m59l83Q98j125K76N28j66Q18o84J40l91N82N84J4J01l8m62m48L96L3L10
3724D10k10l44L82j63M57o70L72O99l34j070R15q07L43R52k86p0j20M04l21m01
3744A38J20m15K40m06k93J178p02j196J014k54j64k54J17J758j008N13M73j598
3762g39r3k85J194q76n25P86L26k53l82R20K29m3J01J23p16J92j017O41J024j117
3782e10L03n93L04J384Pj352l27J007J039m12j278l23J152M90n12Q47j763K596
3800B059j87j118L24k396K530j141j3N67M4q91J015N13j874M71p93L92j51M91
3818a58P56p78o84P14p67K60r08J448l62l07n60P23r16Q13L80j502J783m28Q50
3837C57j149O39k15j258L702j984j419J774O41j469N06p68J9J336n08n54R87K9
$$ plain form
3703 -114 -573 -956 -58 -1183 -907 -379 -545 273 -411 -271 -662 -80 504 518 619 581 119 -329 67 100 410
3724 410 200 -144 238 75 532 -138 234 933 599 -471 444 -363 -20 932 646 576 456 860 539 138
3744 138 258 -157 83 -323 -616 562 -140 -1336 -322 -576 -740 -994 -877 881 -127 386 859 -739
3762 -739 -832 -1117 77 -799 -1324 -538 -212 -465 -847 73 302 259 360 483 -233 -41 -1058 -417 607 -510
3782 -510 -207 -800 -496 888 895 -457 -784 223 1262 850 -428 -751 401 891 379 1226 -537 2059
3800 2059 1872 754 1078 -1318 1212 71 58 625 669 -222 793 1306 -568 -97 -890 -498 -649 -158
3818 -158 598 -180 -864 -150 -917 -657 -1565 -117 -479 -786 -1346 -623 -1539 -726 -346 -1848 -65 -493 357
3837 357 -792 -153 -368 -1626 2076 92 -1327 447 1088 -381 125 -643 -624 712 204 -350 637 666
3855F66L93o05j16j008M12M48M45O61Q5j285j15K53K44K76n91J18O63N20r81q82
3875c99J529r33K18j96k88N23l1K87q82n40J554K83j075K29K21p37J89O6R85p46
3895B57P20k015J017O56j717J420j142O04j004J078J45l68r02K145p76n94J193
3912G17k35j22j98p40O42Q3m80N04l78J53L05o34L78k49M12K31P26j135J86K09
3932C75l24k42k55Q83P11j106M54M92j140R99R1l42k32l52k83n89J101O81J79
3951A101l78N44j316Q62j287M06N01R66k73j247P11m06j43j011J146o86k08N81
3969a37j374J973m99M9q88J744j791K319m52j554J140j537J524r76K00J30p16
3986h45N97J106j287O94n2J8L17p48n93J004m80L81P54j818O41J062j346l0R85
$$ plain form
3855 666 1059 454 338 -670 -258 190 635 1296 1381 96 -19 234 478 754 163 281 944 1464 483 -399
3875 -399 1130 197 415 219 -69 454 423 710 -172 -712 842 1125 50 279 500 -237 -48 18 1003 257
3895 257 977 -1038 -21 635 -1082 338 -804 -200 -1204 -126 19 -349 -1251 894 118 -476 717
3912 717 482 360 162 -578 64 147 -333 171 -207 -54 251 -383 -5 -254 158 389 1115 -20 166 375
3932 375 51 -191 -446 437 1148 42 496 988 -152 847 938 596 364 12 -271 -860 241 922 1101
3951 1101 723 1267 -49 813 -474 -68 433 1399 1126 -121 590 184 41 -970 176 -510 -718 -137
3969 -137 -1511 462 -37 12 -876 868 -923 1396 944 -610 530 -1007 517 -459 -259 -129 -845
3986 -845 -248 858 -429 265 213 231 548 -200 -793 211 -269 112 866 -952 -311 751 -595 -625 360
4005C60l34R30j88j189O57N78o31o46l72K377j450j83k41j000J806j011J406Q8
4023I57j74j198O89j391J238j08K35m6N66j100N19J156j589J307j496J255j164
4040c44R58p87R31r10K112k069l39J073j444J384q06J9nj69l45J444j032q83L69
4059h43k80J56J320o40k44K62k93m2P10q50M30Q05j029O07K69M37m65N73o17k07
4079E9n10L94j29K28k27K98K87l7n2o08J344n94J9n08j63M82l37l26J066m30J081
4100A337j68j703k38K928k817J194q03m8J801r76p80P11j76L17o61Q17n49j116
4118i30M27k1O18o60M05o37R95j412Q72K62q31Q00j13n15Q6J181j135P68J68q0
4138B48j355Q6L60r1N12K95K70r06m51k01J482m17L95j21l9R6p69J028j44n8J6
$$ plain form
4005 360 26 956 768 -421 236 814 183 -463 -835 1542 92 -91 -332 -1332 474 -537 869 957
4023 957 783 -415 274 -1117 121 13 248 202 768 -332 187 1343 -246 1061 -435 820 -344
4040 -344 614 -173 758 -152 1960 -109 -448 625 -819 565 -241 -222 -227 -396 -741 703 -329 -1212 -843
4059 -843 -1123 -967 353 -287 -531 -269 -562 -604 106 -744 -314 491 -538 69 338 775 310 883 266 59
4079 59 -451 -57 -186 42 -185 113 400 363 311 -297 1047 453 472 -36 -199 283 -54 -380 686 256 1337
4100 1337 1169 -534 -772 2156 -661 533 -270 -318 1483 507 -273 438 262 579 -82 735 186 -930
4118 -930 -503 -524 94 -566 -161 -798 197 -1215 -343 -81 -912 -112 -225 -740 -654 527 -608 160 328 248
4138 248 -1107 -1021 -661 -752 -240 55 325 -581 -1032 -1233 249 -168 227 106 67 163 -606 422 278 220 236
4159B36n16j00k83N16o4J166J42j337q39K702m08O4k01q27N69J32r82O1L36l46
4179B1j74P02j033p9O16J582p96j387J087n69N64j315J626m28L80j758J033k07
4197a35m75m86K029q95l73kQ50p62O65q35N18j172J319j342J794l01j052J430
4215G75j775P78J272j872J370R6j678J212j825J352n75J8J051o60J29n53R11Q16
4233H42o45N78m90Q08j739P61o12N83M09q22J111j88J20L30j372J072o07J354
4251A493r61k14N63q72q4n9J238m30N80j240M80M57o25O28j9p05j47m46Q39L21
4271G97k060R31P88K92Q3j532J981j040j37r41K52n04J176j026K34P07j27M37
4289C11j134J12O9O08P5r18J98J60k55m21L09N14J088m04r61N83P87n76n38Q39
$$ plain form
4159 236 -280 -380 -663 -147 -211 955 1097 -240 -1079 1623 1215 1279 1078 251 820 952 -30 31 367 21
4179 21 -153 549 -484 -563 53 1635 839 -548 539 -30 534 -781 845 417 797 -961 72 -135
4197 -135 -610 -1096 933 38 -335 -337 513 -249 416 -419 99 -1073 246 -1096 698 397 -655 775
4215 775 -1000 -222 1050 -822 548 644 -1034 178 -1647 -295 -870 -852 199 -461 -332 -885 26 842
4233 842 197 775 285 1093 -646 115 -497 86 495 -327 784 596 716 1046 -326 746 139 1493
4251 1493 532 318 881 9 -75 -134 1104 674 1254 14 494 951 326 954 935 230 83 -363 476 797
4271 797 -1263 -332 456 748 831 -701 1280 240 103 -838 -586 -1090 86 -940 -706 1 -126 311
4289 311 -823 -711 -642 -34 41 -877 -679 -519 -774 -1195 -886 -372 716 312 -649 -66 721 145 -393 446
4309D46r42j67K178k111J569Q87j196J45o67j14L03n81J185n36j324K083o87j99
4327B72r58l59J476O67j968J805r15O86r46J02o08J030P1q5j90O69l02j194J16
4346f31J304k59j196J000K27j683K067j202J132n05l89J098r30m2j53o28N5N24
4364b11M05N08r73M06j104l17N61k090K108L75M87q7r07J446q94R3j087k72K177
4383F24q31k49J503o71J410j717J594q16r38J68N06k72o88P41M81k19k86j826
4401a486L174p60n68J56Rn12j005J918k43M21l24m80j052K63r24J545m39R29j292
4420f70R08o97M00m72p67J102l9L53l63K49J92K66o56j429K310j019P47j186p94
4439a565K045j60j443J369m17o2j50J115j021L19J47o54P25r58N83N26J5P00k56
$$ plain form
4309 446 -496 -663 1515 -596 973 1860 664 809 142 28 331 -250 935 399 -925 1158 471 272
4327 272 -686 -1045 431 1098 -870 935 20 706 -240 -138 -746 284 355 270 80 749 447 -747 -631
4346 -631 673 414 -782 218 445 -1238 829 -373 759 254 -135 963 33 -9 -162 -790 -735 -211
4364 -211 194 702 -271 135 -969 -1286 -725 -2815 -707 -332 155 68 -839 607 -287 -194 -1281 -1553 624
4383 624 -207 -456 1047 376 1786 69 1663 847 -91 77 583 311 -377 364 845 626 340 -1486
4401 -1486 1688 928 360 516 525 13 -992 926 683 1104 780 300 -752 -489 -1413 132 -307 622 -670
4420 -670 238 -459 -59 -531 -1298 -196 -235 118 -245 4 196 462 -194 -1623 687 -332 415 -771 -1565
4439 -1565 480 320 -1123 246 -171 -233 -383 732 -289 30 177 -477 248 -710 -127 399 414 1114 858
4458H58o26M48J1n42p87J483l76q27J187j314Q98K87o17M62K67q61m00j75K94
4477c30L79m58J567r34j057R24p5J45R64j289k7N25p11J063j306O26J231j380
4495a43L04k66M22M71M6k03m40Q36m73j247k19k53O12L50n76J455j205J425q64
4514C2n70J88J775j685P24j098Q16M47m87j22J197q74p03J793k005J454r62q1
4532a61O10j539J065K96k17k80K47Q84j120M1O02j088L08K55P6L72N55j381j72
4551f47R41r14L61J069o38k38P0K69o51R27l02K66r6L72j362R40Q97o80r91l02
4571g09m17J417p27L51j609J295J03j045R97K08j126M32M08k81M11r16R90j418
4589a636K153l47l30J540Kj847Q14n76PJ070M9J25k954J375J791j907M19O96j244
$$ plain form
4458 858 232 680 691 149 -638 845 469 -358 829 -485 413 700 83 545 812 -49 -449 -624 -330
4477 -330 49 -409 1158 224 -833 91 16 161 1125 -164 -191 334 -377 686 -620 6 1237 -143
4495 -143 161 -105 317 788 834 631 191 1027 554 -693 -912 -1165 -553 -203 -779 676 -529 896 32
4514 32 -538 -350 1425 -260 464 -634 182 629 142 20 1217 343 -360 1433 -572 882 -80 -161
4532 -161 449 -1090 -25 271 54 -226 21 905 -215 -174 428 -660 -352 -97 -21 351 906 -475 -647
4551 -647 294 -620 -259 810 172 -66 4 273 -378 549 247 513 417 789 -573 367 1264 584 -407 -709
4571 -709 -1126 291 -436 -85 -1694 -399 -296 -1341 -344 -136 -1262 -830 -422 -703 -292 -1208 -218 -1636
4589 -1636 517 170 -160 1380 1382 -465 349 -227 -220 850 899 1024 -1930 -555 1236 -671 -252 444 -800
4608h00M80Q62j283J53J882p13J328k25j741L30P96j31J9m41p91Q71m0K18J44
4627I18j536M50R61n34r31R90K25j125J538J04j280K54Q1n13L50p94J068j23l6
4646F7j449J704q91R00n64q89KJ236M03K17o63P45n91q07J056o00P67j819J019
4665a57K0J344j722L86M14j369J89J092p63J71p1j54P79M60o04j525P33J010l11
4684g8N09j29J68L24M0n21O16o39M57j430K535j531o52Q99m43N20p69K68j80M19
4704C83j098N65L53J212k246N82k54Q38q33k4O10j853J265O93L90J93k33J27o64
4723Fq68J123J87j094J264m75k86n74J196j385k42P41J5Q00o54k73o83J262r34
4742h74N58R62r34j08L28o94K288k332O75K9l02R70o35n68L04P30r68L58K83j18
$$ plain form
4608 -800 -320 542 -741 -588 1294 581 1909 1684 -57 273 1069 938 957 516 -275 596 556 774 918
4627 918 -618 -168 793 259 -672 318 543 -582 956 1060 -220 34 115 -398 -48 -842 226 103 67
4646 67 -1382 322 -569 331 -233 -1122 -1120 116 519 736 73 818 227 -580 476 -124 643 -1176 -157
4665 -157 -137 1207 -515 -129 285 -1084 -895 197 -566 -395 -466 -620 159 619 15 -1510 -777 233 -78
4684 -78 431 302 470 794 834 313 929 290 747 -683 1852 321 -331 568 125 645 -124 144 -36 383
4704 383 -715 -150 203 1415 -831 -249 -503 335 -498 -522 88 -1765 -500 193 583 776 543 670 6
4723 6 -862 261 448 -646 618 143 -143 -717 479 -906 -1148 -407 -392 408 -246 -519 -1202 60 -874
4742 -874 -316 646 -288 -396 -68 -762 1526 -806 -131 -102 -404 566 -69 -637 -333 397 -571 -213 70 -48
4762d8j40R04n70M6L5n27O96N55l69k69J19j188J549p62N09q16O11J50L9l32o46
4783d54J29L81p48J414m82k58p08M12K83K12Q9j349J197k93M27k32M62o28L01
4802A55j27r62J089l33J29P00m88kn78p16J042q21O05q44J473r16J090J14j877
4821a267Q47N72J06l2m33J154o80j201J363J12j34k99N07o74N84j191J908j818
4839e76O95J38P16j120L2M99m90m18O76j09L06n51J594j126j268J339p63J045
4857F19n97K8J134j118N71m85r51P52P3m45N76M12j286O50J31k27L13r1j270K396
4877A185j461N5N99m14q1j86j23O03k54l62N95n97K32N56r4j146J287o1l79j204
4897a250J870J08l65n84m69O04P35p14L46k62o01K94Q10j252O00J364k23j347
$$ plain form
4762 -48 -188 716 146 192 227 -300 396 951 582 313 432 -756 793 31 540 -276 335 485 524 192 -454
4783 -454 -325 56 -692 722 240 -18 -726 -314 -31 181 270 -1079 118 -175 252 20 482 -146 155
4802 155 28 -934 155 -178 -49 651 163 161 -417 -1133 -91 -912 -307 -1151 322 -594 496 610 -1267
4821 -1267 -420 152 258 226 -207 947 267 -934 429 541 407 108 615 -59 525 -666 1242 -576
4839 -576 119 257 973 -147 -115 384 -106 -524 152 43 349 -202 1392 266 -1002 337 -426 619
4857 619 22 50 1184 66 637 152 -799 -47 26 -419 157 569 -717 -67 64 -163 150 59 -1211 1185
4877 1185 -276 -221 378 -36 -117 -303 -426 177 -77 -439 156 -441 -209 347 253 -893 394 333 -46 -1250
4897 -1250 620 728 363 -221 -690 -86 649 -65 281 19 -582 -288 522 -730 -130 1234 1011 -336
4915c36O63K29q75M74L63m45Q19m79o63M61m31R40q26O48j137P49j13J036o45
4934D32j045L12R76j258R1R54q07P94l32p11O30L49l15l04L47q3K52l24n52P72
4954A78k08J191r04j073M96j07p26L68K29M54m9J86o8O45n14j16L25j91J009j722
4974e97O07M72q5o76m33R71O85j980J434L21j21k54L40L15j875K01J001R82j121
4993A87NJ153N68j903J177j381m69K18J178O58j586r29K201j768J108O42j154
5010i5M02Q17k058O64J006j361J173l75l33j49p85N66P55K63n92m69R9k60L38
5029c94L32j96o68l1Q46k56m49J46M04N56O2l84p4j095R57P72j025P64n50Q45
5049E62L20j207o3M45K01m93L62M80l94K82o55m18O61N71p29Q05J75k61p00O61
$$ plain form
4915 -336 327 556 -319 155 518 73 892 413 -250 211 -220 720 -106 542 -595 154 41 1077 432
4934 432 -613 -301 675 -583 -492 462 -345 449 117 -594 36 385 70 -234 113 30 282 -42 -594 178
4954 178 -30 1161 257 -816 -320 -427 -1153 -785 -556 -102 -151 35 -33 612 98 -18 307 116 1125 -597
4974 -597 10 482 397 -279 -712 259 944 -1036 398 719 598 344 684 999 -876 -675 326 1308 187
4993 187 192 1345 1913 10 1187 -194 -663 -445 733 1391 -195 -1124 1077 -691 417 1059 -95
5010 -95 307 1124 -934 -270 736 -625 548 173 -160 -309 -1094 -528 227 490 -102 -571 -472 -732 -394
5029 -394 -62 -258 -926 -957 -111 -367 -816 -670 -266 290 352 -32 -106 -1201 -244 528 -497 267 -283 562
5049 562 882 -325 -388 57 258 -235 127 607 213 495 -160 -578 83 654 -75 730 905 644 -56 605
5069F05q02Q12k31J22l87K99L21j375J360j77r42M18J099n32O52j191k85L17M08
5088D91p33n92l54J211L44o02l69Q47l35j64m76K23N19j84j66J05K82j007R79
5107A9j525J293n01r2J064o91K64k80J91N5M67j15o20M49L06n01J334j481o5O14
5127A85r31L00oR27l73J473k176J700j946J502l4m64J120k040K337j121l76l81
5145c04J326q10o58N95j211J496n22R71m36K72j82N26k092J164K38l88j61J47
5163b9P87q70j095M40O74m70N46j288J048q33J197p11p3N10m67l51O10O88j745
5182a432J542n67N40L30l07n06K78J255j031M12k79p57O46j126O05J362j403K628
5200B190j708j51J774j398l18q85O77q93l77J485o25k3R77l98K06k62m72O03j56
$$ plain form
5069 605 -197 615 384 506 119 418 739 -636 724 547 -395 23 1122 590 1242 51 -234 83 491
5088 491 -242 -834 -1188 23 367 -235 -604 243 -92 -256 -732 -509 10 -174 -340 -235 47 -960 19
5107 19 -1506 -213 -714 -806 258 -433 -169 -449 -258 -203 264 149 -471 -22 284 -217 1117 -364 -429 185
5127 185 -746 -446 -452 475 102 1575 -601 1099 -847 655 621 157 1277 -763 1574 453 77 -304
5145 -304 1022 212 -446 149 -1062 434 -88 883 447 719 537 1063 -1029 135 373 -15 -176 -29
5163 -29 758 -112 -1207 -767 -93 -563 -17 -1305 -257 -1090 107 -604 -677 -167 -634 -985 -375 313 -1432
5182 -1432 110 -457 83 413 106 -400 -122 1133 102 514 235 -522 124 -1002 -397 965 -438 2190
5200 2190 482 331 2105 707 389 -496 181 -712 -1089 396 -229 -252 725 327 533 271 -201 402 246
5219B46j027Q00L02j413R54J103j477J505o75l73P47K88J07o75p72k38O94l55
5237b59R47n35l1k44n1L82o15k97O96N15j260J303q08J57N30j407J005k83J939
5256A684k502O04m58oQ62r05J062j123j05J210o35KO35j61o17J78O39q84K29j20
5276d11L82J14j29p97J083n65P29n35j180J365q52J002m6M49J059j315k76J89
$$ plain form
5219 246 -781 19 321 -1092 -138 965 -512 993 318 -55 692 980 1087 412 -360 -598 96 -259
5237 -259 688 153 122 -122 -173 209 -406 -703 -7 508 -752 551 -257 -100 430 -977 28 -255 1684
5256 1684 -818 -214 -672 -678 184 -721 341 -782 -887 323 -312 -310 325 164 -453 -275 364 -520 -291 -411
5276 -411 -29 85 -44 -841 242 -323 406 -129 -1309 56 -796 206 160 609 1668 353 77 266
$$ [...]
8191A32
##END NTUPLES=NMR FID
##END=
