##TITLE=1H_SA_30.236.1
 CDCl3, 108 sc, 
 17.12.2020
##JCAMPDX= 6.0         $$ Bruker NMR JCAMP-DX V2.0
##DATA TYPE= NMR FID
##DATA CLASS= NTUPLES
##ORIGIN= UXNMR, Bruker Analytische Messtechnik GmbH
##OWNER= root
$$ XWIN-NMR		Version 3.5
$$ Thu Dec 17 12:39:13 2020 Russian Standard Time (UT+4h)  she@DPX200
##.OBSERVE FREQUENCY= 200.1315066352
##.OBSERVE NUCLEUS= ^1H
##.DELAY= (6, 6)
##.ACQUISITION MODE= SIMULTANEOUS
##.ACQUISITION SCHEME= undefined
##.AVERAGES= 108
##.DIGITISER RES= 18
##SPECTROMETER/DATA SYSTEM= spect
##.PULSE SEQUENCE= zg30
##.SOLVENT NAME= CDCl3
##.SHIFT REFERENCE= (INTERNAL, CDCl3, 0, 15.7039)
##AUDIT TRAIL= $$ (NUMBER, WHEN, WHO, WHERE, WHAT)
$$ ##TITLE= Audit trail, XWIN-NMR		Version 3.5
$$ ##JCAMPDX= 5.01
$$ ##ORIGIN= Bruker BioSpin GmbH
$$ ##OWNER= she
$$ F:/spectra/data/she/nmr/H-F/1/audita.txt
$$ ##AUDIT TRAIL=  $$ (NUMBER, WHEN, WHO, WHERE, WHAT)
(   1,<2020-12-17 12:37:24.73 +0400>,<she>,<DPX200>,
      <continue with go, POWCHK disabled, PULCHK disabled
       configuration hash MD5:
       00 E9 B6 7A A2 85 ED C7 34 08 36 98 17 FE 4E 26
       data hash MD5: 16K
       DD CA 59 C3 6E CD AF CE BE F2 FE DB F7 EA 1B 7D>)
$$ ##END=
$$ 
$$ hash MD5
$$ 7C CB A4 C3 8D DA E0 64 39 2B 07 3A D4 1B 2B DE
##$RELAX= 
##$RELAX= 
##$RELAX= 
##$RELAX= 
##$RELAX= 
##$RELAX= 
$$ Bruker specific parameters
$$ --------------------------
##$DU= <F:/spectra>
##$EXPNO= 1
##$NAME= <H-F>
##$PROCNO= 1
##$TYPE= <nmr>
##$USER= <she>
##$AMP= (0..31)
100 100 100 100 100 100 100 100 100 100 100 100 100 100 100 100 100 100 
100 100 100 100 100 100 100 100 100 100 100 100 100 100 
##$AQSEQ= 0
##$AQ_mod= 1
##$AUNM= <au_zg>
##$AUTOPOS= <>
##$BF1= 200.13
##$BF2= 200.13
##$BF3= 200.13
##$BF4= 200.13
##$BF5= 200.13
##$BF6= 200.13
##$BF7= 200.13
##$BF8= 200.13
##$BYTORDA= 1
##$CFDGTYP= 0
##$CFRGTYP= 5
##$CHEMSTR= <none>
##$CNST= (0..31)
1 1 145 1 1 1 1 1 1 1 1 1 1 1 1 1 1 1 1 1 1 1 1 1 1 1 1 1 1 1 1 1 
##$CPDPRG= <>
##$CPDPRG1= <>
##$CPDPRG2= <>
##$CPDPRG3= <>
##$CPDPRG4= <mlev>
##$CPDPRG5= <mlev>
##$CPDPRG6= <mlev>
##$CPDPRG7= <mlev>
##$CPDPRG8= <mlev>
##$CPDPRGB= <>
##$CPDPRGT= <>
##$D= (0..31)
0 1.2 0 0 0 0 0 0 0 0.06 0 0.03 0 0 0 0 0.0002 0 0 0 0 0 0 0 0 0 0 0 0 
0 0 0 
##$DATE= 1608193787
##$DBL= (0..7)
120 120 120 120 120 120 120 120 
##$DBP= (0..7)
150 150 150 150 150 150 150 150 
##$DBP07= 0
##$DBPNAM0= <>
##$DBPNAM1= <>
##$DBPNAM2= <>
##$DBPNAM3= <>
##$DBPNAM4= <>
##$DBPNAM5= <>
##$DBPNAM6= <>
##$DBPNAM7= <>
##$DBPOAL= (0..7)
0.5 0.5 0.5 0.5 0.5 0.5 0.5 0.5 
##$DBPOFFS= (0..7)
0 0 0 0 0 0 0 0 
##$DE= 6
##$DECBNUC= <off>
##$DECIM= 32
##$DECNUC= <off>
##$DECSTAT= 4
##$DIGMOD= 1
##$DIGTYP= 9
##$DL= (0..7)
0 120 120 120 120 120 120 120 
##$DP= (0..7)
150 150 150 150 150 150 150 150 
##$DP07= 0
##$DPNAME0= <>
##$DPNAME1= <>
##$DPNAME2= <>
##$DPNAME3= <>
##$DPNAME4= <>
##$DPNAME5= <>
##$DPNAME6= <>
##$DPNAME7= <>
##$DPOAL= (0..7)
0.5 0.5 0.5 0.5 0.5 0.5 0.5 0.5 
##$DPOFFS= (0..7)
0 0 0 0 0 0 0 0 
##$DQDMODE= 0
##$DR= 18
##$DS= 0
$$ [...]
##$SUBNAM2= <"">
##$SUBNAM3= <"">
##$SUBNAM4= <"">
##$SUBNAM5= <"">
##$SUBNAM6= <"">
##$SUBNAM7= <"">
##$SUBNAM8= <"">
##$SUBNAM9= <"">
##$SW= 16.9725356469052
##$SWIBOX= (0..15)
0 0 2 0 0 0 0 0 0 0 0 0 0 0 0 0 
##$SW_h= 3396.73913043478
##$TD= 16384
##$TD0= 1
##$TE= 0
##$TE2= 300
##$TE3= 300
##$TEG= 300
##$TL= (0..7)
0 120 120 120 120 120 120 120 
##$TP= (0..7)
150 150 150 150 150 150 150 150 
##$TP07= 0
##$TPNAME0= <>
##$TPNAME1= <>
##$TPNAME2= <>
##$TPNAME3= <>
##$TPNAME4= <>
##$TPNAME5= <>
##$TPNAME6= <>
##$TPNAME7= <>
##$TPOAL= (0..7)
0.5 0.5 0.5 0.5 0.5 0.5 0.5 0.5 
##$TPOFFS= (0..7)
0 0 0 0 0 0 0 0 
##$TUNHIN= 0
##$TUNHOUT= 0
##$TUNXOUT= 0
##$USERA1= <user>
##$USERA2= <user>
##$USERA3= <user>
##$USERA4= <user>
##$USERA5= <user>
##$V9= 5
##$VALIST= <valist>
##$VCLIST= <CCCCCCCCCCCCCCC>
##$VD= 0
##$VDLIST= <DDDDDDDDDDDDDDD>
##$VPLIST= <PPPPPPPPPPPPPPP>
##$VTLIST= <TTTTTTTTTTTTTTT>
##$WBST= 1024
##$WBSW= 4
##$XGAIN= (0..3)
0 0 0 0 
##$XL= 0
##$YL= 0
##$YMAX_a= 733713
##$YMIN_a= -199259
##$ZGOPTNS= <>
##$ZL1= 120
##$ZL2= 120
##$ZL3= 120
##$ZL4= 120
##$ABSF1= 10
##$ABSF2= 0
##$ABSG= 5
##$ABSL= 3
##$ALPHA= 0
##$AQORDER= 0
##$ASSFAC= 0
##$ASSFACI= 0
##$ASSFACX= 0
##$ASSWID= 0
##$AUNMP= <proc_1d>
##$AZFE= 0.1
##$AZFW= 0.1
##$BCFW= 1
##$BC_mod= 2
##$BYTORDP= 1
##$COROFFS= 0
##$CY= 11.3945322036743
##$DATMOD= 1
##$DC= 2
##$DFILT= <>
##$DTYPP= 0
##$F1P= 15.9154993809931
##$F2P= -4.1035820241983
##$FCOR= 0.5
##$FTSIZE= 0
##$FT_mod= 4
##$GAMMA= 1
##$GB= 0.15
##$INTBC= 1
##$INTSCL= 1
##$ISEN= 128
##$LB= 0.24
##$LEV0= 0
##$LPBIN= 0
##$MAXI= 10000
##$MC2= 0
##$MEAN= 0
##$ME_mod= 0
##$MI= 1.114404
##$NCOEF= 0
##$NC_proc= 0
##$NLEV= 6
##$NOISF1= 3.799351
##$NOISF2= 2.8
##$NSP= 1
##$NTH_PI= 0
##$NZP= 0
##$OFFSET= 15.70392
##$PC= 1
##$PHC0= -10741.85
##$PHC1= -5.999057
##$PH_mod= 1
##$PKNL= yes
##$PPARMOD= 0
##$PSCAL= 0
##$PSIGN= 0
##$REVERSE= no
##$SF= 200.130013532006
##$SI= 16384
##$SIGF1= 3
##$SIGF2= 2
##$SINO= 400
##$SIOLD= 16384
##$SREGLST= <1H.CDCl3>
##$SSB= 0
##$STSI= 0
##$STSR= 0
##$SW_p= 3612.71676300578
##$SYMM= 0
##$S_DEV= 0
##$TDeff= 0
##$TDoff= 0
##$TI= <>
##$TILT= no
##$TM1= 0
##$TM2= 0
##$TOPLEV= 0
##$USERP1= <user>
##$USERP2= <user>
##$USERP3= <user>
##$USERP4= <user>
##$USERP5= <user>
##$WDW= 1
##$XDIM= 8192
##$YMAX_p= 0
##$YMIN_p= 0
$$ End of Bruker specific parameters
$$ ---------------------------------
##NTUPLES= NMR FID
##VAR_NAME=  TIME,          FID/REAL,        FID/IMAG
##SYMBOL=    X,             R,               I
##VAR_TYPE=  INDEPENDENT,   DEPENDENT,       DEPENDENT
##VAR_FORM=  AFFN,          ASDF,            ASDF
##VAR_DIM=   8192,          8192,            8192
##UNITS=     SECONDS,       ARBITRARY UNITS, ARBITRARY UNITS
##FACTOR=    0.0002944,     1,               1
##FIRST=     0,             0,               0
##LAST=      2.4114304,     0,               0
##MIN=       0,             -199259,         0
##MAX=       2.4114304,     733713,          0
$$ Real data points
##PAGE= N=1
##DATA TABLE= (X++(R..R)), XYDATA
0@%%%%%%%%%%%%%%%%j08K16k16K16k16K16l24M32m32N07o15O53p61Q86r94J188
32F48j365J494j654J870k129K421k696K997l334L695m105M544n027N554o128O761
48C546p444Q189r015R934j0951J2079j3340J4765j6392J8246k0388K2931k5981
61a3821K9696l4359M0398m8559O0250p8377J10543j84062O41471K10533r32972
72a99259O80157j49221k33736J66787j3068k55156J71089K1584r5741j23261J21842
83I2017Q0996k71503J68527j1977p4811P5167o4581J6158l7606J19932j31063
94c8744J4346L6921K3093l0077o2461J00490n6552K1765j9322j995l0107Q8161
106D5518m8489j05298J63419r2905M9030o4839P357P5651q3689M7348l9566k965
$$ plain form
0 0 0 0 0 0 0 0 0 0 0 0 0 0 0 0 0 0 -108 108 -108 108 -108 108 -216 216 -216 291 -324 329 -432 454 -540 648
32 648 -717 777 -877 993 -1136 1285 -1411 1586 -1748 1947 -2158 2386 -2641 2913 -3215 3546
48 3546 -3898 4291 -4724 5210 -5741 6338 -7002 7763 -8629 9617 -10771 12160 -13821
61 -13821 15875 -18484 21914 -26645 33605 -44772 65771 -118291 523180 733713 -199259
72 -199259 480898 331677 97941 264728 251660 -3496 167593 189177 93436 -29825 92017
83 92017 173013 -98490 70037 58060 -16751 58416 -6165 9993 -27613 92319 -38744
94 -38744 -24398 12523 35616 5539 -56922 43568 -12984 8781 -10541 -12536 -42643 45518
106 45518 -2971 -108269 55150 -37755 11275 -53564 -46207 29444 -54245 -6897 -46463 -49428
118d9428M5568J8067j17271R8223L123n3934P5308r9111R0646l2488O271J960
130a3066l3025N6710j3811o897k8798P0562m7617K2107j2368o386M6909m7317
142a2997L6029m2500M8104r221j5973j477J2356K5226m6291M1332m7644M8696
154C5640o502l2314K3951j0432K5932k7736O403k1066M8987l9629L249J1916l4575
167a6176O4939n9407K563J6886M887j7370j882l060K243K3821n5527M3422k5031
180a9692J2326R353l9554K5249J085j04k2860K5743k2173K6068j9124j3397L5853
193a227l3130L3844l1842J0902J0488J97j0446M071Q678j0270L2267m7877L9479
206E134p872m390J1204j8332K5227j2587J4361k1528K6090j6731J6101k65k3330
$$ plain form
118 -49428 -3860 14207 -103064 -4841 -1718 -55652 19656 -79455 11191 -21297 -15026 -13066
130 -13066 -46091 10619 -3192 -10089 -38887 31675 -15942 6165 -6203 -12589 34320 -12997
142 -12997 23032 -19468 28636 19415 3442 1965 14321 39547 -6744 34588 -13056 35640
154 35640 29138 -3176 20775 10343 36275 8539 14942 -6124 42863 3234 6483 18399 -16176
167 -16176 48763 -10644 -8081 8805 13692 -3678 -5560 -8620 -6377 17444 -38083 5339 -19692
180 -19692 -7366 1987 -37567 -12318 -11233 -11337 -34197 -8454 -30627 -4559 -23683 -37080 -1227
193 -1227 -34357 -513 -32355 -21453 -10965 -10768 -21214 -17143 -8465 -18735 13532 -34345 5134
206 5134 -2738 -7128 4076 -14256 10971 -1616 12745 -8783 17307 576 16677 16412 -6918
219f918M2655l3120K2343j4187J0038l974Q475l240j4392L0189l3804L8518l9314
232C269J9109P482k0392K3156l0799K6583j5516J5982l1554K4550r134q895K1851
245B5692m5084M8466l5535J9256j7845k913K1205k2448R243k3517L9430m0826
257b4876K7612k3439m98K7746l6309K7453l7144M2030k1606n8n300N629J7490
270a270l8138L9303m0040M4405k2824n994J4787j2467L0605l9844K9579k3498
282b5396L6548k5519j00J9993k3663M2443n0239L5734j4909J7186r115r873K2990
295A6080j9256L3466m9676M3230k0068J1895L821k8960M0874k9662K6280l4250
307f226K7411j1810O993o96k2598L9363l9404L6821l8860J9603N126j5480J1748
$$ plain form
219 -6918 35737 2617 24960 10773 20811 16837 25312 22072 7680 37869 4065 42583 3269
232 3269 22378 29860 9468 32624 1825 28408 12892 28874 -2680 21870 12736 3841 25692
245 25692 -19392 29074 -6461 12795 -5050 -7963 13242 -9206 37 -23480 15950 -24876
257 -24876 2736 -20703 -21201 6545 -29764 -2311 -39455 2575 -19031 -19089 -24389 -18760 -1270
270 -1270 -39408 -105 -40145 4260 -18564 -24558 -9771 -22238 8367 -31477 -1898 -25396
282 -25396 11152 -14367 -14467 5526 -18137 24306 -25933 9801 -5108 12078 2963 -6910 16080
295 16080 -3176 30290 -19386 23844 3776 15671 19492 -9468 31406 1744 28024 -6226
307 -6226 21185 9375 16368 15672 -6926 32437 -6967 29854 -9006 10597 15723 243 11991
320A1991k4636L2686l1783K6548k9932J7546K793j8541K2661l8586M0824k7740
332a6169J1517j2833P519R540j9466J9473l2285M1241l0812J5524r411k998K5503
345F343l1195K2092k2861L0991k0454P211m022n96K4418l5493L0816k6923L0698
358A1025j1923o493R966o335K2551k9371K3380j7618K6172j3712p995J7896j3539
371D004K4077l0010J8907o794J4092j1831o110J5281j3574K4321l4652K1170l291
384A5590L156l559j4661K0668j2250J0060k3243K0325j0490N752l991j6664K6418
397A7111k1491J4462k2042J2504K675o533l573n392J4823j5945J3189k3002J7852
410e362j838p137M889j2447K0192j6943P555j1181J4279l151n947O056j1913K2437
$$ plain form
320 11991 -12645 20041 -11742 14806 -15126 2420 5213 -13328 9333 -29253 11571 -16169
332 -16169 -4652 -17485 -9966 -426 -19892 -419 -32704 8537 -22275 -6751 -16162 -19160 6343
345 6343 -24852 -2760 -25621 5370 -15084 -7873 -11895 -12491 11927 -23566 7250 -19673 11025
358 11025 -898 -7391 2575 -3760 18791 -10580 12800 -4818 21354 7642 -353 17543 4004
371 4004 28081 -1929 16978 10184 24276 12445 6335 21616 8042 32363 -2289 18881 15590
384 15590 18746 15187 526 21194 8944 19004 -4239 16086 5596 11348 7357 -9307 17111
397 17111 -4380 10082 -11960 544 3219 -3314 -6887 -12279 2544 -13401 -212 -23214 -5362
410 -5362 -7200 -14337 -9448 -21895 -1703 -18646 -11091 -22272 -7993 -11144 -17091 -11035 -22948 -511
424e11j6763Q557r046J0596p45m001M389q588K0807j8673J3442r380P743O762
438D589j3380J1293o681J3730j2043J2453j3530J3242J494j0884J2946j5870K3627
451B0986j7198L555J352L330P92q092R721j2080K1119k2282R934m285L230O528
465A6610j9826J6515j2607J4500j7534Q855l065j827Q188k0965J8896j4135J5626
478I231j7948N746J219k452P003k2769K4309j8148J5568j4542N53J1181j2105
491a3154J1053j8394K1729j4324J0553j1899L688R915j4106J7384k3370K6410
503E485j5662P863r41n496J6216j7597J8629j9537K0262j1646P519j809n712K2128
517A9702k6384K3472k1189K1072q739l148J0193j3552J9719j9546J6722j8719
$$ plain form
424 -511 -17274 -8717 -17763 -7167 -7912 -11913 -7524 -16112 4695 -13978 -536 -9916 -2173 4589
438 4589 -8791 2502 -4179 9551 -2492 9961 -3569 9673 11167 283 13229 -2641 20986
451 20986 3788 7343 8695 12025 12817 4725 14446 2366 23485 1203 11137 6852 10082 16610
465 16610 -3216 13299 692 15192 -2342 6513 3448 1621 9809 -11156 7740 -6395 9231
478 9231 -8717 -2971 -1752 -4204 2799 -19970 4339 -13809 1759 -12783 -12230 -1049 -13154
491 -13154 -2101 -20495 1234 -13090 -2537 -14436 -10748 -833 -14939 2445 -20925 5485
503 5485 -10177 -2314 -3255 -8751 7465 -10132 8497 -11040 9222 -2424 5095 3286 -2426 19702
517 19702 -6682 16790 -4399 16673 7934 4786 14979 1427 21146 1600 18322 -397
529c97J8397o275o756J2635j6902K2355k4487J9136j4511P182P83j0498J3132
542A3794k1391K7318k6471J3448p061J000N578j5274J3789j7238K1581k3399J1883
555b443n859r3J0346k5195K5145j9540J5605j3005L037J641j931P433j9150K3609
569d00k0040J8863j5195K010J0318j2003J6923k1958J9559j0512J1439j0427Q24
582a0599J4635j4885J6039j8442J9064q831N615l928p65J4877j6288J6503k0793
595g798K2459q080j747N741r093J5715j6200J3416j1938J3625p111L39J212p892
609B648J8279k1114J5369j2154R779l558n559O927r969J4542j6186R527r460Q346
623G417l305q185Q906j0714J4530j6217R134o694M701o9r745J1122j0775J1569
$$ plain form
529 -397 18000 11725 4969 17604 702 23057 -1430 17706 3195 10377 11160 662 13794
542 13794 -7597 19721 -6750 6698 -363 637 6215 -9059 4730 -12508 9073 -14326 -2443
555 -2443 -8302 -8395 1951 -23244 1901 -17639 -2034 -15039 -12002 -10361 -12292 -4859 -24009 -400
569 -400 -20440 -1577 -16772 -14762 -4444 -16447 476 -21482 -1923 -12435 -996 -11423 -10599
582 -10599 4036 -10849 5190 -13252 5812 -3019 2596 -1332 -2097 12780 -3508 12995 -7798
595 -7798 14661 6581 4834 10575 1482 17197 997 14413 2475 16100 8989 9328 10540 2648
609 2648 20927 -187 15182 3028 12807 9249 3690 10617 648 15190 -996 8531 -929 7417
623 7417 4112 -4073 4833 -5881 8649 -7568 1566 -5128 -427 -496 -10241 881 -9894 1675
637A675j1914P334m983J713K758r204Q714o544J1885j4159Q136o56l87L022r343
652a1953J2674j1046J2980r034K543J562K190N36o986J1970p461R159j2656Q497
666B975J974k326O594j2194J2978o932P566j0455O918J516k849L888r076J3511
680A4088r985P085q462M436J626l200K262q564J3513j2210P350p880L526L909
694G494q800N338j0913J4024j0989M874o195M255L347j1364R685j3542J4548j0151
708h389L186l671R01N555j1794R521j0312J4614j2614L575J121l493Q182j2036
722a5654J3550j2101J3435q512O77L595l987J0702j5732J6820j1845R937m133
735c248q94O325p657J3277j5833J5407r767R634m726k760J0872j1848J4955j4054
$$ plain form
637 1675 -10239 -2905 -7888 -6175 -3417 -12621 -3907 -10451 1434 -12725 -4589 -5245 -5632 -2610 -11953
652 -11953 721 -10325 2655 -6379 -3836 -2274 -84 452 -6534 5436 -2025 7134 -5522 2975
666 2975 4949 2623 9217 -2977 10001 3069 10635 180 7098 8614 5765 9653 577 14088
680 14088 4103 11188 2726 7162 8788 5588 7850 -714 12799 589 7939 59 3585 7494
694 7494 -1306 4032 -6881 7143 -3846 1028 -5167 -912 2435 -8929 756 -12786 1762 -8389
708 -8389 -5203 -8874 -7973 -2418 -14212 -4691 -15003 -389 -13003 -9428 -8307 -11800 -3618 -15654
722 -15654 -2104 -14205 -770 -9282 -8605 -5010 -8997 1705 -14027 2793 -9052 885 -3248
735 -3248 -4142 2183 -5474 7803 -8030 7377 -2390 7244 2518 -242 10630 -1218 13737 -317
749c17J1586o728N200j348n822J2266j3226J4953j6796J3699n999J89L616j1407
763a34J5448j5240J3765j6097J1441l218k537N527j3199J6872j6613J1838j3105
776e252O823J410o272O454j3041J6813j5962J0494r107L934L238r294J0165j5368
790a4965J8236j3764N894m693K814O124j3438J4624j3633J5526j2201N670l06
803d112l375J2733j6684J3263r927J2439j0748N066L232o057J2007j6382J5092
816F547r591J0858o924j543P963q447J1636j3938J3319q843P721k797n444R861
830A0378j0438J2050j4251J1841q041N361j772m864R052j0064J2174j6123R625
843D928k858o89J564o809R875j2015J1177j1266N804k086l9J767j0278J2130j0344
$$ plain form
749 -317 11269 4541 9741 8393 2571 14837 1611 16564 -232 13467 7468 7657 11273 -134
763 -134 15314 74 13839 -2258 9183 5965 3428 8955 -4244 12628 -3985 7853 -5252
776 -5252 1571 2981 -3291 3163 -9878 6935 -9027 1467 -7640 -3706 -468 -9762 403 -14965
790 -14965 3271 -10493 -4599 -9292 -6478 -354 -13792 832 -12801 2725 -9476 -3806 -4112
803 -4112 -7487 5246 -11438 1825 -8102 4337 -6411 -1345 1887 -4170 7837 -8545 6547
816 6547 -3044 7814 890 -653 7310 -1137 10499 -3439 9880 1037 8758 5961 517 10378
830 10378 -60 11990 -2261 9580 1539 6900 5128 264 9316 -748 11426 -4697 4928
843 4928 2070 1381 2945 -3864 6011 -6004 5173 -6093 -289 -2375 -2414 -647 -10925 1205 -9139
858i139R773j1105O956j444k791N576j0886J2527j1118Q434o416L646K831n140
872h296N310q370J2404j0396P239n406M510J987m066N078p485J0863p812N247
886H07k515K176M678p369O345o342J1259q790M793j625J489M742q766P792n735
901B939P775o992K285l38J672L302q311P377n832P335q756L135K081l195L656
916H133p413P507p813P208o815J588J036l053M959r890R143p228N100o735L186
931a087m16k909O134j1449Q956o317N679n441L55L899n061N842r673R571o380
946h297N344m084k34O645p038Q143j0215R346n421M470k592k510Q126j0373J1871
961C181j0064R535m824K684o4k869Q422r626R888j0097R832m010j22K520n439
$$ plain form
858 -9139 634 -10471 -3515 -4959 -7750 -2174 -13060 -533 -11651 -3217 -9633 -5987 -3156 -8296
872 -8296 -2986 -11356 1048 -9348 -2109 -7515 -3005 -1018 -5084 -6 -7491 3372 -4440 807
886 807 -1708 468 5146 -2223 4122 -2220 9039 249 5042 3417 4906 9648 882 8674 2939
901 2939 10714 3722 6007 5669 7341 10643 2332 9709 3877 11212 2456 5591 7672 4477 8133
916 8133 720 8227 414 7622 807 2395 3431 378 5337 -4553 4590 -2638 2462 -4273 -1087
931 -1087 -1503 -4412 1722 -9727 -771 -7088 -1409 -6850 -6495 -2596 -7657 -1815 -11488 -1917 -8297
946 -8297 -2953 -7037 -7271 -626 -7664 479 -9736 -390 -5811 -1341 -3933 -6443 1683 -8690 3181
961 3181 -6883 2652 -2172 512 448 -2421 6001 -3625 6263 -3834 5998 1988 1866 4386 -1053
976a053J1858j2255R585p584P021m252m53M486q066J1950j3442R964p622O603
990F740k549o475Q257q231J0922j2438P331m941K358K217r205R548q817J0962
1004E679j2735O130j985j12K323q466R756q916R546r950N209o4l648O317j0712
1019a1628J2360r948Q303n367R57L862n558P940j0584J3061j0518P966m739K292
1033a601L782o990J0347j2260J2405p872N641l026O52P210r851J0368j0929J1099
1047H975o895L275P58l812Q233r315Q938r969R010n823J294L382o623R018r868
1062E78Q477q880O235l337j127L838p137J0872j2265Q333o493L519K71m942M131
1077B073p011Q390r295O529m152K438O07o015O293p917P633p235M121k462J331
$$ plain form
976 -1053 10805 -1450 8135 551 7572 3320 2867 7353 -713 11237 -2205 7759 137 6740
990 6740 4191 -2284 5973 -2258 8664 -3774 3557 -1384 974 3191 -6014 3534 -5283 5679
1004 5679 -7056 -926 -2911 -3023 -700 -9166 590 -8326 1220 -8730 -3521 -3585 -7233 -916 -11628
1019 -11628 732 -9216 -913 -6280 -5323 -1461 -7019 921 -9663 3398 -7120 846 -3893 -1601
1033 -1601 2181 -4809 5538 -6722 5683 -2189 3452 426 1078 8288 -1563 8805 -2124 8975
1047 8975 2080 5355 6113 2301 10534 1219 10157 188 9198 3375 4669 8051 1428 10446 578
1062 578 9055 175 6410 3073 1946 5784 -1353 9519 -2746 5587 -906 2613 2884 -2058 2073
1077 2073 -4938 3452 -5843 686 -3466 -1028 -421 -6436 -143 -8060 -427 -7662 -3541 -6003 -4672
1092d672K327o696P408o514Q329q400M186p19l70K706m835N751m854O700q099
1107g752O048N5j865M239o678R299o559O305n009K368J697l036L943o379R209
1122E885n887M638m160K498J484l912N152n443P493o539L535j993l94L457m294
1137A520L308m215N407m582O26q21l53K506n113N623n836O169n842L563k501j075
1153a616L199o063N892o499N886m339J149q12m77L858p417P511p670M927n92o95
1169c758R05l165O054p252O523l950N040l281q11L278l513N865o698P100n304
1184b967L803j629p42L578l941P436q262Q189o254M504j600j323N058m895O480
1199G435p897P473m888L587j310k036N748p051P439q889O450k660M77J109m145
$$ plain form
1092 -4672 -2345 -9041 -1633 -8147 182 -8218 -4032 -4751 -5121 -2415 -7250 -1499 -6353 347 -7752
1107 -7752 -1704 -1649 -3514 725 -5953 3346 -3213 3092 -1917 451 2148 -888 3055 -3324 5885
1122 5885 -2 4636 476 2974 4458 546 5698 255 7748 1209 4744 2751 2357 5814 1520
1137 1520 4828 613 6020 1438 2064 1243 890 3396 -1717 3906 -1930 4239 -1603 1960 -541 -1616
1153 -1616 1583 -4480 1412 -5087 799 -3540 -2391 -3203 -3680 178 -7239 272 -7398 -2471 -3063 -3758
1169 -3758 -2853 -6018 36 -7216 -693 -4643 397 -2884 -3695 -417 -3930 1935 -4763 2337 -2967
1184 -2967 836 -793 -1535 2043 -1898 5538 -2724 5465 -789 3715 2115 792 5850 955 7435
1199 7435 -462 7011 2123 5710 4400 2364 8112 1061 8500 -389 6061 3401 3878 4987 842
1214H42P175r184P995q878N428j263j320K207o711P839p585N821n748L259q58
1229i81k290M687p422P859p781N493m302J523J339m872N272p061Q633p804M666
1244c041k657Q65K964o084P603p549Q353o344L893k722N01M469q199R017o619
1259e550O699m794K392N29r40N586q127P465o290P644m774R22K032l512P839o982
1275A39O799o501N275k734j84L445m060O098r167P182n321M930j311n074O587
1290F103n731N944p851O388m153R10J547m431N565p549P899q574O350k455j588
1305a626J874n379P757p621N741m952K937n33j865K675m518P109o824M820k880
1320c285J668J10j967L378n070O946p171M380j357J98L319m830M836m209O391
$$ plain form
1214 842 8017 -1167 6828 -2050 3378 2115 795 3002 -3709 4130 -3455 2366 -3382 -123 -981
1229 -981 -3271 1416 -6006 1853 -5928 -435 -4737 -3214 -1875 -6747 -1475 -8536 97 -7707 -3041
1244 -3041 -5698 -4833 -1869 -7953 -350 -7899 454 -5890 -1997 -4719 -4218 251 -7948 1069 -5550
1259 -5550 1149 -3645 -1253 -724 -1664 3922 -4205 3260 -3030 4614 -160 762 2794 -718 7121 139
1275 139 6938 437 5712 2978 2794 6239 2179 8277 -890 6292 971 5901 4590 -484 6103
1290 6103 372 6316 -1535 4853 700 1610 3157 -1274 4291 -3258 4641 -3933 2417 -38 -1626
1305 -1626 248 -5131 2626 -4995 746 -4206 -1269 -1802 -3667 -992 -5510 1599 -5225 -405 -3285
1320 -3285 -1617 -1507 -3474 -96 -5166 1780 -5391 -1011 -2368 -2170 1149 -3681 1155 -3054 3337
1335C337o144L213Q5Q26K061m117M821m701M607m192K366m0j05J983l921M494
1351D573m514O406m633J413Q17k640M215n241M473m299M268m336J856O46k364
1366F40L032n219N950n105L217k689p52K301k611K467m318L682m439M137k851
1381b558m75J319j880L713o359M956l931K518j753o03K398k798L787m784M530
1396a920l916L245j428n46L937m316L843l522M068k537J410L4r16L126l847M854
1412A569n194N751k259M30N59q75M070o276N619l610M398j713p95J824k255M582
1428E825m255L393l863L627p10j967K096k882N320n461L892k990J737n73l188
1443AL707m367N864o313M871m291L038j051l698M927o061N461n366M150k746N01
$$ plain form
1335 3337 -2807 406 491 1317 3378 -739 4082 -619 3988 -204 2162 2122 2017 4000 79 4573
1351 4573 59 6465 1832 3245 4062 1422 5637 396 4869 570 4838 502 2358 3004 640
1366 640 3672 -1547 4403 -702 2515 -174 -926 1375 -1236 1231 -3087 595 -3844 293 -2558
1381 -2558 -3033 -1714 -3594 119 -6240 -1284 -5215 -2697 -4450 -5053 -2655 -5453 -1666 -6450 -1920
1396 -1920 -5836 -2591 -4019 -4565 -628 -4944 -1101 -4623 -555 -3092 -1682 -1648 -2564 562 -3285 1569
1412 1569 -3625 2126 -133 297 856 -19 4051 -2225 3394 -216 4182 2469 1674 3498 1243 5825
1428 5825 1570 4963 1100 4727 4017 2050 4146 1264 6584 1123 5015 2025 3762 3189 1
1443 1 3708 -659 5205 -1108 3763 -528 2510 1459 -2239 2688 -3373 2088 -3278 872 -1874 -1373
1459a373J197l985N662n929M165m140K652o5j802K882m210M609l947M171l812
1474c925K643P3k030K876m118O678n535M006l174J346J527l035M829o113P057
1489C105m303J549P51o61J704l379N928o458O098l669J171k84q76M812o759O607
1505E336n275L673k488J029K42k708M974n161L973m342N160k980j116J811l265
1520a137M139o527N996n115K886m10j633K868m841N098n631M191l711K471n82
1535a938l227N072m917M686n164L634k500Q20J551m037N372m512M715l334K693
1550a086m04q85O97l194N958m654M416m499L403J080k824M311l656M117l744L916
1566B952l798K167J455k147K959m222N389m839L094j701Q12J648l088M178m572
$$ plain form
1459 -1373 -176 -4161 1501 -4428 -263 -4403 -1751 -1816 -3618 -736 -4946 -337 -4284 -113 -3925
1474 -3925 -1282 -1209 -3239 -363 -4481 2197 -3338 668 -2506 -1160 367 -2668 2161 -3952 3105
1489 3105 -1198 351 1102 441 2145 -1234 4694 -1764 4334 665 1836 1552 676 5488 -1271 5336
1505 5336 61 3734 1246 2275 2517 -191 4783 -378 3595 -747 4413 1433 317 2128 -1137
1520 -1137 3002 -3525 2471 -2644 242 -168 -1801 1067 -3774 1324 -4307 -116 -3827 -1356 -1938
1535 -1938 -5165 -93 -5010 -324 -5488 -1854 -4354 -3534 -1983 -6020 -648 -5160 -445 -3779 -1086
1550 -1086 -1490 -2375 -1678 -4872 1086 -3568 848 -3651 -248 832 -1992 2319 -1337 2780 -964 2952
1566 2952 -846 1321 2776 629 3588 -634 4755 -84 3010 1309 2121 3769 681 4859 287
1581B87N308m237J706m12n1Q10k771M294m976M554l386J711J48j711K443l587
1597A30K030k795K836k921R76j157P38J944m525L029k453K167j861k87P31m54
1613a872J708l631L780l902K913j717j23P50j796L358m029M017l639L353k103
1628b933O15J301k211L894l878L762k223J678o84r90L412l520L793l874L794j823
1644A13K025q53p80K103k659L062k668K456j881J747k26j290K453k906L080l845
1660f9L051k700J935o0l355M473m182L379l128K390j799L56j10k352L924m670
1676b917M374m397K217q99q46J742l033M878n210L086k468K161J06k859K861l747
1692d951M438l706K683j108L04J005j726L583m408N298m237J900r22K89K546l546
$$ plain form
1581 287 5595 1358 3064 2652 2601 3411 640 4934 -42 4512 1126 2837 2985 1274 3717 130
1597 130 2160 -635 2201 -720 256 -901 -163 1781 -2744 285 -2168 -1 -1862 -2149 -1418 -1872
1613 -1872 -164 -3795 -15 -3917 -1004 -2721 -2844 -2094 -3890 -532 -4561 -544 -4183 -830 -2933
1628 -2933 -2318 -1017 -3228 666 -3212 550 -1673 5 -679 -1669 1743 -1777 2016 -1858 1936 113
1644 113 2138 1285 505 2608 -51 3011 343 2799 918 2665 2439 1149 3602 696 3776 -69
1660 -69 2982 282 2217 2157 -1198 3275 -907 2472 -656 1734 -65 291 181 -2171 1753 -2917
1676 -2917 1457 -2940 -723 -1622 -2468 -726 -3759 1119 -4091 -1005 -3473 -1312 -1206 -4065 -1204 -4951
1692 -4951 -513 -4219 -1536 -2644 -2340 -1335 -3061 522 -3886 1412 -2825 -925 -1847 -1558 988 -2558
1708b558M275l608M614l699J389R85j273K021l793N390m419L922k838K000N94
1723C002j619L139m431N003m007L842k497n67J847l164L854m854M326l120K452
1738C206j886k45K659m081K977l194L080j129q96M89j844K671l919L823m880M090
1754I21j522k84J128j938K590l973M043n409L460j579j272L001l302M245n772
1769e663L668p16M94QK30O89j574K935m060L669k405J97J552j852K999l530L795
1786D36k744J610J99O70J420j913J889k324M310l661J485N79o46J437l017K977
1802B707l042L602r30j153j25o44K260l354L894l241K426j673P73J082j608J521
1818B495k534K910l579K629j922r66K601k280L66j339K662j254J325j568j771
$$ plain form
1708 -2558 1717 -1891 2723 -976 413 1398 125 2146 -1647 3743 -676 3246 408 2408 3002
1723 3002 1383 4522 91 5094 1087 4929 2432 1865 3712 548 4402 -452 3874 754 3206
1738 3206 1320 1075 3734 -347 2630 -564 2516 1387 491 980 -864 1807 -2112 1711 -3169 921
1754 921 -601 -885 243 -1695 895 -3078 965 -4444 -984 -2563 -3835 -834 -4136 109 -5663
1769 -5663 -1995 -2711 -2217 -2209 -1979 -1290 -2864 71 -3989 -320 -2725 -2528 -976 -2828 171 -3359 436
1786 436 -2308 -698 -499 171 1591 -322 1567 -757 3553 -108 1377 1956 1310 2747 -270 2707
1802 2707 -335 3267 2337 1184 1059 415 2675 -679 3215 -26 2400 727 1500 2582 974 2495
1818 2495 -39 2871 -708 1921 -1 -967 1634 -646 -280 -1619 1043 -211 1114 -454 -2225
1833b225J712j459K008l480L638k094J753j595n05J823k118J561k745L118k058
1848b666Q07Q88j528K999k233J872k412K535j318J380k95j168K875k509K862k360
1864b71J776m83J70M41j013K269j902K865k073N37j083p2J823k387L729m170K720
1881B876j802J724j184m12J261k009M118m344K453q36N59m20o04M7k165K560l901
1898b079K189o52P47J29j443J681l047L866l447J290j119k17J884l358L272l195
1914c499L096l133K419p40m11J112k574L201l530L561k997K418j180o04K454k868
1930c275M915m744J938j232K268o2j875K989k892K822k156K988j060q99K140k274
1946d09K315k939M917l726J903N4j845L012l462L685l475M234l623J001m6j518
$$ plain form
1833 -2225 -513 -1972 36 -3444 194 -1900 -147 -1742 -2247 -424 -2542 -981 -3726 -608 -2666
1848 -2666 -1859 -971 -2499 500 -1733 139 -2273 262 -1056 324 29 -1139 1736 -773 2089 -271
1864 -271 1505 1022 1192 1633 620 2889 987 3852 1779 2316 1233 1161 2984 597 4326 156 2876
1881 2876 1074 2798 1614 1202 2463 454 4572 228 2681 1845 2404 1984 1380 1427 -738 1822 -2079
1898 -2079 110 -542 205 334 -1109 572 -2475 1391 -2056 -766 -1885 -2102 -218 -3576 -304 -3499
1914 -3499 -403 -3536 -1117 -1857 -2268 -1156 -3730 -529 -4059 -498 -3495 -1077 -2257 -2861 -407 -3275
1930 -3275 1640 -3104 -1166 -2398 -130 -192 -2067 922 -1970 852 -1304 1684 624 -275 1865 -409
1946 -409 1906 -1033 3884 158 2061 2115 270 3282 -180 3505 30 4264 641 1642 1596 78
1962G8L777n140M459l081J876j712P56M03k012M020m570M208n954L811j176j406
1978a663K475k167K638m325M951m259K564p47p15K035m246M030l274K517j107
1993a293M31K76k057K799k088K277k658R06N58n74J451k085L854m139L474k743
2009a611J065J871j704J809k555L703l639M056k995J985k21j742L362m361M088
2024C111l045L570k757N22J075q54M10k589L952k812K301j033l1J265l647K599
2040B037l158L341k447R81l89o42K849l244Q66j584K192k052k0K88n69L53k340
2057c538L099l189L536j176r09J258k604K845k959L779l210L163l187J255J471
2072c66k198J525l606M381j281l21J204q42R93j585K345k565K852j641J555L61
$$ plain form
1962 78 3855 -1285 3174 93 1969 257 1013 1416 -596 3424 -1146 3062 -2892 919 -257 -1663
1978 -1663 812 -1355 1283 -3042 1909 -2350 214 -533 -1248 787 -3459 571 -2703 -186 -1293
1993 -1293 -862 -586 -2643 156 -1932 345 -2313 -1407 -849 -1423 28 -2057 1797 -2342 1132 -1611
2009 -1611 -546 1325 -379 1430 -1125 2578 -1061 2995 0 1985 1764 22 3384 -977 3111
2024 3111 66 3636 879 1401 2476 1622 2032 -557 3395 583 2884 1851 1820 3085 -562 2037
2040 2037 -1121 2220 -227 754 365 -277 2572 -672 194 -1390 802 -1250 -1270 -982 -1551 -1198 -3538
2057 -3538 -439 -3628 -92 -1268 -2177 -919 -3523 -678 -3637 142 -3068 95 -3092 -1837 -366
2072 -366 -2564 -1039 -4645 -264 -1545 -1866 -662 -1504 -511 -2096 249 -2316 536 -1105 450 811
2088H11j960K162j962L071k889J617j041J043j99j149K422j678K060k616K101
2103A793l42N47P38j802K495l555L249k404J642j197J15M94j831K866l532L471
2119B747k370J941j104j110J272k259J907j948J651k858K917j283j444K086j664
2134a519K286l639L334k471K147n12k305K244j884K540k909K841j340L99L40j153
2150a601J773k078K525k075J155L24J40Q48k198K864k788K497k010J272J4q68
2166b06J890k022K656k747K107j852N13j7j55K269k477L133l588K513j809J272
2182A480K04j358J659k713L213k325J498j293R1J283k667L398l570K871k738J314
2198C47n01r20K792l280K670l914K821k200N20J170j466J127k044K740l130K400
$$ plain form
2088 811 -1149 1013 -949 2122 -767 850 -191 852 653 -496 1926 248 2308 -308 1793
2103 1793 1451 1998 2736 934 3429 -126 3123 719 2361 1164 1279 1773 -58 2808 -724 2747
2119 2747 377 2318 1214 104 1376 -883 1024 -924 727 -2131 786 -497 -1941 145 -1519
2134 -1519 767 -2872 462 -2009 138 -374 -2679 -435 -2319 221 -2688 153 -1187 -788 -448 -1601
2150 -1601 172 -1906 619 -1456 -301 23 163 1011 -1187 1677 -1111 1386 -624 648 662 -206
2166 -206 1684 -338 2318 -429 1678 -174 339 322 167 2436 -41 3092 -496 2017 208 1480
2182 1480 1684 326 1985 -728 2485 160 1658 365 456 1739 -928 2470 -1100 1771 -967 347
2198 347 -154 -1074 1718 -1562 1108 -2806 15 -2185 -1665 -495 -1961 -834 -2878 -138 -3268 -868
2214h68r38j48J604k918K780k033K341l637L448k026R89P05j809L116l266K741
2230H1k566J824l55J0P83j617K871j282P75j376J752k64j482L631k786L213l938
2247g26K472k41j425K571k607K822k759K300j746J180K94j101J292k563M297l125
2263I35J622j831N78L79j155J560l189L396j679J069k027J3R62p45J075l091L895
2280A767j751K75q86r15K110j646J795k192J748j491M07j364p27K877k134K864
2296G37l165J227j909K913p18n81N80j070K122k134K309k010J372M57n2N79k311
2313a654K513j231J377p69N72J412l186L630k316J058j070P21K97j570K228k157
2329a45K686k741J617l82k90N11j206J378j249K625l426K304j357j73N10m09M28
$$ plain form
2214 -868 -1806 -1954 -350 -3268 -488 -2521 -180 -3817 -369 -2395 -1406 -701 -2510 606 -2660 81
2230 81 -2485 -661 -1016 -1006 -223 -1840 1031 -251 524 -852 900 636 -846 2785 -1 3212 -726
2247 -726 1746 1505 80 2651 44 2866 107 2407 661 1841 2135 1034 2326 -237 4060 935
2263 935 2557 726 1304 1683 528 2088 -1101 2295 616 1685 -342 -329 633 -112 963 -2128 1767
2280 1767 16 291 -595 -1510 600 -1046 749 -1443 305 -1186 -779 -2143 -2870 7 -2127 737
2296 737 -2428 -1201 -3110 -197 -915 -1496 -916 -1986 136 -1998 311 -1699 -327 130 78 657 -1654
2313 -1654 859 -372 1005 236 808 2220 -966 2664 348 1406 336 1057 1354 -216 2012 -145
2329 -145 2541 -200 1417 1035 745 1256 50 1428 179 2804 -622 1682 325 152 662 253 681
2346F81j594J665l111M011j553n01J19j170K315k403K279k827J658j183m31J123
2362i22j028N76M38l3j528j49J919n39O65k236L469k326J798j749R23nj079L131
2380A325m163K949j363J116R9J332l26j578J477j075J807j937J553K24m3O89j849
2397B37K272k923L063j205k15l35M92P25j414J775j930J338l15K17p23m38J986
2414B607l102K085j155K622k239k31N27j934J839j934K753l173K298k115q30J599
2430c83q52K774m404K815l171K458Pj184J516j120J317j856J561j091J238q11
2446a186q20K299k267K016k766K149M65j066Q23k309K473j423J708k390K498r00
2462f96O50J240k343K370k613K072r73R90k58m07J601j779J764k106K026l54J45
$$ plain form
2346 681 -913 752 -2359 1652 99 -402 -283 -1453 862 -1541 738 -2089 -431 -1614 -2045 -922
2362 -922 -1950 -1374 -936 -969 -2497 -2646 -727 -1266 -601 -2837 632 -1694 104 -1645 -722 -727 -1806 1325
2380 1325 -2838 111 -1252 -136 -37 1295 969 -609 868 -207 1600 -337 1216 1440 1397 2086 237
2397 237 2509 -414 2649 1444 1229 894 1386 2111 697 2472 542 1880 1565 1782 1059 621 2607
2414 2607 -495 1590 435 3057 818 587 1114 -820 1019 -915 1838 -1335 963 -1152 -1982 -383
2430 -383 -1235 1539 -2865 -50 -3221 -763 -756 -1940 -424 -1544 -227 -2083 -522 -1613 -375 -1186
2446 -1186 -2006 293 -1974 42 -2724 -575 -110 -1176 -353 -2662 -189 -1612 96 -2294 204 -696
2462 -696 -46 1194 -1149 1221 -1392 680 -293 697 439 32 1633 -146 1618 -488 1538 1184 1329
2479A329p7k217K701j834J403j612J259j048n8K230k615J984k779L417k139J397
2495A341q94j567K217k079J824k387J998j441K21k47O2J277j939Q95j461J434
2511g46j043P80K95r25K078k673K068k145J380j66J87J172j544J596j730K101
2527F85k574K597r83r37J462J2O45n29K284k974J179r41L76J202j312J421j921
2544c08K260j028J1O04j015P01k60J368k234J962o55O01r30M21N87j877J897j989
2562A16J348k77n91J48q31J212j056Q00n10O15l85n81J126k212K130k223J140
2579c1j003J271o93n87J514k298J346j005J382q89k29R20q33p8j272L108k219
2596a596j4J23m5J388j062Q23j048J929j609L08N79k74M77q92P83r62J060p90
$$ plain form
2479 1329 1252 -965 1736 -98 1305 -307 952 -96 -154 2076 -539 1445 -1334 2083 -56 1341
2495 1341 447 -1120 1097 -982 842 -1545 453 -988 -767 -1014 -952 325 -1614 -719 -2180 -746
2511 -746 -1789 -1009 -714 -1639 439 -2234 -166 -2311 -931 -1097 -910 262 -1282 314 -1416 685
2527 685 -1889 708 -275 -1212 250 262 907 378 2662 -312 867 -74 302 1504 192 1613 -308
2544 -308 1952 924 935 1539 524 1225 965 2333 99 2061 1406 2007 1077 1498 2085 208 2105 116
2562 116 1464 1187 596 744 -87 1125 69 869 359 974 589 8 1134 -1078 1052 -1171 -31
2579 -31 -1034 237 -456 -1043 471 -1827 -481 -1486 -104 -993 -1222 -302 -1135 -1213 -2485 623 -1596
2596 -1596 -1610 -1487 -1532 -144 -1206 -383 -1431 498 -1111 -803 -224 -498 -21 -913 -130 -1092 -32 -822
2614h22R03o47k3J133r48J228q41J523m01o85M52l79k1p5J459j248j72J6M68O72
2634A592l66J84j697K417j543O46j358j6M72p97K431k407K136j477K94n56p68
2651h13J046j014N16o87J416j839P85M02j442J832j661J368j101J756j235o67
2667a338Q1L73J529k798J951j768J775o11j82J126j238J384j308J446o84O06J83
2684E27j010K153k871J938j026J436q47L29L84r53J804j810J849j102N31n07J94
2701A019N58j406J909j665Q81j406K398j310n73J086j422K267k103J467j513L0
2717B17L76p91J324j383J085k170J503p57N00K47o64P69j911J904j454J101o50
2734g54m18R91j184O63j315J201r44Q19Pn39J063j553J405j277J451j065M86N21
$$ plain form
2614 -822 81 -566 -589 544 -404 824 -17 1506 1105 420 872 493 472 397 1856 608 436 452 920 1592
2634 1592 1226 1410 -287 2130 587 1233 -125 -141 331 -466 1965 -442 1694 217 511 -45 -813
2651 -813 233 -781 -265 -952 464 -1375 -590 -188 -1630 202 -1459 -91 -1192 564 -671 -1338
2667 -1338 -1257 -884 645 -2153 -202 -1970 -195 -806 -988 138 -1100 284 -1024 422 -262 344 527
2684 527 -483 1670 -1201 737 -289 1147 300 629 1013 60 1864 54 1903 801 1332 825 1019
2701 1019 1577 171 2080 415 1296 -110 2288 978 405 1491 69 2336 233 1700 187 217
2717 217 593 -198 1126 -257 828 -1342 161 -596 -96 151 -513 256 -1655 249 -1205 -104 -754
2734 -754 -1172 -181 -1365 -702 -2017 -816 -1760 -941 -934 -1473 -410 -1963 -558 -1835 -384 -1449 -963 -442
2752d42j226J885k232J919j557J582q55L23J063j238J470k830L080j907K111K16
2768A362k33j47l73N08j222J777j918J168l8j693J821q85J268q97J989j153P0
2785A404n06r24J465j269J610j004M66j347J055j238p80Q83r01J724m59n14j9
2802c54N41L66j444J00j39O37j047K889k105j183J223j097K092l250J497N77J28
2819e69Q4j56Q06j421K526j929N89j100L62R14q63N76j795J334L47J110r78P57
2837E94k07j87R06j886J518p79N49j06O37K2r64J808j623K154j895P58r4K56k96
2856A165m50M17p06J383n05n55L60j758J098m78J011j142J170j550j12L12o97
2873a037K160k908R30J101l23p82l10J143r28J272j651J357j475J265l83k36J077
$$ plain form
2752 -442 -1668 217 -2015 -96 -1653 -71 -926 -603 460 -778 692 -2138 942 -965 1146 1362
2768 1362 1129 982 609 1117 -105 1672 -246 922 884 -809 1012 127 1395 498 2487 1334 1404
2785 1404 898 -26 1439 170 1780 776 1242 -105 950 -288 -1068 -185 -1086 638 179 -335 -354
2802 -354 187 553 -891 -791 -930 -293 -1340 1549 -556 -1739 -516 -1613 479 -2771 -1274 -697 -569
2819 -569 -485 -641 165 -1256 1270 -659 -70 -1170 -808 106 -757 -181 -1976 -642 -295 815 -163 594
2837 594 387 200 1106 -780 738 -41 508 402 1039 1061 97 1905 282 2436 541 1299 1205 1461 1165
2856 1165 715 1132 426 1809 1304 749 1109 -649 449 -29 982 -160 1010 -540 -652 -340 -1037
2873 -1037 1123 -1785 -855 246 -77 -859 -1169 -26 -954 318 -1333 24 -1451 -186 -569 -805 272
2890B72j441J438j675L62o51J392q91r74J701r18K087k089Q05j067J228q7J90
2907c18J304j591J321j075j52M78J7R84j852J871j621J454j82l61L9o39J429j767
2925f61J451k14P19j266L73J838j828K944l125J094j775K042j358J667p74j271
2941a44K414k705J285lk13k15k27l87o20R03l67R77l45M05o33n19L72j796K965
2960A147k667J928o80N1K1r49J456j258M91j277J799m16O94j147k87L066k477
2977e05J067j465o2L09l75J317j899K343j641J578j403J985j813k04K518j847
2993i7K203j706Q42k30j309rj03J026q13j60n62K137j101Q2J551k705K656j742
3011d0L43p37J187p33o17P51q65K997l026J397q19M76k10m91N57n76L58j203J591
$$ plain form
2890 272 -1169 269 -1406 -1044 -1695 -303 -1194 -2168 -467 -1385 702 -1387 -582 -1649 -421 -508 -318
2907 -318 986 -605 716 -359 -511 -33 -16 968 -884 987 -634 820 638 277 316 -323 1106 -661
2925 -661 790 576 1295 29 402 2240 412 3356 231 1325 -450 1592 234 1901 1127 -144
2941 -144 2270 -435 850 847 634 419 192 -195 -815 88 -279 698 353 758 125 -394 -22 -1818 1147
2960 1147 -1520 408 -272 -221 -200 -1149 307 -951 -460 -1737 62 -354 340 -807 -1094 1972 -505
2977 -505 562 -903 -965 -656 -1031 286 -1613 730 -911 667 -736 1249 -564 -768 1750 -97
2993 -97 2106 400 1242 1012 -297 -306 -409 617 -196 -356 -918 1219 118 200 1751 -954 1702 -40
3011 -40 303 -434 753 20 -597 154 -711 2286 -740 657 -162 314 104 -387 170 -406 -48 -1251 340
3030C40j01l42j80j134J391n58K03n81R87j930J601j2j398K278j719R50j554K73
3048a486M77J457r74q40J375j449J404q44J256r51p9J255j329K00M40J361j264
3065IJ565r82j96q0q5J255j374Q03o18J719j908J101J132k923J866m12l4p74P64
3084H28k16l12Q04q65J005j284n21O05r17P94K53K53m28P92j502J028K73r08J515
3103A197j425oN3K45j528J163K02m68k55j641K393j119N14j21J366q23n10J580
3121H17j762J652k652R52O06k79J395j483K317k381J400j306O20M36p0j20j015
3138h73R90j316J779r63J135j336J105M79j112R02n72J153r00M79n30m71J514
3155A463k096K392j764R14j167O16Q64j109J988l383J080J73J146p59M4N39j199
$$ plain form
3030 340 239 -103 -283 -1417 -26 -584 -381 -962 25 -1905 -304 -316 -1714 564 -1155 -205 -1759 -1486
3048 -1486 -1009 448 -526 -1366 9 -1440 -36 -880 376 -575 -654 601 -728 -528 -88 1273 9
3065 9 1574 592 396 316 231 1486 112 915 297 2016 108 1209 2341 -582 1284 872 838 64 828
3084 828 612 300 1104 239 1244 -40 -561 44 -873 -79 174 427 -1 791 -711 317 590 -318 1197
3103 1197 -228 -234 -181 64 -1464 -301 -99 -567 -822 -2463 -70 -1189 -675 -796 570 -253 -763 817
3121 817 -945 707 -1945 -993 -387 -666 729 -754 1563 -818 582 -724 -104 332 262 142 -873
3138 -873 117 -1199 580 -383 752 -584 521 1000 -112 790 218 1371 471 950 420 -51 1463
3155 1463 -633 1759 -5 909 -258 358 1222 113 2101 -1282 -202 -29 1117 358 402 941 -258
3172b58P89o50K83q59Q30o4p54J92J55Q44j804J557o39j53q76P09J543k932J721
3191c66j037P40p07K96J088j638J394j679J698j540J387J45j458K550j929J808
3207G52r37J296j948J565l51q64J457k330K847j698J011k1m5j64j236J606j041
3224a01J748k082J111n26L1Q90p60J68J5L75j547K300j487M77n65J03L08q32J453
3243A079p74L63N14j199P80j281P27j625J019jp8P67r82O04r26J242j202J057
3261H4j75p15L22j534K635j488O64n23J85N96j092J392j378J257j83l74r04P80
3279d51J203j504O52j451K823j930J508r59M03O67j013m8N0P82m41n36M3P18M31
3298I47j602J485m80P92m61k51K5M12N80j783J123j242J059l09L43j418R34M18
$$ plain form
3172 -258 531 -119 164 -695 135 71 -683 -491 -336 508 -1296 261 -378 -531 -1407 -698 845 -2087 -366
3191 -366 -1403 -663 -1370 -1074 14 -1624 -230 -1909 -211 -1751 -364 -219 -1677 873 -1056 752
3207 752 -185 1111 -837 728 377 -487 970 -1360 1487 -211 800 779 734 570 -666 940 -101
3224 -101 1647 -435 676 150 181 1071 311 479 494 869 -678 1622 135 612 47 150 458 -374 1079
3243 1079 305 668 1182 -17 763 -518 209 -1416 -397 -398 -476 291 -691 -87 -1013 229 -973 84
3261 84 -91 -806 -484 -2018 617 -871 -207 -730 -545 51 -1041 351 -1027 230 47 -327 -1231 -451
3279 -451 752 -752 -100 -1551 1272 -658 850 -109 294 961 -52 -100 -50 732 291 -245 -202 516 947
3298 947 -655 830 350 1142 681 430 455 867 1447 -336 787 -455 604 295 638 -780 154 572
3316E72n17R06j826J827o18K3j27r82J744j889J538l93O57j117l24R27j603J665
3334D63k871K584j591J910j505j626J315J126M11o83L55q80J167j43j37n00O83
3351G8o10M82N13q89P73O85j461K011k026J173r26R03m7j192J516M75L26k148
3369c64K121j985J059N39j4j125k67R13j555J735j068J303m28l75M62j256O52
3386C47r02J068m69K32Q49j274J962l070Q67J677j505L76K52m27p73N19j307K284
3404G06q47j088J488o8l16j414K297p91O37j663J347k828J338K275j620J110j953
3421a390J52J249l78J18n83J225m86P98k19r40q5K96K5k18J132q67Q57q62Q25
3440F49m9j07J8q33J014j645J528o14N90R93j412J230j485J515j553J661o40n49
$$ plain form
3316 572 55 961 -865 962 344 367 240 -742 1002 -887 651 258 915 -202 -526 401 -1202 463
3334 463 -2408 176 -1415 495 -1010 -2636 -1321 -195 216 -467 -112 -992 175 32 -105 -605 78
3351 78 -532 -50 463 -426 347 1032 -429 1582 -444 729 -197 706 659 -533 983 1458 1784 -364
3369 -364 1757 -228 831 1370 1356 231 -36 877 -678 1057 -11 1292 864 489 951 -305 347
3386 347 -555 513 44 276 1125 -149 1813 -1257 -390 1287 -218 158 410 -17 -790 -271 -1578 706
3404 706 -141 -1229 259 191 -125 -1539 758 -33 604 -1059 288 -2540 -1202 1073 -547 563 -1390
3421 -1390 -1238 11 -367 -249 -832 393 -93 705 486 -454 -539 -243 -218 -436 696 -171 686 -176 649
3440 649 600 493 511 -322 692 -953 575 -39 551 1544 132 1362 -123 1392 -161 1500 860 311
3458C11n7m94M74l64J018p29n12L09m34J516l51l5j693J095j02M69r79N26O84
3477F52j517R99l44l69K4N46K7j709L91J736n31k69N80j535K215m81k005J521
3495f9j682K548q60k30L57K01R3j866J082m01K278j385L32l62k36j0k96J184j411
3514g33J414j115O92K00o80L32o93J752q99k91J95Q89m75l50P73q79J074j397
3532a91k6P52O07l64j157J566j037J815k400J427r21M30j309O82o89Q78n06L72
3550g1K96J59j347L05K14k36N47J77r64o5N11j010P52m53O22l85O56J010j569
3569h51l68M74M02n20J323j037J680k511P24R75j530J837j947J759l57j98O79
3586E34p69J170r94N70j031K85K36N90j85M19O38k206J424j333K475j767J542
$$ plain form
3458 311 254 -240 234 -130 888 159 -353 -44 -478 1038 687 652 -1041 54 -48 421 -558 -32 652
3477 652 -865 134 -210 -579 -555 -9 18 -1691 -1300 436 -95 -364 216 -1319 896 415 -1590 -69
3495 -69 -1751 797 -63 -293 64 265 358 -1508 -426 -827 1451 66 398 36 -200 -210 -506 678 -733
3514 -733 681 -434 258 458 -222 110 -583 1169 270 -21 174 1063 588 238 1011 132 1206 -191
3532 -191 -217 535 1142 778 -379 1187 150 1965 -435 992 71 501 -808 -126 -815 63 -443 -71
3550 -71 225 384 -963 -658 -444 -680 -133 44 -920 -985 -474 -1484 -732 -1185 -563 -948 -292 718 -851
3569 -851 -1219 -745 -343 -863 460 -577 1103 -1408 -684 291 -1239 598 -1349 410 53 -145 534
3586 534 -235 935 -59 511 -520 -235 1 591 406 825 1463 -743 681 -652 1823 56 1598
3603A598k02j521Q03l02J542j827R62j90k00l97j161J819j523J131j664J451j097
3620g78K74Q79n55K96k78k69P38J30M46j136O31j889K205j573L90k55q6M61l48
3639g17N09j100J725j515J003o05m50j35Q05O8n93J619j436P71m89L35l43l04
3657h52J461p95J67j9K15J46j182J654p59O00k24L50N19j290n46K29R12N3J093
3676A732k060Q70J67j347R24k14L48p50O38K28M74J61p93p31k35J130k69p48j28
3695f03Q79k58j606J786j012J402q69l36M83l26j70l15R3R49j68q68O14o53R41
3714c7j62p36Q32p42J42m8l92P42p27J088M17l95k56P51k458J401J254j061J442
3733A055p61k63k71J501K60o89j557J002k68M31P09J31O93j362o20L73J119l77
$$ plain form
3603 1598 1396 -125 678 376 1918 91 1053 863 663 266 -895 924 -599 532 -1132 319 -778
3620 -778 -504 375 -180 116 -162 -431 307 437 883 -253 378 -1511 694 -879 -489 -744 -830 -369 -717
3639 -717 -208 -1308 417 -1098 -95 -700 -1150 -1285 -480 -412 -1005 614 -822 -51 -540 -205 -548 -852
3657 -852 609 -186 -19 -38 177 323 -859 795 36 636 412 762 1281 -9 -555 -326 586 639 1732
3676 1732 -328 542 709 -638 286 72 420 -330 308 536 1010 1171 378 -353 -588 542 273 -475 -603
3695 -603 276 18 -1588 198 -814 588 -281 -617 -134 -460 -630 -945 -852 97 -71 -939 -325 -978 -37
3714 -37 -199 -935 -103 -845 -703 -751 -1143 -401 -1128 -40 377 -18 -274 477 -1981 -580 674 -387 1055
3733 1055 294 31 -240 1261 1521 832 -725 277 9 440 1149 1280 1973 611 -9 364 1483 1106
3751A106L7q05J161j608J910j530K51o62K03n46J497j125L55P26j910K207j188
3768G9N10n0J8n16j80J060j009k92Q62k79k313J774K16J74N63k075Q95K43O15
3787B95l21n90o07M37M96J027P8j585Q08j338J266k88j68O05n25J013o50K92j368
3806a123K20J007j006K205j856J233q68O38j205K149k49k208K725k781J770j017
3822c66J000o0q34J42N78Q64j542R90p44r6L80n77O38Jk70n51J364j261q0P46
3842C22r31J272j869K453j268l63N37m54o15K59J929j127K65j056O62Q57q69j577
3860a573m91J969l54O60q51J152j307M46l16O48J038q24k27p20K46o5j229J320
3878d78M55m31j34L51K52l4J165k258K391j433N09p90K099n91j076K33J43O78
$$ plain form
3751 1106 1143 338 1499 -109 1801 271 522 -140 63 -483 1014 -111 244 970 -940 1267 79
3768 79 589 539 557 41 -139 921 -88 -380 482 203 -2110 -336 -120 54 617 -1458 -563 -320 295
3787 295 -26 -616 -1223 -786 -290 737 815 -770 38 -1300 -34 -322 -490 115 -410 603 -47 245 -1123
3806 -1123 -903 104 -902 1303 -553 680 -188 450 -755 1394 1145 -1063 1662 -1119 651 -366
3822 -366 634 574 -260 -118 460 1324 -218 772 28 -68 312 -265 373 374 104 -447 917 -344 -424 322
3842 322 -609 663 -1206 1247 -21 -384 153 -301 -916 -657 1272 145 410 -646 16 873 4 -1573
3860 -1573 -2064 -95 -449 211 -640 512 -795 -349 -665 -17 1021 197 -30 -750 -504 -569 -1798 -478
3878 -478 -23 -454 -588 -237 15 -19 1146 -1112 1279 -154 355 -435 1664 1073 -3 230 373 1051
3896A051j465J355n18j105M13P75l55o22R35p96O0L15n99J357r98M87j22J86J09
3915D63j193j46J301J086j386L4n29O01q96Q40l52l20N46j050J976r79Q97l08
3933E85n77o04L89J20q71J397o77J0M10K53n24j21J771j996J364j626Q39j475
3951a333M49J737k379R41L53k30m43J207Ln01mJk41n77J775n76K66r13N00N08
3971E43n95L35o87M00J92q75J388q35J171r0n32m34J50n84P19O14k45j47q08j77
3991d97O66p45L17j89L78l08R63j497J580j133PK14r1k84J18J040jk5q96J121
4011G38j178m58K70L68J140l90q79J096J34j893M82J166j153N99m43N89M9m76
4029b39K36n5o7n41K42K57O27j151p6R67n68L85k19K49j9l88K05J023m48K38n42
$$ plain form
3896 1051 -414 941 423 -682 -269 506 151 -471 464 -332 -272 43 -556 801 -197 290 168 354 463
3915 463 -730 -876 425 1511 125 159 -370 231 -665 175 -177 -497 49 -1001 975 -4 893 585
3933 585 8 -596 -207 -87 -958 439 -238 -228 182 435 -89 -210 1561 -435 929 -697 142 -1333
3951 -1333 -884 853 -1526 -585 -232 -462 -905 302 305 -196 -200 -199 -440 -1017 758 182 448 -465 35 543
3971 543 -52 283 -404 -4 188 -687 701 -134 1037 947 415 -19 131 -453 266 880 635 488 -320 -497
3991 -497 169 -576 -259 -448 -70 -378 585 -912 668 -465 -458 -244 -335 -619 -501 539 538 513 -383 738
4011 738 -440 -898 -628 -260 880 490 -389 707 841 -1052 -570 596 -557 42 -401 188 237 -239
4029 -239 -3 -58 -125 -666 -424 -167 460 -691 -767 200 -368 17 -202 47 28 -360 -155 868 420 658 116
4050A16m42P36R05o76j12q40J002m20L02J40m96k99M36r56K65P11j711J363j426
4069a402J586k47L56L38r12J414j327M24j006j16J005j094J112j082L60R5J24
4086c72k4J334j125j410J985j079O11j384J098l10ok49l79J182q74R55r8J96N17
4105E68J97K3q62R3N09j95N06n25o7r0M64n52M57m52l56L27M60R7m72L48M30o89
4127B19l31O61n06L37k19j382K191n01K20m92L11J061M2J19n26n53j222j024N45
4146a050R76m62J086l67j016K99l7J094j604J253Q80k333K227k336J453P68j563
4163g32j12n34J363k96J307j191M93j205J091j185L81n3J09j68O87l65j92O37
4181C5r14L06K73m58J872n59p3q87R68Q1k71L73M74m84j340oJ374j21r53J221
$$ plain form
4050 116 -326 410 1315 639 527 -313 689 269 571 711 215 -84 352 -604 -339 372 -1339 24 -1402
4069 -1402 184 -63 293 631 -281 1133 -194 230 -776 -892 113 -981 131 -951 -591 -496 -372
4086 -372 -396 938 -187 -1597 388 -691 -80 -1464 -366 -676 -682 -931 -1310 -128 -1002 -47 -145 51 568
4105 568 765 788 -74 19 528 333 839 314 247 157 621 69 526 74 -282 45 505 602 130 478 908 219
4127 219 -112 549 43 380 161 -1221 970 469 689 197 508 1569 1611 1730 1204 651 -571 -1595 -1050
4146 -1050 -74 -536 550 183 -833 -534 -571 523 -1081 172 1052 -1281 946 -1390 63 831 -732
4163 -732 -844 -1378 -15 -311 996 -195 298 -907 184 -1001 -620 -673 -564 -732 -45 -410 -602 35
4181 35 -879 -573 -300 -758 1114 555 482 -405 563 644 373 746 1220 736 -604 -610 764 643 -310 911
4201I11o92j98m70J755q58M31j229J444K14n08j129Q43N19o67k2j230J364R9j111
4220e34o90J165r6M22K42K63r24K55K25r13L67L49j160N21K79L50p40R85q89P08
4240A85r64R21k20j539K630j559N79m70Q62o60l69O5k78J589m36j054j07J314
4258D89r79j05J127j543N35k2K70O96j69l87o92J144p81J268q92K53L54L09m37
4277D38n43J019m82Q14p76k83J264p63p37J160n32L30n22r63O16K52O23J05j138
4296a18J093j068m01J127p45J16r63R08j086J983p10n90P00o91O24p36J372j999
4314a184J810n96r8P17j588J352j191M60J04n0K22M06j46q1j12q95Q13J58K18
4333C19j62J24O58q27J51M03l43L45k56m58K01L32q25J027o55J283k107J207O5
$$ plain form
4201 911 219 21 -449 1306 448 879 -350 1094 1308 800 -329 514 1033 366 344 -886 478 577 -534
4220 -534 -1224 -59 -155 267 509 772 -152 103 328 -585 -218 131 -1029 -508 -229 121 -619 366 -523 185
4240 185 -779 142 -78 -1617 1013 -546 33 -437 425 -235 -604 -539 -817 772 336 -718 -825 489
4258 489 -490 -595 532 -1011 -476 -498 -228 468 299 -88 -780 364 -417 851 -41 212 566 875 438
4277 438 -105 914 432 1246 470 187 1451 688 -49 1111 579 909 387 -576 40 292 915 1020 -118
4296 -118 975 -93 -494 633 -112 4 -959 -51 -1137 846 136 -454 246 -445 179 -557 815 -1184
4314 -1184 626 30 -68 649 -939 413 -778 -318 -214 -264 -42 364 218 137 25 -870 -57 101 319
4333 319 157 281 939 112 263 666 323 668 412 -46 155 487 -338 689 34 1317 -790 417 482
4352D82j578J938J59J60j964J228q17J030j425J504o39P73qj917N33O82q42N62
4370a39o79J172m58o18N77n54L70M03J71j023l72Q70M93k74j25L87j266J467o28
4389b26Q22j156K11m44K66J59m58J226j537J413o03m39Q95m88J380j574R36q97
4407e14J71J1K19R4M52K71p91M27m29m1j90R08p60K75K81j017Q54N6N32j211J329
4428I27q91K73J05n92J173o61O11q1N04n69q21L66j147R88k39O14o61L18L12k180
4448a651K214j143J278j258J187j022o34K462k465J661j036J653j124r20q3J298
4464D17j5j024M80J49o31P9P59o65O8j009R14Q10k17J135j700l34O68j56J611
4483A339j113N03l20l70j262P82N4J085o24J38n74N35q76J271o60K21P21n84J080
$$ plain form
4352 482 -1096 842 1001 1161 -803 425 -392 638 -787 717 78 851 843 -1074 -541 141 -701 -139
4370 -139 -818 354 -104 -722 -145 -699 -329 74 245 -778 -1150 -280 213 -61 -186 201 -1065 402 -226
4389 -226 596 -560 -349 -793 -527 -368 -826 400 -1137 276 -327 -766 129 -359 1021 -553 383 -514
4407 -514 -343 -332 -113 -19 433 704 -87 340 -89 -130 -320 588 -172 103 384 -633 221 277 809 -402 927
4428 927 36 309 414 -178 995 334 945 864 1368 799 -22 344 -803 185 -54 560 -101 217 529 -1651
4448 -1651 563 -580 698 -560 627 -395 -1029 1433 -1032 629 -407 1246 122 -798 -881 417
4464 417 402 -622 -142 7 -624 -545 214 -451 -383 -1392 -478 332 115 1250 -450 -784 -116 -272 1339
4483 1339 226 729 409 39 -1223 -441 -387 698 74 212 -362 173 -703 568 -92 129 850 266 1346
4502A346R43j639j160J288j062M60K39N60j362J082J25j621K263j463P28n62k45
4519h0K80j241K064r71O92j066l0M41o55m21O00m13J758j871k79J811n57L1j371
4538a278P45P29L49J79p14N65j912J797p46M3J46K09j141K72J358J34q24P10j260
4557f39R94l93P78k151R72Q40o29M6O17R54m86j295J717o67j064R21N02j344j030
4576a357J186o05J373l25j72J217o51k197K785j264M20o75N21M74j478J080J86
4593E18q41J29R95l44L1j8o95k99M2R2Q26l50o43M43n94Q7M04l15P71j118Q59
4614b0o65k67J673r63l2L28J87p82o40J304r81P55j19J330j551J15J205o93Q55
4633A039j278n8K35L92j235J461j100j37N9J91R56j399P96O1l05K1J342j074O49
$$ plain form
4502 1346 2289 650 -510 778 -284 176 415 975 -387 695 820 -801 1462 -1 727 165 -80
4519 -80 200 -1041 1023 52 744 -322 -352 89 -566 -987 -387 -800 958 -913 -1192 619 62 93 -1278
4538 -1278 -533 196 545 724 10 575 -1337 460 -286 -243 -97 112 -1029 -757 601 735 -89 621 -639
4557 -639 355 -38 740 -1411 -439 401 -228 -182 435 1389 903 -392 1325 658 -406 515 1017 -327 -1357
4576 -1357 -171 -776 597 272 100 1317 666 -1531 1254 -10 410 -265 256 730 -748 332 518
4593 518 -323 -194 801 457 488 470 -225 -524 -482 -390 436 86 -557 -114 -708 -621 -217 -532 239 -879 -20
4614 -20 -685 -952 721 -242 -274 54 241 -541 -1181 123 -858 -103 -222 1108 -443 -328 877 184 1039
4633 1039 -239 -297 -62 330 -905 556 -544 -681 -622 -431 525 -874 -78 -17 -322 -301 1041 -33 616
4652F16n07K23k51P8J092j394m38J664k71j277O89M37p05m14L70O08k3j061o35
4671a199J246R88n72M82J06K85l35j866M18l48R27J89j237P42J23P83m05R42o50
4690F19J77n92Q79j087m54Q36m13N58j235O93J002j045k57L08j722K638j897P96
4708a96N14p68j8Q41r95R03J70o07J026l38k11L86q83l53N83M05n14k72n52J263
4728C84k36K57O03p51r0k47L69q9j83j44K78o42N16l36Q37j637J274r9o45K21
4748c60j62M39n02P10l61j18O40q12J285r09M39r55J127q09O42r16M66o57J915
4767A102j314J81J62Rr18J314q41J39J059o4o30m32Q65r19J071o08K78j307J009
4786A56j56m46P64o49J217l06m20O52l45l88k74j50R86j049N90j97M45j00M28
$$ plain form
4652 616 109 332 81 159 1251 -143 -581 1083 812 -465 224 661 -44 -458 -88 520 497 -564 -1199
4671 -1199 47 1035 463 945 1051 1336 1001 -865 -447 -795 132 321 -916 -174 -51 732 327 1269 619
4690 619 796 204 1083 -4 -458 378 -35 523 -712 -19 983 -62 -319 -11 -1733 905 -992 -196
4708 -196 318 -450 -468 373 -622 281 451 -156 870 532 321 707 -176 -529 54 459 -55 -327 -879 384
4728 384 148 405 1008 257 167 -80 289 200 17 -127 151 -491 25 -311 526 -1111 163 64 -581 -360
4748 -360 -522 -83 -585 125 -236 -354 286 -526 759 -150 289 -666 461 -348 294 -622 -156 -813 1102
4767 1102 -212 -31 131 140 -778 536 -305 -166 893 829 199 -233 632 -287 784 176 454 -853 156
4786 156 0 -446 318 -331 886 580 160 812 467 79 -195 -345 641 -408 182 -15 430 330 758
4805G58O8j467P21L91L16j007Kl2J600j285K01K09q37R30q90L86k72L2k16k09
4825f01m16Q61J027j762J081m50k11l67J985l426J684K52n08j16P44R07l27j088
4843g31O5M57Q61j734P27P47mq0j22n74N5J000j436Q88l48J069J01k049P94L68
4863E4k2J84k35L60k70J88O84l01q55l27Q63K55l9J9N77j165o26M16M02J89RJ75
4885E35K3k205J597L37j05J902k630J480j192O5L36M70m79K06r17J02J100j060
4903d35P68j062O48Q38j550J697j379L40p08J148k35p47L22J167j145l70O67j14
4921a50o02L21l86N40K13O8o27J852j359j001N19o39P29K27J085n77K35r49R98
4940D97K25j323O65O87k64l19o56L83P13j98j253O82Q39o34q9O52J0q22L93j013
$$ plain form
4805 758 826 -641 80 471 787 -220 -218 -250 1350 65 266 475 -362 568 -322 64 -208 -176 -392 -601
4825 -601 -1017 -156 871 -891 190 -260 -471 -838 1147 -2279 -595 -343 -851 -967 -223 684 357 -731
4843 -731 -666 -209 652 -1082 -355 392 388 308 186 -388 -333 667 -769 119 -229 840 941 -1108 -314 54
4863 54 32 216 -19 341 71 259 943 642 -213 -540 323 578 539 558 1135 -30 -656 -240 162 351 360 535
4885 535 558 -1647 -50 287 182 2084 -546 934 -258 -193 143 613 134 340 -577 -475 625 -435
4903 -435 333 -729 -81 757 -793 904 -475 -135 -843 305 70 -677 -355 812 -333 -703 -36 -150
4921 -150 -752 -431 -817 -277 -64 4 -623 1229 -130 -1131 -612 -1251 -522 -295 790 213 448 -501 497
4940 497 722 -601 64 751 487 168 -488 -105 608 410 -843 -161 678 44 -45 607 617 -205 188 -825
4960h25J226j505P00K75l90N10M93k09m28J134j374Q50j035Q06M00l86M38r89
4978c09P47J64l51n81O74m6k54P8O0n43L67m64L63P87m35j25M04r79P00J57M63
4999H77j933J152m2j49k69m36J689o63p45J801k038J409L61j052m37J563k71r13
5017i6L46o98J070r94P13j089J591j25K1Q22j571j282J345k98M44q1R06l19m91
5036B14P01j223J86l16N13q41R43k65J491k179N64j29K92J43o18L17k83O06n50
5055d34P84k76n26J335j484p58R11J114l99l44K51p63j003J475p05L96M74M24
5073D72q55K76q1r4N85L63r55R51o61o30J976j691m86J60Q98n98M75n55J66L10
5093B6l79R01n35k5R20j057J78O42l6M65n61m53n45N84m47r99O05J842j837J069
$$ plain form
4960 -825 401 -1104 -404 -129 -519 -9 484 275 -153 981 -393 457 -578 228 628 242 680 -309
4978 -309 438 602 251 -330 344 298 44 122 182 -361 6 -458 -95 692 257 132 536 -443 257 414 877
4999 877 -1056 96 54 -95 -364 -800 889 226 -519 1282 -756 653 1014 -38 -475 1088 817 -96
5017 -96 250 -448 622 -372 341 -748 843 718 739 1561 -10 -1292 53 -245 199 118 1024 705 214
5036 214 915 -308 -122 -438 75 -766 177 -88 1403 -776 -212 -341 -49 94 -524 -207 -490 116 -434
5055 -434 350 74 -452 883 -601 -1359 -448 666 267 -77 174 -589 -1592 -117 -822 -426 48 472
5073 472 -383 -107 -188 -282 303 666 -289 662 1 -629 1347 -344 -830 -670 228 -370 105 -450 -284 26
5093 26 -353 548 13 -12 908 -149 29 671 635 1100 539 86 -459 125 -322 -1321 -716 1126 -711 358
5113C58j029J342j613J414j500N26R18q48R51j461J521o32P4K92q54N99j49L99
5131C08k53P80l42o47n35l13K88l12O96j25N6O38j199K23J196j160J33J047k56
5150B23J39L13q59L20k24P12q67k26M24n18Q14K68n03j320J760p61P69r69R70
5169D65L81N2j221N31r3j012J550o69m48P28k5M23j424J231j78J64o84J19L09
5188A99j932K558n78L10j76K60p57K87N42j947J515k099K025o26M39k9j79K50
5206F2j620J908L89R2r44n38N74J06o34Q56L05m43m76Q14o03K8n16R40j511J370
5226A59m38P92q78O00j72j37j86l17J484j302J844j286Mm49L10J035r59j57L64
5245C11r2P84j196N22n36L95m37Q40j87n70J96J00O44j120M26L77o89M38j027
$$ plain form
5113 358 -671 671 -942 472 -1028 -502 416 -432 519 -942 579 -53 21 313 -541 58 -91 308
5131 308 55 835 493 -154 -689 -1002 -714 -1026 -330 -455 -399 239 -960 -737 459 -701 -568 479 223
5150 223 362 675 -184 136 -88 624 -243 -469 -45 -563 251 519 16 -1304 456 -305 464 -505 465
5169 465 846 898 -323 208 115 -897 653 -16 -464 264 239 662 -762 469 291 455 -229 -110 199
5188 199 -1733 825 247 557 381 641 -116 171 713 -1234 281 -1818 207 -419 20 -9 -188 62
5206 62 -1558 350 739 831 -113 -651 -77 29 -605 251 556 113 -363 451 -152 -124 -640 300 -1211 159
5226 159 -279 513 -365 235 63 -74 -260 -577 907 -395 1449 163 167 -282 28 1063 104 -53 311
5245 311 219 1003 -193 329 -207 188 -249 591 404 -166 30 130 774 -346 80 457 -232 206 -821
5264h21J476k06j009Q01r04J532p45n38O14n6n99J026j120P79M68j138m82P56
5282a66L1j052J164m60o97P14j18Q62O6j61k92k82P49J43l81n98P26k70q19M69
5302c72P32j89j47m36N7j51O77O38j538J333l23j59K96j140J095j514J657J86
5320G02l94q11j32M81J325L50j060Km50N0j41K77m65R34j070J83P0M27J40J50
5340E68J79n32J37o68m63J452j069P59n00N67l7j625Q93L95j01K63l18M59n89
5359b30l35l29Q29o05J100Pp05L56n0K89l20L20q10M50J30j37J90p21N66Q92o60
5380B27N12Q0j011J21m5p6O06p23j62O38j04N32j163J240Q0R7q15N9L71Q1k47
5401B98K47k79k22k59j74Q84l09k45J58o25J146p53k45K13m39O09p9l37P43R67
$$ plain form
5264 -821 655 449 -560 241 -663 869 124 -414 200 144 -455 571 -549 230 698 -440 -922 -166
5282 -166 -135 -1187 -23 -483 -1180 -466 -584 278 344 183 -109 -391 358 501 120 -478 248 -22 -841 -372
5302 -372 360 171 24 -412 -355 -506 171 809 -729 604 281 122 418 -722 373 -1141 516 702
5320 702 308 -503 -635 -154 1171 1521 461 463 13 63 -78 199 -266 668 -402 -219 -149 278 418 568
5340 568 747 215 352 -316 -779 673 -396 363 -137 430 393 -1232 -339 56 -45 218 -100 359 -230
5359 -230 -565 -894 -65 -670 430 437 -268 88 38 327 7 327 -483 -33 97 -40 150 -571 -5 887 227
5380 227 739 819 -192 -71 -116 -192 414 -309 -471 167 63 595 -568 672 752 849 34 93 464 545 298
5401 298 545 266 44 -215 -389 495 186 -59 99 -526 620 -133 -378 -165 -604 5 -74 -411 332 1299
5421A299j344M19l90o00N04M94j047J023k97J343k160L60N57n41l20Q93K21j334
5439i20O86J385j97p69m04L96L26j027L81j73j296N50J265j85m02O53m26J62J97
5458B02J71l84m2Mr44O14N44L67l99Q84M4k216J497m60M69q1j10l13l49J357o77
5479A78j48k48J96j005J038L89l28J130j848O35J74M72o62Rn61L10J174j673J038
5498B70j408J440r32P00r11K6M79o72J81L75N94O56m96N67n17j325l0J416p80
5517c67L79Q39k33Nq1p22o72P25L63n58P3J843j778L35M87q79J596j144L38r2
5537D57l36k03M92Q23p18L89r74J328q91J24j5M86m27n3o33n43M64p92P2M15L53
5558a82O60l72K04P54n13k61j84J284j505k53n29Q23J53K49O12l92q6p0o03k8
$$ plain form
5421 1299 -45 374 -16 -616 -112 382 -665 358 61 1404 -756 -396 161 -380 -700 193 414 -920
5439 -920 -234 1151 954 185 -219 177 503 -524 -143 -316 -1612 -1062 203 18 -384 269 -157 5 202
5458 202 373 -11 -53 -49 -993 -379 165 532 133 1017 1061 -1155 342 -118 351 270 160 -153 -502 855 178
5479 178 30 -218 -22 -1027 11 400 72 1202 -646 -11 163 635 -27 -18 -579 -269 905 -768 270
5498 270 -1138 302 -630 70 -841 -815 -336 -1008 -827 -452 142 798 302 869 352 -973 -1003 413 -367
5517 -367 12 851 618 623 542 -180 -852 -127 236 -322 -249 1594 -184 151 638 -241 1355 211 549 457
5537 457 121 -82 410 1233 515 904 -70 1258 367 491 476 962 535 482 -151 -694 -230 -1022 -950 -535 -182
5558 -182 478 106 310 1064 551 290 106 1390 -115 -368 -897 -74 79 328 940 548 462 392 -211 -239
5578b39k30K14N5O42K14J33j307k91J162j104J946j157J58J24j268Q10j40R87
5596G09p53J081j605m88Q25O73Q10q01M57n21L93j775J584k51J069q34j689K200
5614A084p23J46j157J059j063K456q15k55m82j539J650M19o02j108J320o28J075
5631H37r63O0j65M64j026J052J50M85j790J370j068J077J51j346k94J350o91J118
5649G71j148L76O29jp7l83Q92j624L41p60M41O8l38J662o00j466L34Q75P56N6
5669H04q25Q25j227R84j241Q67m37M41M14n27j021J404J90j261m44N08m33O45
5687c34J631j797Q26j92J5O40n19r81J338j047J259l39j99m05P11k36n30O59q83
5706c83O99j128J130p78Q15m83k54K89l91L34l19J647k354R54m3J40j47n02O07
$$ plain form
5578 -239 -469 -255 -200 442 656 789 -518 -809 353 -751 1195 38 196 320 -948 -138 -278 709
5596 709 -44 1037 -568 -1056 -231 442 1252 451 908 387 780 -995 589 338 1407 573 -1116 1084
5614 1084 361 507 -650 409 -654 1802 987 732 250 -1289 361 780 178 -930 390 -238 837
5631 837 -126 -66 -231 233 -793 259 409 894 -896 474 -594 483 634 -712 -1006 344 -347 771
5649 771 -377 -1 628 627 550 167 1059 -565 -224 -984 -543 -475 -813 849 249 -1217 -883 -8 748 804
5669 804 -21 804 -423 561 -680 187 -250 191 605 78 -943 461 651 -610 -1054 -546 -979 -334
5687 -334 1297 -500 326 134 149 789 270 -711 627 -420 839 500 301 -104 607 371 -159 500 -383
5706 -383 316 -812 318 -460 355 -128 -382 -93 -484 -150 -469 1178 -1176 -222 -265 -125 -272 -774 -167
5725a67K29j05M28L60j562j57J967q75l84R63n00l32N93K21j990J731q30m40J126
5744B76r2N3m58Q2k53j23j2J062j369J454k23l40k041K343L10j001M94l20O66
5763E08j53m90N98k38j057k75Q29Q43N11o34L72l92j719K570r19P58j589L08r22
5782a091J774j376OL19Q34j328N54k6M36k7L98N4q50J72o1J3n6m20j40J075j04
5803A56J895j430j057N09K54K96N67k096R82O2N03L69m73j077j325P22J601n05
5821d7K4j23l30M98o08l8J418q65O36L73r31j8n50N59P70l29m02J70k55K27K01
5842C80j14p89L73J20mm28J85P6K29K35M49k82j494J813j311J009N27o62j80r02
5862g70Q94l86Q18q50R52j31o49N3k67K33j27M68J74q58k74O60N1m91J113k193
$$ plain form
5725 -167 62 -43 385 745 -817 -974 993 118 -266 697 197 -135 458 679 -1311 420 -410 -850 276
5744 276 184 237 -221 -139 -392 -515 -527 535 -834 620 397 57 -1984 359 669 -332 162 -158 508
5763 508 355 -135 463 225 -832 -1107 -278 565 1076 442 814 422 -1297 1273 354 1112 -477 -169 -1091
5782 -1091 683 -693 -687 -368 466 -862 -308 -334 102 75 473 527 -323 -151 -212 -199 -255 -675 -815 260 156
5803 156 2051 621 -436 73 327 623 1190 -906 76 138 641 1010 537 -540 -1865 -1143 458 -47
5821 -47 -23 -146 -476 22 -586 -624 794 -71 565 938 7 -11 -561 -2 768 439 37 207 -48 179 380
5842 380 266 -523 -150 -30 -34 -462 -277 -201 28 263 712 430 -1064 749 -562 447 974 312 132 -770
5862 -770 124 -262 556 -294 658 527 -122 -69 -336 -103 -230 238 412 -446 -720 -60 -9 -500 613 -1580
5882a580R15L68k23N69k01j94L85L92n80j0l48M93n6m11j24P62J47j129Q42k29
5902b12n76J249j380J182n80J88m74N48J90j182J410n25k7J101j273J451n35j443
5920h88J132q76K83R84m64L8L7l40N86n57j17R74q18L24L60o27o74J60j52N37
5940i8n1J89q33J15K86J25N08j323J978j640Q57L82q51Q06j18j066P91j93o40
5959g76J010q77M55J006j198K38k75J028J84j126q6K70Q75m27o67L82Q96j529
5977f17J315j85j301R36j28n75K50k40R35l16j62j308Q62M59M4K20p91J712q09
5996C01M25q4m04J79k67n74l15M20J454j103L32m20K44J488j111P20l53j011P83
6015G04p21L86j172l81J016J193r13m02M19l44N36r07Q55o67o43M00oN63O86j08
$$ plain form
5882 -1580 -665 -297 -520 49 -152 -346 39 431 -149 -159 -507 -14 -70 -481 -605 157 304 -825 17 -212
5902 -212 -788 461 -919 263 -317 -129 -603 -55 135 -1047 363 -162 -189 912 -361 1090 555 -888
5920 -888 244 -632 -349 635 171 209 246 -94 492 -65 -182 792 -26 298 658 31 -643 -483 -635 -98
5940 -98 -149 40 -793 -678 -392 -267 241 -1082 896 -744 113 495 -356 450 332 -734 57 -136 -776
5959 -776 234 -643 -188 818 -380 -142 -417 611 795 -331 -417 -147 728 301 -366 16 912 -617
5977 -617 698 513 -788 148 20 -555 -305 -545 390 74 -88 -1396 -534 -75 -31 189 -602 1110 301
5996 301 726 642 238 417 150 -424 -739 -319 1135 32 364 -56 188 1676 565 1285 932 -79 704
6015 704 -17 369 -803 -1184 -168 1025 112 -290 129 -215 321 -586 269 -398 -1041 -641 -647 -84 602 494
6035D94j184J514j789J042j49j74P38j210O10R19p34O65J11o16o38J24J21m07
6053e63k21R68M05n61P84q70p10O17P51m19N49m12n06O44o39m58R03O47o34l6
6073B39m22j60J384j286OM00j334Q00Q31p39n03J104J13m26M03q97M59k68m26
6092g22P04L22m85J8L82KO2k92K28r3m74l44R91m42n41N16o96O26M8M10j332J615
6114E03N7o38L29l35J017o18n31M61m42Q28l99m12m32L66K35R67j008l84J149
6133G13r00j64k54Q26n79lm1L19J9K00j73L74M88j854R79O05m82o3l06O77n41
6154a60p7J307r18o66J047n17O04n50k50Q32r54L53l53O04m26Q0M35j235J476
6173F32n79r0K16l26L09k86K86l22L88K12L30j83r63L72L83N04r06m06M24o72
$$ plain form
6035 494 -690 824 -965 77 -72 -246 492 -718 -108 811 77 742 853 237 -401 -277 -156 -563
6053 -563 -784 184 589 28 812 -58 -768 -151 600 181 730 318 -188 456 -183 -641 262 909 275 239
6073 239 -183 -343 1041 -245 -239 161 -1173 -373 458 -281 -784 320 433 7 410 -487 -28 -296 -722
6092 -722 -18 304 -181 -163 219 221 283 -9 219 126 -348 -692 299 -143 -684 -168 -864 -238 -190 220 -1112 503
6114 503 560 -78 251 -84 933 315 -216 245 -197 631 232 -180 -612 -246 -11 956 -52 -436 713
6133 713 -187 -351 -605 221 -358 -361 -402 -83 -64 136 -37 337 825 -1029 -50 555 73 10 -296 381 -160
6154 -160 -237 1070 152 -514 533 16 620 70 -180 652 -302 51 -302 302 -124 -44 391 -844 632
6173 632 53 -37 179 -147 162 -124 162 -160 228 440 770 587 -376 -4 379 883 -23 -429 -5 -677
6193f77J078m2n36J120j006N31j457K55P91M10M46j115q38Q83n29j56l0M53J132
6212G13k190J257L14n94Q65q45j20J208j202J063P51j027Q17j116O26m26J24o85
6230d67N88J278o27j289J52P58j045K0J814p10o20J156j772N88N11pL05l9j181
6249e87j58J250j0r73J130p75k07K88j43O18q35P45j38L29Nr88Q33j024J003r71
6269f08j66Q35M17m12l7q3nL73o49k8R05j06j329O64Q59q46o44R80O35j309J211
6290F57p81R42j401L57o45Q90J63M46n11L9m57O57n46p91J548m35k80O24l50k44
6310a18P90p15j28J406j023P30o35o50Q21q64k02l6P74n25J411n82l48K04r49
6329f39M61k79J489q91k71L69j480J786k81j421J119L72j337J49M75K77k7j503
$$ plain form
6193 -677 401 359 -177 943 -63 468 -989 -734 57 467 913 -202 -1040 -157 -686 -842 -872 -419 713
6212 713 -1477 -220 94 -500 365 -480 -600 608 -594 469 1220 193 1010 -106 520 94 218 -467
6230 -467 121 1399 772 -517 -365 393 -652 -632 1182 472 -148 1008 -764 -176 335 328 633 594 -587
6249 -587 -745 505 495 -478 652 -123 -330 -42 -185 433 -402 343 205 534 539 -449 384 -640 363 -608
6269 -608 -774 61 478 66 29 -54 -59 314 -335 -363 542 436 -893 -229 630 -216 -860 120 755 -554 657
6290 657 -124 818 -583 -226 -871 19 182 628 117 156 -301 356 -190 -981 567 132 -148 476 126 -118
6310 -118 672 -43 -171 1235 212 942 307 -343 478 -386 -588 -624 150 -375 1036 454 106 310 -639
6329 -639 -178 -457 1032 141 -130 239 -1241 545 264 -1157 -38 334 -1003 -854 -379 -102 -129 -1632
6347a632J023M94m00L89n2n98j71j87J188j35j126J883j861O66R14j20j092J786
6365I69l77m96k39M73K0m07n03P04p62Q01K74j023J011l12J21o62k70n76J296
6384D2P94j551J127j184Q89k41l3K89o74N83n03J573j979N10K98k9O3l52K33J56
6404A1M85o06K18o07J061p17L58j025M09P47j653J73N37M27M03M26m89L17p42
6423b67L48j86o9P04j041k69P24P48p3k78p94k1K74Q01p00l29P26k42p27L53Q06
6444D88P36j603O51R4Q0j187J221J58M86r76p65K80K88M13r26q9K337j603K28
6463C11j072n66K029m75o61j69J71R42m86J196j080J48n35P25n87p21K80L74M45
6482B69J56J017k043J71M51r6J19j87k72q58J704J95o72j93l7R67j352J224r7
$$ plain form
6347 -1632 -609 -115 -515 -126 -178 -776 -947 -1134 54 -81 -1207 676 -1185 -519 395 275 -817 969
6365 969 592 96 -143 330 350 -57 -560 144 -618 183 457 -566 445 133 254 -408 -678 -1254 42
6384 42 836 -715 412 -772 117 -124 -157 132 -542 41 -462 1111 -868 -358 -60 -89 -26 -378 -145 11
6404 11 496 -110 108 -499 562 -155 203 -822 -413 334 -1319 -1146 -609 -182 221 647 158 475 -267
6423 -267 81 -105 -174 530 -511 -780 -56 692 619 341 -453 -474 -200 601 -99 -428 298 56 -671 -318 488
6444 488 1224 -379 272 366 446 -741 480 638 1124 148 -617 -337 -49 364 -562 -651 1686 83 311
6463 311 -761 -1327 702 227 -434 -603 -432 510 24 1220 140 288 -247 478 -109 -830 -550 -176 269
6482 269 425 1442 -601 -430 21 -75 44 -143 -415 -1273 431 626 -46 -239 -276 691 -661 563 466
6501D66o70N80k4K36j715J083M24O7n63J34J80q56P94k135L699j143o17N24j70
6520B94N8j93j68J35r64J529m60p57J355p41l5K3O69o33r38N57m19K28J857j188
6540B09l32M05j49m70R12o89N16l13j41J002n69O05j914J241r45L67O15o36n20
6559h06N98J56L37J50o77L50k78M46j371J623j0J15k508K194R24j140j82l34p5
6578d88P08j26j070N49l88J200j572J553j028O39n0N91j338J010M66n44o36O43
6596A19m03r48J853l26P6r13O26o70Q45k51P54l92K06j187O24N18j00r01J108
6615F38j09p51O09L49o22O90r94J50M48k67J42L83j384O79K88Jl50O39J85m74
6635B50O5j10J3k23R4j47R2l84o44J707j668P44P12j65m03l32J411q94j112Q88
$$ plain form
6501 466 -204 376 352 588 -1127 -44 380 447 -116 18 198 -658 136 -1999 1700 557 -60 464 294
6520 294 352 159 -9 126 -838 691 231 -526 829 88 53 76 745 112 -826 -269 -688 -460 1397 209
6540 209 -123 282 133 -337 575 -114 402 89 -52 950 381 986 -928 313 -632 -265 350 -286 -806
6559 -806 -208 -52 285 435 -242 108 -170 276 -1095 528 518 633 -1875 319 1243 103 -79 -413 -488
6578 -488 220 94 -976 -427 -815 385 -1187 366 -662 -23 -73 518 -820 190 656 112 -524 119
6596 119 -284 -1232 621 295 371 -542 84 -586 259 8 762 370 576 -611 13 531 431 -470 638
6615 638 529 -222 387 736 114 804 -190 -40 408 141 283 666 -718 -39 249 250 -100 539 724 250
6635 250 315 205 218 -5 89 -58 34 -350 -994 713 -955 -211 501 336 -67 -399 1012 118 -994 -106
6655a06k16q1L99K17m54M02J19l47n09J754j498J2N6j105J854m60L21l62r46Q88
6675f2r5N77n30m45Q74q50M27J82o26P07Q1o0j42K90J33n63O22l83J526q44m87
6696C32n01PL03r6O12j447R60M32j041L87j25r62P41L71o83J546r27J561j685
6715b15N30k90O21p94q93J078p34P92J92p58Q2L51n9n67J068Q46o33p48m36J79
6735c88q8P52L07k61K04k82K51m23O20p23N52k53o60m44O35m34J030l71m44k3
6755d43O7N37k92p78M18L83J35R3l99p5k2L83K47n05N96j218J263r32J49N62j54
6776A5q93M34P49P82j702M66o4m13j58M05J244j11j448J181L01l29l34l53j74
6795d02N47N68n37Q75r27J22m41k44K18K31l94Q98j463J135k99PL1J030j141Q
$$ plain form
6655 -106 -322 -403 -4 213 -241 161 280 -67 -576 1178 -320 -308 -252 -1357 497 37 358 -4 -950 -62
6675 -62 -157 420 -110 -555 319 -531 -104 78 -548 159 240 180 38 328 461 -102 520 137 1663 819 332
6696 332 -169 -162 141 45 657 -790 170 602 -439 -52 -177 -1139 -398 -27 -710 836 -91 1470 -215
6715 -215 315 25 646 -148 -1041 37 -697 95 287 -471 -389 -38 -97 -664 404 1250 617 -131 -567 -388
6735 -388 -476 276 583 322 526 244 495 72 692 -31 521 268 -392 -836 -201 -635 395 24 -420 -443
6755 -443 -376 161 -131 -909 -491 -108 27 120 -279 -354 -376 7 254 -251 345 -873 390 -542 -393 169 15
6776 15 -878 -444 305 1087 -615 -149 -213 -626 -784 -379 865 754 -694 487 788 459 125 -228 -402
6795 -402 145 713 176 1051 124 246 -195 -439 -221 10 -384 514 -949 186 -113 -106 -75 955 -186 -178
6815a78j39J7N6M80k69K33K49J04O08j613J025p32M72k35J82q31O35k62O25j014
6835e87N49R63j724J023L77q39O7J08N56o17J73K11m73m09J147k94k37k99K04
6854a01q66J039M07l81P40j018j4O67J64j182Q88o68j21j09l67J629j024J94j13
6873b36K2J4o32J078j67K43O6K54p47N62O66j457N38q91J123p33o52L32O4L53
6893b00R83j344J79J305j307P17p01P17m62j18J86N49k63l93O03K70o23Pl04q2
6913b81K59k53P4L69r68J026j23J295k273N46P67k98M48j706J255M15J41o21m46
6932c74M08l23Q80q12j83o76P49P96n78J307j917J052m49n9m7N74n20J00L6r40
6952i76J485q12N41k27j32p65J482k51j335J062k73o13O22N75k30Pr4j01O16j620
$$ plain form
6815 -178 -317 -300 -244 236 -33 200 449 553 1161 -452 573 -159 313 78 260 -571 64 -198 427 -587
6835 -587 -38 925 -799 224 601 -238 -171 -63 493 -124 49 260 -213 -622 525 231 -6 -305 -101
6854 -101 -967 72 479 98 838 -180 -194 473 637 -545 343 -325 -446 -555 -922 707 -317 -123 -236
6873 -236 -214 -200 -832 246 79 322 388 642 -105 457 1123 -334 204 -687 436 -297 -949 -617 -553 -200
6893 -200 783 -561 -382 923 -384 333 -368 349 -113 -231 -45 504 241 -152 451 721 98 105 -199 -281
6913 -281 -22 -275 -201 168 -800 226 103 1398 -875 -329 438 140 588 -1118 137 552 693 72 -374
6932 -374 34 -289 591 -221 -404 -1080 -331 465 -113 1194 -723 329 -120 -179 -226 348 -172 -72 -36 -976
6952 -976 509 -303 238 11 -121 -886 596 345 -990 72 -201 -814 -192 383 153 160 66 -35 581 -1039
6972a039J019M50k49j71k24N46l59o14J624l09j749K609j045q70J015o69Q53p20
6990I8j69J578j041o15P26J09l28r2L18j440L32L4J218l80m56N7J19k63J138j154
7010b11K03Jk44L36l23k81m1n17J356J04k02j187J088p1j43o33K42O85n0Q40k50
7031G02j354Q86L00l62j06J92m84J489k23j303O06l5J69j405P85n03P21N30j110
7050e05J004n42O99o20O92j411Q53J48l81O49r31M33J3p00Q62m66N81k62Q42j507
7070e49o3m68J570k51r74N12M91r3p17K03J479j027j49m7r32J499p83l71J120
7089D50o11J072p64k68K3M8L27M89p61J83p81k74J621l07r59P66K1l0K38p70m02
7110f89R78m67k84J004q37J489j324J74m03n99R1R84m28P9P34j218O38L08R67
$$ plain form
6972 -1039 -20 430 181 10 -214 332 -27 -641 983 674 -1075 1534 489 -381 634 -35 818 98
6990 98 -71 1507 466 -149 577 686 358 266 584 -856 -524 -490 728 348 -108 -51 68 -195 943 -211
7010 -211 -8 -7 -251 85 -238 -519 -560 -1077 279 383 181 -1006 82 11 -132 -765 -523 162 112 952 702
7031 702 -652 234 534 172 66 258 -226 1263 1040 -263 343 308 477 -928 -143 -646 75 605 -505
7050 -505 499 -43 656 36 728 -683 170 318 -63 586 -345 88 101 -599 263 -203 378 116 958 -549
7070 -549 -612 -1080 490 239 -735 -223 268 175 -542 -339 1140 113 -36 -83 -1015 484 -299 -670 450
7089 450 -161 911 147 -121 -98 -50 277 766 5 188 -593 -867 754 447 -512 254 275 245 483 -287 -689
7110 -689 289 -178 -462 542 -295 1194 -130 44 -359 -958 -867 117 -311 -232 502 -716 -78 230 1197
7129A197j205K2J302j628j23O33k69r4k13K09J292q95j100J012l25n70P38j12
7147a29P06j028l62J042K62j7r79R30j43j97K29j601J271k85l24R64k50j21m11
7166d43O72j004O52L60l23M1l04M70N21j791J151J22J05m46N64O53j053l6k80
7185c69m43P65J27l74K13P43n31n4L46j44j9r54O75k02n15M07J096j102J171r49
7205a13J146j101k49l57l2K20Q75r80N06L28j45K01k29L95n34O63k38P9j034P85
7225A86l00l22p01J161q85O86N67n31L97K84p64l10N12J12m05J43q93P43K49O3
7245hL68o56K12j104J354l42q8n20O60N78L92r25M06j304J70N79k8P5p09Q48O20
7266E78j10p54J30l01J631j867M02J12l38R79J75r26R40o04J53Ol40L98m43J497
$$ plain form
7129 1197 -8 14 1316 -312 -435 198 -71 -165 -378 -169 1123 228 -872 140 -185 -755 -17 -129
7147 -129 577 -451 -813 229 491 474 -505 425 282 85 314 -1287 -16 -301 -625 339 89 -32 -443
7166 -443 229 -775 -123 237 -86 -45 -349 121 642 -1149 2 124 229 -217 347 1000 -53 -89 -369
7185 -369 -812 -47 80 -294 -81 662 131 77 423 279 260 -694 -19 -221 -736 -329 767 -335 836 -113
7205 -113 1033 -68 -317 -674 -706 -486 389 -591 -85 243 98 299 70 465 -69 594 356 435 -599 186
7225 186 -114 -436 -1137 24 -861 -175 392 -139 258 542 -222 -532 -20 92 -313 -170 -1063 -320 -71 -8
7245 -8 360 -296 -84 -1188 166 -176 -264 -784 -124 454 846 -79 327 -977 -807 -228 -256 -181 -890 -42 578
7266 578 468 -286 -156 -457 1174 -693 -291 -179 -517 462 637 -289 651 47 200 206 -134 264 -179 1318
7286A318j941R12N53o36K44l57%m2n06J067m58J13N74j318N76P18r45J61n29Q06
7306C10n39Q76p53r35N85O26N12j402J778q16J112j793n9K22q4n39N56M5Q34j77
7326C59j08k54K33n76O89k03P4M74r87N8L28m67L66O61M63q53R2o57J143m52n31
7347a48Q32m56K53l05k89J180j114p8k38M7N34N70n71P14q48J45o29J63j26Q47
7367D83p9m97j338J836l96j45K89m0N76j698J940j164m93R35l2n04L44l23L62
7386E6K77K96m39lj06Q73k044J155o61k4O21L95j121M42L94k61k42K73l50Q19
7406C50j269J642j092R01M8p65O53ok72L77q05K41M35q22K46m54M93Q99o31q70
7426g01J090m5q18p9N89P00q08j66j0K64k93J064q12J074j745n15J801j401P95
$$ plain form
7286 1318 -623 289 842 206 450 93 93 51 -455 612 154 267 841 -477 99 817 -128 33 -496 310
7306 310 -229 647 -106 -1041 -456 170 682 -720 1058 242 1354 -439 -498 -276 -360 -899 -343 -298 536 359
7326 359 251 -3 230 -346 343 140 214 688 -299 -241 87 -380 -14 647 1110 257 349 -308 835 383 -148
7347 -148 684 228 481 176 -113 1067 -47 -125 -363 -316 218 788 217 931 83 228 -401 -238 -364 483
7367 483 404 -93 -1431 405 9 -136 153 113 689 -1009 931 -233 -726 209 177 -327 17 -306 56
7386 56 333 629 190 187 81 954 -1090 65 -596 -620 1 396 -725 -283 111 -150 -392 -119 -469 350
7406 350 -919 723 -369 532 580 -185 468 462 190 567 -238 3 438 -384 -138 -592 -99 800 169 -701
7426 -701 389 344 -474 -553 36 736 -72 -238 -248 16 -277 787 -25 1049 -696 -1211 590 -811 -16
7445a6N9O65q43N87N32k60o41k53P4Q86j469n99J843q07J040j656O33P63r63Q62
7465D37J01K98J56q90l48N84J64j681O59J787r09q00q60O74N59K63j28O7J40j817
7485a544J178m3J57n04R57K70l48j267J958m14o98O77j076L61m53J652p03k70
7503a10o94j05J025J083r39o84J417P8j723J845p22j849K150j204k45M87r02J390
7521B98R20m5j191O34o60o78M08R7M14L30n96r33K004J8n24p47J87l7J29J80J49
7542C57l05l09O66j160K200j676J228q56p0j19N2m7m43L61o35J250j252K076m65
7561H53p91m28R45q58n81J42K40l60J422J50o87P19o26n70O23O6K58j70j49O55
7581H53m81q32k18Q57R5j07O24o82k62Q63j053P32k74K64J762k721j69K49J045
$$ plain form
7445 -16 43 708 -135 452 984 724 83 -170 -96 790 -679 -1278 565 -242 798 -858 -225 538 -425 437
7465 437 538 836 992 102 -246 338 502 -1179 -520 1267 358 -442 -1302 -628 -69 194 66 133 273 -1544
7485 -1544 -366 -409 -252 -756 201 471 123 -1144 814 400 -298 379 -697 -336 -789 863 160 -110
7503 -110 -804 -909 116 1199 260 -424 993 1071 -652 1193 471 -1378 772 -432 -677 -190 -1092 298
7521 298 1218 1173 -18 616 -44 -722 -314 -217 197 527 -69 -1002 1002 1020 496 -251 -64 -101 28 208 357
7542 357 52 -257 409 -751 1449 -227 1001 145 75 -44 8 -39 -482 -121 -756 494 -758 1318 853
7561 853 62 -366 579 -279 -860 -718 -478 -838 584 734 47 766 140 -430 193 259 517 347 198 853
7581 853 372 -460 -678 179 274 167 791 109 -153 710 -343 389 115 379 2141 -580 -749 -500 545
7600E45N38k71r06l17N04j178P96P61j496J611j117N51K93m1j57j70R35j789J671
7619G63m10J014j181n44R29n86o97N22Q9O90m41p29O97J33o37M9o70R42J338l60
7639I11j315M96n74j24J148m72P54j395QP77q44L00J25m89O71j023N28R23K37
7658F42L73o25m95j54K099k254J621p24J41p31O71j189J070q4k32m73J242j070
7676a72J45o67J331r02r78J248r57N75N4K96J693p99j191p1j03P28l02j6q3J59
7696a2p30Q74k26j038J349l33L57n58J68J353k021j17Q07n8N48j130M59O59j426
7715a075J472Q6j395J631J81o44L0m99Q14j511K53J190q74n88O69k05P30n72K4
7734b83L57k10N77n88Q23j152P43O10m89p3r10M10q79L46j4m25J487q78j68J034
$$ plain form
7600 545 1083 812 -94 -411 93 -1085 -289 472 -1024 587 -530 21 314 273 116 -54 881 -908 763
7619 763 353 1367 186 -358 571 -15 -712 -190 -101 589 148 -581 116 249 -388 -339 -1009 -67 1271 911
7639 911 -404 92 -482 -606 542 70 824 -571 -563 214 -630 -330 -205 -694 -23 -1046 -518 405 642
7658 642 1015 390 -105 -259 1840 -414 1207 483 624 -107 564 -625 445 361 129 -344 898 -172
7676 -172 -27 -694 637 -265 -1243 5 -952 -377 -323 -27 1666 867 -324 -395 -498 230 -72 -88 -171 -12
7696 -12 -742 132 -94 -1132 217 -116 241 -317 -149 1204 -817 -934 -127 -185 363 -767 -308 351 -1075
7715 -1075 397 483 -912 719 900 256 286 -213 601 -910 -657 533 -341 -929 -260 -465 265 -307 -283
7734 -283 74 -136 441 -147 676 -476 267 877 388 315 -595 -185 -1064 -718 -732 -1157 330 -548 -716 318
7754C18k46l18K60p36J189j73N2L82j93j331Q2J36N35k14L37M00j544P81J67j88
7774c04N23k27M41l12j90o1J62n6O38k83l55o92J130N64j444n7N42L80n58O17
7794D58K97n63j093o2J018j221L54P48q09J045J12J4j02o64M21L13q58J070j238
7813g60J534j031L72m46J06J66K58K26O0Q76j299J88p02J216j29R1J3j268N00
7832b9o07J9J324j239j10M22K30M88k52L00j41m04K4o10M19J505j654O54r4k22
7852B3l82O8J115Q2k52j174P87P44l82p68p06J087o88O37j108P44n38R79q37R15
7872C46N75o73l86l59J083m50j88j547J634J91k14n71n23K043j145m36M03l62
7890e79J372m94l96j46n32k5J288m32K89L37j336Q39j18J064j525L02K33L07m76
$$ plain form
7754 318 72 -246 14 -722 467 294 346 728 535 -796 -714 -578 -43 -257 80 480 -1064 -283 -116 -304
7774 -304 219 -8 433 121 -69 -130 32 -24 614 331 -24 -716 414 978 -466 -523 19 399 -159 458
7794 458 755 192 -901 -963 55 -1166 -812 -64 -873 172 284 298 196 -468 -47 266 -592 478 -760
7813 -760 774 -257 115 -331 -225 -59 199 425 485 1361 62 250 -452 764 635 726 739 -529 -29
7832 -29 -636 -617 707 -532 -642 -220 10 498 246 546 405 1 25 -585 -166 1339 -315 339 245 23
7852 23 -359 -291 824 906 654 -520 267 1011 629 -139 -845 242 -446 191 -917 -173 -711 268 -569 346
7872 346 921 248 -138 -497 586 136 -52 -1599 35 226 12 -559 -1082 961 -184 -620 -217 -579
7890 -579 793 299 -97 -243 -775 -800 488 56 345 682 -654 185 67 1131 -394 -92 141 448 -28
7909b8n63K42J56J97q58P0J135M86m45M00p25p67J407n92j91j42M44j176L07J156
7929E13n62k29J272j215j27m21Q23l60M10N45n86L12KL03k38j474J890k082J409
7948A85N14L7j80j176J456j373O69o52mK71R23r46O3o17J368r48J403p03l01L51
7968C40K12j004Q25l20q2m27L38L48l92Q47l91n82r3O06l05J98q74M64l26J423
7988H05m2j21n56J53K83j303M25r1R08n32L50q59l89J176O8k3L3kM97r34O45r28
8010d37O36l12q25O51K95R42j23r43j053J330R7M02r59Q81k85L55q30P61k10n15
8030a42J387j339N7P70j601J288r71R24J68r22P47j91j492N04K131k497J70K84
8048g25O60L70k13J79o99L36k41M55o25J384r19j3P73n35j27p28J027o75M53J0
$$ plain form
7909 -28 -591 -349 -193 4 -854 -784 351 837 392 792 67 -700 707 115 -76 -218 226 -950 -643 513
7929 513 -49 -278 994 -221 -348 -769 54 -306 104 649 63 375 377 680 442 -1032 858 -1224 185
7948 185 699 736 556 -620 836 -537 132 -520 -524 -253 670 -276 -213 -830 538 -410 993 290 -11 340
7968 340 552 -452 373 53 -29 -456 -118 230 -162 685 294 -288 -381 225 -80 118 -756 -292 -618 805
7988 805 763 642 86 239 522 -781 -356 -447 461 -71 279 -580 -969 207 275 252 285 283 780 -154 491 -437
8010 -437 199 -113 -938 -287 8 950 827 -116 -1169 161 258 660 -299 582 297 652 -178 583 373 -142
8030 -142 1245 -94 -37 733 -868 420 -551 373 541 -381 366 175 -1317 -813 1318 -1179 -1009 -725
8048 -725 -65 305 92 271 -428 -92 -333 122 -503 881 -38 -51 722 187 60 -668 359 -316 137 147
8068A47n77M12P07j49j578J834j197P36Q7O44q59l10J16j322J586M9l69m77K87
8087b33o96J521j471J033o36L2R24J66K61j185N81q83q42J514p10O50J1Q3L4o52
8107d98P28M76j610P62j066R17P78n05p5K81P04j466R77j328L2n49J422j15J768
8126A633j332P77k017R85J206j604Pm24O43j64P28n00N41j128R47j143M99O6n9
8145c39o1L17J69n67K98j203J728j043Q30j076P83M03n04J235j422M63o5N95j505
8164i64j25N58R39n21K87p5k6j48K92m27R3P5M54j177N42K58J241k007O17M02
8184B88j431O46R72J95j593J151N08
$$ plain form
8068 147 -430 -18 689 540 -1038 796 -401 335 422 1066 207 -103 13 -1309 277 326 -43 -520 -233
8087 -233 -929 592 -879 154 -482 -450 474 640 901 -284 297 -586 -1428 86 -624 26 37 120 154 -498
8107 -498 230 706 -904 -142 -1208 -291 487 -18 -93 188 892 -574 403 -925 -893 -1442 -20 -135 1633
8126 1633 301 1078 -939 46 1252 -352 -345 -769 -126 -290 438 -62 479 -649 298 -845 -346 -280 -339
8145 -339 -400 -83 86 -481 -183 -1386 342 -701 129 -947 -164 239 -265 970 -452 11 -54 541 -964
8164 -964 -1089 -531 408 -113 174 99 73 -75 217 -210 -117 -42 412 -765 -223 35 1276 -731 -114 288
8184 288 -1143 -497 475 670 -923 228 736
8191G36
$$ Imaginary data points
##PAGE= N=2
##DATA TABLE= (X++(I..I)), XYDATA
0@%%%%%%%%%%%%%%%%r3K01k16K16k16K16l24M32m32N40o48P52q60R72j143J257
32F54j411J623j846K094k392K694l015L367l744M175m648N159n711O321o986P707
48D041q496R368j0317J1359j2517J3801j5230J6823j8619K0656k3002K5721k8917
61a5329L2763l7469M3395n1138O1780p7462J03453j58002N41115m75796K01640
72A68950L73440o29376K52204j1195j91081M5239J69790k05888j4245K4758J71595
83A54191k62721O2220J44346j74743R6208l9159L8J093N4811l2719q5419J23215
95D1361m4688J3400q6615R9772j7593l3844K3352k4975J1852J5015L2244j46723
107a17442J50174j3783o8264N0840o9623J25219q4432J1024J4762k4816M7858
$$ plain form
0 0 0 0 0 0 0 0 0 0 0 0 0 0 0 0 0 0 -93 108 -108 108 -108 108 -216 216 -216 324 -324 428 -432 540 -603 654
32 654 -757 866 -980 1114 -1278 1416 -1599 1768 -1976 2199 -2449 2710 -3001 3320 -3666 4041
48 4041 -4455 4913 -5404 5955 -6562 7239 -7991 8832 -9787 10869 -12133 13588 -15329
61 -15329 17434 -20035 23360 -27778 34002 -43460 59993 -98009 443106 -32690 168950
72 168950 542390 -86986 165218 154023 -37058 8181 177971 -27917 -42162 -17404 154191
83 154191 -108530 -46310 98036 -76707 19501 -19658 -19620 -18527 36284 3565 -81854 41361
95 41361 -3327 10073 -76542 23230 5637 -28207 -4855 -29830 -17978 -2963 29281 -117442
107 -117442 32732 18949 -49315 1525 -68098 57121 -27311 -16287 -1525 -26341 21517
118B1517J0623p7510K6103R8851j20901Q3174n3697J5734N1917o9846N3459n2592
130a3168N5713j1002j7843j5483M0346k023m1032M4228m7562N9076m4503O352
142A3099k50j240L1054n6010K7942j2218L6888n1509J7235o09o902L9697o9202
155c2025L6572n890J0765j6227o654j217J8177q80m3391N1570m6902M4372j8604
168a0334l8334N0984j3485o164j3729J9397j2970L1422m1799J3137K3416l3503
180c1962L9923m3548K3920J1958p429j3302J6943L815n775J9380m2847N0777k3147
193a294Q018L740j7948L3892j6760L362j0109K5341k0494K4232k3673K201L2981
206D3489l9730K9033k4573J9940n077j980m079J39J0650j9559K8217m3046L8192
$$ plain form
118 21517 32140 -45370 -19267 79584 -41317 41857 -11840 3894 55811 -14035 39424 -13168
130 -13168 42545 31543 13700 -1783 38563 36540 -4492 39736 -7826 51250 6747 13099
142 13099 12849 11609 42663 -13347 14595 2377 39265 -12244 4991 4382 -2520 37177 -32025
155 -32025 4547 -1343 9422 -6805 -13459 -14676 3501 2621 -40770 10800 -36102 8270 -10334
168 -10334 -48668 2316 -11169 -17333 -31062 -11665 -24635 6787 -35012 -21875 1541 -31962
180 -31962 7961 -35587 -11667 291 -7138 -20440 -3497 318 -5457 13923 -28924 21853 -1294
193 -1294 6724 10464 -7484 26408 9648 13010 2901 28242 7748 31980 8307 10508 43489
206 43489 3759 32792 8219 28159 23082 21102 17023 17162 27812 8253 36470 -6576 31616
219C1616j5043r073J4395k0383J8500j9287J8645k9574K8070k1204P329j37k5217
232b1363M2775m4492K7331k1959Q291N195r773j696q662K8167l9253L6697l8225
245c6967K3988M058k2865K3488l1157M1133l0083J0109j1756K2415o868j4917
257b9422K7207l7706N1534l9745J7686n464N725J8506l3793K8275j7659L5152
269B0296m1433K6658n731r59K4633m4656M2808k5512K8707k4430M945J0311l419
282A2218J6299m2699M9721l5783L1900k4596j156K5268k7754K5121l6936L7262
294B8865k4843J9902k1625O91K5983l6532L6317m7468L9202j4836l123j980q284
307g731K5039l1264K6648l8567L8667k0985r0O444k5169M2708m1821K2325j9288
$$ plain form
219 31616 16573 7500 21895 1512 20012 725 19370 -10204 17866 -3338 3991 3854 -21363
232 -21363 21412 -23080 4251 -17708 -9417 -4222 -13995 -15691 -24353 3814 -35439 1258 -36967
245 -36967 -12979 -8921 -31786 -8298 -39455 1678 -28405 -18296 -30052 -7637 -14505 -29422
257 -29422 -2215 -39921 11613 -28132 -10446 -15910 -10185 8321 -25472 2803 -14856 20296
269 20296 -21137 5521 -210 -1169 23464 -21192 21616 -3896 24811 381 5326 15637 12218
282 12218 28517 -14182 35539 -244 31656 7060 5904 31172 3418 28539 -8397 28865
294 28865 4022 23924 2299 2990 28973 -7559 28758 -18710 20492 5656 2533 553 -7731
307 -7731 17308 -13956 12692 -25875 12792 -8193 -8283 -1839 -27008 15700 -26121 -3796 -23084
320b3084K2216j0193m436Q110k0213L8893m1168L1967k6536J8389O063k3224K3768
333E52k0369L2512l2857K3554j6246J4852M867k2287K9695l0395L9713k9140J0436
346D887j376M178J0012k4531K4834k1769L4359l1746J2160M349p436K1033l4316
359e362K9056j6514K0504k2231M428P200p446J5319l4981L3715j9091J4264j5531
372C330l666J5089j2890J1220k6156K6442j7324J1098j4019l950K0494k1959J2936
385F45k2378K2979q388k766n745J660J1270j8442J6070k4799K4964q760l865J244
399a6311p344K2685k1668R780p797J5246j1398N818j304o252K2134k4304J5905
412d810r521J3673l817n636O772j394J2105j7403J5825j1660J6013m205o886J0854
$$ plain form
320 -23084 -868 -11061 -15497 -7387 -27600 11293 -29875 2092 -24444 -6055 8 -23216 552
333 552 -19817 12695 -20162 3392 -12854 1998 6865 -15422 14273 -16122 23591 -5549 4887
346 4887 3511 7689 17701 -6830 18004 -3765 30594 -1152 11008 15357 7921 28954 -5362
359 -5362 23694 7180 27684 5453 9881 17081 9635 24954 -10027 23688 4597 18861 3330
372 3330 -336 14753 1863 13083 -13073 13369 -3955 7143 -6876 -10826 9668 -12291 645
385 645 -21733 1246 -7142 -9908 -15653 -13993 -2723 -21165 -5095 -29894 -4930 -13690 -17555 -16311
399 -16311 -23655 -970 -22638 -12858 -20655 -5409 -16807 -10989 -12293 -18545 3589 -20715 -4810
412 -4810 -14331 -658 -4475 -10111 -3339 -4733 7372 -10031 5794 -5866 10147 5942 -944 9910
426I910p708J4337j5087J0611p814J3953o702m710J1407j2682J8376k0063J0089
439A3917k887K784n67m505M503n776J5451k4094J5202j0465Q633q94j5330J6442
453A2414j2129J0408j5903J0373r084R197n514j1456J6780j4456J5985k2188J2506
466c067l74k126m38r982J8139j7487J8200k0867J1092J542l625L664j4419K2635
480B887j6807J4688j9752J5422K152q406J1212j9319K7433j8453J0639r918Q679
493D57N322j0706J1672j4681K5221k2145J4924j0068P545P901k0811K2435k0180
506c114K3382j6649P283k236o85R851j7486J7335j9105K4345k1241O782J811q415
520A858J6501k6854K3260j8241J5880j1741j39L763j0911J8760k7960K4581j9564
$$ plain form
426 9910 2202 16539 1452 12063 4249 18202 11500 6790 18197 5515 23891 3828 13917
439 13917 11030 13814 13247 8742 13245 7469 22920 -1174 14028 3563 12196 11302 -4028 12414
453 12414 285 10693 -5210 5163 -3921 5276 -238 -11694 5086 -9370 6615 -15573 -3067
466 -3067 -3441 -5567 -6005 -15987 2152 -15335 2865 -18002 -6910 -5368 -8993 -5329 -19748 2887
480 2887 -13920 768 -18984 -3562 -1410 -9816 1396 -17923 9510 -8943 1696 -8222 457
493 457 5779 -4927 6745 -7936 17285 -4860 10064 -4 7541 15442 -5369 17066 -3114
506 -3114 20268 3619 10902 8666 7981 17832 346 17681 -1424 22921 1680 8462 10273 1858
520 1858 18359 -8495 14765 -3476 12404 663 524 4287 -6624 12136 -15824 8757 -10807
533a0807J3374r276l616J1419j8345K2017k5182J8756j5567J3476m448j1971J9694
546d76k1299K0533k0321J3982p347O713k767r195K0013k0270K4636k6094J7129
559d763l7o254J1563j6316J8962j2454J5992j8543J5323q50n219J1348j9024K5909
573A5637j8770J5495j1768M640P892q899J1094j7790K5751j9400R876n954K696
586A0500R132j5090J2114j5098J8983j4401O903n892P50R565k0411J6741j3826
599c0J4377j1037Q53J919m656Q753j6554J6416j8065J7800j4316l59O747r200
613g352J1898j7207J1951j0062R742o476l683P271p121J0342j5642J3453p906
626a0792O561l923m544R097p762J1676j5627J4142n713L786j233k987R679j0901
$$ plain form
533 -10807 2567 -6709 -10325 1094 -17251 4766 -20416 -1660 -17227 -3751 -8199 -20170 -476
546 -476 -21775 -1242 -21563 -7581 -14928 -8215 -10982 -20177 -164 -20434 4202 -21892 -4763
559 -4763 -4800 -11054 509 -15807 3155 -9299 6693 -11850 3473 2623 -2596 8752 -10272 15637
573 15637 -3133 12362 594 5234 13126 4227 15321 -2469 23282 3882 13758 7804 10500
586 10500 19632 4542 16656 1558 20541 6140 13043 7151 7901 17466 -2945 13796 -30
599 -30 14347 3310 4163 6082 1426 10179 -6375 10041 -8024 9776 -4540 -4899 1848 -7352
613 -7352 4546 -12661 -710 -10772 -1030 -7506 -11189 -3918 -11039 -697 -16339 -2886 -10792
626 -10792 -4231 -8154 -12698 -3601 -11363 313 -15314 -1172 -6885 -3099 -4332 -7319 2360 -8541
640h541J2923j2921R725k926N419k954n090J1375q330J0322j3341J2282l380J001
654E564K263p732J1811q717P567j1455J1023l023n85K008p405J1374j0824P707
668I576q750N357J814n320m26m487J1463r586N312j0348P331j81m350J250n944
683g289J1473j2531O576p866Q036j967n379N624r306J4807j4989O603l636M627
697e217l33p087O836n551J2194j5061R781m056K159L079r053J1001r560J4027
711C159j2275O180M03J434J415p521J5100j3005J3418j0619O445p62l76N537j1918
726c385J6578j1387J1257j1858O983L359p583J0827j5289J6777j1384R168p499
739F564N49O033q606J0581j5899J7086j4029P983m733k295Q036j2133J0770j4896
$$ plain form
640 -8541 4382 -8539 1186 -1740 3679 725 -4365 7010 -1320 9002 -4339 7943 4563 5564
654 5564 7827 95 11906 3189 10756 -699 10324 7301 6716 8724 1319 12693 1869 9576
668 9576 826 6183 7997 2677 2251 -2236 9227 -359 4953 -5395 1936 1755 -2595 -1345 -7289
683 -7289 4184 -8347 -1771 -9637 -1601 -3568 -8947 -3323 -12629 2178 -12811 -6208 -9844 -5217
697 -5217 -5550 -12637 -5801 -11352 842 -14219 -4438 -8494 -6335 -3256 -12309 -1308 -10868 3159
711 3159 -9116 -2936 -2533 -1099 316 -7205 7895 -5110 8308 -2311 4134 3372 2996 8533 -3385
726 -3385 13193 1806 13063 1205 8188 11547 3964 14791 -498 16279 4895 14063 6564
739 6564 7113 13146 4540 15121 -778 16308 2279 10262 5529 3234 11270 -863 9907 -4989
753d989J4483j0429N140m108m407J2099j6473J4642j6950J4092p834Q25M21p791
767a1279J4953j7284J4619j5654J2461m545l148O388j0637J7052j7415J2002j0139
780a2626R630l149n298J0051j3068J9544j8024J3372q442N340M236j0476J1931
793C021j0791J5510j5843J1438m616J210O299j2553J5412j3615J6191j4101P745
806E307J22j057M889j2698J6344j2994J2924j1696L992L591p182Q469j3010J4433
820A1434j2250Q783p211J929L930r929J2254j7109J4052r158N621m463j294P498
834D087j1901J0976j3008J2924q991K955j413m931J0791j2051R937j1368R721
847b272m326J041O53n212J0122j0785J0847j0948R250k893j572M877o285J0378
$$ plain form
753 -4989 9494 -935 4205 97 -4310 7789 -8684 5958 -10992 3100 -4734 -3909 -3488 -11279
767 -11279 3674 -13610 1009 -14645 -2184 -6729 -9877 -3489 -14126 2926 -14489 -2487 -12626
780 -12626 -2996 -6145 -11443 -1392 -14460 5084 -12940 432 -8010 -2670 1566 -8910 3021
793 3021 -7770 7740 -8103 3335 -1281 -71 6228 -6325 9087 -4528 11663 -2438 5307
806 5307 5429 4372 9261 -3437 12907 -87 12837 1141 5133 8724 1542 10011 -2999 11434
820 11434 -816 7967 756 2685 6615 -3314 8940 -8169 5883 -3275 2346 -2117 -3411 4087
834 4087 -7814 3162 -9846 3078 -5913 -2958 -4371 -9302 1489 -10562 -625 -11993 -2272
847 -2272 -6598 -5557 -4904 -10116 6 -10779 68 -10880 -1630 -4523 -6095 -1218 -7503 2875
861B875j0792R836q763P961r6k955M657n459J0764j0064Q039o622P265j18n366
876A162O082n496R701j0389O798m085L818J161n077O536p303Q500q674M934n92
891G076L51L57n921P366p904R678j1438N015j735J598n70n974Q037p360O446q754
907c732M185n65k201J776o102Q199p076L652o184N120l07l522L164p536J0417
922g12r121Q360r122N306J569m259L112n530Q297p775P247o679N317J536m920
937g374O596p138J0091p441M463k707J826K926l672O828q805J0751q293N392l899
952d56J828L922n440P466r492J1829q519M538k154l42P577j0397P537o715Q674
967I856q421L904j850j987O831j1346J1051j1124R970o163j613N232n973P376
$$ plain form
861 2875 -7917 1919 -6844 1117 1021 -1934 2723 -2736 8028 -2036 6003 -619 6646 6528 1162
876 1162 7244 1748 11449 1060 7858 3773 7591 8752 3675 10211 2908 11408 2734 7668 7076
891 7076 7427 7784 1863 9229 1325 11003 -435 4580 2845 4443 3873 -2101 5936 -1424 5022 -3732
907 -3732 453 -112 -2313 -537 -6639 1560 -5516 -1864 -8048 -2928 -3235 -6757 -3593 -11129 -712
922 -712 -9833 -1473 -10595 -5289 -3720 -7979 -4867 -10397 -2100 -9875 -2628 -9307 -3990 -2454 -7374
937 -7374 -778 -7916 2175 -5266 -803 -3510 -1684 1242 -2430 4398 -4407 6344 -1949 3443 -456
952 -456 1372 5294 -146 7320 -2172 9657 1138 5676 3522 3180 10757 360 7897 1182 9856
967 9856 1435 5339 3489 1502 8333 -3013 8038 -3086 6884 721 -892 4340 -1633 5743
981E743j1497J1039j0108P478m170m172O665o615R762j3021J1300o942K896j906
995c548l939P850r006J1900j3800R401m904K712K26n189J0394r197J0823j2874
1009i151J0551m183L01J937o374J2550j0997Q739p061Q520l295k526N874q106
1023c221J2313j0837P983p028N516J357m856Q641j0885J2503j0818Q246n792J245
1037D367M550p565Q677j0744J1642r864N792l441j158N431r987R624j0988J0415
1051F751p388K821p85l940O991r905Q997r263P472n733Q47K736n449O236r384
1066h996Q984q351P789n279o06M552o907P314r781R785o431N188k841j522N748
1081a354p013Q691r977P839m073L223l48l416P436n536P538r953R192l668J875
$$ plain form
981 5743 -5754 5285 -4823 2655 -1515 -5687 978 -5637 4125 -8896 2404 -4538 -1642 -3548
995 -3548 -7487 363 -8643 3257 -10543 -1142 -6046 -3334 -3108 -8297 2097 -7100 3723 -9151
1009 -9151 1400 -2783 -2482 -545 -6919 5631 -5366 3373 -3688 4832 1537 -989 4885 -3221
1023 -3221 9092 -1745 6238 -790 4726 6083 1227 9868 -1017 11486 668 8914 3122 4367
1037 4367 8917 1352 10029 -715 10927 1063 6855 3414 2256 7687 -2300 7324 -3664 6751
1051 6751 -637 2184 1399 -2541 4450 -5455 3542 -5721 1751 -3982 -3135 -399 -5848 388 -8996
1066 -8996 -12 -8363 -574 -5853 -6459 -1907 -8814 -1500 -11281 -1496 -7927 -2739 -5580 -7102 -1354
1081 -1354 -8367 324 -9653 -1814 -5887 -2664 -3012 -6428 1008 -4528 3010 -6943 2249 -1419 456
1096D56M91m260Q922p383O431n620M152M12k08J190n756J0336q086N525n072M076
1112E606O5k731L036m980P401o818N093o184N731j606m183N100o272Q341r992
1127b393N135k007J983L29m490L315n025P425q499M920l611J338Q52m449N535
1142C58o108O035m549L390k942Q85J800n488N857n882P692o100L823j333j664
1157d226L302l575N802o668O807o710L910L01l74L715o701Q521o466P622m956
1172C04J846j265M42M697p493Q025n611N841m996R88K941l240M091q134R588o680
1188A344O292n870R39L981o080O941r616Q779o442K886k137r30M912o468N092
1203C623p575O956m242J059j848j949N986p657P246p764O580o301K406j11l025
$$ plain form
1096 456 947 -3313 5609 -1774 4657 -963 3189 3601 3393 4583 -1173 9163 1077 6602 1530 5606
1112 5606 5671 2940 5976 996 8397 1579 6672 488 6219 4613 430 5530 -742 7599 -2393
1127 -2393 2742 735 2718 3047 -1443 1872 -3153 4272 -4227 693 -2918 -1580 -728 -5177 358
1142 358 -5750 285 -4264 -874 -3816 -2931 -1131 -6619 -762 -6644 1048 -5052 -1229 -2562 -4226
1157 -4226 -924 -4499 1303 -5365 1442 -5268 -1358 -1057 -1431 2284 -4417 4104 -2362 5260 304
1172 304 2150 885 1327 6024 -1469 6556 945 6786 1790 2778 5719 2479 6570 -1564 8024 1344
1188 1344 7636 1766 2705 6686 606 7547 -2069 6710 268 3154 1017 87 4999 -1469 3623
1203 3623 -3952 3004 -1238 -179 -2027 -3976 2010 -5647 1599 -6165 415 -5886 -3480 -3591 -6616
1218f616O348p518P005p230O766l449j693L537m729P460q727P575o643N311p38
1233c341k952N872n797P833q010P512n065L566K14l610O456o014P202p435O376
1248B807k541N16L316m871P018o699P151p165N151n07p83L762o629P855q670R016
1264H727p191J981J039k041M769q471R057p768N718m033J928J393o212P097p997
1279b004P048o662N399l502k028L545m994O255q378P326m757J918j087m48L970
1294A601p410O362p102O804m325O7J781l520O343p315N897n271N652k793j24K744
1310f09l495O410p031N773m578M155k416o36M615m985O698o958O068m076K817
1325A752O16k753M785m778N213m630L604k035J010L83k928N358o102O592n835
$$ plain form
1218 -6616 -268 -7786 -781 -8011 -1245 -4694 -6387 -2850 -7579 -119 -8846 -1271 -7914 -2603 -3341
1233 -3341 -6293 -421 -6218 1615 -6395 1117 -3948 -382 -168 -3778 2678 -3336 3866 -3569 2807
1248 2807 266 782 4098 -773 6245 -454 6697 -468 4683 4176 3393 7155 526 8381 -289 8727
1264 8727 1536 3517 4556 2515 7284 -1187 7870 102 5820 1787 3715 5108 -1104 5993 -2004
1279 -2004 5044 -1618 3781 279 -1749 1796 -3198 3057 -5321 2005 -2752 -834 -1921 -2369 1601
1294 1601 -5809 553 -6549 255 -4070 -4003 -2222 -5742 601 -6714 -817 -6088 -436 -3229 -3353 -609
1310 -609 -4104 2306 -4725 1048 -3530 625 -1791 -2427 2188 -2797 3901 -3057 3011 -1065 1752
1325 1752 2368 -385 4400 -378 4835 205 3809 1774 2784 3167 239 5597 -505 6087 252
1340B52L330j420j67J026l338N782n648M819n574K831k350Q21K354n845N210l261
1356a178K830n831L095P36k862L060m265M525m521M568m269K223o35k105K671
1371a958k930M155n738M331k214R43J878l478L825n285N514k888K739k518R98
1386b626K112k890L351m719O056k591K445k531J339K362l273M986l980L343k116
1401A268K536k137O9L067m240M588m900O146m529J555N91j076L582m297L884m877
1417A230M944m555J640o4j058K795o029N755m358L613l769M40M48k139M178n271
1433b200M773m034L604l665m73J662l115M558n560N935o120K979p09j168L640
1448A07m538L958m766M014j718N2J69j585N048n517N051n161M731k349L87K473
$$ plain form
1340 252 3582 2162 1995 3021 -317 5465 -183 4636 -938 1893 -457 364 2718 -3127 2083 -1178
1356 -1178 1652 -4179 -1084 -348 -3210 -150 -4415 110 -4411 157 -4112 -1889 -2524 -4629 -1958
1371 -1958 -4888 -733 -6471 -2140 -4354 -3411 -1533 -5011 -1186 -6471 -957 -3845 -1106 -3624 -2626
1386 -2626 -514 -3404 -53 -4772 1284 -1307 1138 -1393 -54 2308 -965 4021 41 3384 1268
1401 1268 3804 1667 1736 4803 563 5151 251 6397 1868 3423 4014 2938 6520 2223 6107 1230
1417 1230 6174 1619 3259 3195 2137 4932 -1097 4658 300 3913 144 584 1032 -1107 3071 -2200
1433 -2200 2573 -1461 2143 -1522 -1995 -333 -3448 1110 -4450 1485 -4635 -1656 -2365 -3533 107
1448 107 -4431 -473 -5239 -1225 -2943 -2891 -2722 -4307 741 -4776 275 -4886 -155 -2504 -2117 356
1464C56l562N071n831O142m398L401j799k7K598m471O449n163M559l780K625Q4
1480B254k540M219n359P076o021N146m577K385J130k815M034n741N569n956L553
1495B357j719J18L788n529L842n063O533n285J094N84o70K366m617L726n725O739
1511B539n337Q93J227k665L777n747O567n460L860k733p89K551l338M481n790
1526e964N957l822K776j584o65L858m058N170o596O745m404K045L25j779L832
1541A836l858N221n566M483k146J197L98k335M885m192L808l097K442K01k232
1556A045L993l479M278n379N762m292J287k48q58K360m039N647n185L597l932
1571E57K128l40j156K167l797M242l467K335l675J398K534m498K963m302L759
$$ plain form
1464 356 -3206 1865 -3966 2176 -2222 1179 -620 -647 1951 -2520 3929 -1234 3325 -455 2170 2254
1480 2254 -286 3933 -1426 5650 -371 4775 198 2583 3713 898 4932 -809 4760 -1196 2357
1495 2357 638 756 4544 -985 2857 -2206 4327 -958 136 720 50 2416 -2201 1525 -4200 2539
1511 2539 -2798 -1905 -678 -3343 434 -5313 1254 -4206 -346 -3079 -3868 -1317 -4655 -174 -5964
1526 -5964 -7 -3829 -1053 -2637 -3302 556 -3502 1668 -4928 1817 -2587 -542 -217 -1996 1836
1541 1836 -2022 3199 -2367 2116 -30 1167 1565 -770 4115 -77 3731 634 3076 3277 1045
1556 1045 5038 1559 5837 458 6220 1928 3215 2967 2109 4469 430 6077 892 4489 557
1571 557 2685 2345 1189 3356 -441 3801 334 2669 -1006 392 2926 -1572 1391 -2911 848
1586H48l490J195q91L06J329l464M004l129K290l279J591l46k90J734k795L223
1602a164m121M286l278J730O18k045L337m050M561k880K939k504J394l00k46J640
1618h3k423L321k913L183j639J426o4p85K027l648N403m987L312j32n74K097l106
1635D15K850l332M575l829K798j932j42K069k924K803m311M816k888J747j460
1650A255j140K848l773L381m135K598k014J135q21m12J586m449M583l977L985
$$ plain form
1586 848 -2642 -1447 -2338 -2032 -703 -4167 -163 -3292 -1002 -4281 -2690 -3036 -3326 -1592 -4387 -1164
1602 -1164 -5285 -999 -4277 -2547 -1929 -3974 -637 -4687 -126 -3006 -67 -2571 -1177 -1477 -1723 -83
1618 -83 -2506 815 -2098 1085 -554 872 808 23 2050 -1598 3805 -1182 2130 1998 1424 3521 415
1635 415 3265 -67 4508 679 3477 1545 1403 3472 548 3351 -960 3856 968 2715 1255
1650 1255 115 2963 -810 2571 -1564 1034 -980 155 -666 -1078 508 -3941 642 -3335 650
$$ [...]
8191A56
##END NTUPLES=NMR FID
##END=
