##TITLE=1H_SA_30.236
 CDCl3, 8 sc, 
 16.12.2020
##JCAMPDX= 6.0         $$ Bruker NMR JCAMP-DX V2.0
##DATA TYPE= NMR FID
##DATA CLASS= NTUPLES
##ORIGIN= UXNMR, Bruker Analytische Messtechnik GmbH
##OWNER= root
$$ XWIN-NMR		Version 3.5
$$ Wed Dec 16 11:18:37 2020 Russian Standard Time (UT+4h)  she@DPX200
##.OBSERVE FREQUENCY= 200.1315066352
##.OBSERVE NUCLEUS= ^1H
##.DELAY= (6, 6)
##.ACQUISITION MODE= SIMULTANEOUS
##.ACQUISITION SCHEME= undefined
##.AVERAGES= 8
##.DIGITISER RES= 18
##SPECTROMETER/DATA SYSTEM= spect
##.PULSE SEQUENCE= zg30
##.SOLVENT NAME= CDCl3
##.SHIFT REFERENCE= (INTERNAL, CDCl3, 0, 15.7039)
##AUDIT TRAIL= $$ (NUMBER, WHEN, WHO, WHERE, WHAT)
$$ ##TITLE= Audit trail, XWIN-NMR		Version 3.5
$$ ##JCAMPDX= 5.01
$$ ##ORIGIN= Bruker BioSpin GmbH
$$ ##OWNER= she
$$ F:/spectra/data/she/nmr/H-F/1/audita.txt
$$ ##AUDIT TRAIL=  $$ (NUMBER, WHEN, WHO, WHERE, WHAT)
(   1,<2020-12-16 11:16:51.35 +0400>,<she>,<DPX200>,
      <created by zg, POWCHK disabled, PULCHK disabled
       configuration hash MD5:
       00 E9 B6 7A A2 85 ED C7 34 08 36 98 17 FE 4E 26
       data hash MD5: 16K
       96 24 41 CE 11 BB 8D 78 84 39 B3 C4 E7 B5 5E 49>)
$$ ##END=
$$ 
$$ hash MD5
$$ 7E 43 57 FB 65 74 73 DA 89 8E 2C 97 1A 5E 18 26
##$RELAX= 
##$RELAX= 
##$RELAX= 
##$RELAX= 
##$RELAX= 
##$RELAX= 
$$ Bruker specific parameters
$$ --------------------------
##$DU= <F:/spectra>
##$EXPNO= 1
##$NAME= <H-F>
##$PROCNO= 1
##$TYPE= <nmr>
##$USER= <she>
##$AMP= (0..31)
100 100 100 100 100 100 100 100 100 100 100 100 100 100 100 100 100 100 
100 100 100 100 100 100 100 100 100 100 100 100 100 100 
##$AQSEQ= 0
##$AQ_mod= 1
##$AUNM= <au_zg>
##$AUTOPOS= <>
##$BF1= 200.13
##$BF2= 200.13
##$BF3= 200.13
##$BF4= 200.13
##$BF5= 200.13
##$BF6= 200.13
##$BF7= 200.13
##$BF8= 200.13
##$BYTORDA= 1
##$CFDGTYP= 0
##$CFRGTYP= 5
##$CHEMSTR= <none>
##$CNST= (0..31)
1 1 145 1 1 1 1 1 1 1 1 1 1 1 1 1 1 1 1 1 1 1 1 1 1 1 1 1 1 1 1 1 
##$CPDPRG= <>
##$CPDPRG1= <>
##$CPDPRG2= <>
##$CPDPRG3= <>
##$CPDPRG4= <mlev>
##$CPDPRG5= <mlev>
##$CPDPRG6= <mlev>
##$CPDPRG7= <mlev>
##$CPDPRG8= <mlev>
##$CPDPRGB= <>
##$CPDPRGT= <>
##$D= (0..31)
0 1.2 0 0 0 0 0 0 0 0.06 0 0.03 0 0 0 0 0.0002 0 0 0 0 0 0 0 0 0 0 0 0 
0 0 0 
##$DATE= 1608103010
##$DBL= (0..7)
120 120 120 120 120 120 120 120 
##$DBP= (0..7)
150 150 150 150 150 150 150 150 
##$DBP07= 0
##$DBPNAM0= <>
##$DBPNAM1= <>
##$DBPNAM2= <>
##$DBPNAM3= <>
##$DBPNAM4= <>
##$DBPNAM5= <>
##$DBPNAM6= <>
##$DBPNAM7= <>
##$DBPOAL= (0..7)
0.5 0.5 0.5 0.5 0.5 0.5 0.5 0.5 
##$DBPOFFS= (0..7)
0 0 0 0 0 0 0 0 
##$DE= 6
##$DECBNUC= <off>
##$DECIM= 32
##$DECNUC= <off>
##$DECSTAT= 4
##$DIGMOD= 1
##$DIGTYP= 9
##$DL= (0..7)
0 120 120 120 120 120 120 120 
##$DP= (0..7)
150 150 150 150 150 150 150 150 
##$DP07= 0
##$DPNAME0= <>
##$DPNAME1= <>
##$DPNAME2= <>
##$DPNAME3= <>
##$DPNAME4= <>
##$DPNAME5= <>
##$DPNAME6= <>
##$DPNAME7= <>
##$DPOAL= (0..7)
0.5 0.5 0.5 0.5 0.5 0.5 0.5 0.5 
##$DPOFFS= (0..7)
0 0 0 0 0 0 0 0 
##$DQDMODE= 0
##$DR= 18
##$DS= 0
##$DSLIST= <SSSSSSSSSSSSSSS>
$$ [...]
##$SUBNAM2= <"">
##$SUBNAM3= <"">
##$SUBNAM4= <"">
##$SUBNAM5= <"">
##$SUBNAM6= <"">
##$SUBNAM7= <"">
##$SUBNAM8= <"">
##$SUBNAM9= <"">
##$SW= 16.9725356469052
##$SWIBOX= (0..15)
0 0 2 0 0 0 0 0 0 0 0 0 0 0 0 0 
##$SW_h= 3396.73913043478
##$TD= 16384
##$TD0= 1
##$TE= 0
##$TE2= 300
##$TE3= 300
##$TEG= 300
##$TL= (0..7)
0 120 120 120 120 120 120 120 
##$TP= (0..7)
150 150 150 150 150 150 150 150 
##$TP07= 0
##$TPNAME0= <>
##$TPNAME1= <>
##$TPNAME2= <>
##$TPNAME3= <>
##$TPNAME4= <>
##$TPNAME5= <>
##$TPNAME6= <>
##$TPNAME7= <>
##$TPOAL= (0..7)
0.5 0.5 0.5 0.5 0.5 0.5 0.5 0.5 
##$TPOFFS= (0..7)
0 0 0 0 0 0 0 0 
##$TUNHIN= 0
##$TUNHOUT= 0
##$TUNXOUT= 0
##$USERA1= <user>
##$USERA2= <user>
##$USERA3= <user>
##$USERA4= <user>
##$USERA5= <user>
##$V9= 5
##$VALIST= <valist>
##$VCLIST= <CCCCCCCCCCCCCCC>
##$VD= 0
##$VDLIST= <DDDDDDDDDDDDDDD>
##$VPLIST= <PPPPPPPPPPPPPPP>
##$VTLIST= <TTTTTTTTTTTTTTT>
##$WBST= 1024
##$WBSW= 4
##$XGAIN= (0..3)
0 0 0 0 
##$XL= 0
##$YL= 0
##$YMAX_a= 13359
##$YMIN_a= -7659
##$ZGOPTNS= <>
##$ZL1= 120
##$ZL2= 120
##$ZL3= 120
##$ZL4= 120
##$ABSF1= 10
##$ABSF2= 0
##$ABSG= 5
##$ABSL= 3
##$ALPHA= 0
##$AQORDER= 0
##$ASSFAC= 0
##$ASSFACI= 0
##$ASSFACX= 0
##$ASSWID= 0
##$AUNMP= <proc_1d>
##$AZFE= 0.1
##$AZFW= 0.1
##$BCFW= 1
##$BC_mod= 2
##$BYTORDP= 1
##$COROFFS= 0
##$CY= 11.3945322036743
##$DATMOD= 1
##$DC= 2
##$DFILT= <>
##$DTYPP= 0
##$F1P= 15.9154993809931
##$F2P= -4.1035820241983
##$FCOR= 0.5
##$FTSIZE= 0
##$FT_mod= 4
##$GAMMA= 1
##$GB= 0.15
##$INTBC= 1
##$INTSCL= 1
##$ISEN= 128
##$LB= 0.24
##$LEV0= 0
##$LPBIN= 0
##$MAXI= 10000
##$MC2= 0
##$MEAN= 0
##$ME_mod= 0
##$MI= 1.114404
##$NCOEF= 0
##$NC_proc= 0
##$NLEV= 6
##$NOISF1= 3.799351
##$NOISF2= 2.8
##$NSP= 1
##$NTH_PI= 0
##$NZP= 0
##$OFFSET= 15.70392
##$PC= 1
##$PHC0= -10767.27
##$PHC1= 18.00089
##$PH_mod= 1
##$PKNL= yes
##$PPARMOD= 0
##$PSCAL= 0
##$PSIGN= 0
##$REVERSE= no
##$SF= 200.130013532006
##$SI= 16384
##$SIGF1= 3
##$SIGF2= 2
##$SINO= 400
##$SIOLD= 16384
##$SREGLST= <1H.CDCl3>
##$SSB= 0
##$STSI= 0
##$STSR= 0
##$SW_p= 3612.71676300578
##$SYMM= 0
##$S_DEV= 0
##$TDeff= 0
##$TDoff= 0
##$TI= <>
##$TILT= no
##$TM1= 0
##$TM2= 0
##$TOPLEV= 0
##$USERP1= <user>
##$USERP2= <user>
##$USERP3= <user>
##$USERP4= <user>
##$USERP5= <user>
##$WDW= 1
##$XDIM= 8192
##$YMAX_p= 0
##$YMIN_p= 0
$$ End of Bruker specific parameters
$$ ---------------------------------
##NTUPLES= NMR FID
##VAR_NAME=  TIME,          FID/REAL,        FID/IMAG
##SYMBOL=    X,             R,               I
##VAR_TYPE=  INDEPENDENT,   DEPENDENT,       DEPENDENT
##VAR_FORM=  AFFN,          ASDF,            ASDF
##VAR_DIM=   8192,          8192,            8192
##UNITS=     SECONDS,       ARBITRARY UNITS, ARBITRARY UNITS
##FACTOR=    0.0002944,     1,               1
##FIRST=     0,             0,               0
##LAST=      2.4114304,     0,               0
##MIN=       0,             -7659,           0
##MAX=       2.4114304,     13359,           0
$$ Real data points
##PAGE= N=1
##DATA TABLE= (X++(R..R)), XYDATA
0@%%%%%%%%%%%%%%%%%%%%%Oj4J6j6J6j6J6k1K8l1L2l7M4m7N4o1O8p6Q4r4J05j16
43f0J28j43J57j72J90k09K32k54K78l08L39l74M14m59N11n72O43p27Q29r58J122
64F07j343J657k136K966m789J5596l211j6506J7427j1063L027J987k76o619J2119
79I443r530J23Q083j1857R694m466J42L22J756l905J032M622j0070J0323o752
94a040J559N46n80o66r55M148p778Q318n939Q70J871k216J076j352K926o060Q289
111C017p716K502L965p506N999k557O4o80L775o178N176j79n234Q107p124L838
127g31n76L86p72J137M23k536N141o230N476j845l56J358r93J401k103L519m297
144a598M479k146k34K007j855J609k050L655m607L914j620j113K870l032J969
$$ plain form
0 0 0 0 0 0 0 0 0 0 0 0 0 0 0 0 0 0 0 0 0 0 0 6 -8 8 -8 8 -8 8 -13 15 -16 16 -21 23 -24 30 -31 37 -39 45 -49 56 -60
43 -60 68 -75 82 -90 100 -109 123 -131 147 -161 178 -196 218 -241 270 -302 341 -386 443 -515 607
64 607 -736 921 -1215 1751 -3038 12558 9347 -7159 10268 -795 2232 4219 3943 -2676 9443
79 9443 -87 36 8119 -3738 5956 1490 1632 1954 3710 -195 837 5459 -4611 5712 -1040
94 -1040 519 1065 485 -181 -1136 3012 -4766 3552 -2387 -1517 354 -1862 -786 -2138 788 -5272 3017
111 3017 -4699 -2197 1768 -5738 261 -2296 -2232 -2912 863 -5315 -139 -318 -5552 2555 -4569 -731
127 -731 -1307 -921 -1693 -556 -133 -2669 2472 -3758 1718 -127 -483 875 -118 1283 -820 2699 -1598
144 -1598 2881 735 501 2508 653 2262 212 3867 -740 3174 1554 441 3311 279 2248
159B248p60O29k589L894l390Q95J606m218M653l244Q78j61K32j090R61j6k079
176a551L407m175K772j148j11o9k54K66j224K456l150K695j982P05J78p54J254
193f85j830K347k636K325j129J96pk4P05j480K977l066K833j787P4J912k008J728
211D45r33J348j799K514k039J353N65k165L039k497K183j488J276r81O15M50j761
228A25K976l515K842j790J158m25m78J328k442K729k639K344k431J462k76r91
244b3J643k909L266l462K435j334k26J021j620J657k403L116l479K613j631j88
260a524J557k802L187l092K396j792J427r12n7J420k828L658l578L049j528K03
276a216P66j469K217k555L139l077K911j529J69J285j847K861l336L627k790J780
$$ plain form
159 2248 1488 2117 -472 3422 32 927 2533 -1685 2968 -276 602 441 673 -417 544 528 -1551
176 -1551 1856 -2319 453 -695 -806 -875 -1129 -863 -2087 369 -2781 -86 -2068 -1363 -1185 -1939 -685
193 -685 -2515 -168 -2804 -479 -1608 -1412 -1419 -1443 -738 -2218 759 -2307 526 -1261 -1187 725 -1283 445
211 445 -488 860 -939 1575 -464 889 1454 -711 2328 -169 2014 526 1802 821 1436 1886 125
228 125 3101 -414 2428 638 1796 1371 893 2221 -221 2508 -131 2213 -218 1244 968 -23
244 -23 1620 -1289 1977 -1485 950 -384 -610 411 -1209 448 -1955 1161 -2318 295 -1336 -1524
260 -1524 33 -2769 418 -2674 -278 -2070 -643 -1555 -1612 -192 -3020 638 -2940 109 -1419 -1216
276 -1216 -450 -1919 298 -2257 882 -2195 716 -813 -644 641 -1206 1655 -1681 1946 -844 936
292I36n01l21J849k534L190l393L513k700J352L75j723K661l174L306l028K478
308B286j832R54J49j803L023l797L712k979J533k87j084J287j957K666l278L034
324A627k612J390l39j471K505l199L116k900J973j396M94N37j535K463l087L002
340E68l170K570j143n10J804k147K431k945K773k108J570q90m15K201k592K967
356I64k781K383j226K58O23r58J899k296K774k497K079r10nR64j553K133k035
373a84J970j773J377l62j36Q11j558K126k272J934j287N74J65j007J514k026J678
390A544j701J507j356Q53o1j179J679j962J533j620Q98l46J8K35j017J395j724
407a304J555j779J215m39l67Q76j437J278j288J438j185P51n40j52P98j141J740
$$ plain form
292 936 435 114 1963 -571 2619 -774 2739 39 1391 1766 43 2704 -470 2836 -192 2286
308 2286 454 1408 1557 -246 2777 -1020 2692 -287 1246 959 -125 1162 -795 1871 -1407 1627
324 1627 -985 405 66 -1405 1100 -2099 1017 -1883 90 -1306 -812 -275 -1810 653 -2434 568
340 568 -2602 -32 -1175 -1685 119 -2028 403 -2542 231 -1877 -307 -1197 -1612 589 -2003 964
356 964 -1817 566 -660 -402 221 -737 1162 -1134 1640 -857 1222 312 307 1271 -282 1851 -184
373 -184 1786 13 1390 1028 892 1703 145 2271 -1 1933 646 1220 1385 378 1892 -134 1544
390 1544 -157 1350 -6 847 786 -393 1286 -676 857 -763 135 -211 -193 42 -975 420 -1304
407 -1304 251 -1528 -313 -752 -1119 -243 -1680 -402 -1690 -252 -1437 -686 -1226 -1378 -580 -1721 19
424A9j549J399j075N50J12l57R32j124J229j002J222j024N12L85p13J098p05J102
442A011j240J261r45P19r5l86J198j308J280j323J068m16J14O4m16Q35j168J261
460A514j408J190n36j31P14j317J329j484J275j437J370j029j49N09j190J506
476G26j656J566j612P80j21m35J097j754J408j454J374j025M48J17o46J005j756
493a938K086k014J470q05J83O88r95J299j609J948j535J256m30j79Q90j573J918
510F60j756K082j326O78k15k11J107j644K195k018J933j173J31M71q36J526j614
527a0K102k143J793j290K04R28j760K064k158J752j343R55l81l56Q02j569J930
544A520k273J864j361O03J0j101J589j984J765j962J700q67j57Q47j731K281k201
$$ plain form
424 19 -1530 -131 -1206 -656 -544 -901 31 -1093 136 -866 356 -668 -156 229 -484 614 -91 1011
442 1011 -229 1032 87 806 711 325 1523 215 1495 172 1240 824 938 1002 586 1421 253 1514
460 1514 106 1296 760 629 1343 26 1355 -129 1146 -291 1079 50 -99 410 -780 726
476 726 -930 636 -976 -196 -317 -752 345 -1409 -1 -1455 -81 -1106 -658 -541 -1187 -182 -1938
493 -1938 148 -1866 -396 -1201 -1018 -330 -1325 -26 -1635 313 -1222 34 -396 -575 315 -1258 660
510 660 -1096 986 -340 338 123 -88 1019 -625 1570 -448 1485 312 443 914 78 1604 -10
527 -10 2092 -51 1742 452 656 1584 -176 1888 -270 1482 139 1094 713 357 1159 -410 1520
544 1520 -753 1111 -250 353 363 -738 851 -1133 632 -1330 370 -497 -654 193 -1538 743 -1458
561a458J834j704P39k21k43R71j710K097k195J992j355M12N20j036J654j596J354
578E5j454J700j169M65N47j185K036k140K033j595J304n37k27J026j494K141k081
595e75J869j104O25j78n43J243j299J523j626J495r35J53M09r50J187j368J478
612A404j705J226m84j93P83j216J268j451J217r45N94k52q74J164j478J537j504
629i09J010n82r2N15p71R25j096J013j294R33q25M43K61o56J010r11P99j011Q41
648c97n18K14M47p29J213j373J147p48L65J77n58R01m67P11p44P88q75Q17m80
667a09p0J193p39N33r01P73k98M39l16j28P42o65P58q66Q06n99J79L4l82Q36j088
688A32O24n42M63l52j38K21n15R15q94O57p85P73q11P2K51o35Q85j170R08n27
$$ plain form
561 -1458 376 -1328 -589 -810 -1053 -82 -1792 305 -1890 102 -1253 -841 -321 -1357 297 -1299 55
578 55 -1399 301 -868 -403 144 -1041 995 -1145 888 -707 597 60 -167 859 -635 1506 -575
595 -575 1294 190 815 637 94 1337 38 1561 -65 1430 495 648 1057 107 1294 -74 1404
612 1404 -301 925 441 248 1031 -185 1083 -368 849 -96 498 246 -628 536 -942 595 -909
629 -909 101 -481 -573 -58 -829 96 -1000 13 -1281 -348 -1173 -730 -469 -1125 -115 -1026 -227 -1238 -397
648 -397 -915 -701 -254 -983 230 -1143 4 -744 -379 -202 -760 141 -326 385 -359 429 -446 371 -109
667 -109 -179 1014 275 808 -93 680 382 821 505 377 1119 454 1212 346 1152 553 732 766 384 1220 132
688 132 756 214 677 325 187 408 -107 808 -86 571 -214 559 -252 -180 71 -564 321 -849 59 -468
708d68Jl16J40M82q13J124r62L97n12N79m12o9N81q72J336j379Q50k71n7L09o26
729i58P70o94J495j491J290r09L03N84q44Q98r17J381j143Q19n20K74P26j088
747b4J290j502J388j102P80j56l22R72j322J584j668J253r92M03M7m48R07j293
765b05J424j491J008q26O50j10r24J279j490J378j489J016m01M2N38j431J208
782A76j104J313j316N17j5k17R02j522J316j272J353q81K01K54p48J086j522J961
800D82j769J097k60j30P30j137J577j507J446j077O83l7n67Q01j119J874j536
817d49J211n84M41n7p10J233j378J339j137R86m45o9O11j049J391j343J067r31
835A27O80mo38P07j121J576j509R65q95L57K59r74R74j038J355j324P47k81q3
$$ plain form
708 -468 -467 -783 -643 -161 -974 150 -812 -415 -927 -348 -760 -829 -248 -1120 216 -1163 -313 -584 -641 -332 -958
729 -958 -188 -882 613 -878 412 -497 -194 390 -454 444 -473 908 -235 584 64 338 1064 -24
747 -24 1266 -236 1152 50 830 674 352 1324 2 1586 -82 1171 179 582 629 181 1088 -205
765 -205 1219 -272 736 -90 560 450 -474 805 -685 693 -796 220 -181 -139 399 -1032 176
782 176 -928 385 -931 -414 -429 -646 256 -1266 50 -1222 131 -750 -549 -295 -1043 43 -1479 482
800 482 -1287 -190 -450 -580 150 -987 590 -917 529 -548 135 98 -469 332 -787 1087 -449
817 -449 762 178 619 562 -148 1085 -293 1046 -91 895 450 381 992 -57 1334 -9 1058 127
835 127 807 803 165 872 -249 1327 -182 783 -112 245 504 -470 504 -534 821 -503 244 -37 -120
854a20M27j195J119j100J080j064O27k97J56K89j061J190j093R48o78L28K97o72
872h19O53r90J098r00O72k99J09L89n79Q50j149J231q40O47m25K8O93o38P74o24
892a19Q00q50M24J39m50N28j55P17q43L91j97M76l54k89L39m90P72n97O17n90
912B69J69j1j98N60r48P41r19Q72m27K49j97l16N69p15L37n25O94o52L29Rl52
933d62O96q66P40p39N16m06K00L5l03L18q90Q04l12M27l19n9L72m13N75q95J066
954H5o93N76j01j94L74n85O87o49Q47o44N03J95l48N80r65J052j011P71k76N2
974B56K49l31Q12j060J100q42O25o66M31J23o89J045j081J038j050M85k0nK7p21
994b74J051j448J210n74K74k25q4N91j128J086j256J171r24K23N16r08Q67j063
$$ plain form
854 -120 307 -888 231 -869 211 -853 -226 -523 -367 -78 -1139 51 -1042 -94 -772 -444 -147 -819
872 -819 -166 -1156 -58 -958 -286 -585 -476 -87 -666 184 -965 266 -574 73 -352 -324 369 -269 505 -119
892 -119 681 -169 255 394 -56 472 317 1034 191 582 385 861 507 218 557 67 839 242 859 269
912 269 438 427 229 789 -159 582 -337 535 108 357 160 -156 413 -302 35 -490 204 -448 -119 -110 -462
933 -462 234 -632 108 -631 -115 -521 -321 -286 -589 -271 -1161 -357 -669 -242 -561 -620 -248 -661 -86 -981 85
954 85 -608 -32 -133 -327 47 -538 149 -500 347 -297 206 401 53 633 -332 720 -291 480 204 256
974 256 505 174 986 -74 1026 184 809 143 574 697 8 1053 -28 1010 -40 445 425 420 447 -274
994 -274 777 -671 539 -35 239 14 -70 521 -607 479 -777 394 -530 -307 209 -699 168 -895
1012h95J070j052Q71o15K19K84r53J384j542J370q34N22k65j46O25q95J407j418
1030h63J289j110N02J55m66J030j293J562j339Q99p09N69J75n61Q48j179J573
1047A082j195Q07m00rO45r62J126j054Q32n60K4J87k70P02j087J256j109R72j135
1066a48N37J91q20J068j149J009j070R52m48l02M39r91J087r98J067p35K02k28
1084c37k99P86p80P43r02O85m58o1O06q42J030j053R17q48R71o77j2N64p25R09
1104B17j179J128o84M22l0j57P08r64J138j006O43k91K71J4j84M90q58Q01o19
1123a40O51m95M31M88o33O33r89P54p25N50j60J12J8l72O42q57P32k86K61m05
1143B10m4L70o29M67o76Q01o01K69k04j48K69m73N87o30O01n16L83l79O7O7k42
$$ plain form
1012 -895 175 -877 -6 -621 -402 -118 -1071 313 -1229 141 -693 -171 -436 -582 43 -852 555 -863
1030 -863 426 -684 -182 -27 -493 537 -756 806 -533 366 -343 226 401 -160 688 -491 1082
1047 1082 -113 694 294 285 930 -32 1094 40 872 312 336 523 253 955 -132 1124 15 987 -148
1066 -148 389 580 -240 828 -321 688 -382 570 122 -180 259 -732 355 -643 424 -311 -109 -337
1084 -337 -636 150 -630 113 -789 -104 -562 -623 -17 -859 171 -882 35 -813 158 -519 -531 33 -692 217
1104 217 -962 166 -518 -96 -126 -283 425 -539 599 -407 236 -55 216 230 46 536 -322 479 -140
1123 -140 511 16 447 935 302 935 -54 700 -25 525 365 477 495 123 765 -92 640 354 615 210
1143 210 166 536 -93 374 -302 499 -102 167 -37 -185 84 -389 198 -432 169 -347 36 -343 -276 -209 -451
1164d51N27r53R46n19q3K34k72O80r29Q25o57M79m04L09K02l97N21n46P00n75
1184c63M04j31l9L23m82O22k95L63m79J61R9J44J15l93N99l78L92n25M72k67l10
1205C2P44r46R56p59N93n34M65l7k35L15o21O19o71O94m84P3M9k69L84m75L02
1226A95p24P64m02k02K76m33O68p65P30q14P17m81o9L88p35R79o80N68o81N00
1246b01k26l6M06o47Q25q53P52m43j58O28m51O80j008J081q40O92j09m29O60o07
1266b84R67j051J003p21M32qk24N76q43R22r46J135r65M44K03o50O99q04Q38p96
1286g3M86j68j27L95q16J112j005Q17q39N68J9m77M39o93Q43q80P23m63r4N87
1306C54p53N44o17O23p80O21l75j04L85q27R11q08R93o77M38j52l76L79m51O72
$$ plain form
1164 -451 76 -877 69 -450 -533 -299 -571 109 -820 5 -652 -173 -577 -268 -66 -463 58 -488 212 -363
1184 -363 41 -90 -129 194 -288 334 39 402 -77 84 183 327 442 49 648 270 662 137 609 342 32
1205 32 776 -170 786 27 620 86 551 514 279 594 -27 592 -79 615 131 204 253 -16 368 -107 195
1226 195 -529 235 -167 -369 -93 -526 142 -623 107 -707 10 -471 -540 -152 -887 92 -588 -20 -701 -201
1246 -201 -427 -463 -57 -704 121 -732 20 -423 -581 47 -404 276 -732 349 -491 201 92 -337 323 -284
1266 -284 683 -368 635 -86 346 338 114 690 -153 769 -177 958 -7 437 640 -10 689 -115 723 -73
1286 -73 413 245 118 513 -303 809 -196 621 -218 350 369 -108 331 -362 481 -399 324 -139 -233 354
1306 354 -399 145 -472 151 -629 -8 -383 -487 -102 -929 -18 -826 167 -510 -72 -224 -600 -221 -672 0
1326@p66Q28o30L88K0m39Q16r95R73q38P39k25J13P2j72N93p97R82j042O67M7
1347C34k47N53n87O24p25O63m93L59l0l11N67m99L65p54Q00m65L08p4l37M18o34
1368a65P50p35N46j34k53J68k75K16m23L39j38L95o59M05k68j01L57l91L58m48
1388d56K35j57K15N3o12P43o08L67k50L69j70k08J41l74M07l23O12l81K17J54
1408b6l87M72l67P31q44M13j69M17l22J00Q8k74O20n19J97L08m42K89p1M70m68
1429B16N58m70P6l23K56L19m51J36m33L26k34K56q0j89K47k10J83l72N91m46K63
1450B19j05j44J37m01M22m51K36m70M50k30M4K95m44M56n14L08m18K69j8k99O33
1471b5o67M79j50K52J11k72J46n00R56p69P86o14J46K19m22O08p70R64q59P27
$$ plain form
1326 0 -766 62 -568 -180 -160 -599 217 -778 195 -643 96 -129 -16 56 -116 477 -320 662 -380 287 334
1347 334 87 640 53 677 -48 615 122 481 451 140 707 208 573 -181 619 154 462 388 51 469 -165
1368 -165 585 -150 396 262 9 177 -98 118 -305 34 -104 291 -368 37 -231 -332 25 -366 -8 -456
1388 -456 -221 -378 -163 -110 -722 21 -587 -220 -470 -101 -271 -479 -338 -712 -305 -628 -16 -397 -180 -26
1408 -26 -413 59 -308 423 -421 -8 -177 240 -82 18 106 -168 452 -67 130 438 -4 285 214 684 216
1429 216 774 304 380 57 313 632 181 317 -116 210 -24 232 152 -37 210 0 183 -189 402 -44 219
1450 219 114 -30 107 -294 128 -323 -87 -557 -107 -337 -293 2 -442 14 -500 -192 -610 -341 -359 -658 -25
1471 -25 -692 -213 -363 -111 0 -272 -126 -626 330 -439 347 -267 -121 98 -324 284 -486 478 -381 346
1491C46k45o2K63m63M45n62N19l60K76kK6P9k68O87j100R62n26N5J68K37J53p59
1513a31R34j191R66m86L14l6n43N91n02M87m26K65l70J66J81o25N94n44O98n28
1533a86Q8k11N0K19m16M59o60O37l65k3J94j23L30o90N94m20N11l32M00pK2j12
1555d1k28N00q21O43M8k86P8k0q3n4O65l66J7O26q48J235j433J388o24j07j02
1576A87l72M17p14Q60o84J085j035R69l48j28K18o43Q50p76M77m55L53P6l30M3
1596E0j25L90o58M58k00J3J50k68L57l24J44l03J82k04j33J46mK86k99K41k81
1617c82L3J62j68K39l61L98j69K37m86M67p0k54K79k34Q09j049N42k31M07k08
1637c9q5K45k61N34l25n7j41L61P4k93L37l50M21n94L89m4m4K32m88N30n68P21
$$ plain form
1491 346 101 39 302 -161 284 -278 241 -119 157 155 181 260 -8 679 -421 541 15 70 238 475 628 -131
1513 -131 803 -388 578 92 406 370 -173 418 -84 403 -23 242 -128 38 219 -406 188 -356 342 -186
1533 -186 -98 -309 -259 -40 -456 3 -657 -20 -385 -408 -214 -337 -7 -697 -103 -523 -12 -344 56 49 71 -41
1555 -41 -269 231 -590 53 101 -185 -107 -127 -210 -264 401 35 52 678 -170 1065 -368 1020 396 289 187
1576 187 -185 232 -482 378 -306 779 -256 713 365 237 455 -188 662 -114 363 -92 261 337 7 50
1596 50 -75 315 -343 115 -85 -72 78 -190 167 -157 -13 -316 -134 -338 -471 -325 -329 -43 -342 -101 -382
1617 -382 -349 -187 -355 -116 -477 -79 -248 -11 -497 -30 -100 -354 -75 -309 500 -549 -7 -238 169 -39
1637 -39 -124 121 -140 394 69 12 -129 232 306 13 350 0 421 -173 216 172 128 360 -128 402 -166 555
1659E55n16K29J3k08J13k35N28o93L02j15K16R1j05K6m46M44j75L37k82l09J27
1680a03j0P5j72O1k94M17l16No8K35J3j36J64m17L78k65K71n0l30N64k47K39l87
1703c73M72m88J59K10l74P11p07O20m62K81k32KL62k70L35m35N03j95O9Mk2M5
1725B15l05N05n02N41m57K08QJ01L27p39P04p82O66l93J6R5p0K65p66Q95n64N44
1747E12l89j03K7l48M87o64Q97n18l9K26j71N8r0J34l68L60m07M5K51m12O18o42
1769e36P78o90L27nj16J6l76P45o97Q25n32L90m96J54J25l95O04k19M41p85O12
1790A70Q9k98M03o20N75m61N65k75jL08p52J017n91K30p7k35J51m7M27m96L87
1811D69n73N69m63J18o9j98O71o30O74q37N51n50M07j67l6J0m3J82m05L16N3j33
$$ plain form
1659 555 39 268 281 73 186 -49 479 -214 88 -27 189 280 175 201 -245 199 24 361 79 -230 -103
1680 -103 -113 -38 -210 -149 -443 -26 -342 -337 -405 -170 -157 -293 -129 -546 -168 -433 -162 -212 -542 22 -225 14 -373
1703 -373 99 -389 -230 -20 -394 317 -390 230 -232 49 -183 -181 181 -89 246 -189 314 119 188 192 170 215
1725 215 -90 415 -87 454 -3 205 213 314 641 -98 606 -176 490 97 113 208 138 403 -363 532 -32 512
1747 512 123 20 47 -301 186 -478 419 -99 -138 88 -83 -25 -115 19 -349 11 -396 -351 -100 -512 106 -536
1769 -536 242 -448 -121 -126 -242 -226 -602 143 -554 271 -261 129 -367 -213 -88 -483 121 -98 343 -442 170
1790 170 259 -39 364 -256 319 -142 423 148 147 455 -297 720 129 359 282 47 198 151 578 82 469
1811 469 -104 465 2 120 51 -147 524 -106 568 -269 282 -268 139 -28 -64 -54 -97 85 -320 -4 49 -84
1833h4J28n82M91k71j3K8m3L58k14J13m07N53l89L31m74K35L0l5J71l11L31l2
1855h6J76l08R9J44j74K99k22J49m42L44k83M59j44k27N04l74L33k36R4K38k33
1876A10J58l61N71l86L61l39J65j75K00o9k76J08m7M10n73J63N29n9k61m85J044
1897G88q77k60K74K90J25N27k64q65K86Om16m34J517m17M7l61L90M80j122K72
1917a4j296M23J156j117J096n13K76J13k02l6l56M07l91M04M6Q5r8j5j00M9L50
1938B67n20L59p0J32j79J50N9j79L8J17J21j06K57l35m1K17k87L26l37J65J71
1959C25o3k9N9k18k64L79l28L68l01K19J60l07M90k25m0l78J65P5k61J78k01J59
1981c8k62N0n6N39k79JJ29m00M98l48L00n12K73k8k61O36p62P45m76M13l67j2
$$ plain form
1833 -84 44 -538 -47 -318 -331 -303 -346 12 -202 -89 -496 57 -332 -1 -475 -240 -210 -245 -74 -385 -54 -86
1855 -86 90 -218 -119 25 -149 150 -72 77 -365 -21 -304 155 11 -216 288 -86 247 11 105 343 110
1876 110 268 -93 478 92 453 114 279 104 304 235 -41 67 20 430 -143 20 549 490 229 -256 788
1897 788 -89 -349 -75 215 340 867 603 -262 24 30 -386 -820 697 280 327 -34 356 836 -286 -14
1917 -14 -1310 -887 269 -848 248 -265 11 124 -78 -114 -470 -63 -454 -50 -4 81 -17 -32 -132 -83 267
1938 267 -253 106 36 168 -11 139 198 19 57 174 295 189 446 111 70 287 0 326 -11 154 325
1959 325 262 233 292 74 -190 189 -139 229 -72 147 307 0 490 265 225 -153 12 87 -174 4 -197 -38
1981 -38 -300 -250 -306 233 -46 -45 84 -316 182 -166 134 -378 -105 -133 -394 242 -520 225 -251 162 -205 -217
2003b17J55l34K49k32M15m33O52l28J46Q2n73N45l83P21m72K35l47J32L01l58
2023d4N38o34O96o91K71Q6p3M94o21M25n56M08j46J51J2k41L64l84M35n09L99
2044C80l29j54K80n32P34o10M03m7l47N69o39K96l21P07n56Q3K99q33j46R95n99
2065c67n53P16j01N66m77Q7J21k26K15j72L60n90P6M89m65M67l23L43m59M28k70
2086a35L84n00kN41k89L33k73M39m79O4J9j80M24n05K3L00J96l67K66Q2l90oL1
2109b4J31j64K60k74J04K12n4m1k44M04l43j35J66M4J57k68Q7l09J86j35J90K6
2131b4OJ12m30M22m01M12j99J15k3o13N55j28K69n24J42J94J47p4J5j51L8M29
2153B89o92L09q2K39M36l50nl14P83j96p56K06N39L32n00K76j33k23o46N57L59
$$ plain form
2003 -217 -62 -396 -147 -379 36 -397 255 -73 73 155 -418 127 -256 465 -7 228 -119 13 314 -44
2023 -44 494 -140 556 -135 136 222 149 643 22 447 -109 299 153 304 316 75 439 55 490 -19 380
2044 380 51 -103 177 -355 379 -231 172 125 -222 347 -292 4 -317 390 -166 -83 216 -617 -763 232 -367
2065 -367 -920 -204 -305 261 -216 -129 -8 -234 -19 -191 169 -421 -345 144 -321 146 -177 166 -293 135 -135
2086 -135 249 -251 -253 288 -1 332 59 498 19 83 102 -78 346 -159 -136 164 360 -7 259 341 -49 -55 -24
2109 -24 107 -57 203 -71 33 245 191 150 -94 310 -33 -168 -2 42 199 -69 18 -291 -105 -240 -50 -24
2131 -24 -18 94 -336 86 -315 97 -102 13 -10 -623 -68 -196 73 -451 -309 -115 32 -42 -27 -178 -140 289
2153 289 -403 -94 -176 63 499 149 144 -170 613 417 -339 -133 406 738 238 514 381 158 -488 69 428
2174D28m8l70J98J17o1j98rmK38N82q87l15R74m17j97O11p58j87R16n29j219J115
2196b0n93O35M62K24m14p86N87k37M86o94j40R62j197O95m2j91q48P68K20k9L99
2217B47j065N74K97N27m06o74Q05l60l09q20M35r7M54Q98nj246O2P61n42L30O42
2238E08k85m8l36M51n10P75o85N5k86O02l95K18j7l64P82m19o7n52J403j392Q84
2259C22j36m62K81j77K79o66R83k64k65L82o49N36k46J86Qk30J4K0nq2L5j15R61
2282G10q75J04R4j40J22p03N28k39j70M05N1J06l34M70o37O24m66N8J97J74J42
2303B21l52K58n85M47l28L95L02o96N73m88P66n38j79K42qQ8K5L6k60K47l25J34
2325b5J17L4J03m19L45m5L16k84J83l6l07P72q61J77qP5l12O82j36m76N10o51
$$ plain form
2174 428 380 10 208 325 264 66 57 53 291 873 -14 -329 645 228 31 642 -116 -303 613 84 -1135 -20
2196 -20 -613 22 484 708 294 -492 95 -142 344 -350 -490 472 -725 -30 -72 -263 -1111 -343 -123 -152 247
2217 247 -818 -244 53 580 174 -500 305 -55 -364 -1184 -749 -846 -392 506 501 -745 -683 78 -464 -134 508
2238 508 223 175 -161 290 -220 555 -130 -75 -361 241 -154 64 47 -317 465 46 -21 -573 830 -562 322
2259 322 186 -276 5 -172 107 -559 424 160 -105 277 -372 164 -82 104 112 -118 -104 -84 -89 -171 -136 -251 710
2282 710 -165 -61 33 -107 15 -688 -160 -399 -569 -164 -113 -7 -341 129 -508 116 -350 -292 -95 79 221
2303 221 -131 127 -458 -11 -339 56 358 -338 235 -253 513 -25 -204 38 30 118 143 179 -81 166 -159 -25
2325 -25 92 126 229 -190 155 110 426 142 325 289 -18 754 -107 70 62 137 -175 507 371 -105 405 -246
2347b46P96o30K88k26q6K47k00O3M4J54k3m18J71j18J46k31L12q29Q32j36J80
2368I0n90R7K98j22j79k63P87m91J1l53P81j28J27k50q0L14L5l40J48M20l16l81
2390c85M01k99J14m30J075l96r5p3j73P08p25J201p57m12K93j10K16n89J108j336
2410f64Q48o15L3L32L74m67N88j04j04j24J57k97N17p94N24l69M2r4L89k88K78
2431A62J47n62K61J31m20k32K12R2R7m64P27n88M72r2m93l14J320j190R74m99
2451b59L96j074M17K78k15N05%k3k05m90M23j32o9Q04o77N92j31O9Mj13J39j36
2473A03j96P0j61L12n23N11N5j29N03o91L77k50R6K3j96L85m54M81l1K5l84Q1
2495Gj11K40r5l4K9k53K45j45L22l76J34J78q4n1j98J61k48L93l56M6Q0j34L05
$$ plain form
2347 -246 550 -80 208 -18 -104 143 -57 6 50 204 181 -237 -66 -184 -38 -269 43 -786 46 -90 90
2368 90 -500 -403 -105 -227 -406 -669 118 -373 -362 -715 66 -62 65 -185 -265 49 84 -256 -108 312 -4 -385
2390 -385 16 -283 -169 -599 476 80 -15 -88 -261 447 -278 923 166 -246 47 -63 153 -436 672 -664
2410 -664 184 -431 -398 -66 308 -159 429 325 221 97 254 -43 474 -320 204 -165 -123 -217 172 -116 162
2431 162 309 -253 8 139 -281 -513 -301 -209 -112 -576 151 -437 35 -57 -550 -864 456 -734 240 -259
2451 -259 137 -937 -520 -242 -457 48 48 25 -180 -670 -247 -379 -448 356 -321 271 140 209 213 100 239 103
2473 103 -93 -23 -184 128 -395 116 171 42 545 -146 231 -19 77 100 -96 289 -165 316 285 310 -74 7
2495 7 -104 136 41 7 36 -217 28 -117 205 -171 -37 141 57 6 -192 -31 -279 114 -242 -196 -116 -250 55
2518E5j72m9r0P3L0K2L33m93M46n57K20K1j97L6NM91k74K33k16J04P6r3J63m47
2542b80L89J64k38k53K31J47k91L28j46J50l60N14j85o2J8j18L28l55K62o8nO3
2564B33k98L60k95l10L21M15m81J44j38K3l4q5K57j45PJ14j44O6K9k02m17O61
2586H1l49J49j40L52p6l07J93k44M23m00N99m43J45q6L5j59J48J40k9j36Oo9J79
2609A2j23L22n47N06j56M6K7j79K45l58K94j75L15j26J74p3j42K7j65P6m6J46
2631A00j31k0l3J78J67l32N15l99R7l87L08K45l42J95RJ0l67K93J03m35O3J75
2653A2J00k23J93j84j7j6M8O0j83K16R4N1r8l29K23j01K6j87L43k59M26j18j81
2676a04o5P0J97k93L39l11L04k63N7O0r5R8r7L38l14J04L27k10n2J95p8j37J78
$$ plain form
2518 55 -117 -166 -256 -183 -153 -131 202 -291 155 -402 -182 -161 -358 -322 -317 174 -100 133 -83 21 97 4 167 -280
2542 -280 109 273 35 -218 13 160 -131 197 51 201 -159 355 170 108 126 8 336 -19 243 175 170 233
2564 233 -65 295 0 -310 11 426 -55 89 -49 -26 -60 -145 112 -33 -26 88 -56 10 39 -163 -580 81
2586 81 -268 -119 -259 93 17 -290 -97 -341 82 -318 281 -162 -17 -103 -68 -227 -79 61 32 -104 -98 -167 12
2609 12 -111 211 -336 170 14 60 87 -92 153 -205 89 -86 229 103 277 204 62 89 -76 0 -46 100
2631 100 -31 -51 -84 94 261 -71 444 45 142 -245 63 308 -34 161 170 180 -187 106 209 -226 -163 12
2653 12 112 -111 82 -102 -119 -135 -87 -27 -210 6 100 151 53 -276 -53 -154 -128 -315 28 -231 195 77 -104
2676 -104 -169 -99 98 -195 144 -167 137 -126 -69 -9 -104 -6 -103 235 -79 25 352 142 90 285 207 70 248
2699B48l39J87j70K15j23r6M15l05O9Q8J34k59K5J95j91J69p0J6Pk30L06k69J2
2722C4k09K04k67J27J86o1nj75K69j15Mo9J79k08q3J89k22J56q0J28l55J18J74
2745h1k40K96l68M88k92J55j74K23r2o5Q1l8k6K54j57j74RR9k14L71k70K95n5
2768B5j65K16j73L51l17K70l61K47J44j08j52K5Q0k85N05l58K25J37k86J14l10
2789a76N47o00M58j01j99O7m7R9k12L90l54J78j35j1K89q3Ok50p1K64o8R1n98
2812e16O63o3k59J8N4O0J24q4j60o8R5Lj24K11j73J42P2l13J43J12J2J0Qj31J68
2837Dj2j95L80j70J0J04K03m90N6R0Q4J5k8j68P8K46J1k58J07r2M30m76K16p0
2861G5j95K06N4j09o4L74k80M13m02n8K13k35P4K7j02k45L07k55P7P9l4J61m02
$$ plain form
2699 248 -91 96 -74 141 18 -78 337 32 101 189 323 64 89 284 93 262 192 208 215 -15 291 22 34
2722 34 -175 29 -238 -111 75 14 9 -166 103 -12 -8 -77 102 -106 -189 0 -222 -66 -146 -18 -373 -255 -81
2745 -81 -321 -25 -393 95 -197 -42 -216 7 -85 -150 -69 -107 -133 121 -36 -210 -201 -102 -316 55 -215 80 25
2768 25 -140 76 -97 254 -63 207 -154 93 237 129 -23 2 82 -203 302 -56 169 306 20 134 -176
2789 -176 371 -229 229 128 -71 -4 -51 48 -164 226 -128 50 -85 -96 193 110 116 -134 -205 59 -9 82 -516
2812 -516 147 84 -175 -157 -103 -43 81 -3 -163 -231 -136 -133 -257 -46 -219 -77 -5 -318 -175 -63 -51 -41 -33 -164 4
2837 4 -8 -203 177 7 17 121 324 -166 -110 -20 64 79 51 -117 -39 207 218 -40 67 -25 405 -71 145 75
2861 75 -120 86 140 31 -33 341 61 474 72 14 227 -8 66 93 -9 -254 53 -202 -125 -46 -80 81 -321
2884c21J71J50K4j16J73r9M7j60j15J46o8j31K88j79l4J56P0j07J92k01J22j97
2906a89k1K61J11lj48j41P5P8k79J86N5K13P2J6l02j59J72J11o2J85m15L83j47
2929E2N4M7j0J3k89J48k7K67j64k45J08K0k2O9K19j41J65j97Q4k53Q5M7L7K11
2953B78m01L08k80j44K30J9K29m15N5j13K35j29q5L77m68L07rj8k06J89j77PJ79
2976c2J8o4j9K55m66J69J35l8J11K58k15k83L06k5k38K85m03O46o54N05k04Pp0
2999a6K19o9r4J74n51M87j82M1M2l1J29l5q7P0K65m19L43k65l9K41l20J58K9k1
3023F9j75l2P7j42L11j55O6j85K32j24J37K0j23J08o1Q2l56L74k44P1P9k14L10
3046A25m68J55J52o1K58l75J38q5l6j52L94j15J74J12l43L28l91J13j20K67j82
$$ plain form
2884 -321 -150 0 24 -92 81 -18 29 -131 -246 -100 -168 -299 -11 -190 -224 -68 2 -105 87 -114 8 -189
2906 -189 -210 51 162 159 11 -130 -55 23 -256 -70 -15 198 270 286 -16 -175 -3 108 46 231 -184 199 52
2929 52 106 153 143 156 -133 15 -12 255 91 -154 -46 -26 -48 21 240 99 264 67 151 -102 -17 30 67 278
2953 278 -123 185 -95 -239 -9 10 239 -176 -121 -234 1 -128 -213 164 -304 3 -6 -24 -230 -41 -218 -211 -32
2976 -32 -14 -78 -97 158 -308 -139 -4 -42 69 327 112 -171 135 110 -128 157 -246 400 -254 251 47 54 -16
2999 -16 203 134 40 214 -337 150 -32 9 51 20 149 114 27 97 362 -57 286 21 -18 223 -97 61 90 69
3023 69 -106 -138 -61 -203 108 -47 19 -166 66 -58 79 99 -24 84 23 105 -251 123 -121 -50 29 -185 125
3046 125 -343 -188 -36 -97 161 -214 -76 -161 -197 -349 45 -70 104 216 -127 201 -190 -77 -197 70 -112
3067a12Q4n7J76k74JK30o6lK51k76K08Pp3j85L1J75k8J6k6M6k21L94q2k44K7r0
3093i1N7l4K40j16J23k37q7P3j74K98k58N2RL47M0m15R8P3j5k16J66pJ85k28M3
3118g4J52m02K10k4Q9k30L05l21J97J2O8N9o1J27k55L14l00M0j87J13J91Q7J31
3141B41l47j8N8N1M2k98M16n9n9M9j68M5J01M0Qk8J02k21r6K01J29M3k65Q3P4
3166A24l35L62j44q3N8k9J3N1L75m21J00L5m43J80J18P5j70N1k85L76j60J19J15
3189H2k78O0j42K29l42L84J22m07L29k82J48K1R7R8j76Kk64M57l35J66j31J97
3211C5nO8K6m94K84o6L94m27K83k89K1K19j85M92n72J15k1J09J20j96L23k04L43
3234C73l39M9n3k5J38j57J39j06P0r9K0L14l97RJ1Qj1M55l66j80K04j02R0m04
$$ plain form
3067 -112 -28 -85 91 -183 -182 48 -18 -21 230 -46 162 169 96 -89 -58 117 89 105 79 125 -96 298 216 -28 -1 -91
3093 -91 -34 -68 172 56 179 -58 -145 -72 -246 52 -206 -154 -145 202 242 -173 -75 -2 -17 -233 -67 -74 111 -117 -74
3118 -74 78 -324 -114 -138 -49 -279 26 -295 -98 -86 -18 41 -20 107 -148 166 -134 -94 -281 -168 23 110 241
3141 241 -106 -124 -66 -15 27 -271 145 86 27 76 -92 -47 54 94 102 74 176 -45 -141 60 189 232 -33 50 124
3166 124 -211 151 7 -76 -18 -47 -34 17 392 -29 71 106 -337 -157 -39 36 -134 -83 -368 8 -152 -33 82
3189 82 -196 -136 -278 -49 -391 -7 115 -292 37 -245 -97 -76 21 119 -57 -55 -319 138 -197 -31 -162 35
3211 35 30 98 124 -370 -86 -152 242 -185 98 -191 -170 49 -136 356 -216 -101 -122 -13 107 -89 234 30 373
3234 373 34 83 30 5 143 -14 125 19 89 -10 10 324 -73 -64 -53 -45 -56 399 33 -147 57 -45 45 -359
3258c59M03k81K88k13J53j63N5J55l23L21k12K40q4j20P4j67K20r2L14l23J33
3279A9Nm7j07R5k07J32J18o9J98R3k76P0k42M04l7j08J92k99J16j34K37k03J55
3302A05R2k14j11K45K35m77K32l36L90j35m1J31k29K95o6o6j64K22k34K17r2p2
3324g3L71m67K90n18M99j30j46Q3J73n4j13J08K1j96mM0k3o0J84N4o8J25j7j56
3348g7j79K77J22l0j86L7j17J04k7nL3J8j20j05J78j22J62K50l17L06l82K35l10
3371b55M80l27J69O0k3Ok56K56k28J59J44j05N4k75N7J07N6q9r5J48J15K2n3j53
3395b6p2J70J04j75J41l5j35l31N20n9j60Mj25J49j08J71j07J09l32J98K9p6J99
3418E3o2l7q5Q7j48Q5J44Q8j48j3K03J30m54N1kM7J52Q7k53n6K05p0p6P9J29l17
$$ plain form
3258 -359 44 -237 51 -162 -9 -172 -117 38 -285 36 -176 64 -20 -140 -66 -233 -13 -105 209 -114 19
3279 19 24 -23 -130 -35 -242 -110 8 -61 137 230 -46 24 -218 186 149 41 233 -66 50 -84 153 -50 105
3302 105 197 -17 -128 117 352 -125 107 -229 161 26 -15 116 -113 182 116 50 -114 108 -126 91 -1 -73
3324 -73 298 -169 121 -397 102 -28 -174 -91 82 28 -85 23 44 -152 -156 -116 -139 -199 -15 39 -29 96 79 -77
3348 -77 -256 21 143 113 -73 -36 -153 -49 -76 -81 -48 -30 -150 -255 -77 -199 -37 213 -104 202 -180 55 -255
3371 -255 225 -102 67 127 104 110 -146 110 -118 41 185 80 134 -141 -84 23 79 -10 -105 43 158 180 127 -26
3395 -26 -98 72 176 1 142 107 -28 -359 161 102 -58 -54 -179 -30 -138 33 -74 35 -297 -99 -70 -146 53
3418 53 -9 -46 -131 -44 -192 -107 37 125 -23 -36 167 297 -157 -106 -108 -61 91 178 -75 -131 74 4 -72 7 136 -181
3444a81K65K0j18nK23m16lL90l32K72o2R2k6J50j63k61L18r5K14m16L23J05j82
3467A12L5j85K46k15J53l89K21K37k59L45l82l2r6L11m19L58r5P5q4lK14m53L43
3490C8k20J69m0N3j20J01J39k24L61k98m8l8Q6K13k70J71o4m9K09jl96K76M8j61
3514f5J52j5L5L6j56j7N8O1k35L69l31J78L7k56K93M8j03o1O0K1k61M08k95Q7
3538D8j57K15j5j01l21O7K50r1K27n03N51k46J97j77NJ19m48M88j94N8j0K65l
3561B24j71j33p7O7Q8j58K22j95J78k28J8K41k6m5o5J48j7k73l2R3O7J32k50K21
3585B9j72J77Qk7n8P8l1QJ06j61K3K57j13k46M0J42R5q8l6r5J2j20K22j39K0q1
3611a50J83j46r6K47Po0K10j26k03R1p6k01L97J81m29J47L00m05J29P2q5N7j69
$$ plain form
3444 -181 84 104 -14 -19 204 -212 -215 175 -157 115 53 145 119 269 106 -155 163 68 282 -134 189 294 112
3467 112 147 -38 208 -7 146 -243 -22 215 -44 301 -81 -113 -209 102 -317 41 -54 21 -63 -66 148 -305 38
3490 38 -182 -13 -53 0 -120 -19 120 -104 257 -41 -89 -127 -41 172 -98 73 9 -40 169 168 -228 48 96 -65
3514 -65 87 72 107 143 -13 -30 28 89 -146 223 -108 70 107 -149 144 192 89 28 88 109 -152 256 -39 48
3538 48 -109 106 91 -10 -331 -264 -14 -105 122 -381 170 -76 121 -56 -51 68 -380 108 -86 -28 -38 227 224
3561 224 53 -80 -157 -90 -2 -160 62 -133 45 -183 -165 76 50 5 -60 88 71 -202 -234 -141 -74 58 -192 29
3585 29 -143 34 42 15 -43 35 4 12 118 -43 -20 237 124 -122 -82 60 155 67 31 -64 -52 -172 50 -89 -69 -150
3611 -150 33 -113 -209 38 45 -15 195 69 -134 -43 -119 -320 77 258 -171 -24 276 -129 0 72 -13 44 -125
3634a25Q6L4J25q7q1J4J9K0m1J37k15J71j31Qq8o8K81j75K2N4n7J88k51R8k1J4
3660f9J1Q6L9K47j90k17J67l68M96j10k07J77q0P6k15K34j0q3RJ60j09P2O0j16
3684F0o7P0o4j39L39lj06J29k54jn0N6j31J6K35m8K02l55K59k89r0K71j68J25
3708ck03J49k25L36q9K42q3k61R1j16N0N1k2j15P6J90j89J87l47K35k5j8j96L16
3732C1O2j81J75l76M95j00QJ5j14P8j44K88l52N81m00q8j21M2L87j1j80J54k36
3755A3pM2l7J54n2j95L27jj60q2j08L12o35M71J13K0n9J34r9k24o5J40r8p4L64
3780A94l81J74J95l18k0rK13j39l9p8K92j32k8N2j24J24k0j35K54l08J48Q1L2
3803B8j41o2J95J0j80K61O6k29j14K0N3j7L07j76j07L13p2l5k14K25k34q4J90
$$ plain form
3634 -125 -39 -5 120 33 -48 -34 -15 5 -36 101 -114 57 -74 -66 -154 -222 59 -116 -94 -40 -97 91 -160 -62 -83 -69
3660 -69 -58 28 67 314 124 -93 74 -294 202 92 -115 62 -18 58 -157 77 67 -16 -7 153 44 116 176 60
3684 60 -7 63 -1 -140 199 196 90 219 -35 -36 -86 -30 -161 -145 90 42 244 -111 148 -141 -231 40 -128 -3
3708 -3 -206 -57 -282 54 -35 207 124 -137 -46 -162 -112 -61 -83 -198 -122 68 -121 66 -281 -46 -71 -89 -285 31
3732 31 93 -88 87 -289 206 106 114 129 15 93 -51 237 -115 466 66 -22 -143 -101 286 275 95 249 13
3755 13 6 48 11 165 113 -82 245 244 84 2 -106 206 -429 42 155 175 116 250 151 -73 -138 2 -96 -170 194
3780 194 -187 -13 182 -136 -156 -165 48 -91 -130 -208 84 -48 -76 -24 -148 -24 -44 -179 75 -233 -85 -4 28
3803 28 -113 -175 20 30 -150 111 177 -52 -166 -146 -93 -110 197 21 -86 227 155 120 -94 131 -103 -187 3
3826Ck90K34O9l3J8K22k67K21j44j02K65k18J58m6k0N0r8J0N6Oj23K60k52q5J05
3851aj94K57J0k27j01K88j3N5l8k66L63l53K67q3Q2k21P4K31j56j89j5J34p4J15
3875e5k7J86k34O1j22N1p0J83Q4j35J21L8k17R7lN6k47K52j50K17r2k5n4K12l06
3900a79L13n1k87L56j43Q6j49J41p3j22K09j84J47N3M5q3l79M53j83j20K38j96
3922a08J47J13k5j22l6K29k53J26N2j60j42J37j78J50kJ18Q1k58J1M4Q4r6j5J64
3946F1j07n6K31j90J37k79J9n2J81q4J57j36j40L52j75n9J56r3m9J8r8L0L75n6
3970A43j67n2J01J33M5l15K62L4l33R6L5K40j25K50l29J76k02j02K45j01L77n76
3992a65K29j52R0J77k29J18r1%k70K78L18m48J03j21J76KR7j79J85j82J52p4j40
$$ plain form
3826 3 -287 -53 16 -17 1 223 -44 177 33 -69 196 -22 136 90 70 120 22 32 88 94 -29 231 -21 -106 -1
3851 -1 -195 62 72 -155 -256 32 19 74 36 -230 133 -220 47 -36 46 -175 -101 130 -26 -215 -230 -96 -170 -55
3875 -55 -82 104 -130 -69 -191 -140 -210 -27 57 -78 43 81 -136 -39 -42 14 -233 19 -131 86 -6 -31 -85 127 -179
3900 -179 134 83 -204 152 9 95 -54 87 14 -108 101 -83 64 117 162 79 -300 153 -30 -150 88 -108
3922 -108 39 152 127 5 -31 198 -55 71 123 -37 -179 -42 -220 -70 -72 46 127 -131 -120 -76 8 -88 -103 61
3946 61 -46 -102 129 -61 76 -203 -184 -236 -55 -139 18 -118 -258 94 -81 -140 16 -77 -126 -108 -206 -176 199 143
3970 143 -24 -76 25 158 203 -112 150 184 -149 -53 -18 222 97 347 18 194 -8 -110 135 34 411 -165
3992 -165 64 -88 2 179 -50 68 -23 -23 -293 -15 303 -145 -42 -163 13 15 112 -67 118 -64 88 14 -126
4015a26K12k52K79j66J41q6n7n7J34K0NJ45n2r4o8J37k00M4K6k87J35J77J46o0
4039I6j84M3J81j00l09L41p0J11r2j51K0P5K81k89K52j15m9K74l37M3q7Q2k12
4062a96L22j15j3p7nJ16J54m8p7l3k02J84M7j31J52O3k23J52k61L49j82n6N5K51
4086B26l71POj52K27j67K18k51K23mR8k13O4k5K19k18k7J65j10K3K08j57J11j99
4110i9J58l2l38L40j50K59k35L6k7K43Nk72M89k43n3r9K04QkQ4j46j41J63J81
4134C33m16J08j43O2P3j55P6mq3K41oM0N8k89j15L22m4P0j36J98l31J08L4J18
4158A19j76j02K51o8P7k21J64l3j68q1J5L51k73J57k8K47k18k21K66j94K25j64
4180g5L8O1K56k12j4N2j83J99O1k45J00L0k43m1M52j07j66J1K90l58J14j67L6
$$ plain form
4015 -126 86 -166 113 -53 88 2 -55 -112 22 42 47 192 140 46 -22 115 -85 -41 -15 -302 -167 10 156 96
4039 96 -88 -45 136 36 -273 68 -2 109 17 -134 -114 -39 242 -47 205 90 41 315 -22 21 -66 16 -196
4062 -196 126 11 -2 -79 -84 32 186 138 61 28 -174 10 57 -74 78 141 -82 70 -191 158 -24 -80 -25 226
4086 226 -145 -138 -132 -284 -57 -224 -6 -257 -34 -38 60 -153 -89 -114 105 -113 -140 25 -85 -62 146 -11 100 -99
4110 -99 59 27 -311 29 -121 138 -97 -61 -88 155 160 -112 377 134 81 -18 186 194 192 276 130 -11 152 333
4134 333 -83 25 -118 -56 17 -138 -62 -66 -149 92 86 126 184 -105 -220 102 58 128 -8 190 -141 -33 1 119
4158 119 -57 -159 92 24 101 -120 44 11 -157 -238 -223 128 -145 12 -16 231 13 -208 58 -136 89 -75
4180 -75 -37 24 280 68 54 106 -77 122 183 -62 38 68 -175 -216 236 129 -37 -26 264 -94 20 -147 -111
4203a11L01o4j56r0M5J86k96M76l29K9L4n3L4j65J97j59L58l25J22j0n9q4J59
4226D0L1j37L68o05K52K6Q9K15k14l83L15L9j02K55l56K52j82J40j21oK99j83
4248C2j17K18p8J89n09K48r7j1j3K73k26O4J75j16Qk49KK06J43j34k16L23J22
4271B37k20n7J56k04N6Q4k21o6K72n2J9J01l08J81O5n3J40M3p6n5Nj90J64k48
4295b27J90N2k09L58k35J42q6o9J70Q2k16j14L17k60J50l7J51J44m29P3m3J23
4317B7k1q6O0J2K28k72J31j47K12l8n91N34j51P1k5o5J02L84k80j76J04k43K50
4340B0q0R4pj55K61l32L39j93K53l78J17P4K0l3j77K02N3j46N2k6k5K9N4K1j29
4365i2n5J52Q0j15J73l27R4l1R3P6Q4k04J91L4k13J40k99J49R7r5J49k79M46k49
$$ plain form
4203 -111 190 126 -30 -120 -75 111 -185 291 -38 -9 25 -28 6 -159 38 -121 237 -88 34 24 -35 -119 40
4226 40 71 -66 302 -303 -51 -25 64 279 65 -318 -3 36 -66 189 -167 85 -97 43 -78 -84 215 32
4248 32 -85 133 55 244 -265 -17 -114 -125 -138 135 -91 -27 148 32 40 -209 -207 -1 142 8 -208 115 237
4271 237 17 -40 116 -88 -32 52 -169 -235 37 -15 4 105 -203 -22 43 -10 130 173 97 42 47 -143 21 -227
4295 -227 -37 15 -194 164 -71 71 -15 -84 86 168 -48 -162 155 -105 45 8 159 303 -126 -53 -96 27
4317 27 6 -80 -20 -8 220 -52 79 -68 144 106 -485 49 -102 -31 -56 -121 -19 365 85 -91 13 -230 20
4340 20 -60 34 27 -128 133 -199 140 -53 200 -178 -61 13 33 0 -177 25 78 -68 -16 -42 -67 -38 16 37 -92
4365 -92 -147 5 85 -30 143 -184 -90 -121 -28 48 132 -72 119 153 -60 80 -219 -70 27 -68 81 -198 248 -1
4389ar2J3o5L6K83j09o6Oq5O6j63J88k99K62M6j38Q1m5L06m63J56L14l38J38O8
4414I9Q5o6k09N6J10j65k78M70k10L57k42PLJ67k29n3M54m2m16O7P5l3L4j8J73
4439A96k63M0J91n9j1k06J10L8L4P3m8j45J02k38m5L96P0j62J54l49J5O6J38k09
4463a12l5J98l4p8m8J26n7kJ03k25J13J67k68J4K83j1k90L7M3K09k13J74j06J21
4487A09j86lL5o4K43m30M72j96L5K35j02J8l55m0P7N46l90j13K58p7N0k28K10
4510A04k05J76j54N9k42L57q3r5p3J78K7J66J13l09j57n7L13j18Mj88J78j94M59
4533B59l33J69j10N4j38L8J56k5j95L9O4j6k5M3P1j14J7j68J30Pl3L82l51m5J83
4558E9J12j81r4P2J80k75J01k3p5K50j02N5j64K42j27r0J85j59K05j57O7q7J7
$$ plain form
4389 -1 -93 -80 -145 -109 174 65 -1 5 -80 -14 -177 11 -288 -26 20 -118 -37 -82 224 -239 -83 231 -107 31 99
4414 99 184 118 -91 -35 75 -90 -368 102 -108 249 7 14 17 184 -45 -98 356 314 -102 -35 40 7 41 23 196
4439 196 -67 -27 164 105 94 -112 -2 36 70 143 95 -50 52 -186 -231 165 235 73 227 -122 -107 -41 97 -112
4463 -112 -147 51 17 -61 -109 17 -40 -42 61 -164 -51 116 -152 -138 145 134 -156 -119 -76 133 -80 94 -12 109
4487 109 -77 -80 -45 -109 134 -296 176 -20 15 250 148 166 -189 -229 -152 394 4 -109 149 72 122 -106 104
4510 104 -101 75 -79 -20 -262 95 12 -83 -156 22 49 215 328 19 -138 -195 118 0 4 -184 -6 -200 259
4533 259 -74 95 -15 39 -99 -61 95 70 -125 -86 -22 -38 -63 -20 51 -63 -46 -214 -84 -77 -110 272 -79 -124 59
4558 59 171 -10 -104 -32 148 -127 -26 -49 -124 126 24 79 -85 157 30 -60 125 -34 171 14 81 -6 11
4581A1J29j07n8K21k43O5p7J00l52K93rr0J69p3j36q7K49J44k33K84m54J40K10
4604I6J63k20J24j28J54k24N3r6J15j36M4P4p0K58o7j64j66J64K09l53j0m6J41
4627h5K76l30J89Kj25n2Q0J78k67j7N7M90l52k43R6J19O0l95L92k85J90K30pk46
4651d5j73K14k7R6K2l0o1N5l6J9K69k17O7k05o3OJ22J16L7k07m2J16k36L11j39
4676c1J92k83O5K54p1q3J92m71O1K40o2k57K26%p7L1j2j06L17p6l15K67k93J10
4700a82K54J16k66J07K02m52j9Q1O8L48k92pk6L3J34j89q6M20o5k01J1j12K74
4723A51k65K6RJ88j9r1L84l39P5j52o5l1J40O9o3N9RL26m73O7J05N6m71K33K35
4748A63k98K46J34j81k24L92j51k67J82m9K51k31O1m06J92J02j62K31p0n0j6L55
$$ plain form
4581 11 140 33 -25 196 -47 18 -59 41 -311 -18 -27 -117 52 -21 -157 -244 5 149 -84 200 -254 -114 96
4604 96 259 39 163 35 189 -35 18 -78 37 -99 -55 19 -51 207 140 -24 -190 -26 183 -170 -180 -226 -85
4627 -85 191 -139 50 52 -73 -125 -45 133 -134 -151 -94 396 44 -199 -103 16 76 -319 73 -212 -22 208 201 -45
4651 -45 -218 -4 -31 65 87 57 -4 51 15 34 303 86 153 -52 -115 -109 13 129 166 -41 -83 33 -203 108 -31
4676 -31 161 -122 -57 197 126 43 235 -236 -175 65 3 -254 -28 -28 -105 -74 -86 -192 125 49 -266 1 -292 -182
4700 -182 72 188 -78 29 231 -221 -240 -159 -91 257 -35 -42 -68 -35 99 -90 -176 244 179 -22 -11 -123 151
4723 151 -114 -88 -79 109 90 -1 383 44 119 -33 -98 -129 11 80 17 76 85 411 -62 5 110 166 -305 -72 163
4748 163 -135 111 245 64 -160 232 81 -186 -4 -53 198 -33 28 -378 -186 -84 -246 -15 -85 -135 -151 204
4770B04k1j67m8n6J43k10J39J69j90M7k81N88l14J0K9m5l37N04j78l04N23k02
4792CK9j28K40lj00j18L2Q2K29p2k41P3K97j95K5J02m04j56N03n91Q86m63O1J16
4816B07k43K98k78L80m74K93R5j31l29N32m47N6l7R1q7J04N52n79P4j54J95j79
4838f1m36K90L13l73P17l36l74K33k91L70r9L20k93k62J41Q65K7o91K87k87K5
4859H5P60n58L27m27p3K64m50l69K87L88l53K44n42o2K44J54k67O15l02k71J48
4880a58J47k01P38q96M78K4K71l20l04M03j82k2N9K96k76n52Q71O2j140Q41p70
4901f31J142m56k40L79l06J45o0K08O8j08l12O28n24N5J81k42K83k91J33j45M38
4922C45n87j66M88K2k80J26OM0jm2J4j70O1K35p6O8%J30r6q6K0k0j32L9j3r2J98
$$ plain form
4770 204 183 16 -32 -88 55 -155 -16 153 -37 10 -271 317 3 13 42 -3 -340 164 -14 -318 205 3
4792 3 32 -96 144 141 41 -77 -45 37 266 194 -47 26 323 128 153 255 -149 -305 198 -393 493 30 91 207
4816 207 -36 262 -16 364 -110 183 278 147 -182 350 -97 -41 -78 13 -74 30 582 3 77 -77 118 -61
4838 -61 -497 -207 106 -267 450 114 -260 -27 -318 52 -47 273 -20 -282 -141 724 751 60 347 60 85
4859 85 845 287 614 187 114 378 -72 -441 -154 234 -119 125 -417 -479 -235 -81 -348 267 -35 -306 -158
4880 -158 -11 -212 526 -370 108 132 403 83 -221 182 0 -22 37 333 57 -495 376 438 -702 139 -631
4901 -631 511 55 -185 194 -112 33 -27 181 249 141 -171 457 -67 -12 169 -73 210 -81 52 -93 345
4922 345 -242 -408 80 102 -178 -52 -46 -6 -7 -49 -35 -205 -144 91 15 83 83 213 117 31 51 31 -101 -62 -75 -167 31
4949C1j00O9Q4p8k3j21O2q4P4J79j9N0j57N8J92j65o5J47j52j08M8J03j13J6p8
4974a50K96L7N1l10J65j27j73Q8J70j42KJ81j78K7j77M2J92n2K5J26K5l9J3q9
4998Cj81J64N6j76K27l4k07P7l6R2N2j82J61J23l93J45m2J69J12o5j31K39k65
5021i2K25k79L70n3o7j44J22n9j6l5Q7J1L8j88L02k3j31l51K60Q4k1k32J32K59
5045A99j99J71j20j28N0J64M5j53L9j27j3j98L01M2j29j13O9K01j79R3j13p0J61
5068gK1j51J06J44K2n6r0J20l43J10K07l26J49L26k85J31K64m58j02J3K30O5j72
5091h2K96n07L76k31k9J05J34k14L78l25Q1p3J80Om4J38n7j5k74J48j26L08j01
5114G2l6J77m2N3l76K9k2K47l20K14j81%K56O4K8k9K7r7j56r6L79k46l9M9j18
$$ plain form
4949 31 -69 0 84 6 -17 -138 -76 -160 -86 93 74 124 -33 25 217 52 -13 134 -18 -126 -78 25 -88 -72 -150
4974 -150 146 183 234 -76 89 -38 -211 -123 47 -95 -93 88 -90 -63 -240 -198 -6 -58 -33 93 118 79 92 3
4998 3 -178 -14 42 -134 93 59 -148 -71 -107 -15 37 -145 16 139 -254 -109 -151 18 130 65 -66 173 -92
5021 -92 133 -146 224 171 104 -40 82 23 7 -28 59 70 108 -80 222 199 68 -283 -23 61 40 -192 -60 199
5045 199 0 171 51 -77 -27 137 182 29 68 -59 -72 -270 31 73 -56 -169 -100 101 -78 15 -98 -168 -7
5068 -7 14 -137 -31 113 135 79 -11 109 -234 -124 83 -243 -94 232 -53 78 342 -116 -218 -205 25 90 -82
5091 -82 214 -293 83 -148 -177 -72 62 -152 226 -99 -18 -91 89 95 51 189 132 117 -157 -9 -135 173 72
5114 72 36 213 171 224 -152 -123 -145 102 -218 -4 -185 -185 71 135 163 134 161 64 -92 -188 191 -55 -94 -45 -163
5139a63J76j96P1L21k72R2j9j4j28P4J01k5j00O9p9K7J98j21r0K71p0j10N3j00
5163c4L8K4K4L8j49N8M9j48J1J17J80k82K05nq8q9K23j83j82J64j46J29j21J09
5187e8Q7Q7O9k74J65q0j29K04J45m31L62k93k55L90J34j98q4K84k3l37R7J18M8
5210B8j50K35j85j17M73l46j59O2N32o01M41l0l57O9J08j00P8mJ3o4J58p0m2j36
5234a64K05r9K57j83P0O2j12L1q2N7l0L41n36J63l2l8K29J40m64K94k17J78j73
5257a03r8J36N3J93J89k81l74P01r14N06J41N8J28l95J65j28K00j61N8q9p0K51
5279A66l4p8k93L37k69K93j86lL46m73J004j215N16q6l60O73l07m9O5j77K0m11
5301e21N77J65n48j06L28J061q85N72o38M52M75n87n4J1L42l11n87R63q46m65
$$ plain form
5139 -163 13 -183 -112 209 -63 29 10 -4 -132 -58 43 18 -82 -13 -92 -65 133 12 -78 193 123 13 66 -34
5163 -34 4 28 52 90 -59 -1 48 -100 -89 28 208 -74 131 126 38 -51 172 -11 -193 -29 -175 -46 -167 -58
5187 -58 29 116 185 -89 76 -4 -133 71 216 -215 147 -146 -401 -11 123 -75 -159 125 102 -235 -138 -20 28
5210 28 -122 113 -72 -189 284 -62 -221 -159 373 -228 213 183 -174 -105 3 -97 -19 -23 -10 -74 84 14 -28 -164
5234 -164 41 -58 199 16 86 148 36 67 -15 42 12 353 -183 -20 -52 -90 139 279 -185 109 -108 70 -103
5257 -103 -201 -65 -12 181 370 89 -285 416 -498 8 149 207 335 -60 105 -23 177 16 74 -15 -85 166
5279 166 132 54 -239 98 -171 122 -64 -67 279 -194 810 -405 111 25 -335 338 31 -18 47 -130 -110 -521
5301 -521 56 221 -327 -433 -105 956 71 643 5 457 932 345 291 302 644 333 -254 709 -137 -602
5321f02M28q22J420k20m76l15J130p48O13j40J83p23P90j82n66P82l77k37K48
5340A86M86p53M2L16l43K86k43L3o75O99Q2q1l21O21q3p47M05J02J95L05q43K98
5362c3L14l88M30n65J02j8N6K02n5k02J37R7o08P69l30K91Rl39N47K63q14j87
5384c22m5K02P04n74m5j51q8L66J16l7M1K77o40O26j16r20N12n83L10L99J60l26
5406a34K78KJ00J84m10n5J56j63K60n04P98o29L38J5m20J94k1O7mk17J40L39k89
5429B5J84M5l46J46J88n85J93Q9k50L13L83l33L09k6n97L55K1m5M25j8n88m4K62
5452A06j12k16l08L90L5M32o05P14q59L20o21N30N79l69j31Q9k84J66J03l77Q47
5473D29m10M9M1L32m16O23p77J22K29n14n9L53J61O02l72n6p40O01k54j69L49
$$ plain form
5321 -602 -174 -996 424 204 -272 -587 543 -205 408 268 451 -272 518 336 -230 552 175 -62 186
5340 186 672 -81 -39 277 -66 220 -23 10 -665 34 116 35 -286 335 252 -495 -90 12 207 512 -331 -33
5362 -33 281 -107 323 -242 -140 -158 -102 100 45 -157 -20 77 -531 238 -92 199 208 -131 416 679 -135 -322
5384 -322 -367 -165 539 -35 -80 -231 -319 47 163 126 167 444 -196 430 314 -606 -94 -677 -367 32 192 -134
5406 -134 144 146 246 430 20 -35 121 -42 218 -286 512 -117 221 236 -184 10 -11 56 52 -165 -25 314 25
5429 25 209 254 -92 54 242 -343 -150 -61 -311 2 385 52 361 335 -262 93 114 69 494 476 -112 -156 106
5452 106 -6 -222 -530 -140 -105 327 -278 436 -423 -103 -724 -194 385 16 -115 -26 -310 -144 -41 -418 429
5473 429 19 68 109 441 25 648 -129 -7 222 -292 -351 2 163 765 393 337 -403 198 -56 -225 124
5494A24o66O87n41L25J25K73k36n66K86J01O3K86j44r8j04m81P9J81N13r57J239
5515D89k57k85n05N52k07K20k32O8L04n8K93J83r09L54L05n55J8Q20l56o33Q67
5536D76l74J63m05K47l7k12r2M93j34Qj07P7j89K96k65qm9P5L28m50L64%m52N12
5560B65k83J67K05j52k03k30M92o3l32K43j29J4m3n5J29K29M9m43N8p4P9K49r29
5583g57N43M39k58O98o16J8J58K07j32p15Q4Q88k04P4r93R2L13O58j96m98k11
5604d08N10k44Q17r64L94L83m07J87mn81r9R01p64J81N36J16q22O27m24L63j69
5625A29O6m36K42K93m52k27L2K99J27k13K63L2j24j58J94j83K62l09P7J23k69
5646b32J53J36J4l47J42J14J78l27J63m9O5K27l04J28p9o8R1K83n74L21j05K78
$$ plain form
5494 124 -542 145 -396 -71 54 327 91 -475 -189 -88 -25 261 117 19 -85 -566 -487 -306 207 -750 489
5515 489 232 -53 -558 -6 -213 7 -225 -157 147 89 382 565 -344 10 315 -240 -222 598 242 -391 476
5536 476 102 265 -140 107 70 -142 -234 259 125 133 26 103 -86 210 -55 -63 -112 -37 291 -159 205 205 -247 265
5560 265 -18 149 354 202 -1 -231 261 198 -134 109 -20 -6 -49 -104 25 254 303 -140 -82 -156 -77 172 -757
5583 -757 -214 225 -33 665 49 67 225 432 300 -415 -331 557 353 427 -566 -474 -161 497 301 -197 -408
5604 -408 102 -142 675 -289 105 488 81 268 264 -317 -416 485 -279 -98 438 554 -268 359 -65 298 129
5625 129 195 -241 1 294 -158 -385 -353 -54 73 -140 123 155 31 -127 67 -116 146 -163 -86 37 -232
5646 -232 -79 57 71 -276 -134 -20 158 -169 -6 -55 10 237 -67 61 -18 -86 5 288 -286 35 -70 208
5668B08j72j15K23k99K37l4k69K82k53mM33k37o2J95m5j39k5J88j79rJ72j83K72
5691A85j85j56q8J10J13J12j64r4J98k30J4J89P5k1k21N3N3L17j92j59k06L62
5713F5j93M09r8j91j3j1o7j7K13j97J58j62K19k73K99j57J79O1m21K30k9p1K31
5736A64k10J7p5j5K71k16k6j09K46r2J55q1o1M13m07jR8j51K04j36m5K33L9r8
5760A17l34K1L00J1J9j60j60P9j7K25n6J10l7k90K70k98J45L9L2j59J89n8Q3o4
5784Gj3O5q2J81Q1p0r4K9j08J40j7k16m1L26j48J60k25p3Q8K6P4k49l0J68K10
5809A89m3k73J5P5K53m8j15p0J0K50p2l51Rlj30K55R1k99J94J05j27q9L7K95j79
5834b1m5PL3J23j37J27j00J37k41j41J91O1J42l45K98j81j27J18K37k94J99N2
$$ plain form
5668 208 36 -79 144 -155 82 48 -221 61 -192 -196 237 0 -62 133 88 -51 -76 112 -67 -76 96 -87 185
5691 185 0 -156 -244 -134 -21 91 -73 -167 31 -199 -185 4 79 58 -163 -110 -57 260 68 -91 -297 65
5713 65 -128 281 183 -8 -21 -32 -99 -116 97 -100 58 -104 115 -158 141 -16 163 224 -197 33 4 -67 164
5736 164 -46 -29 -104 -119 152 -64 -90 -199 47 -45 110 29 -32 381 -26 -27 71 -80 124 -12 -57 176 215 117
5760 117 -217 -196 104 115 134 -26 -186 -107 -124 101 45 155 118 -172 98 -200 -55 -16 16 -143 46 -12 71 7
5784 7 -6 59 -23 158 239 169 75 104 -4 136 119 -97 -138 188 40 200 -25 -98 -10 16 90 -159 -189 -21 189
5809 189 146 -127 -112 -37 216 168 53 -17 -7 243 171 -180 -171 -174 -304 -49 42 -257 -63 42 -85 -174 -137 158 -21
5834 -21 -66 -59 -26 97 -40 87 -13 124 -117 -258 -67 -6 136 -209 89 -92 -219 -101 136 -158 41 93
5856I3J05j03K6j48kj21K16J88k25R7j28P8k42L55k1o6j26k5Q7l8j81J05j8J29
5880C5j28j34K49Q2k76J89J2Q4k96K98o7LJ54l24K7L47l73o7K70l39j6L87k62
5903a45J37k50O1K70j11j42K55k10j35K54j32q2N4J33J42k32N6j39J29J04J1M6
5925G4p8j46k5L35j28J3J11o6j24K0M9k3L3Q4k60n6K88j26l17M01n5rnp5J6r5
5951a64R1L6K26l27K64q3n1m4Q1Kl4K15k86L3L7N7J67l00R0k6R8j39J09j8j10
5976g6q6K93k3j88J96k00N7J78j70J36j56J63k35Q2K01k66K82l30M02j21k23j48
5998b32K68NL04l97Q7N5k28J69K17l11q4L16j66K5l3O6j70MJ11p5L01j66k8j8
6022B0j92K94k2m0J01J1k22j79K99o8l0J7k38K84P9m7p2K1j17O0j38K94k54M9
$$ plain form
5856 93 198 95 121 -27 -29 -150 66 254 29 126 -2 76 -166 189 168 102 -24 -49 38 0 -181 -76 -94 35
5880 35 -93 -227 22 104 -172 17 29 113 -183 115 48 51 205 -119 -92 255 -118 -185 85 -254 -270 117 -145
5903 -145 -8 -258 -197 73 -38 -180 75 -135 -270 -16 -148 -230 -176 -43 99 -133 -77 -216 -87 17 28 74
5925 74 -4 -150 -175 160 32 45 156 90 -34 -14 35 12 45 129 -131 -187 101 -25 -342 59 4 -5 -10 -85 -69 -164
5951 -164 -73 -37 189 -138 126 43 -8 -52 29 31 -3 212 -74 -41 -4 53 220 -80 10 -16 82 -57 52 34 -76
5976 -76 -162 131 108 -80 116 -84 -27 151 -19 117 -39 124 -111 -29 172 -94 188 -142 260 139 -84 -232
5998 -232 36 41 345 -52 35 90 -138 31 248 -63 -147 169 3 28 -5 61 -109 -105 6 -69 232 66 38 20
6022 20 -172 122 100 60 161 172 -50 -229 70 2 -28 -11 -249 35 114 67 -5 16 -101 -41 -179 115 -139 -90
6046i0K50k42L55j85k46K10n5R1m6J79p7j46K02j08k00k36N20P8l45j3J65JJ66
6069B28k18p4M8k9K98m86K85j10J62j07j85L00j16J23k29P0M9M7R8k15K1K4J99
6092A83j14n4M9k5j32j13M48m13P7M7N2q4o3J49r6L8j86K36QJ37j34l03L29K4
6116F0Q5j94J42p1L6Q8j73l2l4K23o0j91j79J67K56r9P5j90K50l26K38k24QKr1
6141b34J09lJ3N8K68l67K76l5j5kj46L3O3N3K9P7J33j50o5N9j11r3j28J82j94
6166a90J33j18K64k8j68R6j5J59j47J61j48J57j30k02L50m4Q1q1k35l2R2J4R4
6189F3k66l8K42n4k9P3R2k31M0J09j12Q4J82k15L3l3k7K41j85J2L6j5R6k48RJ58
6215A7Q4o6k10Q5r5pJ88j12J05l8J28o9J18j74J53k09J94j94j99M78j77L4k8L49
$$ plain form
6046 -90 160 -82 273 88 -158 52 -3 88 42 221 144 -2 200 92 -108 -344 176 254 -91 -104 61 62 228
6069 228 10 -64 -16 -45 253 -233 52 -58 104 -3 -188 112 -4 119 -110 -40 9 56 154 -61 -40 -16 183
6092 183 69 15 64 39 -93 -206 242 -171 -94 -47 5 -79 -142 7 -89 -51 -237 -1 7 144 10 -293 36 60
6116 60 145 -49 93 22 58 146 -27 -59 -93 130 70 -121 -300 -133 123 24 99 -91 159 -167 71 -153 -145 -143 -234
6141 -234 -125 -128 -115 -57 211 -156 120 85 70 68 -78 -45 18 71 100 177 310 160 95 154 43 -50 -178 4 -190
6166 -190 -57 -175 89 61 -107 -11 -26 133 -14 147 -1 156 26 -176 174 130 211 130 -105 -137 -45 -31 63
6189 63 -203 -241 1 -53 -82 -9 83 -148 -108 1 -111 -27 155 -60 -27 -60 -87 154 -31 -19 17 2 98 -150 -141 17
6215 17 101 35 -175 -90 -185 -192 -4 -116 -11 -49 79 10 128 -46 107 -102 92 -102 -301 177 0 34 6 355
6239C55k97k46M1KL04j13K8o0j52K37j63l0k22J02J19K01j25K37l06J8J51l09
6261b28J26r2K23p9p6L8M3m8K10j89K3k49J34K49n8m5K3L7O0j71P9j9P8j64j39
6286b34O6k9K09j10R3n8K36j23k49L25J44j56p0N7K50k73Q6k03J62j48P6P2r0
6309C3k25K9J27q2k49q5O00k02K54J69p7m33L44j74R3l17K07K15r0j10J77k88
6331h4Q5m74N48J87o4k94K77J90n86k8Q45o32o72N54o89P99j19N93l87M5o65P10
6353A39L32m51N3J1l06R95j267k5R13l46J46l90O48m93o11N73K98j20J15l46L82
6374B50q9K03L05j97o27P57q12J91m8n2J91k58L6j17M45q2j30L19k09J91l93J99
6396G3r8l02L56j84M79m48K48J79k94Mj07o0K03J18M8o1k47R6K25j37k1L02k78
$$ plain form
6239 355 58 -188 -147 -145 159 46 74 14 -138 99 -64 -94 -316 -214 -95 106 -19 218 -88 -70 81 -228
6261 -228 -102 -194 29 -50 -126 -88 -45 -93 117 -72 -49 -298 -164 85 27 -18 5 42 102 -69 10 -9 69 -95 -234
6286 -234 -168 -197 12 -98 -5 -63 173 50 -199 126 270 114 44 101 351 78 164 -39 123 -25 51 123 33
6309 33 -192 -163 -36 -118 -367 -452 148 -54 200 369 292 -141 203 29 122 -195 12 227 137 27 204 -84
6331 -84 1 -473 75 262 198 -96 181 371 -215 -243 602 -30 -702 -148 -837 -38 -157 436 49 94 -571 139
6353 139 471 20 73 84 -222 773 -494 -519 394 48 194 -196 452 -41 -652 -79 219 99 214 -132 250
6374 250 161 364 669 472 -155 602 -210 -19 -67 -119 72 -186 -150 -267 178 96 -34 285 76 267 -126 73
6396 73 -25 -327 29 -155 324 -124 124 303 9 13 -94 -154 49 167 215 154 -93 3 228 91 70 372 94
6419I4J92l21K58j12l27m5K60L60n08J63J7J44n7r7mj05J17k40J39J61j54K09
6441A44j34K7O7j44q9M18k01l53J65O9P5j42N2J67K11j89k72k38J05m4L63k4r5
6464f2K92n64K94J56j46r1K05r5oJ06j43r1J26Lm4j4o7K83m14L59l71K87M5Mm2
6489A0K01j04p7O8j19q0J6M6J06jj63m7J55j04J12L1Ll08l7L13O4q3M3k05K84
6514A24n2O1O6o4j95J45K57l52j49l3L12j38R2j90K52J17k87J32J2N8n8j3K39
6537C36l83K1p8J29j89J54Q9R6Q6k30j6L04k89j09N7k42N02k54K28k02j31M13
6559B92l95K90l07J97j60Q4o7K01L4n68N50k48p79R13n14N08M49o5l24o6n38K02
6581c11j41N01L26n51L41L04r15L85N97m64R3j81J83l92m07Q07m48q2J89Q4J44
$$ plain form
6419 94 286 -35 223 111 -216 -261 -1 359 -149 14 31 175 118 21 17 -88 29 -211 -72 89 -65 144
6441 144 10 37 104 -40 -129 289 88 -265 -100 -31 44 -98 -46 121 332 143 -129 -367 -262 -306 57 33 -62
6464 -62 230 -334 -40 116 -30 -121 84 -11 -17 89 -54 -145 -19 -16 -60 -74 -141 142 -272 87 -284 3 48 52 10
6489 10 211 107 30 98 -21 -101 -85 -39 67 66 -97 -144 11 -93 19 50 53 -255 -292 21 85 2 45 -160 124
6514 124 72 133 199 135 -60 85 342 -10 -159 -192 120 -18 74 -116 136 253 -34 98 110 168 110 97 336
6537 336 -47 -26 -104 25 -164 -10 79 175 261 31 15 319 30 -79 -22 -264 238 -16 212 10 -121 292
6559 292 -103 187 -120 77 -83 1 -66 135 169 -399 151 -97 -876 37 -477 31 480 415 91 25 -513 -311
6581 -311 -452 49 375 -176 165 469 -446 -61 536 72 165 -16 167 -225 -632 175 -273 -355 -166 -82 62
6602F2n81L75M97l42j7O4L00o70L93m4j12J59j27L49k17j88j78M63m1k96L61k89
6624g9j06J24P1k75K98k24L08j58J50k5nl75K05Q1j14L43l60K79l24K26r5J25
6646G0o0R2k2k6k21j7J60J1L0J99l68J73J47k66o8K26J7j3n1k45R6J61k90M20
6670A55ok26k77K61kq3L14j07j55J32J02r3j8J63j33o4q3k2M19q7k58J45k80K53
6694E0N7k04L32k46P4k09J55mJ14Nk15j80L82J2k78J72J8j87L54rk44J13l18K37
6718a9j75J91Q7n5k15J88L26k06R8q3j95Q6J74m22R1J46N5m11J87J84j98N8k4
6741a32Q9J90l64J91j50J02J39l15P2K38N8k52J55J42P2j29j72Q9j81J55j18J34
6763A3K47k33k26Q3K44o0j75J43j37j57K99P9O8k6l65K19l2j86N5J80l5ln4K04
$$ plain form
6602 62 -519 -144 353 11 -6 58 358 -312 81 37 -75 84 -43 306 89 -99 -277 186 145 -151 210 -79
6624 -79 -185 -61 10 -265 33 -191 117 -41 109 84 79 -296 -91 -10 -124 219 -141 138 -186 40 -55 70
6646 70 10 102 80 54 -167 -184 -24 -13 17 216 -152 21 168 -98 -166 60 77 64 13 -232 -136 25 -265 155
6670 155 149 -77 -354 -93 -95 -178 136 29 -126 6 108 15 -3 160 27 -37 -120 -142 277 190 -68 77 -203 50
6694 50 107 -97 235 -11 63 -146 9 5 119 124 -91 -271 111 123 -155 17 35 -152 202 193 -51 62 -256 -19
6718 -19 -194 -3 84 29 -186 2 328 122 220 137 -58 28 202 -220 -129 17 72 -339 -152 32 -166 -108 -132
6741 -132 -43 147 -217 -26 -176 -74 65 -250 -178 60 118 -134 21 163 235 106 -66 23 -158 -3 -121 13
6763 13 260 27 -199 -116 128 68 -107 36 -101 -258 41 120 188 162 -203 16 -16 -202 -147 33 -2 -5 -59 145
6787A45J00m49L08j32o7K36j99J33j55J02o0J26k01J12o1J8J2j57L30j07j77J51
6809HL01k69r6l2J37k15n0L58j44K17l0l03K09m16L63Oj56J47R0J23k13k5L9o2
6833a3j64L35k90K06q5K57l1j63q8Q7k24J73K03k62K4L4K0rp3J77j49M0NNK69
6858B84p86P74l96L86K5m33J65l2j56J4L33k82N26q31M67J97k87j82O94j97o72
6879c89L81k83K94J9K9lk63L33k00n1K20j88P0r2N0K45J0j25n0L13m79K50N2J25
6903B68l64K37M7q56J188k28m92n3Q08n55R9k42J53k3J75k40J01Kj60L06k37j19
6925a85L45q9k58P7K03k11J29j06j51L67o5q5P9k89L97k98J69p2N7N5o0k19J35
6948g5j33K90l3j15J9j2k00J57J73n7j87J87m%j1L5J82j91M5Q5j81J07Q6j54r
$$ plain form
6787 145 245 -204 104 -28 -95 141 -58 75 -80 22 -38 88 -113 -1 -62 -44 -32 -189 141 34 -143 8
6809 8 309 40 -56 -88 49 -166 -216 142 -2 215 185 -118 91 -325 38 44 -112 35 125 248 35 10 49 -13
6833 -13 -177 158 -132 74 -11 246 215 52 -36 51 -173 0 203 -59 -35 -1 19 10 -63 114 -35 5 10 15 284
6858 284 -502 272 -124 262 287 -146 19 -13 -169 -155 178 -104 422 -409 58 255 -32 -214 480 283 -389
6879 -389 -8 -291 3 22 51 48 -215 118 -82 -133 87 -101 -31 -123 -73 172 182 57 7 320 -159 91 143 268
6903 268 -96 141 188 -668 520 292 -200 -253 555 0 99 -143 10 -13 162 -78 23 25 -135 171 -66 -185
6925 -185 160 71 -187 -110 93 -118 11 -95 -246 121 56 -29 50 -239 158 -140 29 -43 14 69 9 -210 -75
6948 -75 -208 82 49 -66 -47 -59 -259 -102 71 14 -173 14 10 10 -1 34 216 25 70 155 -26 81 167 13 4
6973DQ3j62J66j08J99k71J68J36j45j99J15J79k78k93L56K18R7l83K83j7l35L20
6995A33N1l13L29j97qO9j64O3K07k14J0J46j08K32k43m7N9J7j19k5L2K35r1q5
7019c1M6J77j88j3k58J40q3J82J56n4Nj7P5j0q8o0l8K04kl20J76J47r6R4k5J5
7045A34r6K0k03n4K53J35k54Q8M8q8J15J23l22O0k17L28m8L63j11k23J33k11J61
7068A34k04k0P5j70K33r3j31J93k28J19M0J04j11R9P2k75K98r3J06M8l0k04N4
7091A6Q6j01l4r2J31k6L9j01j41Q6l4K49M9j38L7K8o7P9l1N5J09j80n3J30k30
7116a34N0l7k62M46o4n9J24k12J17M1o3M9k0K06j92M1k58K20j22P8q7K03r7m2
7140g4J89M2j91q3N24n80j1K58k21K02j64J54K0j34L49l09J40n0j29J22j31K00
$$ plain form
6973 4 87 -75 91 -17 182 -89 79 215 70 -129 -14 165 -113 -406 -50 168 265 -118 165 148 -187 133
6995 133 184 -129 200 3 -5 64 -100 -37 170 -44 -34 112 4 236 -7 -54 5 22 -97 -122 -90 145 54 -31
7019 -31 15 192 4 -9 -267 -127 -210 -28 128 74 79 62 137 127 39 -21 -59 145 143 -177 -1 146 50 144 119 134
7045 134 38 58 -145 -199 54 189 -65 23 71 -17 98 221 -101 -41 -258 70 22 385 274 51 184 -27 134
7068 134 -70 -90 -15 -185 48 -45 -176 17 -211 -92 -52 52 -59 40 112 -163 135 42 148 196 166 -38 16
7091 16 102 1 -33 -125 6 -20 19 -82 -223 -137 -171 78 127 -11 26 54 -13 66 35 90 199 19 -34 96 -134
7116 -134 -84 -121 -383 63 -1 -60 64 -148 -31 10 -53 -4 -24 182 -10 31 -227 -7 -129 -51 -138 65 -32 -74
7140 -74 115 157 -34 -117 407 -173 -184 74 -147 55 -109 45 65 -69 280 -29 111 61 -68 54 -77 123
7162A23p5ok17J36l1J26k73J27J57j06n8J68J31j91J62m0k72o7J49L83l80K05
7184A51J47l97J09j66L0m0K5L75k40m0n6Q5p2J22N6q3n3J93q6n5K2j30J46p2R3
7209F4j99J5P8mm3M4K13j57j9P2j86J22O8lL6j97lQ1N0k2J25n5o1j20p4J20J59
7236A04j20jj5J04j54k4M10j17Kj34r5K03k80J68k19Q3J34j01J16L4q9N8m14K19
7260a28o5K79j09k9j13J18O9R0Oq6j86K85k28K59j6k97L25P4r0j02p6kJ21j25
7284b6L0O3p1N5k46J69K71j66M2l28J87M1n8O3QOl7M0K01m02J45J5K8R5j48J28
7310A05j50M0N5K8j05Q4R5J10n67L35j5n0J57k94R6p5J02n0J14N7r8j75K84J85
7334B68j89m5j17N9R5r7O8L7J43o7l73O6J33J9J93j56r6j67p1L47m0K6Q1l08K68
$$ plain form
7162 123 48 42 -175 -39 -70 56 -217 -90 67 -39 -97 71 202 11 173 133 -139 -206 -57 326 -54 151
7184 151 298 -99 10 -156 -126 -166 -141 234 -6 -46 -102 -17 -89 33 89 6 -47 146 60 5 27 -103 43 -29 64
7209 64 -135 -120 -42 -46 -89 -45 168 11 -8 64 -122 0 68 65 101 -96 -99 -18 32 10 135 80 19 -101 -175 -55 104
7236 104 -16 -17 -32 72 -82 -106 304 187 189 55 -40 163 -117 51 -168 -85 49 -52 64 98 9 67 -347 -128
7260 -128 -193 86 -23 -52 -165 -47 22 112 118 32 -154 131 -97 162 146 -151 174 248 158 56 -20 -22 99 -26
7284 -26 4 67 -4 51 -195 -26 245 79 121 -207 -20 21 -37 26 34 40 3 43 244 -158 -13 2 30 125 -23 105
7310 105 -45 -5 50 78 -27 57 152 262 -305 30 15 -35 122 -172 -76 -151 -49 -99 15 72 -26 -201 83 268
7334 268 79 34 -83 -24 71 -26 42 79 222 155 -218 -152 -19 0 193 37 -59 -226 -297 50 10 36 117 -191 77
7359G7j02oJ73M5j73m8J9K4p3J53J51k53j28R7J24Q4j76k70J38j61L39j03J10
7382D1J35j73J22j55r2J77k84J90K47j07J52k66rO2k24N3M7O9Qj57j25L72K1k31
7406a27n2J21J47o9j51J54N1j74K1K4J32Oj08n0J31j63L45j37q3k14K25K9L6m2
7430E2J21j19j12L6n9R4J41N5k79J70j1l2O0N0n7j32P9j00j54J41J49N5l04J7
7454a39K26m14K77J52j52j8o3J27q5K5J92j65j98L76m73O25l02p3L35k86Q1n8
7476a0j45K8N81o54L31l21J08L12r6j78o1J00N2j75j58K06q4N01l36K12l52J84
7498D5l02L86k17R2k0K3J36k53J67nQ5m6k79K16rO8K2L3j46k18L44j1p3q3m0J50
7524F5M9l57J79o4K72k12o4R4J91j86k5l02K11j44L85l4mj13n04J48L14J24l6
$$ plain form
7359 77 -25 -31 142 187 14 -34 -15 9 -64 89 240 -13 -141 -44 80 164 -12 -282 -144 -305 34 -69 41
7382 41 176 3 125 -30 -122 55 -229 -39 208 101 253 -13 -22 40 -184 -131 -84 -15 -7 -164 -289 83 104 -127
7406 -127 -179 -58 89 20 -131 23 74 -100 -79 -55 77 83 -25 -75 56 -107 238 101 18 -196 29 58 94 52
7430 52 173 54 -58 -22 -81 13 154 209 -70 100 89 57 117 167 110 -22 57 -43 -197 -56 93 148 -156 -139
7454 -139 87 -327 -50 102 -50 -68 -131 -4 -89 -64 128 -37 -235 141 -332 293 -9 -82 253 -33 48 -10
7476 -10 -155 -127 454 -200 131 -190 -82 230 134 -44 -105 -5 47 -128 -286 -80 -164 337 1 213 -139 45
7498 45 -257 129 -88 4 -16 7 143 -110 57 52 137 91 -188 28 19 87 109 142 -4 -222 122 111 38 -45 -85 65
7524 65 114 -243 -64 -128 144 -68 -132 -38 153 -33 -58 -360 -149 -293 92 58 54 -59 -563 -415 -101 23 -13
7547a3K37k09n3m8l08L62J37l03L86k58Po6j29K00J4m6K1J26J47k37oJ9K4m3J84
7572A45k99J19k41K73k1P5n9j74J60j10L17m74K53K35k25M2j65L26k35p5K51l97
7594b79N37j41o7k10K11K96m97K51J2M6k93K13l98N65k54L1M0j3j38J16Q3k13
7616a02O8l9n7K44K08k29j66J10j2M9O1k27l7l1M07l55J65l9N1J89k92N1LJ61
7640A81m51J66R7OJ87k13j32l45N07Q4n9Q7k66R9K79l63J46K33k46JJ34q8o9o0
7664h5J58k06K16J5j54J91q5n2J61j69Q4K38n76K45p8K75l21M2K08L0k63P7n8
7687a07J08j86N61o98M62j23N1o1l08L11j8Q7j87N5k1K00j28K93l28K0J24k01
7709i4p2LP6N0J70j92%p1L7N20m14N7o4O1m8k63J87J85p0m1j64J67J76q4k9P0
$$ plain form
7547 -13 224 15 -38 -86 -394 -32 105 -198 188 -70 -63 -129 -258 -58 -44 -90 -69 57 204 -33 -39 -20 4 -39 145
7572 145 -154 -35 -276 -3 -24 51 -8 -182 -22 -132 185 -289 -36 199 -26 16 -149 177 -58 -133 118 -279
7594 -279 258 117 50 -160 51 347 -150 101 113 159 -134 79 -319 246 -8 23 63 50 -88 28 111 -102
7616 -102 -34 -73 -130 114 322 93 -73 37 25 74 135 -92 -129 -160 247 -108 57 18 69 258 -34 17 20 181
7640 181 -270 -104 -7 -1 186 -27 -159 -504 3 87 28 115 -151 -52 227 -136 10 243 -3 -2 132 44 -25 -85
7664 -85 73 -133 83 98 -56 135 50 -2 159 -10 74 312 -264 -19 -97 178 -143 -101 107 137 -126 -49 -107
7687 -107 1 -185 376 -322 140 17 68 7 -301 10 -8 79 -108 -53 -74 126 -2 291 -37 -17 107 -94
7709 -94 -166 -163 -87 -37 133 -59 -59 -130 -93 427 13 70 6 67 19 -244 -57 128 58 17 -147 20 196 112 83 153
7735A53j59OM2Lm8k4K7j6k5o8J06L1r3r7L67m58J62o5R5J0J58l8J97k41n5k8n
7762f3K38j8K0l06q5R9K48l41Q9J72j18Q5k16N8L32m0O3k06l0J56j51j9l5P5k54
7787b47L01j48J47m5O4pj33j09K72j66L52k05j43J47p7r8j61M25j56J18m42O58
7809C47n1j09n34N45l95M55j34j46j50P3K53q0l09J29M2R6K54j72l38K19K90k97
7831a2J81L99j140M25r1M64l67J45k25N91j251J023J14j34n8o56P24l5p0l08P46
7852D65n46j45K22o45J095k06k87M39k09j10K72Ln4j41l29K86k79J53P5J35k81
7873h7J23K37P2n16j79K21P25p71q7L29M4R75p39q91M51Q16M0m74k03P48o06k74
7895d6M33p6l84N2K76n3k78M07L43r56J49L59p85J036j97k95L77m0J49j274N11
$$ plain form
7735 153 -6 0 42 45 -3 -27 0 -16 -41 -109 -3 28 -65 -162 205 -253 -91 -156 -61 -51 107 69 266 25 -30 -58 -63
7762 -63 175 157 177 -129 -214 -115 133 -208 -119 53 -65 20 -196 -138 194 154 217 11 -19 137 -14 -33 -68 7 -247
7787 -247 54 -94 53 8 72 65 -68 -177 95 -71 281 76 -67 80 3 -95 -256 169 13 131 -311 347
7809 347 296 187 -347 198 -197 258 124 -22 -172 -99 154 74 -235 -106 -64 32 286 114 -224 -5 285 -12
7831 -12 169 568 -572 -147 -238 226 -141 4 -221 370 -881 142 256 122 64 -592 132 97 27 -281 465
7852 465 -81 -226 -4 -649 446 240 -47 392 183 73 345 348 294 153 -176 110 -169 -16 59 194 -87
7873 -87 36 273 345 -171 -350 -129 596 -175 -262 67 111 1086 347 -544 -93 723 763 289 86 834 228 -46
7895 -46 387 311 -73 -21 255 202 -76 331 674 -282 -133 226 -559 477 280 -15 362 322 471 -803 -292
7916b92J40K32l98K07N44j6l2j034Q47n80M66n25O87o11LJ075n40K08m83N9m98
7937e41M61K56j26j28J20k08M20j43J57m10O06q65N46j21j00p4K03j03L97j09
7957B38m4k55N25n54K79j71n6K04J99p6l00L40k42k22k66L10K86j74j51P40o06
7978DJ77m98K46J67l25l43O54l67R35r12k50M95N32l94o25Q3l2M95J11J26n12
7999b33K71o21P91L0l32k99K72n7L09l08L14J37m37J49j82O01m62kk98P10k4l48
8021a9l88O14q34P73j14N31l1k55m28J74o47N30j24Q09o04k85O8L01l37k84P19
8042A69l87l46J40M46J81l09Q2J11K08k36J96M94m97l2n19J38O32p10j44Q2n02
8063h03N50l83O68k23K42m87Q72j092Q45m68j05n9L66P40n43j86l87M82j16n5
$$ plain form
7916 -292 -152 80 -318 -111 433 417 385 -649 198 -382 84 -441 246 -365 -362 713 173 381 -102 -43 -541
7937 -541 -80 176 50 -78 42 -166 254 111 268 -142 464 -401 145 24 -76 -150 53 -50 347 238
7957 238 194 -61 464 -90 189 18 -38 166 365 289 -11 329 87 -135 -401 -91 195 21 -130 610 4
7978 4 181 -317 -71 96 -229 -572 82 -285 650 -262 -512 -17 515 121 -504 -421 -453 42 153 279 -233
7999 -233 38 -583 208 238 -94 -393 -121 -178 131 -177 137 274 -163 -14 -196 405 -57 -59 -357 353 329 -19
8021 -19 -407 207 -627 146 32 563 532 277 -151 23 -624 -94 -218 591 -13 -298 -230 71 -266 -550 169
8042 169 -218 -564 -424 22 203 -106 -24 87 295 59 255 749 252 220 -299 -161 471 -239 -383 -301 -803
8063 -803 -253 -636 32 -191 51 -436 436 -656 189 -279 -384 -443 -77 663 120 -66 -453 29 -87 -142
8083a42o68M45J081j031r1K55rK00k61K04K09k76j11k33P15L86q86M98J55l37
8103A03n57N9K83K04J49r40M29K17P1K6q9M59j36l36m77J65Q6J224j110K98k09
8124h1J04L81o09l8K32j39l42R26j79n78M43K80O8o21K68L78j025R07k56m90L24
8145d7K33k01q0n8j55n4L93k88K26P13r74L19q9R1J95j33k64J02K4j15N72m98
8167h8L9j18l4j01N5L6j15J05j17L60J67j77j37P5J08n1k6K99k04j32j15k21J31
8190b61K81
$$ plain form
8083 -142 -810 -365 716 -315 -406 -151 -160 40 -221 -17 192 -84 -195 -428 287 673 -213 285 440 103
8103 103 -454 -395 -112 92 241 -699 -270 -53 18 44 -45 414 278 -58 -535 -370 -284 940 -170 128 -81
8124 -81 23 404 -205 -243 -11 -150 -492 434 255 -323 120 400 468 -153 115 493 -532 375 119 -371 -47
8145 -47 186 -15 -95 -153 -308 -362 31 -257 -31 682 -292 27 -62 29 224 91 -173 -71 -47 -162 410 -88
8167 -88 -49 -167 -201 -302 -247 -211 -326 -221 -338 22 189 12 -125 -50 58 7 -19 280 76 -56 -171 -392 -261
8190 -261 20
8191B0
$$ Imaginary data points
##PAGE= N=2
##DATA TABLE= (X++(I..I)), XYDATA
0@%%%%%%%%%%%%%%%%%%%%%Kj0J6j6J6j6J6k1K9l2L2l7M5n0N8o6P2q1R1j01J14
42F1j28J42j56J73j93K12k33K57k83L11l42L77m15M58n08N62o24O97p81Q81j002
63e34J152j347J610j987K599l863J5729j9249J0127P60q280Q285l984l095M333
78B256J806j1721J5270j2087M107K542n913M217j969Q50m019P692q637M319K135
93H48o811P205n055K892l578N431n637L319J651o206P118m514K302j801L500m152
109c488K805R95o068J0204q567M037R99k352J322J515j493j485O525q727P383
124C605k700j776M425l583K178j643K892m287N002l107r5L356m893L902k584K534
140C226l098K444j659j2K450m488M327l174J527j862K163j482q57K867m811M583
$$ plain form
0 0 0 0 0 0 0 0 0 0 0 0 0 0 0 0 0 0 0 0 0 0 0 2 -8 8 -8 8 -8 8 -13 16 -16 16 -21 24 -26 32 -34 38 -43 48 -53 61
42 61 -67 75 -81 92 -101 111 -122 135 -148 163 -179 198 -217 241 -267 295 -329 368 -413 468 -534
63 -534 618 -729 881 -1106 1493 -2370 13359 -5890 4237 4997 -3283 5002 1018 -2077 2256
78 2256 4062 -7659 7611 -4476 -369 2173 -3740 477 -1492 -642 -4661 3031 -5606 -1287 848
93 848 -5963 1242 -3813 -921 -4499 932 -4705 -1386 265 -5941 1177 -3337 -1035 -2836 664 -3488
109 -3488 -683 312 -5756 4448 -4119 -82 917 -1435 -113 1402 -91 -1576 4949 -3778 3605
124 3605 905 -871 3554 -29 2149 506 3398 -889 4113 1006 911 4267 -626 3276 692 3226
140 3226 128 2572 913 901 3351 -1137 3190 16 1543 -319 1844 362 -495 2372 -2439 2144
156B144l178M74P15p10q55Q82N82l201M807n137K953p1k077K261j282L79o82J897
174i9l280L166j584n41K398k782K379j663J581j415J459j052K59J273j857K718
190I60k565K399j788J238J58p17J717j588J778j818J693j297J800j291J13J670
206B462k841L149k452J490l25Q9m12N34L82j920L014l667K569r89n67J087j271
223C32J146j723J888k644K364j640L41O22k113K321k329K304k291J493j413L35
239a007O59j690K758l445K998k792J807m43j040K234k786K789k512K064j653J275
255g84k66p20J982l267L929k997K379j102K91Q87j457K143k713L554l001K302
271A160q45n54K151l036L362k828K718k221J514j74r10K315l051L384l602L131
$$ plain form
156 2144 -1034 -560 155 -555 -1410 -528 54 -3147 1660 -3477 -524 -595 -2672 -411 -1693 -1314 -1996 -99
174 -99 -3379 -213 -1797 -2338 60 -2722 -343 -2006 -425 -1840 -381 -1433 -1174 99 -1758 960
190 960 -1605 794 -994 244 402 -315 1402 -186 1592 -226 1467 170 1970 679 792 2462
206 2462 -379 2770 318 1808 1483 1572 1160 1694 2076 156 3170 -497 2072 1083 516 1603 332
223 332 1478 -245 1643 -1001 1363 -277 64 686 -1427 894 -1435 869 -1422 71 -1342 -1007
239 -1007 -348 -2038 720 -2725 273 -2519 -712 -1155 -2195 39 -2747 42 -2470 -406 -2059 -784
255 -784 -1050 -1770 212 -3055 874 -2123 256 -846 -555 332 -1125 1018 -1695 1859 -1142 1160
271 1160 315 -239 1912 -1124 2238 -590 2128 -93 1421 1247 337 2652 -399 2985 -617 2514
287B514j595L55O97j978K683l414L132k778K147j291R2J092k808L721m153L186
303A602j979N25R5j067J634k437K882l609L280k543R82R22k472K552l122L275
319E20k706J796q27O1Q29k062K999l749L324k211J179j00p16J809k109L025l047
336a985K344j712Q79O33j363K755l204L209k873K107n38l04J217j604K136k618
352i21L139k702J722j29r08J768k374K691k577K244j488P17J18j098K036k701
368d63K740k502J683j232L85P00j639J664j844J982k035J358r76j94J044k056
384a385J983k005J782j269N03q8n86P57j454J854k112J798j279N14l0n96J203
401d10j552J803j368J278j134M90K85p89J689j799J750j145R72k45l29N90o78
$$ plain form
287 2514 919 1274 1971 -7 2676 -738 2394 -384 1763 472 564 1656 -1152 2569 -1584 1602
303 1602 -377 148 243 -824 810 -1627 1255 -2354 926 -1617 -635 287 -2185 367 -2755 520
319 520 -2186 -390 -1217 -1156 -327 -2389 610 -3139 185 -2026 -847 -947 -1663 146 -1963 1062 -1985
336 -1985 359 -1353 -474 159 -1204 1551 -1653 1556 -1317 790 252 -52 1165 -439 1697 -921
352 -921 2218 -484 1238 1109 201 1969 -405 2286 -291 1953 465 1182 1300 202 2238 -463
368 -463 2277 -225 1458 226 611 1311 -328 1336 -508 1474 -561 797 -179 -373 671 -1385
384 -1385 598 -1407 375 -894 -391 -479 -1065 -308 -1762 92 -2020 -222 -1501 -987 -1017 -1613 -410
401 -410 -1962 -159 -1527 -249 -1383 -893 -608 -1397 292 -1507 243 -902 70 -175 -504 86 -592
418e92J247j405J816j652J508o42j80P40q72J280j177J281j085J067l96l38Q71
435A471j221J400j554J287p69M74q3k15M09j028J191j349J400j477P48j63o65
452a44O31q97J085j216R35r28L11K38q18R82j348J499j494J106n84oJ65q27J009
471c01j756J774j403J401p67j22O01p90J318j611J533j174R23k58l27Q33j189
488a315J606j460J851j479R45k33o0J038j470J768j620J633j230P83J17j013J745
505A606j844J925j791J203l00n1M47r43J390j928J995j805J263m36n02J249j856
522c78J934j820J215j022O47j70r66J454k074K184k276J637p70l9O10j472J850
539E44k059K126j975J188l90o51J410j956K135k241J825j247Q89m22m80J465j949
$$ plain form
418 -592 655 -750 1066 -586 922 280 100 840 -32 1248 71 1352 267 1334 938 600 1471
435 1471 250 1650 96 1383 614 1088 1005 790 1199 171 1362 13 1413 -64 684 521 -144
452 -144 487 -410 675 -541 394 -534 -223 15 -803 179 -1169 330 -1164 -58 -642 -648 -483 -1310 -301
471 -301 -2057 -283 -1686 -285 -1052 -1174 -573 -1363 -45 -1656 -123 -1297 -374 -632 -959 -126 -1315
488 -1315 291 -1169 682 -797 148 -85 -145 893 -577 1191 -429 1204 -26 757 874 -139 1606
505 1606 -238 1687 -104 1099 799 748 1195 252 1642 -286 1709 -96 1167 731 229 1478 -378
522 -378 1556 -264 951 -71 576 406 -560 894 -1180 1004 -1272 365 -405 -444 166 -1306 544
539 544 -1515 611 -1364 -176 -566 -1217 193 -1763 372 -1869 -44 -1291 -402 -824 -1304 161 -1788
556a788K300k221J780p30P0N99j058J696j878K019k065J581l69l79J270j888K437
573A376j989J797j313Q18k2m36J328j932K125j741J481j033J88N35j115J807k125
590b51J965j751J298n44l65Q74j518J541j797J494j117O95j96n63J031j517J466
607G45j430J153j075K83J95p18J171j567J485j259Q11o69o4O96p37J120j604J512
625D8j612J082j63k77P90j281J501j412J317q26L81M2k88R91j231J372j299J173
643C08n34L80K00o15J240j263J255j066J008m94m1M38l36O29j056J134q77P77
661A087o04J52P1l20Q34r49P04q56M35r1k52L25m60O35p02M92p46L70j14l04O96
682D03q65P91j057Q44o35M08m93J30Q5o29J157j196Q70o17J16K36m06M87p06O15
$$ plain form
556 -1788 512 -1709 71 -659 -589 10 -1048 648 -1230 789 -1276 305 -64 -443 827 -1061 1376
573 1376 -613 1184 -129 689 667 231 1559 -373 1752 11 1492 459 647 1182 67 1874 -251
590 -251 1714 -37 1261 717 352 1226 -292 1249 -548 946 -171 524 328 -235 796 -721 745
607 745 -685 468 -607 -324 -129 -847 324 -1243 242 -1017 -206 -875 -939 -243 -980 140 -1464 48
625 48 -1564 -482 -645 -922 -132 -1413 88 -1324 -7 -833 -452 -410 -698 293 -938 434 -865 308
643 308 -226 154 354 -261 979 -284 971 -95 913 419 378 816 480 1109 53 1187 310 1087
661 1087 483 635 706 386 1220 271 975 119 554 463 211 536 76 711 9 501 -245 125 11 -293 403
682 403 -462 329 -728 116 -519 -111 -604 -474 -389 -1018 139 -1057 -187 -804 -688 -452 -858 -371 -1077 -462
702d62o66Q83j002Q60k77j30Q96j174J175j115J180n72J73J04k01Q55j275J047
720B99o37O53m09K36L16o68J045r12J330j162P72l09l62R69j066J206j360Q72
738H13p24P78j85m48Q78j307J465j144Q14p42P6L74j000J342j647J453j153O36
756B79l41k86O03j192J634j714J387r14L73j61n27R25j087J326j544J259q47K38
774e89L27q83J183j436J499j268Q76j78j9L66q66J195j268J652j609R07j46l24
792e81J200j246J428j312J114p98M63L62r78J508j687J515j145R37m17J46P35
809A244j303J398j492J333j234Q28k14l78R25j425J518j653J430j068M72L93r33
826a59R12j143J229j300Q90o12k1Q92j491J352j599J515j251P47k12m43P54j161
$$ plain form
702 -462 -1128 -245 -1247 -387 -664 -794 102 -1072 103 -1012 168 -404 -231 -127 -328 527 -748 299
720 299 -338 315 -94 142 458 -210 835 -77 1253 91 863 554 192 1161 95 1301 -59 813
738 813 89 867 682 234 1112 -195 1270 126 940 198 274 648 -352 990 -657 796 -357 279
756 279 -62 -348 255 -937 697 -1017 370 -544 -171 -332 -859 66 -1021 305 -1239 20 -827 -589
774 -589 -262 -1145 38 -1398 101 -1167 -291 -469 -488 -122 -988 207 -1061 591 -1018 -111 -257 -581
792 -581 619 -627 801 -511 603 -195 268 630 -348 1160 -527 988 -157 780 363 509 1244
809 1244 -59 1339 -153 1180 -54 774 560 182 1107 -318 1200 -453 977 -91 381 774 -159
826 -159 753 -390 839 -461 429 -183 -204 688 -803 549 -1050 465 -786 -39 -251 -694 60 -1101
844a101J179j362J266q88M65L1o02P44p01Q17o58O30m33M36L9o58J246j326Q82
863Fo29Q40r4m14O11q24J102j217J332q59N28j12k60P41q20J087r84P72o37L49
883E18m8q7P88j176J045r35N21l76J19J56k64Q42j337P81n46M64j54k99N33o80
903a35P51r16O53o19O51l83j97L52o31O90o21K51o16O69l10M2K9m33P27q17P47
924a16m56Q1M0k09K69k97N58o29N64n11N47k12o6O48q37N00l72O49m38K48P4k74
946b39R07q25P49n73M69l13K9L61m47P36q32P71q27O05k23O6L50o28Q02r50J084
967A072p37J68j23j71O36q17J089j435R68o41M48l14k74O77r09Q35q37O56l57
986f6%Q8l38L51j296J589j205P16j07n22O68j036J402j312J158r27N12j87k66
$$ plain form
844 -1101 78 -1284 -18 -906 -441 -410 -1012 -268 -969 -152 -810 -180 -613 -177 -138 -796 450 -876 6
863 6 -623 217 123 -291 320 -504 598 -619 713 -146 382 270 10 751 -69 1018 34 806 169 518
883 518 470 383 1171 -5 1040 105 626 250 369 525 261 1103 -234 547 1 465 311 12 545 -135
903 -135 616 -300 353 -266 385 2 -195 157 -474 216 -405 -154 -770 -101 -411 -369 -340 -773 -46 -863 -116
924 -116 -572 -491 -451 -660 -391 -688 -130 -759 -195 -706 -159 -371 -437 211 -626 -126 -498 151 -287 -39 35 -239
946 -239 668 -157 592 19 488 175 204 565 118 854 22 793 -34 571 348 414 764 136 938 -12 1072
967 1072 335 503 380 209 845 28 1117 -318 650 9 457 143 -131 546 -363 472 -365 291 -66
986 -66 -66 22 -316 35 -1261 328 -877 -161 -268 -790 -122 -1158 244 -1068 90 -837 -325 -512 -778
1005g78R90j252J230j005J029p59L99L3m87P19r78J449j233R66o28O1N09p74J225
1024G16j124J122j160J099l58j23P40j234J391j342J058p59N85k53l23Q57j200
1041c08J448j093Q58p39J71J45n79Q00r75J281j191M83l47N6M35j004J234j133
1059d58P35q48L57K25n24P62r28R42j201J180q15J86J38o59J105j109J107j114
1077i19Q57l31k32N84q37J045j025J024r45O83k20q7N27n89R62p90O92p96L01
1096i6M30p22P80o21J090q95N50k19J0L44o99J011j094Q44o25L04j12J03M49q30
1116BP90q27R21q62M62l08m46R57o85O18p16N15m48K03J70p22O25o06M15o81O20
1137cj42pJ2l82P29j038P67m94N01k76j89M21o59M94o12O67l44K26J22j69K90
$$ plain form
1005 -778 212 -1040 190 -815 214 -545 -146 -113 -600 119 -859 590 -643 323 -305 -244 265 -509 716
1024 716 -408 714 -446 653 295 172 912 -322 1069 -273 785 26 611 358 35 892 -308
1041 -308 1140 47 905 166 337 482 -97 703 -272 1009 -182 301 -46 10 445 -559 675 -458
1059 -458 277 -571 -214 11 -513 249 -679 263 -938 242 -573 -387 -249 -908 197 -912 195 -919
1077 -919 -62 -393 -625 -41 -878 167 -858 166 -779 -96 -316 -403 124 -465 497 -293 399 -397 -96
1096 -96 334 -388 392 -229 861 -34 516 297 307 651 -48 963 -131 713 88 392 280 383 832 2
1116 2 792 -35 886 24 486 178 -268 689 4 622 -94 421 -27 176 346 -376 249 -357 58 -623 -3
1137 -3 -145 -152 -140 -522 207 -831 -64 -558 -57 -333 -522 -101 -760 -266 -878 -211 -555 -329 -207 -376 -86
1158h6m46N45o39O89n73O37k48j01J87k43M73o08O74l84L03O8k47N92r54Q81n06
1179A4M73l99K78l9m9L71n10M07o15Q44k71j79Nj17O00j045N71n66P28l20j4J87
1201C54m56M58o57M63n52M93k21OL78o91M28m01O74o62k9NJ14K73l22M96r43P42
1223e0l52K31J07l74M23p24R71q88N76l44K90P9n58P50p57P40n83O29m48J59L54
1244B31o74P01m79O62m07N18l53k25P44r65P64m63O93m89j5K21m44Q72q51P75
1264H16q07Q33n48N8K74p36J092j107P73p17N05j73l46O45p54P36q90Q03p84L33
1284FL26o50P81j102R99j070P55k43k22N24q58J042j175O98m83O52k72k40M80
1303e2p61R42q29P33l05J6Q9l06N86o34O38m73N44l00J3K73n66P23q73P58l64
$$ plain form
1158 -86 -532 13 -626 63 -510 127 -121 -222 -35 -278 195 -413 261 -123 180 248 1 593 -361 520 14
1179 14 487 88 366 327 278 649 139 546 -69 775 504 325 330 213 813 -232 339 -227 501 181 167 354
1201 354 -102 356 -301 162 -390 103 -118 -112 266 -425 3 -398 276 -386 -415 -410 -296 -23 -345 151 -792 -50
1223 -50 -402 -171 -64 -438 -15 -739 232 -656 -80 -424 -134 -55 -613 137 -620 120 -463 166 -282 -123 231
1244 231 -443 258 -221 441 34 552 199 -26 718 -247 517 54 747 258 243 464 20 892 41 816
1264 816 9 842 294 352 626 -110 982 -125 648 -69 436 263 -83 562 -192 544 -346 457 -327 6
1284 6 332 -318 463 -639 360 -710 45 -198 -420 104 -754 288 -887 -189 -672 -20 -292 -532 -52
1303 -52 -813 129 -700 33 -272 -256 -167 -473 113 -521 117 -356 188 -112 -99 174 -392 331 -542 216 -148
1324a48M24j39R2K10q22P08p27R97o85M89j40J48J30l94M43n78M51k99K13R1n27
1345f3P26p79R07q46K20K1j32N21r00Q68q06N89n76L49j88n4J91l99L20l93N16
1366I2l98K58p4k96L20m66N95m38K22M0k99K35k41K66l91O56m43K02l67J83O5
1387b79N9M41o12O68n10K73l08J46M31p24N85l05L71k48K21r2M2Q1%L08l24L01
1409E25m56K81O7m02M86m39R1k30Q79p53K43j7k08L93l02K55m63L69m24K36K0
1430A51l38L60l37N29r15O70l67J41N7j58L34n75L30k53K61r1j98K53k86K88k90
1451d34M55o55O96k99m7L86o35N93q15Q53k23k9l2P4J87k29L30l77M45m44M25
1472B25j85j49N52o99N38m84L62J00k51O59o40O02p94N89j51L14k08O3k9l46M99
$$ plain form
1324 -148 276 137 229 439 -383 325 -402 595 -90 399 259 407 537 143 586 8 459 160 373 464 -63
1345 -63 663 -116 791 -55 165 186 54 575 -325 543 -263 326 -250 99 -89 -143 48 -351 -31 -424 92
1366 92 -306 -48 -122 -418 -98 -564 31 -407 -185 -145 -444 -209 -450 -184 -575 81 -362 -160 -527 -344 -279
1387 -279 -220 221 -391 277 -233 40 -268 -122 309 -415 170 -135 236 -12 209 117 159 240 240 548 224 525
1409 525 69 350 417 15 501 62 153 -77 802 49 292 275 67 460 158 413 -50 319 -105 131 151
1430 151 -187 173 -164 365 -550 120 -247 -106 -49 -207 127 -448 -118 -371 -110 -201 -399 -146 -432 -144 -434
1451 -434 21 -634 62 -237 -284 102 -533 60 -755 98 -125 -154 -186 -112 75 -154 176 -201 244 -200 225
1472 225 40 -109 443 -256 282 -202 160 260 9 668 28 630 -164 425 274 588 380 443 414 68 567
1493E67p35O58n22J36L66o06M53m36O02o59M14m68Q6K74l98Q15r85N26l80K95
1513Cl11M5L1l47J009j076O68o09M33M1j54J82n06Q65q16P17l12m2J57l73M62
1534F7o55P38m70K94j65l37N12k04O51j022R29l98nK76j59L4k31P54q79O70j54
1555B46qj46L6O70r06P73o30K31j76K29p6K11L60j546J052l15L27O34j519M15
1575a38O80m61m92P69j80j85Q5l00O69n54J85l72K83q5J9N9m83P63q11O65m56
1596c40K20k13%K24l59L79o08O37l81J53J72l69M92k48J15j51L75m64K4N24o65
1617d83N66m60O14k11Pk11K35J82j57J21k87L81j14Q2r5J14J58m53O28q25P63
1638E55o08L52J23k37L48l68M1k9L38k20l7j78L8K22l45J51n1j14nj43K48l85
$$ plain form
1493 567 -168 490 -32 104 470 -136 317 -119 483 -176 238 -230 -144 130 -268 547 -438 88 -292 3
1513 3 -308 -263 -232 -579 430 -646 22 -587 -154 -113 -267 -85 -591 274 -542 175 -137 -179 -22 -395 67
1534 67 -588 150 -320 -26 -191 -528 -16 -220 431 -591 338 -60 -65 211 52 86 -145 609 -270 400 246
1555 246 238 92 128 798 -108 665 35 266 90 319 243 454 814 -732 320 5 332 966 -553 -138
1575 -138 542 81 -411 358 178 -7 78 -222 447 -107 78 -294 -11 -96 -77 -18 -501 262 -549 116 -340
1596 -340 -120 -333 -333 -109 -468 -89 -697 -60 -441 -288 -116 -485 7 -241 -126 -277 98 -366 -342 182 -483
1617 -483 83 -377 237 26 33 -178 57 239 82 203 -84 297 183 265 170 284 442 -11 617 -208 555
1638 555 -53 299 422 185 533 165 206 177 515 295 258 80 118 340 -5 146 95 -19 -24 -167 81 -304
1660c04L95k17L88l48k0k41J65M36n61K08j4K36l62L35l50k2O6k99N39n75N42
1681cn87M24J11L4J66n93M08k75L82l32K98l24k1M86l51N40o52M16m3m2J63j57
1703D8K27l32M59l72L22p1K2j42pL26m30L73n21M83k10O3j02j14N42o78N86n44
1725g2K55k25L6M00n46M55k78L07l90N1l0k65L20n09P57o34L30j41k4J31l48M75
1747E5p48P39q01O26J60k71K45n01P41p12M89p52O42j41k20N54n50O35k91K16
1767A15l48K08J15j46M07l21L41o20P38m86K42J10o90O93o24P67m24L23j25n4
1787B21J12k87M23p12O76m38K05O3k42N37q25O53l36J95l82J66J15J5J57m67L22
1808A71l03l0j01J70J17m17N62m29K41k70L10j42l46M25n88O69l90L27k81q7K45
$$ plain form
1660 -304 91 -126 262 -86 -106 -347 -182 254 -307 -99 -113 123 -239 96 -254 -276 -210 -509 30 -545 -3
1681 -3 -590 -166 -55 -21 145 -448 -40 -315 67 -265 33 -291 -312 174 -177 363 -289 127 84 42 205 48
1703 48 275 -57 402 30 352 281 303 161 154 480 50 423 -98 385 175 238 136 22 564 -114 472 -72
1725 -72 183 -42 -6 394 -152 303 25 332 -58 -7 -37 -302 18 -491 266 -368 -38 -179 -203 -72 -420 55
1747 55 -693 46 -755 -129 31 -240 5 -496 245 -467 22 -730 -88 -229 -449 105 -445 190 -101 115
1767 115 -233 -25 90 -56 351 30 371 -249 489 3 245 355 -335 358 -266 501 77 400 275 221
1787 221 333 46 469 -243 433 -5 200 263 21 558 -267 386 50 245 -137 29 144 159 316 -151 171
1808 171 -132 -162 -263 -93 24 -393 169 -260 -19 -289 21 -121 -467 -42 -630 39 -351 -24 -305 -392 -147
1829a47l85M57m40P11n83L95k14L6K90l71J95j68L22l86K27j97J58J58l57N18
1849B19l76K3j0K66L9Q1L75p77N61n15L09j12k91N46k43K97k85L59n69J68N0Q2
1871A97P8j81P8k82N35m47J25o8Qn8j97L73m07N50l59J62j95m3MO9k8j41K47j81
1895a61l66L21j96K0L0K7n79K67O41n87P07J44n67j55R13n83M24K01m38K07m31
1916a61L37M52j92p57M12K22o99O61m75K01m6M47l85J36J26r0j06j60M45n16O55
1937E07l57Jj12p4L24k49K53k52N52n10K74j68J1K44o70O04o53K88k68J87K08
1958A40j37L59o13L86m41K80Rj87J00j31L65m88L87k95K48j20j16l6n8K77j84
1979b55M23n91L41R2l23L38m05M31l15L09j43p1qLO29q22N16m08J64K35j71K19
$$ plain form
1829 -147 -532 -75 -515 196 -387 8 -206 -170 120 -251 -56 -224 98 -288 -61 -258 -100 58 -299 219
1849 219 -157 -134 -144 122 161 242 617 -160 401 -114 195 83 -208 338 95 392 107 466 -103 65 115 197
1871 197 275 94 172 -110 425 -22 103 35 43 -15 -212 161 -246 304 -55 107 -88 -131 -127 -58 -86 -227 20 -161
1895 -161 -527 -206 -402 -382 -352 -325 -904 -637 4 -583 124 268 -299 -454 459 -124 300 501 63 270 -161
1916 -161 176 628 436 -321 91 313 -386 275 -200 1 -45 402 17 153 279 189 83 -77 368 -148 507
1937 507 150 151 39 -35 289 40 293 41 593 83 357 189 200 444 -226 378 -275 13 -255 -68 140
1958 140 3 362 -251 135 -306 -26 -17 -204 -104 -235 130 -358 29 -266 -18 -138 -254 -290 -348 -71 -255
1979 -255 168 -423 -82 10 -313 25 -380 51 -264 45 -98 -169 -177 -174 455 -367 149 -259 -95 140 -31 188
2001A88l48L73j56K40l32j24L20m18M03j02L15j18k2l59L86Rj76L14m48M09k61
2022I3L07k48j53lj00L18n77N16m19M88k22J51j5m06P88p91N08n46M3M70n13M45
2044A34l55L35m88K18J3k1N7n90R79p14P97n94L00J07m44L97j014P42o96O82n18
2065f73N84M08m43L20q53R03j86L37n16P2J45k12N42n96N97l17L56k47k34L51
2085C38k41K85n84N54k48J3J97k25n2o3K16j28J64k83j45N40l16L70m66J88m13
2106b99O31l24K9K6k02N11o67M95l77J61j13OK01l75L02m70K27L5k3J81k60L54
2128D9k45M6l02K77j42K67O1n21N19k42L72k66L22k69m5j3R4K9k99N42j78J51
2150B07K0q2j55Q3M12l37K49l63M23l69k34L06N6P48l20p74P00o68R77j120Q22
$$ plain form
2001 188 -160 213 57 297 -35 -159 161 -257 146 44 359 241 219 -140 246 255 79 393 -55 354 93
2022 93 400 152 -1 -4 -104 214 -363 153 -266 222 0 151 136 -270 518 -273 235 -311 -268 202 -311 134
2044 134 -221 114 -374 -156 -143 -164 -107 -697 282 -432 365 -229 71 178 -266 131 -883 -141 -837 -155 -673
2065 -673 -89 319 -124 196 -657 246 60 397 -119 -47 98 -114 428 -168 429 112 468 221 -13 338
2085 338 97 382 -202 352 104 117 314 89 37 -26 190 62 226 -57 -202 338 22 392 -74 114 -299
2106 -299 332 8 37 63 -139 372 -295 200 -177 -16 -129 -123 78 -297 5 -465 -238 -203 -226 -45 -305 49
2128 49 -196 -150 -452 -175 -317 -50 11 -510 9 -233 139 -127 195 -74 -119 -132 -38 -9 -308 234 56 207
2150 207 227 145 -10 73 485 148 397 34 457 88 -146 160 216 964 644 -130 570 -98 879 -241 581
2171E81q0r4j50K3j127J491m84K42j067J143p86l17O38R88o77j19k11O8j37M47
2191C72o17P65k36j131J352q07M94m42l16q4J014o43r9L12j84l6J25L89j44k8
2211E6k12K12k63M50Q7M44k54q11J43J293j280k06N32J81p66O52q35R34k79J36
2231B14M63o99K98m00j85O98k23K30l54J6J25j88N83K6n60k81O48k07J08n04M54
2252B62m80k60L32M89p4j220J104k15m25K28Q61j033N88p09N17J47o88R66m34
2271d4Q3M7q61O44l37K11n0J01J12Qk88K21M30o50N49m29K11M46j84m4m40J77
2293h7k61L71K07n23J39k47N04j81L82k46K65j18p3J7rK12o29M28o25O03K99m07
2315B1K03j13M75n60P5qj01L63m48L72k52J66m20N09o7j3J78m90K43l19j99K3
$$ plain form
2171 581 501 407 257 280 -847 644 160 402 -665 478 -308 -625 13 1001 324 205 -6 62 -75 372
2191 372 -245 520 284 -847 505 -302 192 -250 -566 -650 364 -279 -378 -66 -250 -286 -161 228 84 56
2211 56 -156 56 -207 243 330 774 520 -291 -148 1145 -135 -341 191 372 -394 258 -577 357 78 214
2231 214 677 -22 276 -124 -309 389 166 396 42 58 183 -5 578 604 44 -237 411 204 312 -192 262
2252 262 -218 -478 -146 343 269 -951 153 -62 -487 -259 602 -431 157 -552 -35 112 -576 390 -44
2271 -44 39 86 -775 -131 -468 -257 -307 -206 -94 -86 -374 -153 277 -373 176 -253 -42 404 220 176 -264 -87
2293 -87 -348 23 230 -293 -154 -401 103 -78 304 58 323 205 132 149 140 352 -277 151 -474 129 428 21
2315 21 224 111 586 26 101 93 -8 355 -93 279 27 193 -227 282 215 202 380 -110 133 -186 -385 -362
2337c62N45r7n64M46j62L2j17J20k38M96R3k71n8r5J5l05nP3M46Jl36M59m02K59
2361b7J59j46r4R5Q3m08L11Q2j93k04K54J8j00M89m69j17L71P9p2L3L79m01K25
2384C47K42k2p81K21j39k11N02Nj90k35O18k3N34q14J4N38j006L05j09L34Q8L0
2406B48k42l89M95P15o99p98J074J89R0q35K98o45L9R1K86k55o9R4M16j184J591
2427E10r66O48k8k5J70M5j89Q6r5n80J011j096Q43j98O02j213N86L19j48m66M
2448a80K56J40K6p4n07J2j3R1J044r34K85L92J51o03n8O11k21p79J95o6Q95n14
2470A49m44R24o78q7M4K86J80l95Q7n95R15m79M20K56n25m2M0J72l21K49k47J56
2492F5m77K98J72m67L61k42M37l24n5L7m88O99k92M30n47L14J38m78L21j11L00
$$ plain form
2337 -362 183 86 -478 -32 -194 -162 -279 -159 -397 99 192 -79 -137 -232 -217 -522 -527 -454 -8 -7 -343 116 -286 -27
2361 -27 132 -14 -108 -13 70 -338 -27 55 -138 -342 -88 -70 -170 319 -150 -267 104 183 111 144 523 122 347
2384 347 589 567 -214 7 -132 -343 159 164 -26 -261 357 334 868 54 68 606 -400 -95 -204 130 218 248
2406 248 6 -383 112 827 128 -670 404 593 683 -152 146 -499 -460 -369 -83 -338 -407 -313 103 -1081 510
2427 510 -456 192 164 139 309 354 165 251 156 -424 587 -509 334 136 738 -475 111 430 282 -184 -180
2448 -180 76 216 242 168 -339 -327 -340 -249 795 -139 146 538 689 86 28 639 418 -361 -166 -232 663 149
2470 149 -295 629 -49 -136 -92 194 374 -21 66 -529 386 -93 327 583 58 16 56 228 -93 156 -91 65
2492 65 -412 -114 58 -409 -48 -290 147 -177 -232 -195 -683 16 -276 154 -393 -79 59 -419 -98 -209 91
2513I1l46O40k81j36K07m57M31j00m1l10N47m50L40K36m36K97k89L06k25K65r4
2534A95J74j67l68K85k19L24j99M90n93P6K55k50M17j88p1q6N4L7j51J37l55L19
2556A16MPq2j76J21j5J83l92M53j96L2k16L5J60k74N77q41M91l28M52m18L72j36
2579g1j88K66r7J08j74N5j94J98l2k12N0K26K70k09K1J0k09N22n27L72j67J05
2601A23r7J27Q0j46J94j99Kj0K50k70J3K63n6J0m24J62M4r9l0J18M6k1K78l80
2625b2J39m4K66k95J70K4k64J93j78k2j42J42j21J45j33J45N1n18O14k79K38j88
2647g9j48R2r1J44j9j03N4P3K56l18R7j52L40k91P2k6L03k74j52J89j65K33r9
2670f4K30j77j67M39m12P6j3K92k64L87r3j90k9j95N98l95K0k9J12J61l60L56
$$ plain form
2513 91 -255 385 104 -32 175 -282 149 49 8 -302 245 -205 135 371 -65 232 -57 249 24 289 195
2534 195 369 202 -166 119 -100 224 25 515 -78 -2 253 3 420 232 161 75 129 166 15 152 -203 116
2556 116 120 127 45 -131 -10 -25 158 -234 219 23 55 -161 -126 34 -240 337 -504 -13 -341 111 -307 65 -71
2579 -71 -259 7 -90 18 -156 -101 -295 -97 -129 -341 -291 -65 205 -4 17 27 -182 340 -187 185 18 123
2601 123 26 153 233 87 281 82 84 74 324 54 67 330 274 284 -140 22 66 -33 -63 55 101 80 358 -22
2625 -22 117 73 339 44 214 238 -26 167 -11 -33 -175 -33 -154 -9 -142 3 54 -464 150 -129 109 -79
2647 -79 -227 -135 -226 -82 -101 -204 -150 -77 179 -139 -42 -194 146 -145 -73 -99 204 -70 -222 -33 -198 35 -64
2670 -64 166 -11 -178 261 -151 -75 -88 204 -60 327 234 44 15 -180 418 23 43 14 126 287 -73 283
2692B83l25R1K9m5J01j37K47j95J61j60N5j16J22j66p7N45n99K57pj36OJ3j0N5
2716hJ06k94O6RJ59j02N3K6j20J57l49L41j74j03P2j86K74j04K41l38M04n32N22
2739A20Pk58J18j38J51J00l32J08K34P7j01Q9k75K34n10N33Nj42M07m10J39l23
2761a67L06n5K44p6j31j3n6R9k47N2Q8Q9J20l17J81ro6q1J34kJ75k23k14M09l51
2786a11K99k99l6l5J75m5j03K17l23O0M2J12j49j80L90m26O09l22M9J70k02J70
2808F2k73J09L7N4O8j5J88k23j12p1K86l63K21j51K53k57L17J64m52K60lJ6l8
2831G7j48P0n9K44j37Q8L5J60j55J95l35J49l0N9m3o0K52m57m1Q6L5K11j30K05
2855B71l13l9J1L25j04l09j7J12N3n0K18j19o1m3o8J97k28K93m36O8J32J01k0
$$ plain form
2692 283 -42 49 78 33 134 -3 244 49 210 50 105 -11 111 -55 -132 413 -186 71 64 -72 -66 -53 -63 -8
2716 -8 98 -196 -130 -121 38 -64 -11 15 -105 52 -297 44 -130 -233 -161 -347 -73 -177 64 -274 130 -402 120
2739 120 127 -131 -13 -151 0 100 -232 -124 110 187 86 175 -100 134 -376 157 162 20 427 17 156 -167
2761 -167 139 84 328 252 121 108 52 151 -96 -44 44 133 253 -64 117 108 42 -39 95 93 268 45 -169 240 -111
2786 -111 188 -111 -147 -182 -7 -52 -155 62 -261 -201 -159 -47 -196 -376 14 -412 197 -125 -76 94 -108 62
2808 62 -211 -102 -65 -11 57 42 230 7 -105 -176 110 -253 -32 -183 70 -187 130 294 -158 102 99 115 77
2831 77 -71 -1 -60 184 47 135 170 330 175 370 35 184 154 213 170 110 362 -95 -136 -50 -15 196 66 271
2855 271 -42 -81 -70 255 151 -158 -175 -63 -10 -60 158 39 -22 -65 -133 64 -164 129 -307 -239 -107 -6 -26
2878b6k66L35l8q6LjR6J1N1k66J86k36J27n3p7L18k96N14l40p4M6J11Ll10M92
2903B24j82P6j96K03n4r8K66l09J06O9J89k08L2r9J16P8j12J3k94L24l42L99k43
2926d2J79j75R8K70l78K55l59L76%k80J84k12j08k8K26j94P4p0J08N5j41J52l34
2949c44J55j1K42j9j05K29l08No4k4n1J25m6J1K45k52L33j93J75k40m6K45J38
2972B00m3k72J64j73L03N1n15L30K8J11Qj48L1j68K26k07N07k72j7k30j4rJ14
2995EK71l83L67l46K00k18K74k73K41n1l53J75P4K39n04N23k50r2L4r5K10p6J15
3018H7kp4J7j19J08k44L93m01J23O1J9k6k92L84k39J63j30KL02j31K8k31L05j23
3042b0K09l11m4N4J26N1j27j0k12M03l04K64n7m6L89m57K17k54M51k54K2j92K02
$$ plain form
2878 -26 -292 43 5 -81 -78 -79 17 28 79 -187 -1 -237 -110 -163 -240 78 -218 296 -44 -118 -72 39 42 -268 224
2903 224 42 118 -78 125 71 -27 239 -70 36 105 294 86 118 19 135 213 101 114 -180 144 -198 201 -42
2926 -42 137 -38 60 330 -48 207 -152 224 224 -56 128 -84 -192 -220 6 -188 -114 -184 -76 -21 -162 -10 -344
2949 -344 -189 -200 42 23 -82 147 -161 -156 -220 -244 -295 -170 -216 -205 40 -212 121 -72 103 -137 -183 62 200
2972 200 157 -115 49 -124 179 230 -285 45 73 184 192 44 75 -93 133 -74 433 161 144 -86 -100 -109 5
2995 5 276 -107 260 -86 114 -104 170 -103 138 87 -266 -91 -17 222 -282 241 -9 -101 -67 -162 48 -28 87
3018 87 85 11 28 -91 17 -227 166 -235 -112 -51 -32 -58 -350 34 -205 -42 -172 -170 132 1 29 -202 103 -20
3042 -20 189 -122 -166 -112 14 65 -62 -72 -284 119 -185 79 22 -24 365 -92 125 -129 322 68 90 -102 100
3065A00K83n04L87l34p6K49k64L44j21K56j04j94m8J9qk14N39l09J83j42n0K1
3087A3j8K7j16R6r7N2l02L15j71k1L40m23K17j18K67j57P1k32M81k21n5kj06J2
3111a48J89q2P3l7j56j49K73j3k09K21M4k6K05l79K99J55j64K54l13K48k32j20
3133f7L15j06rj42J93k02j8N3J22K3k77J58j04M9L5O8L8J66k21j72L39k30K18
3156B29Ll75J87j93KJ97j72P5j48J81pJ07m77L29k75N58l41j44K15JJ60k11K57
3179A58l05P0k37K10p4l3M56k81j18J94K09k86k8K06j07K39l77J96l72K98J6p1
3201c7J49r4K52j52O8j66J22Q0k80J94k45M12l75J97n3L0Q8k05L71l70L4J0J97
3224B27j50j82J17p6L36j75j04O5j22L2j55M04k77j3L3L5J61m24L09n6l3k04J59
$$ plain form
3065 100 383 -121 266 -68 -144 105 -159 185 64 320 216 22 -26 -7 -15 -229 310 1 184 42 -8 13
3087 13 -5 22 -94 2 -95 -43 -345 -30 -201 -222 118 -305 -88 -206 61 -96 -25 -257 224 3 -52 -54 -160 -148
3111 -148 41 -41 32 -5 -161 -310 -37 -50 -259 -38 6 -20 185 -194 105 260 96 350 37 285 53 -67
3133 -67 248 142 133 -9 184 -18 -36 17 139 162 -115 43 -61 -12 23 91 129 295 74 -98 241 11 229
3156 229 232 -143 44 -149 -147 50 -122 -47 -195 -14 -21 86 -391 -62 -337 221 -120 -264 -49 -48 112 -99 158
3179 158 -147 -77 -314 -104 -178 -211 245 -36 -154 40 249 -37 -65 141 34 273 -104 92 -280 18 34 -37
3201 -37 112 18 270 118 186 20 142 222 -58 136 -109 303 -72 125 72 102 190 -15 356 -14 20 30 227
3224 227 77 -105 12 -64 272 97 -7 58 -64 -32 -187 217 -60 -73 -40 -5 156 -268 41 -15 -48 -252 -93
3247i3J62R6j2j32K1j13k2j02K50j77J48Pj33j61r9M71l19K40j2k5K8k68K71j04
3271g8nj4J75l0P5j19M3J14k41P5K5o7J80q0J6j10J51j29Q2k35J85Q9k24L39j66
3296E1K16j95Qk36J55Q9j09P8k86K50j25m1M0K57m02Q7R9j6K80k25O5j44P8Q7
3320F1j78j11J28j29N4R0o7J94o8k61M64m94K93j46K43j53J31k11L4R1p8jK13
3343I9k16J59k28J41L1K11r3j75K70j60J41j86J44k95j06K75j87K75j53M84l11
3364A20j9o4r3J29PpJ71l01o0P4K56o3j91P5n2J86J32l90K28n5j05L56l91J26
3388F9k22M40k90k42J66J98k46q1J4p8K98l79M26k70M9k2L01o5k04K11k08K48
3410A13q7r5J45j69R7j16J36k31J84l8J50j63L1J2Q0M2j48J30p4L3K40o08N69
$$ plain form
3247 -93 69 165 153 21 42 -71 -93 -195 55 -122 26 33 -100 -261 -360 111 -208 32 20 -5 23 -245 26 -78
3271 -78 -83 -97 78 48 123 4 47 161 -80 -5 20 -47 133 53 69 -41 110 -19 63 -172 13 102 -122 217 51
3296 51 267 72 80 -156 -1 88 -21 57 -229 21 -104 -145 -105 152 -250 -163 -64 -80 200 -25 40 -104 -26 61
3320 61 -117 -228 -100 -229 -175 -85 -152 42 -26 -287 177 -317 -24 -170 73 -80 51 -160 -126 -35 -113 -114 99
3343 99 -117 42 -186 -45 -14 197 104 -71 199 39 180 -6 138 -157 -263 12 -175 100 -53 431 120
3364 120 101 37 -56 73 80 73 244 -57 -117 -43 213 150 -41 34 -18 168 300 -90 138 83 -22 334 -57 69
3388 69 -153 287 -3 -245 -79 119 -127 -208 -194 -272 26 -353 73 -197 -148 -170 131 66 -138 73 -135 113
3410 113 26 -69 76 -93 4 -112 24 -207 -23 -61 89 -74 -43 -31 49 91 -57 73 -1 32 272 -336 233
3433B33r2k07L6J69j1m3n5O8k47K48j1j02J03j07K58j03j57K06k25J5K99l47K74
3456B02k18K32p0R6j37p9J10j46P0l11M52l55N2j0K36j83J45q2M7q0j68J80l7
3479e4pJ10k24L68l53K21O1k43J36p1n2r1M46j62J6k30K13M5k97Pj36L91Jj8j68
3504i1R0K79m54P4J39K5N9K33m00K07P3j93J11J27m2k98l3k9J91O1r7Jr7K24j1
3529A49j60QN6L6j07J55l18K55M2k87R9PNJ53l08L01j33r2L46k33q4K73j73Q2
3553G2O7k90J95N0q8k82K82j50L26m0j37M3J76k29M6N7j15N7j89MQ0N3K09k16
3577a9m0k4J31l7j3k38K87K13l06J94m42L93k00J04K77k53K10j85j81K15J78p5
3599A89k96J03mK77k56J92j44J25r4J01K9j38O6k80J8O4M7R6m82M59j85J17j6
$$ plain form
3433 233 141 -66 -30 139 128 85 30 98 -149 99 88 -14 89 -18 240 137 -20 186 -39 -24 275 -72 202
3456 202 -16 216 146 242 105 26 136 -10 60 -251 201 -154 -102 -112 124 -59 86 4 51 -29 -197 -17 -54
3479 -54 -61 49 -175 193 -160 61 122 -121 15 -56 -108 -199 247 85 101 -129 84 129 -168 -161 -297 94 95 77 -91
3504 -91 -1 278 -176 -102 37 62 121 354 -46 161 234 41 152 279 237 -61 -94 -123 68 129 32 33 -64 160 149
3529 149 -11 -3 53 89 -18 137 -181 74 116 -171 -72 -65 -60 93 -215 86 -47 -139 207 -26 -110 163 -10 72
3553 72 139 -151 44 94 6 -276 6 -144 182 142 5 48 224 -5 41 98 -17 40 -149 -145 -65 -12 197 -19
3577 -19 -59 -83 48 11 -2 -240 47 260 -46 148 -294 99 -101 3 280 27 237 52 -129 86 264 189
3599 189 -107 -4 -8 269 13 205 61 186 92 193 222 84 150 -130 -112 -48 -1 95 -387 72 -113 4 -12
3622a2Op2O4K01k22J01k95K4L7J80q6J46N4l02K4q5PJ66J70j09J6J59j82n0l1
3647i1P0K07J08m37J87N6kP8l52K07L3Q7n8M4j57p5L09k79M15m14K22q2M1j54
3671c7L6J39j72J31P5k0q8M4j39m2K31j77J1L80m07k30J81K21mj40l2n3j7N9j77
3696b27J51J11n1o7J36k11K78K9Q0k75J66k88q1J88j62J75j58L46l48J23J23J39
3718A77j04j85L17k96J9m1J92n9l4P0l22M56j43r8L1J04l14K53j2J23L4j56M4
3741E6o3N2J58j20J1j50M07k33Q0j00J0r5J08j48k21L32k60P1qJ26j3k05K98j15
3765b2R7PK2j18r9J56j72n9K86N2k91K51k69L2P5l7j31K26n4j72K80p5k91K66
3789d0J62n1j51q0J35J5K10l55K86l69J73O3K0J89l02M49n91N27r4Nj80J61j80
$$ plain form
3622 -12 -6 -78 -14 187 -35 66 -229 -205 -168 12 -74 72 126 -176 -152 -237 -230 -64 106 -3 13 172 -10 -60 -91
3647 -91 -21 186 294 -143 44 100 98 176 -176 31 64 151 93 137 -20 -95 214 -65 350 -64 158 76 117 -37
3671 -37 -1 138 -34 97 172 152 64 108 -31 -73 158 -19 -8 372 -35 -265 -84 137 133 -7 -39 -92 -109 -50 -227
3696 -227 -76 35 -16 -83 53 -158 120 149 229 -46 120 -168 -249 -61 -223 -48 -206 140 -208 -85 38 177
3718 177 73 -112 205 -91 -72 -113 79 20 -14 56 -266 190 47 -51 -20 84 -230 23 11 134 168 12 56
3741 56 -7 45 203 83 94 -56 351 118 198 98 108 13 121 -27 -248 84 -176 -105 -113 13 0 -205 93 -22
3765 -22 75 82 104 -14 -113 43 -129 -188 98 150 -141 110 -159 -127 -52 -89 -220 6 -48 -220 60 -15 -306 -40
3789 -40 122 71 -80 -160 -25 -10 200 -155 131 -238 -65 -2 18 207 -95 354 -237 290 196 201 21 182 2
3812BrK56no0l44K34j66K5N1J25q4Q0m2J79l8k93PK42k96K68k98J18j0J13k73
3837b18L01j4o0jk09K12J60j99J24j77P7p0rJ07j10j60J66l8l9ok6J17J14m0k7
3862b5j51J87j13P2j77J72O3k1j60j31K30m1J38o0K41j35K15l34n7L1j39M29l30
3885i6N5K44k42JK07o9jo6k0K28l5k90J53k52K33J48j44p8q5J00K0k5k70M87k00
3910CN5Ll06K42m5j77J7J92j68J55j14M3k00J34K66j38o0j7J48M3J1j40j19L22
3934A50k28O9r6J93j03j68J81j60L71J3j60j79P2P7k18K60j30K54n7q0o9K1J57
3957A70k47J30rM1k24K25l0L23r0k66J63k99J21k01J74j84L41r1k6K61l87O6j58
3980a97L87m67M74r7j07k50P9L32O4l10j02O5m0J90j86J56J85k81j6Nn6K99k56
$$ plain form
3812 2 -7 249 244 184 -160 74 -92 -67 -16 109 25 105 63 242 204 -89 -82 160 -136 132 -166 -48 -58 55 -218
3837 -218 83 69 9 8 -201 11 171 -28 96 -81 -4 -74 -83 24 -86 -246 -80 -118 -157 -163 -189 -72 42 2 -25
3862 -25 -176 11 -102 -30 -207 -35 28 7 -153 -284 -54 -95 43 -17 224 89 304 -30 -87 -56 -195 234 -96
3885 -96 -41 203 -39 -38 169 100 99 33 13 241 206 -84 69 -183 50 198 54 -24 -109 -9 11 -14 -284 203 3
3910 3 58 61 -245 -3 -48 -225 -208 -16 -184 -29 -143 -100 -300 -166 100 -38 -98 -115 33 76 87 -53 -172 150
3934 150 -78 -9 -105 88 -15 -183 -2 -162 209 222 62 -117 -45 32 -186 74 -56 198 141 61 -8 13 170
3957 170 -77 53 44 85 -139 86 56 379 289 23 186 -113 8 -193 -19 -203 138 47 21 282 -105 -39 -197
3980 -197 190 -277 197 100 -7 -257 -178 154 218 -92 -194 -129 -169 21 -165 -9 176 -105 -121 -116 -172 127 -129
$$ [...]
8191c6
##END NTUPLES=NMR FID
##END=
