##TITLE=1H_SA_30.235.2 DMSO/TFA
 CDCl3, 108 sc, 
 25.11.2020
##JCAMPDX= 6.0         $$ Bruker NMR JCAMP-DX V2.0
##DATA TYPE= NMR FID
##DATA CLASS= NTUPLES
##ORIGIN= UXNMR, Bruker Analytische Messtechnik GmbH
##OWNER= root
$$ XWIN-NMR		Version 3.5
$$ Wed Nov 25 13:00:16 2020 Russian Standard Time (UT+4h)  she@DPX200
##.OBSERVE FREQUENCY= 200.1315066352
##.OBSERVE NUCLEUS= ^1H
##.DELAY= (6, 6)
##.ACQUISITION MODE= SIMULTANEOUS
##.ACQUISITION SCHEME= undefined
##.AVERAGES= 108
##.DIGITISER RES= 18
##SPECTROMETER/DATA SYSTEM= spect
##.PULSE SEQUENCE= zg30
##.SOLVENT NAME= DMSO
##.SHIFT REFERENCE= (INTERNAL, DMSO, 0, 15.7039)
##AUDIT TRAIL= $$ (NUMBER, WHEN, WHO, WHERE, WHAT)
$$ ##TITLE= Audit trail, XWIN-NMR		Version 3.5
$$ ##JCAMPDX= 5.01
$$ ##ORIGIN= Bruker BioSpin GmbH
$$ ##OWNER= she
$$ F:/spectra/data/she/nmr/H-F/1/audita.txt
$$ ##AUDIT TRAIL=  $$ (NUMBER, WHEN, WHO, WHERE, WHAT)
(   1,<2020-11-25 12:58:23.82 +0400>,<she>,<DPX200>,
      <continue with go, POWCHK disabled, PULCHK disabled
       configuration hash MD5:
       00 E9 B6 7A A2 85 ED C7 34 08 36 98 17 FE 4E 26
       data hash MD5: 16K
       9D 30 F5 26 96 15 76 FB 17 A5 5C 6E 6A 42 E2 20>)
$$ ##END=
$$ 
$$ hash MD5
$$ ED AC C1 60 64 F6 24 BB 45 BC 52 0C D2 EA ED 07
##$RELAX= 
##$RELAX= 
##$RELAX= 
##$RELAX= 
##$RELAX= 
##$RELAX= 
$$ Bruker specific parameters
$$ --------------------------
##$DU= <F:/spectra>
##$EXPNO= 1
##$NAME= <H-F>
##$PROCNO= 1
##$TYPE= <nmr>
##$USER= <she>
##$AMP= (0..31)
100 100 100 100 100 100 100 100 100 100 100 100 100 100 100 100 100 100 
100 100 100 100 100 100 100 100 100 100 100 100 100 100 
##$AQSEQ= 0
##$AQ_mod= 1
##$AUNM= <au_zg>
##$AUTOPOS= <>
##$BF1= 200.13
##$BF2= 200.13
##$BF3= 200.13
##$BF4= 200.13
##$BF5= 200.13
##$BF6= 200.13
##$BF7= 200.13
##$BF8= 200.13
##$BYTORDA= 1
##$CFDGTYP= 0
##$CFRGTYP= 5
##$CHEMSTR= <none>
##$CNST= (0..31)
1 1 145 1 1 1 1 1 1 1 1 1 1 1 1 1 1 1 1 1 1 1 1 1 1 1 1 1 1 1 1 1 
##$CPDPRG= <>
##$CPDPRG1= <>
##$CPDPRG2= <>
##$CPDPRG3= <>
##$CPDPRG4= <mlev>
##$CPDPRG5= <mlev>
##$CPDPRG6= <mlev>
##$CPDPRG7= <mlev>
##$CPDPRG8= <mlev>
##$CPDPRGB= <>
##$CPDPRGT= <>
##$D= (0..31)
0 1.2 0 0 0 0 0 0 0 0.06 0 0.03 0 0 0 0 0.0002 0 0 0 0 0 0 0 0 0 0 0 0 
0 0 0 
##$DATE= 1606294291
##$DBL= (0..7)
120 120 120 120 120 120 120 120 
##$DBP= (0..7)
150 150 150 150 150 150 150 150 
##$DBP07= 0
##$DBPNAM0= <>
##$DBPNAM1= <>
##$DBPNAM2= <>
##$DBPNAM3= <>
##$DBPNAM4= <>
##$DBPNAM5= <>
##$DBPNAM6= <>
##$DBPNAM7= <>
##$DBPOAL= (0..7)
0.5 0.5 0.5 0.5 0.5 0.5 0.5 0.5 
##$DBPOFFS= (0..7)
0 0 0 0 0 0 0 0 
##$DE= 6
##$DECBNUC= <off>
##$DECIM= 32
##$DECNUC= <off>
##$DECSTAT= 4
##$DIGMOD= 1
##$DIGTYP= 9
##$DL= (0..7)
0 120 120 120 120 120 120 120 
##$DP= (0..7)
150 150 150 150 150 150 150 150 
##$DP07= 0
##$DPNAME0= <>
##$DPNAME1= <>
##$DPNAME2= <>
##$DPNAME3= <>
##$DPNAME4= <>
##$DPNAME5= <>
##$DPNAME6= <>
##$DPNAME7= <>
##$DPOAL= (0..7)
0.5 0.5 0.5 0.5 0.5 0.5 0.5 0.5 
##$DPOFFS= (0..7)
0 0 0 0 0 0 0 0 
##$DQDMODE= 0
##$DR= 18
##$DS= 0
$$ [...]
##$SUBNAM2= <"">
##$SUBNAM3= <"">
##$SUBNAM4= <"">
##$SUBNAM5= <"">
##$SUBNAM6= <"">
##$SUBNAM7= <"">
##$SUBNAM8= <"">
##$SUBNAM9= <"">
##$SW= 16.9725356469052
##$SWIBOX= (0..15)
0 0 2 0 0 0 0 0 0 0 0 0 0 0 0 0 
##$SW_h= 3396.73913043478
##$TD= 16384
##$TD0= 1
##$TE= 0
##$TE2= 300
##$TE3= 300
##$TEG= 300
##$TL= (0..7)
0 120 120 120 120 120 120 120 
##$TP= (0..7)
150 150 150 150 150 150 150 150 
##$TP07= 0
##$TPNAME0= <>
##$TPNAME1= <>
##$TPNAME2= <>
##$TPNAME3= <>
##$TPNAME4= <>
##$TPNAME5= <>
##$TPNAME6= <>
##$TPNAME7= <>
##$TPOAL= (0..7)
0.5 0.5 0.5 0.5 0.5 0.5 0.5 0.5 
##$TPOFFS= (0..7)
0 0 0 0 0 0 0 0 
##$TUNHIN= 0
##$TUNHOUT= 0
##$TUNXOUT= 0
##$USERA1= <user>
##$USERA2= <user>
##$USERA3= <user>
##$USERA4= <user>
##$USERA5= <user>
##$V9= 5
##$VALIST= <valist>
##$VCLIST= <CCCCCCCCCCCCCCC>
##$VD= 0
##$VDLIST= <DDDDDDDDDDDDDDD>
##$VPLIST= <PPPPPPPPPPPPPPP>
##$VTLIST= <TTTTTTTTTTTTTTT>
##$WBST= 1024
##$WBSW= 4
##$XGAIN= (0..3)
0 0 0 0 
##$XL= 0
##$YL= 0
##$YMAX_a= 1185471
##$YMIN_a= -1278548
##$ZGOPTNS= <>
##$ZL1= 120
##$ZL2= 120
##$ZL3= 120
##$ZL4= 120
##$ABSF1= 10
##$ABSF2= 0
##$ABSG= 5
##$ABSL= 3
##$ALPHA= 0
##$AQORDER= 0
##$ASSFAC= 0
##$ASSFACI= 0
##$ASSFACX= 0
##$ASSWID= 0
##$AUNMP= <proc_1d>
##$AZFE= 0.1
##$AZFW= 0.1
##$BCFW= 1
##$BC_mod= 2
##$BYTORDP= 1
##$COROFFS= 0
##$CY= 11.3945322036743
##$DATMOD= 1
##$DC= 2
##$DFILT= <>
##$DTYPP= 0
##$F1P= 15.9154993809931
##$F2P= -4.1035820241983
##$FCOR= 0.5
##$FTSIZE= 0
##$FT_mod= 4
##$GAMMA= 1
##$GB= 0.15
##$INTBC= 1
##$INTSCL= 1
##$ISEN= 128
##$LB= 0.24
##$LEV0= 0
##$LPBIN= 0
##$MAXI= 10000
##$MC2= 0
##$MEAN= 0
##$ME_mod= 0
##$MI= 1.114404
##$NCOEF= 0
##$NC_proc= 0
##$NLEV= 6
##$NOISF1= 3.799351
##$NOISF2= 2.8
##$NSP= 1
##$NTH_PI= 0
##$NZP= 0
##$OFFSET= 15.70392
##$PC= 1
##$PHC0= -11049.89
##$PHC1= 6.800889
##$PH_mod= 1
##$PKNL= yes
##$PPARMOD= 0
##$PSCAL= 0
##$PSIGN= 0
##$REVERSE= no
##$SF= 200.130013532006
##$SI= 16384
##$SIGF1= 3
##$SIGF2= 2
##$SINO= 400
##$SIOLD= 16384
##$SREGLST= <1H.CDCl3>
##$SSB= 0
##$STSI= 0
##$STSR= 0
##$SW_p= 3612.71676300578
##$SYMM= 0
##$S_DEV= 0
##$TDeff= 0
##$TDoff= 0
##$TI= <>
##$TILT= no
##$TM1= 0
##$TM2= 0
##$TOPLEV= 0
##$USERP1= <user>
##$USERP2= <user>
##$USERP3= <user>
##$USERP4= <user>
##$USERP5= <user>
##$WDW= 1
##$XDIM= 8192
##$YMAX_p= 0
##$YMIN_p= 0
$$ End of Bruker specific parameters
$$ ---------------------------------
##NTUPLES= NMR FID
##VAR_NAME=  TIME,          FID/REAL,        FID/IMAG
##SYMBOL=    X,             R,               I
##VAR_TYPE=  INDEPENDENT,   DEPENDENT,       DEPENDENT
##VAR_FORM=  AFFN,          ASDF,            ASDF
##VAR_DIM=   8192,          8192,            8192
##UNITS=     SECONDS,       ARBITRARY UNITS, ARBITRARY UNITS
##FACTOR=    0.0002944,     1,               1
##FIRST=     0,             0,               0
##LAST=      2.4114304,     0,               0
##MIN=       0,             -1278548,        0
##MAX=       2.4114304,     1185471,         0
$$ Real data points
##PAGE= N=1
##DATA TABLE= (X++(R..R)), XYDATA
$$ [...]
2610a06j018R22k94J373q51p63K13Q11N71r14L19J1R28k272J201m36o56J091k64
$$ -106 -1124 -202 -496 877 26 -737 -524 287 858 -56 263 274 1202 -1070 131 -305 -961 130 -134
2629a34L68K93n43k85K21k21k65j18Q02p13P49k42j99j57j59P66l85P54K81k11
$$ -134 234 527 -16 -301 -80 -301 -566 -684 118 -595 154 -88 -287 -444 -603 163 -222 532 813 602
2649F02p58P9k41M21n3m67O08j60P4O51n32m16L64n02J30L15M07j309N0M94J54
$$ 602 -156 -77 -318 103 50 -417 191 31 105 756 224 -192 172 -330 -200 115 522 -787 -737 -243 -89
2670h9K00l64R10j430N26l24K70N06j33l89q6j57J12Q94p71j17k97P18j20P0q55
$$ -89 111 -253 657 -773 -247 -571 -301 205 72 -317 -403 -560 -448 446 -325 -442 -739 -21 -141 -71 -926
2691i26J249M04k86r95R53q8k20k43q7J30j198J458K0J21m92O39K44q60l38J003
$$ -926 323 727 441 -554 399 311 91 -152 -239 -109 -1307 151 171 292 -200 439 683 -177 -515 488
2711D88O59j162J0l7L11J42K29k48n25P10p24M07K20q28Q42l55M3R97l42r00l17
$$ 488 1147 -15 -5 -42 269 411 640 392 -133 577 -147 260 480 -348 494 139 182 1179 837 -63 -380
2732c80P05o00L49k38L21o52O76j053M74J09N42j079M02j45R54p7p6L19q53o14
$$ -380 325 -275 74 -164 157 -495 181 -872 -398 -289 253 -826 -424 -569 385 308 232 551 -302 -916
2752i16j18O98Q6Q32q64J332j360O08m57l39J182qm76L29q46P54m57m89P09o22
$$ -916 -1034 -336 -250 582 -282 1050 -310 298 -159 -498 684 676 200 529 -317 437 -20 -509 200 -422
2772d22M41J04J08p49O36n76k63M05J196p47K62J332n89j440K73Jn6L60q97qL17
$$ -422 19 123 231 -518 118 -458 -721 -316 880 133 395 1727 1138 -302 -29 -28 -84 276 -621 -629 -312
2793c12P62j51l03L63o98m61J52N67O40k91k35l70O98qp09j34L02P81r63j7R02
$$ -312 450 299 -4 359 -339 -800 -648 -81 559 268 33 -337 361 353 -356 -490 -188 593 -370 -387 515
2814E15m04q86p42J550K47m52M64k51K63L07o91K89N11n8l39l78m86K94J72j369
$$ 515 111 -775 -1517 33 280 -172 292 41 304 611 -80 209 720 662 323 -55 -541 -247 -75 -1444
2834a444J537j36P42O4r53L08o0M6M10k08P5n69J61n20R27k27m86N99l02L24J0
$$ -1444 93 -43 699 763 -190 118 58 104 514 306 381 -188 -27 -547 380 153 -333 266 -36 288 298
2855B98N88q64J41M0k58n63J166j578J212N03l06m19K89j109J286p13R45r93N55
$$ 298 886 22 163 203 -55 -618 548 -1030 182 685 379 -40 249 -860 426 -287 658 -335 220
2874B20j59p60J064r49Q71k54k01q63J674p27o40P70j75q18R94K30l05J23L65
$$ 220 61 -699 365 -584 287 33 -168 -1031 643 -84 -724 46 -129 -947 47 277 -28 95 460
2893D60l93J85j13k41n92R17r62J349q59K38l19q61Q1J838p00nR2K4q8k92k34
$$ 460 67 252 139 -102 -694 223 -739 610 -249 -11 -330 -1191 -1110 728 28 23 115 139 51 -241 -475
2914d75j63K50M27j43O32m79j27J11L25K08q82l08L56R40k73m14j45m38J276p68
$$ -475 -638 -388 39 -104 528 49 -78 33 358 566 -316 -624 -268 672 399 -15 -160 -598 678 -90
2934i0p41J270m23l81J014l54K45q27%J290o09k67j27l37O71q46K96N02j172K56
$$ -90 -831 439 16 -365 649 295 540 -287 -287 1003 394 127 0 -337 334 -512 -216 286 -886 -630
2954f30J73k3L45P9P86K67r02q6o25Q25j163P53P82qq88j58J149n21N18j701J131
$$ -630 -457 -480 -135 -56 730 997 95 9 -616 209 -954 -201 581 573 -315 -473 676 155 673 -1028 103
2975A03L60J60J39p91M21K97m93n83N80l52K28L49m96j80l33O32n39J087P50j016
$$ 103 463 623 762 -29 392 689 196 -387 193 -159 69 418 -78 -258 -591 41 -498 589 1339 323
2995C23l87K13K22j92L98p20N80j535Q30L68k79o01J171L04j114M13l81J023r43
$$ 323 -64 149 371 179 577 -143 437 -1098 -268 100 -179 -780 391 695 -419 -6 -387 636 -307
3014c07l22M61J29l9M1j0j01J87n05m06Q92M4l26l04R7k44L42Q7R72j204P30J33
$$ -307 -629 -168 -39 -78 -37 -47 -148 39 -466 -872 20 64 -262 -566 -469 -713 -371 -284 688 -516 214 347
3036C47q62p8l15Q94Q45n67J6j066J251k03j79J44m33O66l17o73J104j339M06
$$ 347 -515 -593 -908 -14 831 264 280 -786 465 262 83 227 -206 460 143 -530 574 -765 -359
3055c59J052p3n26j12M2n82K01L48q0k91K26m97L64J334j056j202M98K72l85P15
$$ -359 693 620 94 -18 24 -558 -357 -9 -89 -380 -154 -651 -287 1047 -9 -1211 -713 -441 -826 -111
3075a11O92o05k45P43j10j293J445p30M99p27Q63j134P93p13L90K00o7M63o39
$$ -111 581 -24 -269 474 364 -929 516 -214 285 -442 421 -713 80 -633 -243 -43 -110 353 -286
3094b86O81J56j235O95j6J52l44J002l40p50Q02m75k60J179j61q99j16j59J033
$$ -286 395 551 -684 11 -5 147 -197 805 465 -285 517 42 -218 961 800 -99 -215 -374 659
3113F59m56P72j297m86J023j138M40J408j040L05k98q7j99O38r9l97K3j16o59
$$ 659 203 975 -322 -808 215 -923 -483 925 -115 190 -108 -195 -394 244 145 -252 -229 -345 -1004
3132a004J582o67J87J87r77O98Q8M6j81j77L06o34p0P28l06K88p18P50J00J49
$$ -1004 578 -89 98 285 -692 6 94 140 -41 -218 88 -546 -616 112 -194 94 -624 126 226 375
3152C75j60k56o91M16O47J26k99l91R61q54M22j100J13O55m05N64q25L17M59J21
$$ 375 215 -41 -732 -316 331 457 158 -233 728 -126 296 -804 -691 -36 -441 123 -702 -385 74 195
3172A95n90L23K91M56r34j39M23J53n7m27P92p93J62M18p06p72J797j183O39j8
$$ 195 -395 -72 219 675 -259 -398 25 178 121 -306 486 -307 -145 273 -433 -1205 592 -591 48 30
3192C0N48j162J270o18l33L77j56Q71n35k35l52L71M29j373J756j355N37N38l13
$$ 30 578 -584 686 68 -265 112 -44 827 292 57 -295 76 505 -868 888 -467 70 608 295
3211B95j117R74K45k61j85N67j51l32L66j069J75Q18N59p11j92R05p68K62o56
$$ 295 -822 152 397 136 -49 518 367 35 401 -668 -493 325 884 173 -19 886 118 380 -276
3230b76J142r82K11O0m28M5l0P03N08k172K11J069q33J313j020P36j360P77N27
$$ -276 866 -116 95 155 -273 -228 -258 445 953 -1219 -1008 61 -772 541 -479 257 -1103 -326 201
3249B01n20N13M3R20p04n75M16l34K94PK44j41n59O69L51j308L07k4m3O8M29l94
$$ 201 -319 194 237 1157 453 -122 294 -40 254 261 505 364 -195 474 825 -483 -176 -200 -243 -175 254 -140
3271a40k8K48n7O08q27O9J087j293N07M34M01j826L87P89k11N46n69j179L87N45
$$ -140 -168 80 23 631 -196 -127 960 -333 174 608 1009 -817 -430 359 148 694 125 -1054 -667 -122
3291a22L11k54N72j215J125j432J289j32m70R27j553J344p37J82j77L80O54o82
$$ -122 189 -65 507 -708 417 -1015 274 142 -328 599 -954 390 -347 -165 -342 38 692 10
3309A0R94o99Pm24L13n57L75l50M12j52j78r51Q52J399j334O35l93P27j690N30
$$ 10 1004 305 312 -112 201 -356 19 -331 81 -71 -249 -1200 -348 1051 -283 352 -41 686 -1004 -474
3329d74Q5M57N2k06k35J295j584K54L59N52q20N93N92j509P12o40Q77j250J395
$$ -474 -389 68 120 -86 -321 974 -610 -356 3 555 -265 328 920 -589 123 -517 360 -890 505
3348E05l62n6o86M07o64P96L37J91J16m82m26j71J057q09O35r31P28k08K18K06
$$ 505 143 87 -599 -192 -856 -60 277 468 584 102 -324 -495 562 -247 388 -543 185 -23 195 401
3368D01n83M44k31K82o3o33K64l52L25K53M56o77R05l85k29k10j45p45J562m19
$$ 401 -182 262 31 313 250 -383 -119 -471 -146 107 563 -114 791 406 177 -33 -178 -923 639 220
3388B20O3m12K70J048j102m60O35o28J057o52R81j364j256K486j088N10o92j23
$$ 220 283 -129 141 1189 87 -373 262 -366 691 39 1020 -344 -1600 886 -202 308 -384 -507
3406e07J238j900J332l47J250m15r86N23j074n1J36P37M67j240j15J974j054m80
$$ -507 731 -1169 163 -184 1066 651 -335 188 -886 -937 -801 -64 403 -837 -952 1022 -32 -512
3424e12L76O1j026P66k84N66J90Q65q49O29j009j67Q72j561R94N66p84k22J217
$$ -512 -136 -75 -1101 -335 -619 -53 137 1002 153 782 -227 -394 478 -1083 -89 477 -307 -529 688
3443F88k53m48M06n42oK12j47j507J697m83l55J044l90N66j918J515K09j43p34
$$ 688 435 -13 393 -149 -155 57 -90 -1597 100 -383 -738 306 -84 482 -1436 79 288 145 -589
3462e89M0J45O63q00R35l66j50K13L00l14N22m74j33n30L99l21P98q14J11O5L36
$$ -589 -549 -404 259 -541 394 28 -122 91 391 77 599 125 -8 -538 -139 -460 338 -476 -365 -300 36
3483C6j79P61j09q02O75j70P4l5k85P1J90L12m76J036p43q95l05J077J19q65N76
$$ 36 -143 618 509 -293 382 212 286 251 -34 37 227 539 63 1099 356 -539 -844 233 352 -513 63
3504F3J1O04j84k01p10M70p54N23L6J099r72J18K21o47J088k29m71m15J246n33
$$ 63 74 678 494 293 -417 53 -701 -178 -142 957 -15 103 324 -323 765 536 65 -350 896 363
3524C63R9k77O3n16K50N58r35O54m04r7O81p29O45l58L72L1Q7K22j115O12L2K40
$$ 363 462 185 248 -268 -18 540 -395 259 -145 -242 439 -290 355 -3 369 400 487 709 -406 206 238 478
3546D78p89L53L12m73r2m71N33K42M97m93K42M20L9j02j196M91j82N23j83j033
$$ 478 -311 42 354 -119 -211 -682 -149 93 590 97 339 759 798 696 -500 -9 -191 332 149 -884
3566h84Q78k63L32n34M69m4L58m17j52k55P75k80Q31q58o73J188n33n98J065j66
$$ -884 -6 -269 63 -471 -2 -46 312 -105 -257 -512 263 -17 814 -44 -717 471 -62 -660 405 239
3586B39p94J165j47k69j1K9M65L79l91k16N20j084q16N39M47M69K7j019O49j75
$$ 239 -555 610 463 194 183 212 677 1056 665 449 969 -115 -931 -392 55 524 551 -468 181 6
3606Fk11K30K80l38p34J217r1p3p17j54p8P18L0l17N60L20r00k74K4N09q5O2O38
$$ 6 -205 25 305 -33 -767 450 359 286 -431 -585 -663 55 85 -232 328 648 -252 -526 -502 7 -78 -16 622
3629F22j19o36j45k24j93L35O6P15k33M28o09m78L97l43M65l92M46O03P7q47j67
$$ 622 503 -133 -278 -502 -695 -360 -294 421 188 616 7 -471 -74 -417 48 -344 102 705 782 -65 -232
3650b32p54J73R94p38O30m87R97p36k74Q99j015Q91q84M44j117J809K45j696P84
$$ -232 -986 -813 181 -557 73 -414 583 -153 -427 472 -543 348 -536 -92 -1209 600 845 -851 -67
3669f7j14p8N12k9K03j051j28J159p7k34o7k50l5Q44L72j041K70M79q98N86N9
$$ -67 -181 -259 253 224 427 -624 -752 407 330 96 29 -221 -256 588 960 -81 189 668 -230 356 415
3690D15m39J00Q03j374M59R1P99j257M69M05q51L70k44Q63j135K36L71j64M06
$$ 415 -24 76 879 -495 -36 55 854 -403 66 471 -380 -10 -254 609 -526 -290 81 -83 323
3709C23m99j97Q81j471L09J205j015m64R06K21o90P40J94n93P93j729N45L40N22
$$ 323 -176 -373 508 -963 -654 551 -464 -928 -22 199 -491 249 443 -150 643 -1086 -541 -201 321
3728C21l76k11J24L08j230Q2J379j264R49J20n77J12K93k63L25%j43k92k64P71
$$ 321 -55 -266 -142 166 -1064 -982 397 -867 82 202 -375 -263 30 -233 92 92 -51 -343 -607 164
3748A64P1r17J887r99o52P13J32o28j05j15J062j212P66M44r35P03k34k3p1n31
$$ 164 235 -682 1205 206 -446 267 399 -229 -334 -449 613 -599 167 611 -324 379 145 122 51 -480
3768d80M99l06O62K56n05l43l16R00j157J092n51l66Q80n34o24Q85R6k9l89R68
$$ -480 19 -287 375 631 126 -217 -533 367 -790 302 -249 -615 265 -269 -893 -8 88 59 -330 638
3788F38j71o17j97N94J53J82p87K34o78L66Q89p31K72j011M77p8P36L12n36n73
$$ 638 467 -150 -347 247 400 582 -205 29 -649 -283 606 -125 147 -864 -387 -465 271 583 47 -526
3808e26J067n76n77P08L76j110J462q98O38J85j184J250j59o48n56J96k05L92
$$ -526 541 -35 -612 96 472 -638 824 -74 564 749 -435 815 656 8 -548 -352 -557 -165
3826a65Q72j382L80pO00j031R93M8o5p40P6M32J38l28l84m6o3J406j332O39p84
$$ -165 707 -675 -295 -302 298 -733 260 308 243 -497 -421 11 149 -179 -563 -609 -672 734 -598 41 -743
3847g43J267l14r27P36L17L23p23J47J88O2m12o99M04k27K041j907R98j285O97
$$ -743 524 210 -717 19 336 659 -64 83 271 333 -79 -778 -374 -601 1440 -467 531 -754 -57
3866e7O69j246P74N64j147J326m04k43L15j68j141k6R34L01q03l45N06R2J369
$$ -57 612 -634 140 704 -443 883 479 236 551 383 -758 -784 150 451 -352 -697 -191 -99 1270
3885A270p13j390P66m81K0M43P66r73O29j417J272P5q28P2P68P4m86J289p61p90
$$ 1270 557 -833 -67 -548 -528 -85 681 -292 337 -1080 192 267 -561 -489 279 353 -133 1156 395 -395
3905c95k53k41J83J157o56J18K35o06J80P02m26L91m34M42J000r51J33p60p78
$$ -395 -648 -889 -706 451 -205 -87 148 -458 -278 424 -2 389 -45 397 1397 446 579 -181 -959
3924i59J043k54p8N38l13O02m89l7k63J075M9j255Q92q04rK78l01L32M30j18n20
$$ -959 84 -170 -248 290 -23 579 90 53 -210 865 914 -341 551 -253 -262 16 -285 47 477 359 -161
3945a61%j60L16l60k62J117m37l99J099r95m54M1M88O96j197J429l87l87m14P82
$$ -161 -161 -321 -5 -365 -627 490 53 -346 753 -242 -696 -655 -167 529 -668 761 374 -13 -427 355
3965C55n34J90n08Q18N37m42k69r60N20R07r19L14K83k84n3m48P73K18o23p7k97
$$ 355 -179 11 -497 321 858 416 147 -813 -293 614 -305 9 292 8 -45 -493 280 498 -125 -202 -499
3986d99P57M37l84n17M9J095o03j23j093J494m88m78K20K0J292p21m00j35K4n16
$$ -499 258 695 311 -206 -157 938 335 212 -881 613 125 -353 -133 -113 1179 458 58 -77 -53 -569
4006e69J316q40k31K84K43l53J483j066L81o04K03j170R27M1KP14r0l75M03j111
$$ -569 747 -93 -324 -40 203 -150 1333 267 648 44 247 -923 4 45 47 761 671 296 699 -412
4026d12l38O02m01j32J279n01K19L97l80m60l29Q24L06q44J76M24j18K23p78j8
$$ -412 -750 -148 -549 -681 598 97 316 713 333 -127 -456 368 674 -170 6 430 312 535 -243 -261
4046b61M68j67m37j87J354j094o46N65J103p65j3L41r23K30P06n05k49J505q02
$$ -261 207 40 -397 -584 770 -324 -970 -405 698 -67 -80 261 -662 -432 274 -231 -480 1025 223
4065B23J25m36o99M35J324l50j442J289M42l24p82L38K18m6j114Q94n20M86r89
$$ 223 348 -88 -787 -352 972 622 -820 469 911 587 -195 143 361 315 -799 95 -425 61 -928
4084i28P04J44R17q69N20j21J032k592R52m80Q57Q37j144p50J365j328M14Q57
$$ -928 -224 -80 837 -32 488 367 1399 -1193 -241 -721 136 973 -171 -921 444 -884 -470 387
4102C87j509K204j797Q5J172j443J711n48n69q7j433L021q35j396J143N79j132
$$ 387 -1122 1082 -715 -630 542 -901 810 262 -307 -394 -1827 1194 359 -1037 106 685 -447
4119d47K24k48J178k06j22r6j310R86N11j367P88m06J113l48J56n90P0N47j232
$$ -447 -223 -471 707 501 379 283 -1027 -41 470 -897 -109 -515 598 250 406 -184 -114 433 -799
4138g99N64M41p21N0J82M55o4O16n95j32q25J032j89Q97o89J21K81j411N12J029
$$ -799 -235 206 -515 -465 -283 172 108 724 129 -3 -828 204 15 912 223 344 625 -786 -274 755
4158G55q81L43j41l11J89K03m37r70J327q62R63j425J762j69O34l09j189O98o05
$$ 755 -126 217 76 -235 -46 157 -280 -1250 77 -785 178 -1247 515 346 980 671 -518 180 -425
4177d25R27K46p89J010j353N46K00r4O30m97j040K92J021j230P55j66L83p14r8
$$ -425 502 748 -41 969 -384 162 362 268 898 401 -639 -347 674 -556 199 33 416 -298 -396
4196c96N67r30N21k33K02M72o96J23r7j38R12k32k62j079J491m19N77o04J69M21
$$ -396 171 -759 -238 -471 -269 203 -493 -370 -467 -605 307 75 -187 -1266 225 -194 383 -221 -52 369
4216C69J281j356m97L35j226N72L55j8J190r26k64M56L55k73k67n7j54M16p28
$$ 369 1650 294 -203 132 -1094 -522 -167 -185 1005 79 -185 271 626 353 86 29 -125 291 -437
4235d37J081r00L59o4k54k06k95J983l2j490O09J31l26k8K98k41K11q64N82L98
$$ -437 644 -256 103 39 -215 -421 -716 1267 1235 -255 354 485 159 131 429 188 399 -465 117 515
4255E15O3j50q07O02p94M81n0K2o02M36M00k49K85j77n54J295j174L69O21n51
$$ 515 578 428 -379 223 -571 -90 -140 -118 -720 -284 116 -133 152 -25 -579 716 -458 -89 532 -19
4275a9K87n30k3j32L85m9k30j73J528r12Q5N31p13R0j20k85O46j67P17j375L42
$$ -19 268 -262 -285 -417 -32 -81 -311 -484 1044 132 217 748 35 125 5 -280 366 199 916 -459 -117
4296a17R57Pp4p57j42j89P05K53l92R91k690K312k31j482J239j103M41o63J099
$$ -117 840 847 773 16 -126 -315 390 643 251 1242 -1448 864 633 -849 390 -713 -272 -935 164
4315A64L50k28o81O26Oo78J014r02R1l83Q73l36P0J3P23p97M60o52O71l33n50
$$ 164 514 286 -395 231 237 -441 573 -329 -238 -621 252 -84 -14 -1 722 -75 385 -267 404 71 -479
4336d79K70J05l23M10L20p51Q26P40l60j584P25O17jq34j44L87K93n34M47o04
$$ -479 -209 -104 -427 -17 303 -448 378 1118 758 -826 -101 516 515 -319 -463 -76 217 -317 130 -474
4356d74L86J48o25M64N1K54m3J79M18j646P35M6N67j252k7L57L25l60O62M79j075
$$ -474 -88 60 -565 -101 -50 204 161 340 758 -888 -153 -107 460 -792 -819 -462 -137 -497 165 644 -431
4377d31J96L67n75J658j411L45k52j89P82J60j589Q16J52N90j329M52N31J47R7
$$ -431 -235 132 -443 1215 -196 149 -103 -292 490 650 -939 -123 29 619 -710 -258 273 420 517
4396E17L25m61n70j87j0O81m65N20o73k6k33K87K42L52n95J37L61L95j051K38
$$ 517 842 381 -189 -376 -386 295 -170 350 -323 -349 -582 -295 -53 299 -296 -159 202 597 -454 -216
4416b16k57J210n40k26k9K69o09k5P66j95q75L97J166j226L52l7P99l59n82P11
$$ -216 -473 737 197 -29 -58 211 -398 -423 343 148 -727 -330 836 -390 -38 -75 724 365 -217 494
4436D94p89N93n72J175j81L62j198p2k27L2l5J06o20J258n29N04M1n02q0l94J11
$$ 494 -295 298 -274 901 720 1082 -116 -188 -415 -383 -418 -312 -932 326 -203 301 342 -160 -240 -634 -523
4457e23M77K92M99L47n95o88l24M62m21J103p70J76p07J269j146JL53mo17J021
$$ -523 -46 246 745 1092 497 -191 -515 -53 -474 629 -141 35 -672 597 -549 -548 -195 -199 -816 205
4477B05k56J46k37R5K11o98J219j245O95O10k90j060M69j084J844m5p01m3Q99
$$ 205 -51 95 -142 -47 164 -534 685 -560 135 745 455 -605 -136 -1220 624 579 -122 -165 734
4496G34k19j284J015j09o10l84J040qN99j040J053j428J07N51n01O80k47J91l05
$$ 734 515 -769 246 137 -473 -857 183 175 774 -266 787 -641 -534 17 -484 196 -51 140 -165
4515a65P72o59L29Rl78L34q3l4m21K95N05r18J299j142Q5Q68j382M94J288q45
$$ -165 607 -52 277 286 -92 242 159 125 -296 -1 504 -414 885 -257 -172 696 -686 -192 1096 251
4535B51j237K8J024OJ92J14n71Q66m40r51R60l9n84P28o91R70k93l26n50J29J60
$$ 251 -986 -958 66 72 264 378 -193 673 233 -718 242 203 -381 347 -344 626 333 7 -543 -414 -254
4556b54N72r90M19K50N59J61k91n6m53K53m59Q81L3j043p9K98l20P84o06J128
$$ -254 318 -672 -253 -3 556 717 426 370 -83 170 -289 592 625 -418 -497 -199 -519 265 -341 787
4576G87j242L69L07o38N19J42q5l61M42K95o68n53J086n64P39n64P82n84J52p57
$$ 787 -455 -86 221 -417 102 244 159 -202 240 535 -133 -686 400 -164 575 11 793 209 361 -396
4596c96N28Q98j697L03K33P02kp42n32N11J11Q0l01k42Q32O84o11j494J639m96
$$ -396 132 1030 -667 -364 -131 571 569 -173 -705 -194 -83 -3 -304 -546 286 970 359 -1135 504 8
4616HL81m63N28m27m08O06L05l76L86r69Q99p69L14K8J49o43J357K79r01P58r07
$$ 8 389 -74 454 27 -381 225 530 154 540 -429 470 -299 15 43 192 -451 906 1185 284 1042 135
4637A35L37o50J034j667R46M74L37j237pK97J13K33j174R86j705J022J050n09
$$ 135 472 -178 856 -811 135 609 946 -291 -298 -1 112 345 -829 157 -1548 -526 524 15
4655A5N03j791J357k01L65J147n92j325M13R3m73L39k8n90M48m94O28M51q36L63
$$ 15 518 -1273 84 -117 248 1395 803 -522 -109 -16 -489 -150 -178 -768 -320 -814 -186 265 -571 -208
4675b08L97N58j07k38m32N50j265R38m83M59m35J17k90N62l76n08N98o48L80j21
$$ -208 189 747 640 402 -30 520 -745 193 -290 169 -266 -149 -439 123 -253 -761 -163 -811 -431 -552
4695e52J99N43q43R17o60J90N93K10m9k21k18L40p27J082j252M42M30p48L91m31
$$ -552 -353 190 -653 264 -396 -206 387 597 548 327 109 449 -278 804 -448 -6 424 -324 67 -364
4715c64O06k42O6M98j74l53j130J471L05q12J46k75P2q92Q50r7k03J96J502j642
$$ -364 242 0 66 564 390 37 -1093 378 683 -129 17 -258 -186 -1078 -228 -325 -528 -332 1170 -472
4735d72J496p73p71M86P79k49N6p29P52r85j84P48m50l14J034l94j94m21N65M9
$$ -472 1024 251 -520 -34 745 496 552 -177 575 -410 -594 154 -296 -610 424 30 -164 -585 -20 29
4755B9k83r3K5l75O30L48Ll88L52K36R2p74k0J487q74j018O5L82jO1J36k03Q41
$$ 29 -254 -347 -322 -697 -67 281 284 -104 248 484 576 -198 -218 1269 395 -623 -558 -176 -177 -116 20 -183 658
4778F58o10j26j10N71j359J908n64l77K68p85Q62j123J079o56M21O12N42j695
$$ 658 48 -78 -188 383 -976 932 368 -9 259 -526 336 -787 292 -364 57 669 1211 -484
4796d84M83l2j45k38N69m4m66K64l22J83J022q42O49p20j26R57q3L70j560j04
$$ -484 -1 -33 -178 -416 153 109 -357 -93 -415 -232 790 -52 597 -123 -249 708 625 995 -565 -669
4816f69l34Q74j07K41n22K42P25j369N89J55K89l57Q36n97n5r8K66J52n81N83
$$ -669 -1003 -129 -236 5 -517 -275 450 -919 -330 -175 114 -243 593 -4 -59 -157 109 261 -320 263
4836B63p34J260q17l23l36J248o70N43m84J093j006Q43j61j410R92l03k02o10
$$ 263 -471 789 -28 -351 -687 561 -109 434 -50 1043 37 880 719 -691 301 -2 -204 -814
4854h14N79J07M53O66j332P3M15r56R8L39P78p00r93J340%p97J085m91m36N95
$$ -814 -235 -128 325 991 -341 -268 147 -809 -711 -372 406 -294 -1287 53 53 -744 341 -150 -586 9
4874IN31l35J42j51J041j117l32M70j0o23O86k73p46M66L80l49k71J1R15n11p2
$$ 9 540 205 347 196 1237 120 -212 258 248 -375 311 38 -708 -242 138 -211 -482 -471 444 -67 -139
4895a39R32o18J356j215j015Q96k36J58J7J121j838J30m5rJ3J15K64j62k71P37
$$ -139 793 175 1531 316 -699 197 -39 119 136 1257 -581 -451 -496 -505 -492 -377 -113 -275 -546 191
4915A91j22m43P39n89m20L98j61M44o80J91M26j2k72j53l2k2J064j178m6P61M09
$$ 191 69 -374 365 -224 -644 -246 -407 37 -643 -452 -26 -38 -310 -463 -495 -517 547 -631 -677 84 493
4936D93n57j30k09L54O68j094L3L3J82K97J12Q54k56j613P37Q35j772P08k81N55
$$ 493 -64 -194 -403 -49 619 -475 -442 -409 -227 70 182 1036 780 -833 -96 739 -1033 -325 -606 -51
4956e1M79k54M37J57n34m13P27L07l81n67O49M79j077M98m93m46M29O32r85J561
$$ -51 428 174 611 768 234 -179 548 855 474 -93 556 1035 -42 456 -37 -483 -54 578 -407 1154
4976A154j167n65K06L7j58Q6J373q44OO55m89L80n09M19l66j48J21m61l02Q7M94
$$ 1154 -13 -578 -372 -335 -493 -407 966 122 128 783 294 674 165 584 218 70 191 -270 -572 -485 9
4997In67jK91K11N71O4O9l85n62J350p43j54p26k71N26P46l44J6P59l81j81n35
$$ 9 -558 -559 -268 -57 514 578 647 262 -300 1050 307 153 -573 -844 -318 428 84 100 859 478 297 -238
5019b38R5R01J88l04l13p08J06J70k95J38N46k31O33p12Q66j239R73n81l86M45
$$ -238 -143 758 946 642 329 -379 -273 -103 -398 -260 286 55 688 -24 842 -397 576 -5 -391 54
5039E4K01q55L94P72o96k97P19L98q41q4P18n18J71QM97l23K30l36K58o38r94
$$ 54 255 -600 -206 566 -130 -427 292 690 -151 -235 483 -35 136 144 641 318 548 212 470 -168 -1162
5060a162J622r16N13R61j268j81J374j235q89J197N44N03p35Jn04ol4Q47K10l75
$$ -1162 460 -456 57 1018 -250 -431 943 -292 -1181 16 560 1063 328 329 -175 -181 -215 632 842 467
5080D67l83n64L71L48o5o95M17K01l03L41k53l44M06l51n97J30J236k25j12P10
$$ 467 84 -480 -109 239 174 -521 -104 97 -206 135 -118 -462 -56 -407 -1004 -874 362 137 25 735
5100G35k05l31o28R72M06p23j13l3J012j066R06m74q77K74L49j133R46j3O75J15
$$ 735 530 199 -429 543 949 226 113 80 1092 26 932 458 -419 -145 204 -929 17 4 679 794
5120G94j258o25L17k48P66j37O47m84N7L89J94j25j36n42K023j513o68K82O50
$$ 794 -464 -1089 -772 -1020 -254 -391 256 -228 -171 218 412 287 151 -391 1632 119 -549 -267 383
5139C83o74m31m93Q15J85L08M88M27j019o26Q96K02r05J127j418P40q16J315o64
$$ 383 -291 -722 -1215 -400 -215 93 581 1008 -11 -637 259 461 -444 683 -735 5 -811 504 -160
5158a60P52r55r30J790k74p21P70l42N2q16K255k163O87K87j163R12m93K82k69
$$ -160 592 -363 -1293 497 223 -498 272 -70 -18 -834 1421 -742 -55 232 -931 -19 -512 -230 -499
5177d99J398m93q06J128l12q62R93o19O20o90j95J73j58J034q56L99j70RL05M54
$$ -499 899 406 -400 728 416 -446 547 -72 548 -142 -337 -164 -322 712 -144 255 85 94 399 853
5197H53k860J796J381j203r71J306K4j910J337RJ312r78K54k20n00q5K38J663
$$ 853 -2007 -211 1170 -33 -1004 302 326 -1584 -247 -238 1074 96 350 130 -370 -455 -217 1446
5215A446k471Q19O43Mj36j91o3l3l31Q44m23j17J59j55N88k22j79k40M11O69m09
$$ 1446 -1025 -206 437 441 305 114 51 18 -313 531 108 -9 150 -5 583 361 182 -58 353 1022 613
5236F13m95l49J74l08J63K18p46P63p55P95l03L10N34j303N53l80N06o47J759
$$ 613 118 -231 -57 -365 -202 16 -730 33 -722 73 -230 80 614 -689 -136 -516 -10 -657 1102
5255A102j554m16J012L93r96L9L61m25N95J19k51l59J4O32j199N85o41J692j031
$$ 1102 -452 -868 144 537 -459 -420 -59 -484 111 230 -21 -380 -366 266 -933 -348 -989 703 -328
5274c28J03M05P16j373R8L02R14l15q11K83j052R39p6J120J71j733j31R51n44
$$ -328 -225 180 896 -477 -379 -77 837 522 -289 -6 -1058 -119 -195 925 1096 -637 -768 183 -361
5293c61j7n02J433L82M97j218j50J50r08J019K02p28J236j231M46j35J8l41k24
$$ -361 -378 -880 553 935 1432 214 64 214 -694 325 527 -201 1035 -196 250 115 133 -208 -432
5312d32J282l97n76p23J231o68n89M74j03J144n1R1q76J23O68o22l15M98k40J16
$$ -432 850 453 -123 -846 385 -283 -872 -398 -501 643 592 683 -193 -70 598 -24 -339 159 -81 35
5332C5j70OJ18m8m56P60r82J264j385Q49k2K65n20k5J89M11j47k46Q66j091O62
$$ 35 -135 -129 -11 -59 -515 245 -737 527 -858 -9 -31 234 -286 -311 -122 289 142 -104 762 -329 333
5353C33n60L89m9l21k92M77K48l11Q32o79m39M59o06j16O45m67l1J18P00O4k16
$$ 333 -227 162 113 -208 -500 -23 225 -86 746 67 -372 87 -519 -635 10 -457 -488 -370 330 394 178
5374A78J96j09j138J180m75K56N0m34R22Q00j172J31L55n82o68M16j70J334k34
$$ 178 374 265 -873 307 -168 88 138 -296 626 1426 254 385 740 158 -510 -94 -264 1070 836
5393H36p14k34P86p10m89N14l68K62L21k93J322n92o88M32n84n58J102O00n50
$$ 836 122 -112 674 -36 -525 -11 -379 -117 204 -89 1233 641 -47 385 -199 -757 345 945 395
5412C95k89r93N18R91j88r94N8K11J50M23J46j92o59R35j76M5j22J72j019Q32
$$ 395 106 -887 -369 622 434 -560 -502 -291 -141 282 428 236 -423 512 336 381 259 431 -588 244
5432B44m47O52n4o20M77j95k74r0N2J231j403J176j064J111j169l07J874j585
$$ 244 -203 449 395 -225 252 57 -217 -307 -255 976 -427 749 -315 796 -373 -680 1194 -391
5450c91O95Q9m12m0n09M89M46m14L4K90J65q31M28q22Q77L38o72j13J061j052
$$ -391 304 393 -19 -59 -568 -79 367 -47 -13 277 442 -389 39 -783 94 432 -240 -353 708 -344
5470c44R65j162P33m18L07k52J00o78L29O6N02r05P91L73o93Q70j367k12O58M18
$$ -344 621 -541 192 -226 81 -171 -71 -749 -420 -354 148 -757 34 407 -286 584 -783 -995 -337 81
5490H1M4j071J511j27j479P94P19l8n05m45J32N06j33m02K34Q80l86J131k218
$$ 81 125 -946 565 438 -1041 -247 472 434 -71 -516 -384 122 -11 -413 -179 701 315 1446 -772
5509g72J055j03j09j84l39Q24j348J581m65K66M38j336Q99j64K10l81j194J100
$$ -772 283 180 71 -113 -452 372 -976 605 140 406 844 -492 407 243 453 72 -1122 -22
5527b2P4L70n55M45K06m97k38k76N03q15J599m87M09j004J013j489J631j080j8
$$ -22 52 422 -133 312 518 21 -217 -493 10 -805 794 307 716 -288 725 -764 867 -213 -231
5546b31M51o31M91o63J126j39l69k76O29q10Q37p27M80k66l1r3M45j55m59N54
$$ -231 220 -411 80 -583 543 404 35 -241 388 -422 415 -312 168 -98 -129 -222 223 68 -391 163
5566A63l07K69K92j029R16K94k82l88L74n64N8J210j536L64N7R13m27l29m27N29
$$ 163 -144 125 417 -612 304 598 316 -72 302 -262 -204 1006 -530 -166 -109 804 377 48 -379 150
5586A50p2p90J109m33k83P79n88k82L25l02N48L21J68j75m60l18M94q6p99N47
$$ 150 78 -712 397 -36 -319 460 -128 -410 -85 -387 161 482 650 475 15 -303 191 105 -694 -147
5606a47l50L53N6N62j057M35o88J116l91J45Q7j1o3R6p92K64J093j365J608o73
$$ -147 -497 -144 -88 474 -583 -148 -836 280 -111 34 121 110 47 143 -649 -385 708 -657 951 278
5626B78n89R28q45L81Q09q99j45L73o08M8K44N2n84R97m76P56n48l20M97k17m
$$ 278 -311 617 -228 153 962 63 -82 291 -317 -269 -25 27 -557 440 -36 720 172 -148 349 132 128
5647A28m37M89l32K48K33j33r7K94q42N97j19N19p86L28p56J063O65p13k25o73
$$ 128 -309 180 -152 96 329 196 99 393 -449 148 29 548 -238 90 -666 397 1062 349 124 -549
5667e49L30L63j224O92J12O27o81M10n36J170R8j348R57Mm16L99l21q14J053n59
$$ -549 -219 144 -1080 -388 -276 351 -330 80 -456 714 812 -536 421 425 9 408 87 -727 326 -233
5687b33N19m25P73r18j57Mn54O16K64q21J076L42m15j10R90j344K00O24m32M62
$$ -233 286 -139 634 -284 -441 -437 -991 -375 -111 -932 144 486 71 -39 951 -393 -193 431 -1 461
5707D61R26k180J041N8k56n07K48PR66p15J21L94p94M53j179P16L32K20r2n02
$$ 461 1387 -793 248 306 50 -457 -209 -202 764 49 170 564 -230 223 -956 -240 92 312 220 -282
5727b82J340j419l96J91k92J111n91l2k05P93j744J465Q91j84q46q5N7K16l39
$$ -282 1058 -361 -757 -566 -858 253 -338 -370 -575 218 -1526 -61 830 646 -200 -285 -228 -12 -351
5746c51n56M83p5J485q29j01n37J087j139L4K1M89n65J036j092N45r51J317j89
$$ -351 -907 -424 -499 986 157 56 -481 606 -533 -499 -478 11 -554 482 -610 -65 -1016 301 112
5765A12q72l19J649j370J932j374P0K99K07q29Q53p53j36J36l39Q58j140O66K98
$$ 112 -760 -1079 570 -800 1132 -242 -172 127 334 -495 358 -395 -531 -395 -734 124 -1016 -350 -52
5784e2N26r2j34J01K37k43j57P09q86m0l63k7J725j714M25j12R26o28O7n19O8
$$ -52 474 382 248 349 586 343 186 895 9 -31 -394 -421 1304 -410 15 -97 829 201 268 -251 -183
5805a83J38J78J98M23j065L9m4P74j13J14q04J242j023j42J73l42M85l2r07O34
$$ -183 -45 133 331 754 -311 -272 -316 458 345 459 -345 897 -126 -268 -95 -437 48 16 -891 -257
5825b57K50n45Q49q15L86L44k91l21J34L0L12j01J79N46q32N7J96J040k160R58
$$ -257 -7 -552 297 -518 -132 212 -79 -400 -266 -236 76 -25 154 700 -132 -75 121 1161 -999 -41
5845d1m57J72k42J258p69j6k77l11P86n11Q78j38j52m23M37N8J150j320O04j50
$$ -41 -498 -326 -568 690 -79 -95 -372 -683 103 -408 470 332 180 -243 194 252 1402 82 686 536
5865E36q67R06j7r58K80p1J18O8R3J92k42m84k1K5j60Q25M85m38p35K35L65j03
$$ 536 -331 575 558 -400 -120 -191 -73 -5 88 280 38 -446 -467 -442 -602 223 708 270 -465 -230 135 32
5887C2j49J58L51k45k1o8K29K20j411J035k45j12Q03j25n78q60J307j010J103
$$ 32 -117 41 392 147 126 58 287 507 -904 131 -114 -226 577 452 -126 -986 321 -689 414
5906D14l01l23k63K08K89K84k63n48p5n23J481j51l68Q3Q72j124p9P45m87n36
$$ 414 113 -210 -473 -265 24 308 45 -503 -578 -1101 380 229 -139 -56 816 -308 -387 358 -129 -665
5926f65K25K97R52K06j254M8k55J490q34o95N61K81n11J47l65J7L96k57M10r33
$$ -665 -440 -143 809 1015 -239 -191 -446 1044 210 -485 76 357 -154 -7 -372 -355 41 -216 194 -739
5946g39M35J688n17l2j495P71k57L64l57k16J335j498N46R07m67q95J353k93m85
$$ -739 -304 1384 867 835 -660 111 -146 218 -139 -355 980 -518 28 935 468 -427 926 633 148
5965A48p7j51n24Q46l2k53l03N64M9j109O57m88J117P0k57J52J24K01n58k36j38
$$ 148 71 -80 -604 242 210 -43 -346 218 267 -842 -185 -673 444 514 257 409 533 734 176 -60 -198
5986a98l40R50J36l2n35l4l4O05L65j782J79J119k93K77m04M67m01n09N15l15
$$ -198 -538 412 548 516 -19 -53 -87 518 883 -899 -720 399 106 383 -21 446 45 -464 51 -264
6006b64J187q07l3O51o94P06K51j295M4K41J88k03M79l10o48K43m24j38K70O07
$$ -264 923 116 83 734 40 746 997 -298 -254 -13 175 -28 451 141 -507 -264 -688 -826 -556 51
6026E1n67O17r64J159M07q72O58Jj031P07n16l38L93m66J052m48k27k28J06R98
$$ 51 -516 101 -863 296 703 -169 489 490 -541 166 -350 -688 -295 -761 291 -157 -384 -612 -506 492
6046D92p39L93L13r36P28j06j32p5n97M67M74k36O1j30k25M31J2K40j70p32J425
$$ 492 -247 146 459 -477 251 145 13 -62 -659 -192 282 46 107 -23 -248 183 195 435 265 -467 958
6067I58r22j84K13J90J73l16P0l00k07N15M5k76l6J78R5m7Q1Jo00P64k63P9J24
$$ 958 36 -148 65 255 428 112 182 -118 -325 190 235 -41 -77 101 196 149 230 231 -369 395 132 211 335
6090C35l60k28J05N42k9p8m8k81m57N79q2j93k0K77pp3L02k77p7k90O69j42q71
$$ 335 -25 -253 -148 394 365 287 239 -42 -499 80 -2 -195 -215 62 55 -18 284 7 -70 -360 309 167 -704
6113g04N04mj87J15J106o37K1n33k60J372k83j331J86P08J72P26r55K5k04M38
$$ -704 -200 -204 -391 -276 830 193 214 -319 -579 793 510 -821 -635 73 245 971 16 41 -163 275
6133B75k45j84j68R26k75l77L72M57l18n35J128p97o25P46m91k39O84o1J072j414
$$ 275 30 -154 -322 604 329 -48 324 781 463 -72 1056 259 -366 380 -111 -350 334 273 1345 -69
6153f9N08l27n49J46R53q36j131R49M24L73K40l02n00l21L77j01M36j65M25r36
$$ -69 439 112 -437 -291 662 -174 -1305 -356 68 441 681 379 -121 -442 -65 -166 270 105 530 -406
6173d06L81P1K00o06P66J41J56K3j178J105o23R00J4j374K03L64j029R20K91o8
$$ -406 -25 46 246 -360 406 547 703 726 -452 653 30 930 944 -430 -227 137 -892 28 319 251
6193B51j80O15j271R52q9M86j055Q54n27M35o42N85q22M52Jl17o62J268j08j022
$$ 251 71 686 -585 367 278 764 -291 563 36 471 -171 414 -408 44 45 -272 -934 334 226 -796
6213g96N29J079q14n16N30l21m28L77N18M84k53m87l01O86o32j61M28Q4j031Q74
$$ -796 -267 812 -2 -518 12 -309 -737 -360 158 642 389 -98 -399 287 -345 -506 -78 6 -1025 -151
6233a51K91k54m67N79m66J60J39L56K1L26n93j70n20P33q8k89j01L06m4L73K06
$$ -151 140 -114 -581 -2 -468 -308 -169 187 208 534 -59 -229 -749 -16 -104 -393 -494 -188 -232 141 347
6254C47k54q03P23l06L27Lj81n98N77N57m76R2J28J17L84qj199J208o63L81j25
$$ 347 93 -710 13 -293 34 37 -144 -742 -165 392 -84 8 136 253 637 629 -570 638 -25 356 231
6275B31n02NK20l11P64l40J70M01n51L10j42n09N92r88j49P74M27j27j33j78N08
$$ 231 -271 -266 -46 -357 407 67 237 638 87 397 255 -254 338 -650 -799 -25 402 275 142 -36 472
6296D72q22N06L95j180k56N77p5O35n09Q50p88k9R24p88j028P54M68l25P29o93
$$ 472 -350 156 551 -629 -885 -308 -383 252 -257 593 -195 -224 700 -88 -1116 -362 106 -219 510 -183
6316a83K81m9Pn30M26p5M74Q53j217l99J094j188J97P09K8o16Q62q02L07J34q1
$$ -183 98 49 56 -474 -48 -123 351 1204 -13 -412 682 -506 -309 400 428 -188 674 -128 179 313 232
6337B32p31P83j50K78K18j150N79O8M14m73L63r96K48J420j150L57J83k88p89
$$ 232 -499 284 134 412 630 -520 59 127 541 68 431 -565 -317 1103 -47 310 493 205 -584
6356e84J366o55K13O5j65j07o7M73r00O5k50K16l70J116j05k48N03p66r5j95N55
$$ -584 782 127 340 405 240 133 66 539 -361 -296 -546 -330 -700 416 311 63 566 -200 -295 -490 65
6377F5J24o71N28k3L98l51L7Q3J62l14r80R67o38J504q58J05p43M7O12M93m39
$$ 65 189 -482 46 23 421 70 107 190 352 38 -942 25 -613 891 33 138 -605 -558 54 547 108
6398A08j593K097K21j093K50L45m67K1L07m0j41N22j093J10p48J672O34m45k85
$$ 108 -1485 612 833 -260 -10 335 -132 -111 196 156 15 537 -556 -446 -1194 478 1112 667 382
6417C82j034O15j86k22J49L77K0n04l00J640J48j222J171j046R3J57k82l66j02
$$ 382 -652 -37 -223 -445 -296 81 101 -403 -703 937 1085 -137 1034 -12 81 238 -44 -410 -512
6436e12N20Q4l81O16K26l16j416R3J156k81M83r22K04J334r01o27O57J33k10n68
$$ -512 8 92 -289 327 553 237 -1179 -1086 70 -211 272 -650 -446 888 -13 -640 17 150 -60 -628
6456f28J32j82K76K77M36P71l59j423J689j179K2L57m59J286q78o2j221J214M74
$$ -628 -496 -678 -402 -125 311 1082 723 -700 989 -190 -168 189 -270 1016 138 76 -1145 69 543
6475E43o10l36o13J077q46J098P5K52J64r90J84Q8p68J02P61m00R19j085l83M70
$$ 543 -67 -403 -1016 61 -785 313 388 640 804 -186 -2 86 -682 -580 181 -219 700 -385 -768 -298
6495b98L10k90M30k65M75n20n40R32P47j254R9p62K35O04J92q41R30J75n20J56
$$ -298 12 -278 152 -113 362 -158 -698 234 981 -273 -174 -936 -701 -97 95 -746 184 359 -161 -5
6515el02O4N21n65R73m77K2R32j683K02j15N36j155J370l93m11J017o99m04J127
$$ -5 -307 -243 278 -287 686 209 231 1163 -520 -318 -433 103 -1052 318 -75 -486 531 -168 -572 555
6535E55m28P37m63l20J91n03O51N04o89j98l96L72J94P84p77m43N56J35J02N55
$$ 555 127 864 401 81 272 -231 420 924 235 37 -359 13 207 991 214 -229 327 462 564 1119
6555A119r96J81k99Q2n13M90n16J192j88j287Q28l52J117j291m19K55N00P72j63
$$ 1119 123 304 5 87 -426 64 -452 740 552 -735 93 -259 858 -433 -852 -597 -97 675 512
6574E12p75N88L6p50l9N86l09l43J394j622J775pp28n27J310r44L37n45n38R53
$$ 512 -263 325 361 -389 -428 158 -151 -494 900 -722 1053 1046 318 -209 1101 157 494 -51 -589 364
6594C64o22K14L15N5o37J287j50m03L01k76n92K36j435J650n13JN57j000O60m3
$$ 364 -258 -44 271 326 -311 976 826 423 724 448 -144 92 -1343 307 -206 -205 352 -648 12 -31
6614c1L22j042J177q18Q66j562R72O20m99L31j66P9m47l74J120p03R82j627R32
$$ -31 291 -751 426 -392 474 -1088 -116 504 5 336 170 249 -198 -572 548 -155 827 -800 132
6633A32K76o66L04P59j868J440J17j01L48j360L40j12K86p43M66n72J097m72K58
$$ 132 408 -258 46 805 -1063 377 494 393 741 -619 -279 -391 -105 -848 -382 -954 143 -329 -71
6652g1O18j36p32N46L53m50q50J96J168n94k89l95K90L4N94J039q80k29Q8k77
$$ -71 547 411 -321 225 578 128 -722 -526 642 48 -241 -636 -346 -312 282 1321 441 212 300 23
6672B3O12l62j299J035p44J811Q4j314M59L78o25Nq11Q68J08o64M56N62q66P16
$$ 23 635 273 -1026 9 -735 1076 1160 -154 305 683 58 63 -748 120 228 -436 20 582 -284 432
6692D32k71m39O71k78L07j84r42N04K79o11O77L30r72O07j58O94j632Q74o9P95
$$ 432 161 -278 393 115 422 238 -704 -200 79 -532 145 475 -497 110 -48 646 -986 -112 -181 614
6712F14n74J6m4L56k99K59m81R26n56M14q58P25j54r02O07J75m73o02J738m44
$$ 614 40 56 12 368 69 328 -153 773 217 631 -227 498 344 -558 49 224 -249 -851 887 443
6732D43m68k07N28q32P68l64L8Q0n54P5J309k08l87J7L95r35J77k41N66j192J129
$$ 443 -25 -232 296 -536 232 -132 -94 -14 -568 -493 816 608 221 238 633 -302 -125 -366 200 -992 137
6753A37O86j345N91L45j82Pr68P56P2o18L04o53J144J8n16J01j83K96J406p39
$$ 137 823 -522 69 414 232 239 -729 27 99 -519 -215 -868 276 294 -222 -121 -304 -8 1398 659
6773F59j046M17O92n33l30q40P97p46N99M6k37O09j52J75O72p32m65R32j73r8
$$ 659 -387 30 722 189 -141 -981 -184 -930 -331 -285 -522 87 -65 110 782 50 -415 517 344 246
6793B46L6L83r31m58M50L23J98m68p08J083l53p7M30M54l82p89J366r88J16L67
$$ 246 282 665 -266 -724 -274 49 247 -221 -929 154 -199 -276 154 608 226 -563 803 -185 -69 298
6813B98J43j250P98J90n28P03n47o05L13K57n66P85j69l49L91M05p7o00R44l68
$$ 298 441 -809 -11 179 -349 354 -193 -798 -485 -228 -794 -9 -178 -527 -136 269 192 -408 536 168
6833A68O78j201l28J223j93n02k92N74r04L63L39K13n56Q01j091o67K128q10o51
$$ 168 846 -355 -683 540 347 -155 -447 127 -777 -414 -75 138 -418 383 -708 -1375 753 -57 -708
6852g08R85j13j86M18j128Q34O60j027J99M38q6m42j3j116J413L7q82M41O13r24
$$ -708 277 164 -22 396 -732 102 762 -265 -66 372 286 -156 -169 -1285 128 165 -717 -276 337 -587
6872e87O06N43k96p69R28J1o52L22J51j86l10O30l36m76M32K65J75m13L85o91
$$ -587 19 562 266 -503 425 436 -216 106 257 71 -239 391 55 -421 11 276 451 38 423 -268
6892b68l04J022q03O95j702J071J694j614N64l35l53M17m8P04k22n44l83J089
$$ -268 -572 450 -353 342 -1360 -289 1405 -209 355 20 -333 84 36 740 518 -26 -409 680
6910F80r99N86m97K77q87J208p50M43m19P33O1r1K18j016R38j667J714r69Q1L28
$$ 680 -319 267 -230 47 -840 368 -382 61 -358 375 436 345 563 -453 485 -1182 532 -437 -356 -28
6930b8R5M67r58J248j244Q89k10J70p92N45p37L14k90R78l96R4L08m61n21N21
$$ -28 67 534 -424 824 -420 469 259 429 -363 182 -555 -241 -531 447 51 145 453 -8 -529 -8
6950hn37J215j40m69M1m85O65r62O93k26j08M07l68L03K21J56r48K76o35N23N77
$$ -8 -545 670 530 61 102 -383 282 -680 13 -213 -321 86 -282 21 242 398 -550 -274 -909 -386 191
6971A91p57K93j87N64J93r06l20J019j60N6J69r39M45M15m53l84M59p5J44N89
$$ 191 -566 -273 -460 104 297 -609 -929 90 -70 -14 155 -784 -339 76 -377 -761 -302 -377 -233 356
6991C56l26p47j40L85K76l69Q80k35k91J250j150O70NJ75p58J95p15Q99RM06r99
$$ 356 30 -717 -857 -472 -196 -565 315 80 -211 1039 -111 559 564 739 -19 176 -539 360 369 775 -224
7012b24j078J572n05l55R53k61k74M33o51m97J478o46K16k87k40O36k50L18l02
$$ -224 -1302 270 -235 -590 363 102 -172 261 -390 -887 591 -55 161 -126 -366 270 20 338 36
7031C6K06O83p66j35K25Q0p85O20m0O00o53l15L81m09l9k59O45l67Q78r70O0J67
$$ 36 242 925 159 24 249 329 -456 164 124 724 71 -244 137 -272 -311 -570 75 -292 586 -384 -324 -157
7053a57j61O10m74N23k98L10m59k73J95L48K67r33R79n37M27j02O26j444N80j30
$$ -157 -318 292 -182 341 43 353 -106 -379 -184 164 431 -502 477 -60 367 265 891 -553 27 -103
7073a03J05J90q59L89m77J325m48l50M02p36Q20l8r74K19M68K47N43r07K43o72
$$ -103 2 192 -667 -278 -755 570 122 -228 174 -562 258 220 -754 -535 -67 180 723 -184 59 -613
7093f13j9J151r50Q7N44p03P91m31L93l01j323J013M72q78J103j65j75n04Q54
$$ -613 -632 519 -431 -344 200 -503 288 -143 250 -51 -1374 -361 111 -767 336 171 -4 -508 346
7112C46q05K11Q26l80L4Q1J256j455p46m3J157m48Q45o1m64j241L13K6J42J25
$$ 346 -459 -248 578 198 232 313 1569 114 -632 -675 482 34 879 818 354 -887 -574 -548 -406 -281
7132b81k10o10J365j15K27p9P82j440O63p52K32N01K75k34l84p8o3K7L41K90j291
$$ -281 -491 -1101 264 149 376 297 1079 -361 302 -450 -218 283 558 324 -60 -138 -201 -174 167 457 -834
7153h34J309k87N24j346K244k257J03N46l28K44l32l22P42j108J848j119m66J943
$$ -834 475 188 712 -634 1610 -647 -544 2 -326 -82 -414 -736 6 -1102 746 -373 -839 1104
7171A104j372Q52o23O87q87k52L32P4L00L27K90r86N17p28J431j135P20q85J229
$$ 1104 -268 584 -39 648 -239 -491 -159 -85 215 542 832 -154 363 -365 1066 -69 651 -234 995
7190I95k59j103j07J33L02q15L40P84O43j027L11n56L52L81o61k72K68J61J199
$$ 995 736 -367 -474 -341 -39 -854 -514 270 913 -114 197 -359 -7 374 -287 -559 -291 -130 1069
7209A069q05J086j006n2l61r57J643l84o23O68N6j014J167J01n96L04Q7j24Jk47
$$ 1069 264 1350 344 292 -69 -1026 617 233 -390 278 334 -680 487 588 -8 296 383 259 260 13
7229A3n8n04L75K4L51n65J192j233J356j156P59M39j099o31P08J12j72k95L38
$$ 13 -45 -549 -174 -150 201 -364 828 -405 951 -205 554 993 -106 -737 -29 83 -89 -384 -46
7248d6j95L19l81m4Q5M84l4j93k36J48L42o80M62j43Q71j140J22m76M81O8l4J
$$ -46 -241 78 -303 -347 -262 222 188 -5 -241 -93 249 -431 31 -112 759 -381 -259 -735 -254 -186 -220 -219
7270b19J57k1K16l95N56n76r5k61m57K087q85m8o1p24Q79Q2p06j18M92l31j97
$$ -219 -62 -83 133 -262 294 -282 -377 -638 -1095 992 107 59 -2 -726 153 235 -471 -589 -97 -428 -625
7291f25L35N38M4o16m38N7J30L75j51O00m1l03J299r23n58J047j435R31l28j683
$$ -625 -290 248 292 -324 -762 -705 -575 -200 -351 249 208 -95 1204 281 -277 770 -665 266 -62 -1745
7311a745J352M80o17J249j903P11Q94n88L48M47l70j131k07J547n84q88O70R85
$$ -1745 -393 87 -530 719 -1184 -473 421 -167 181 628 258 -873 -1080 467 -117 -1005 -335 650
7329F50j280J53O39l20N77r22N74j040P06O0P70J81m20J96o48n3K27n4N70j31
$$ 650 -630 -477 162 -158 419 -503 71 -969 -263 -203 567 748 328 524 -124 -177 50 -4 566 435
7349D35m07Q71j096K13K66o96M31M65j000k0J137o45N77p69n4p3K24J91k56l15
$$ 435 28 899 -197 16 282 -414 17 482 -518 -538 599 -46 531 -238 -292 -365 -141 50 -206 -521
7369e21R34m49R43n01p84L68P27m30pk44J89N68l84l08P90o51q65J665m18q36
$$ -521 413 -36 907 406 -378 -10 717 287 280 36 225 793 409 101 891 240 -625 1040 622 -214
7389b14l22J382r85j98Q80l62n0j62K26l43J39n3O6O24j115j20Q69N45p63o9l65
$$ -214 -536 846 -139 -337 543 181 131 -31 195 -148 -9 -62 4 628 -487 -607 262 807 44 -25 -390
7410c90K89Q29l51o11k23N82L55o89r4L57J11j40p69O33M95o1l24k22M35K47K99
$$ -390 -101 728 377 -234 -457 125 480 -209 -303 54 165 25 -744 -111 384 323 -1 -223 212 459 758
7431G58j378J649l80k55o10K76K34n30o53M72J015n69N33q53n91J032m71J072
$$ 758 -620 1029 649 394 -216 60 294 -236 -889 -417 598 29 562 -291 -882 150 -321 751
7449G51o0r08L87O66p08k00P54j158O86j086J114p41L79N29o89P46j738J031K25
$$ 751 691 -217 170 836 128 -72 682 -476 210 -876 238 -503 -124 405 -284 462 -1276 -245 -20
7468b0P75p59J95L4J64L1N05j806P38O40J12j182m23R61P2l53j68O42o46R45J07
$$ -20 755 -4 191 225 389 420 925 -881 -143 497 609 -573 -996 -35 37 -316 -484 158 -488 457 564
7489E64r86j15O17p12M34L36j45P03p66o6K14L86Q7J81j14n6l50j202P06N20O17
$$ 564 -422 -537 80 -632 -198 138 -7 696 -70 -136 78 464 551 732 618 562 212 -990 -284 236 853
7510H53r45L29O24k072Q08J489o72p78l2J018m17K03n08M39m67J17P0o62J958
$$ 853 -92 237 861 -1211 -403 1086 414 -364 -396 622 205 408 -100 339 -128 -11 59 -603 1355
7529A355q25q49J7j81J25N81r09N31J20M79J09o1j728Q66Q05j583J113J25j090
$$ 1355 530 -319 -302 -483 -358 223 -686 -155 -35 444 553 492 -1236 -370 435 -1148 -35 90 -1000
7548a000R86J22m76J212j133K09k29N8N78l33j09O39L88n93n38m16l31J226n00
$$ -1000 -14 108 -368 844 -289 -80 -309 -251 327 -6 -115 524 912 319 -219 -635 -966 260 -240
7567b40L58M03M73r24O63L46j914J602p4j335N45j45M32M2j278N93n00J762j181
$$ -240 118 521 994 70 733 1079 -835 767 693 -642 -97 -242 190 232 -1046 -453 -953 809 -372
7586c72n99N90L98j32n98K97J54P51P1N6m20o05K77l3n86J194r75N92K97n96J34
$$ -372 -971 -381 17 -115 -713 -416 -262 489 560 616 196 -409 -132 -165 -751 443 -532 60 357 -239 -105
7607a05J94Q10j434L66N86q93R18j185N85P35j494J174n37M14j34J184j066r5
$$ -105 89 899 -535 -169 417 -476 442 -743 -158 577 -917 257 -280 134 0 1184 118 23
7625B3l35k10L1N57J93j009K306r79o95J671n04j233m20M52l22J95m15J282q54
$$ 23 -312 -522 -491 66 259 -750 1556 577 -118 1553 1049 -184 -604 -152 -474 -279 -694 588 -266
7644b66j096J424J301j015j80K83J97l53N77r90L03n53N76j71N05j61o85J375
$$ -266 -1362 62 1363 348 168 451 648 295 872 -118 185 -368 208 37 542 381 -304 1071
7662A071j641P64j099P82R7k24j64L75m3j36J57p3P98k42K70m25l1J207j173j69
$$ 1071 -570 194 -905 -123 -26 -250 -414 -39 -82 -218 -61 -134 664 422 692 267 236 1443 270 101
7682A01k36P90r55Q12m41k74R2J197j201j16O85p18Q39p64J0j46n3L34M62j28
$$ 101 -135 655 -300 512 71 -203 -111 1086 -115 -231 454 -264 575 -189 -179 -325 -378 -44 418 290
7702B90MJn85O83k36o35k50J014M3q02l1K00P55q14J197j474K16J69O12p68J235
$$ 290 294 295 -290 393 157 -478 -728 286 329 -473 -504 -304 451 -363 834 -640 -424 -255 357 -411 824
7723H24n34j392J248m74N20j43n94K60P86o58M04j69o75Q00p01J749o94o59N9
$$ 824 290 -1102 146 -328 192 49 -545 -285 501 -157 247 78 -597 203 -498 1251 557 -102 -43
7742d3k32r18J409n52o30L34O94m20l22P19N5o79O86o08K47K63L15k38o62J520
$$ -43 -275 -1193 216 -336 -966 -632 62 -358 -680 39 94 -585 101 -507 -260 3 318 80 -582 938
7762I38j114m0N48k60N94q33o9M16mq62J89P7M91n84L27M44J51k00k53k18j196
$$ 938 -176 -216 332 72 666 -167 -236 180 176 -686 -497 -420 71 -513 -186 258 409 209 -44 -262 -1458
7783a458J333k59L40R94j053O76j141P71J60m14O18O6m86j679J367Q92l90m40
$$ -1458 -125 -384 -44 950 -103 573 -568 203 363 -51 567 633 147 -1532 -165 727 337 -103
7801a03l71P5L95O8p37J081m22L66j16k54O5L42o72Q27j459R72j053N54J9J6m
$$ -103 -474 -399 -4 64 -673 408 -14 352 236 -18 47 389 -283 544 -915 57 -996 -442 -423 -407 -411
7822d11K36n67N05L37j47j083P63L36Q33q03K82l34l93J047p33l64R02J52J63
$$ -411 -175 -742 -237 100 -47 -1130 -367 -31 802 -1 281 -53 -446 601 -132 -496 406 558 721
7841G21n41J4K99o26J215j167L30q96P11j404J205o63L43P49p52J743r88m39M87
$$ 721 180 194 493 -133 1082 -85 245 -651 60 -1344 -139 -802 -459 290 -462 1281 293 -146 341
7860C41o07M6j67J53k87L91j08L29l25n90R11j94k21O00K0Q9oo43M98N4l65j84
$$ 341 -266 -220 -387 -234 -521 -130 -238 91 -234 -824 87 -107 -328 272 292 381 375 -268 230 284 -81 -265
7882b65K92M28o7p43N03n63p19J135p59P03L33r5K49p59o99l8N44J99J35J480
$$ -265 27 455 388 -355 148 -415 -1134 1 -758 -55 278 183 432 -327 -1026 -1064 -520 -321 -186 1294
7902A294m94j23q12O07k68L21k96M63p19J123j7j213M05j36J91j127P16J57o47
$$ 1294 800 677 -135 472 204 525 229 692 -27 1096 1079 -134 271 135 326 -801 -85 72 -575
7921e75n5m62J351o16k46R84p34P7J69l05M54k95J389j174j98P43q59j76o54J539
$$ -575 -630 -1092 259 -357 -603 381 -353 -276 -107 -412 42 -253 1136 -38 -236 507 -352 -528 -1182 357
7941C57m50m22O01n81L45j89L30K83j89k52P96j342P35k28R75j286K30J379j474
$$ 357 -93 -515 86 -495 -150 -339 -9 274 85 -167 629 -713 22 -206 769 -517 -287 1092 -382
7960c82j58N18O53n53K5j5N91m07j9r69O13k60J194n91l09R5K56j63O2k98p06
$$ -382 -540 -22 631 78 103 88 679 272 253 -716 -103 -363 831 240 -69 26 282 119 181 -117 -823
7981h23N80k60P15m96N64j025M75O10p13O16j25O27r64Q28K93k66p08k70K42J03
$$ -823 -243 -503 212 -284 280 -745 -270 340 -373 243 118 745 -219 609 902 636 -72 -342 -100 3
8001Cj94P93j012O45J63l82m43J84N69r59M85M81Q26j020Jk16J06J58j19p71Q62
$$ 3 -191 602 -410 235 398 16 -427 -243 326 -633 -148 333 1159 139 140 -76 30 188 69 -702 160
8022A60p72J100O7q33P40j71Lr78O80J55l27L30o74j91P65k11K06j08P89j67K51
$$ 160 -612 488 555 -278 462 291 294 -684 -4 151 -176 154 -520 -711 54 -157 49 -59 730 563 814
8043H14l87j24J26l37k07K71pk80j42J38K06n37N16n06J178j209K29l80R01n50
$$ 814 427 303 429 92 -115 156 149 -131 -273 -135 71 -466 50 -456 722 -487 -258 -638 263 -287
8063b87L47J38m61N57j092N05J215j84k6p67M26j89j559J357L70J06o50K58L73
$$ -287 60 198 -263 294 -798 -293 922 738 712 -55 371 182 -1377 -20 350 456 -194 64 437
8082D37m30o47O35l52J165j005j06J030r56L02o52N48k88J098j033P93j220M6
$$ 437 7 -640 -5 -357 808 -197 -303 727 -229 73 -579 -31 -319 779 -254 539 -681 -635
8100f35J163j076M79R71p25J02L46q47o27j9M67k32R15K81n48K77j8j043n18J916
$$ -635 528 -548 -69 902 177 279 625 -222 -849 -868 -401 -633 282 563 15 292 274 -769 -1287 629
8120F29q29q2J241m94r33k5R45j244L86K89P4M02j181O48j192J839k65q99R87
$$ 629 -200 -282 959 465 -468 -493 452 -792 -406 -117 -43 359 -822 -174 -1366 473 208 -691 296
8139B96J45m87j8q08K95J21O63J12p66M94M38r90P20n59P28m47L00O07j115l80
$$ 296 441 -46 -64 -872 -577 -456 207 319 -447 47 485 -505 215 -344 384 -63 237 844 -271 -651
8159f51K45O31m53N27l96J075j252n84Q13M47k82O90j388J010m06p63J331m62
$$ -651 -406 225 -228 299 -97 978 -274 -858 -45 402 120 810 -578 432 26 -737 594 132
8177A32q66K54p0L8O52N02l26j26P5j243J152q38J243r04
$$ 132 -734 -480 -550 -512 140 642 316 190 265 -978 174 -664 579 -325
8191c25
$$ Imaginary data points
##PAGE= N=2
##DATA TABLE= (X++(I..I)), XYDATA
0@%%%%%%%%%%%%%J08k16K16k16K16l24M32m32N40o48P56q97J006j190J406j622
$$ 0 0 0 0 0 0 0 0 0 0 0 0 0 0 108 -108 108 -108 108 -216 216 -216 324 -324 432 -465 541 -649 757 -865
29h65J845k157K477k807L204l610M065m557N106n718O379p108P902q767R714j0748
$$ -865 980 -1177 1300 -1507 1697 -1913 2152 -2405 2701 -3017 3362 -3746 4156 -4611 5103 -5645
45e645J1885j3129J4474j5940J7562j9355K1325k3500K5916k8617L1659l5096
$$ -5645 6240 -6889 7585 -8355 9207 -10148 11177 -12323 13593 -15024 16635 -18461
57a8461L9023m3567M8889n5220O2901p2451Q4692j01036J24052j59053K19188
$$ -18461 20562 -23005 25884 -29336 33565 -38886 45806 -55230 68822 -90231 128957
68A28957l49867J138919q70636j325921K464019q10582j272833J032688N64552
$$ 128957 -220910 918009 47373 -1278548 1185471 374889 -897944 134744 699296
77F99296j075904p6269J023511k31713j107795R10064N61261j158610k5865J137119
$$ 699296 -376608 -452877 570634 338921 -768874 141190 702451 -456159 -482024 655095
87F55095n24701p89564Q52377L40301r52381J96735O82247m73087m17454O40049
$$ 655095 130394 -659170 193207 533508 -418873 -222138 460109 -12978 -430432 209617
97B09617Q6712o82419K73828N72632n64117l22306O98413O8816q05435L21069
$$ 209617 296329 -386090 -112262 460370 -103747 -426053 272360 341176 -464259 -143190
107a43190O45870p01421j19444O29637l32402j76321K94349m2376j37534K557
$$ -143190 502680 -198741 -318185 311452 -20950 -197271 97078 54702 -82832 -80275
117h0275K42145j54544k63811M46323p0921m01371L87836N3983l38325J94983
$$ -80275 161870 7326 -256485 189838 118917 -282454 105382 159365 -178960 16023
127A6023J37829k56341M682K75160j77438k40088L59566P0405m28758J46761L61586
$$ 16023 153852 -102489 -97807 177353 -85 -240173 119393 189798 -238960 -92199 269387
138B69387l01068k14210L73959L7344l61853J40325K80531k94719j10169L88735
$$ 269387 -31681 -245891 128068 165412 -196441 -56116 224415 -70304 -180473 208262
148B08262j52003l18475L86166O0347l96103J68971K42497k27051j33204K43351
$$ 208262 56259 -262216 123950 184297 -211806 -42835 199662 -27389 -160593 82758
158H2758M8076l10786J54439K46092l69000K7648L63012k78350j86416L46053
$$ 82758 130834 -179952 -25513 220579 -148421 -120773 242239 -36111 -222527 123526
168A23526L0675l54198R8746L62513k73177k31813M07369j7012l55177J99762
$$ 123526 154201 -199997 -101251 261262 -11915 -243728 163641 146629 -208548 -8786
178h786J75019k47724l3587K44484p6149k16657K14979J15527l21061P7667K73887
$$ -8786 166233 -81491 -115078 129406 53257 -163400 51579 167106 -153955 -76288 197599
189A97599k63166q8462K92505j00717j84430J88249P3392k12764J6062K37979
$$ 197599 -65567 -154029 138476 37759 -146671 41578 114970 -97794 -81732 156247
199A56247j58577j92591L15211J1826l39448J93466K15268k77934o5054K71869
$$ 156247 -2330 -194921 120290 132116 -207332 -13866 201402 -76532 -141586 130283
209A30283m8828k45289J68639J55537k73898K5123K53346j94794j10190K47217
$$ 130283 81455 -163834 4805 160342 -113556 -88433 164913 -29881 -140071 107146
219A07146l2659k08912J19489J58049j95641p8100K55927o9783k21005K18734
$$ 107146 74487 -134425 -14936 143113 -52528 -130628 125299 55516 -165489 53245
229E3245P0787k48445R7162J63679j76084o6714J95204j3858k12990J19725J80798
$$ 53245 124032 -124413 -27251 136428 -39656 -106370 88834 74976 -138014 -18289 162509
240A62509k36854m4953K64307j13674j69286J84444M6591j78946L3125J62268
$$ 162509 -74345 -119298 145009 31335 -137951 46493 93084 -85862 -52737 109531
250A09531j17980j08802K06496j7401k09062J57035J03336k10082K0036J71543
$$ 109531 -8449 -117251 89245 71844 -137218 19817 123153 -86929 -66893 104650
260A04650r1384j17605J39009N6863j81340N3033J60309j71898m6561K06471q9368
$$ 104650 13266 -104339 34670 91533 -89807 -36774 123535 -48363 -94924 111547 22179
271B2179j43734J57834N7217j67318M822J73598q0672j45231J69406L9615j88993
$$ 22179 -121555 36279 93496 -73822 -69000 104598 23926 -121305 48101 87716 -101277
282a01277Q4405J12541j45165j0654J35979n1948j15183J08471Q0966j73168J0308
$$ -101277 -16872 95669 -49496 -60150 75829 23881 -91302 17169 98135 -75033 -64725
293f4725J78334j22251r2102J64149j5487j25919P5479P4816j05284k9935J36665
$$ -64725 113609 -8642 -100744 63405 47918 -78001 -2522 72294 -32990 -62925 73740
304G3740m8375j31421J45353M8270j77861N8685J25808j09786n8484J15900P577
$$ 73740 25365 -106056 39297 87567 -90294 -31609 94199 -15587 -74071 41829 49406
315D9406j13069M9908R2300j17692j5687J38395q5566q3420J34037O886j24064
$$ 49406 -63663 -13755 78545 -39147 -54834 83561 -2005 -85425 48612 55498 -68566
326f8566M4313J00594q0454p3070J19125P403j25000Q1017O2548j17460K4455
$$ -68566 -24253 76341 -4113 -77183 41942 49345 -75655 5362 67910 -49550 -25095
337b5095R1395p4272n1882R2634J9393j15403L1713J15037r8623n2713J26794
$$ -25095 66300 -7972 -59854 32780 52173 -63230 -31517 83520 -15103 -67816 58978
348E8978l3759q5625P6255K3086p5907J5512P5145n3092o3964J04034J0982j24985
$$ 58978 25219 -60406 15849 38935 -36972 -21460 53685 593 -63371 40663 51645 -73340
360g3340O2962Q3970j01984j9419R2044k4575o5225M9474M0118p8037P196Q5246
$$ -73340 -10378 73592 -28392 -47811 44233 19658 -45567 3907 44025 -34012 -26816 58430
372E8430p1115m4103J06269k0610q7511N9598N0271o7222k6409P4725o660p3699
$$ 58430 -12685 -56788 49481 28871 -58640 958 51229 -15993 -42402 32323 25663 -48036
384d8036N8171L0108q3894L6324N5307p2101q583P1869j8094o5320L8541N7752
$$ -48036 10135 40243 -43651 -7327 47980 -24121 -32704 39165 21071 -44249 -5708 52044
396E2044o8983k6628Q5752k9091n6007O2625L734n6140L1608L4667m7319j7712
$$ 52044 -16939 -43567 42185 13094 -42913 19712 23446 -32694 -1086 33581 -13738 -31450
408c1450O2436o482p1401M8132M7625p7298N47O1870l4521k6746L9089L842l6702
$$ -31450 30986 24504 -46897 1235 48860 -28438 -27891 33979 -542 -27288 11801 15643 -21059
421b1059J5128M0426m9631j7161P3216l1221n5907O0199J6737n3262L782M2044
$$ -21059 -5931 34495 -15136 -32297 40919 9698 -46209 13990 30727 -22535 -18753 23291
433B3291j3160l8122L5187J6289n2524K8527L1294n5433P075M8148k9288l1671
$$ 23291 10131 -27991 7196 23485 -29039 -512 30782 -24651 -17576 30572 1284 -30387
445c0387L5194K2295m2365o396M6276j9024l3160M3856m670l4726L2094R533l6443
$$ -30387 4807 27102 -15263 -21659 24617 5593 -27567 16289 11619 -23107 8987 18520 -17923
458a7923Q273L1760j6653l5331L3216K8041n3280N150M5820l2205j1018K6461
$$ -17923 -9650 22110 5457 -29874 3342 31383 -21897 -16747 29073 -3132 -14150 12311
470A2311j0839j2500J1577J1763k4822m637M3660k4929l2068M8025J233l7810
$$ 12311 1472 -11028 549 12312 -12510 -17147 26513 1584 -30484 17541 18774 -19036
482a9036J6196J8480j3604j4639J5965O617k2708J4470J4130l3525J3819K7420
$$ -19036 -2840 15640 2036 -12603 3362 9979 -12729 1741 15871 -17654 -3835 23585
494B3585l1301r529K8012l52k0773N43K1612q496j7049K1069k194j8492K3387
$$ 23585 -7716 -17245 10767 10415 -10358 -9815 11797 3301 -13748 7321 5127 -13365 10022
507A0022k951k2307J8253J1919j6477j0942J9555J3200l2911L234K9119k4220
$$ 10022 7071 -15236 3017 14936 -1541 -12483 7072 20272 -12639 -9405 19714 -4506
519d506n686J8316j0885j117Q123l445p417L946J5891j7066j4982L1034l959k4551
$$ -4506 -10192 8124 -2761 -3878 4245 800 -6617 -2671 13220 -3846 -18828 12206 8247 -16304
533a6304J6751Q032j0461r31M110K586n620M483L381j4881Q201J5639k3970p26
$$ -16304 447 8479 -1982 -2913 1197 3783 -1837 2646 6027 -8854 -653 14986 -8984 -9710
547i710J9885p556q600K062Q696j063j2846R531K554r770J0855l380j0092J5746
$$ -9710 10175 2619 -5981 -3919 4777 3714 -9132 399 2953 -6817 4038 658 -9434 6312
561F312M83j2575P52J0889K347j8324N565J7418j3464m562J1114p041L079K202
$$ 6312 6795 -5780 -5028 5861 8208 -10116 -4551 12867 -597 -5159 5955 -1086 1993 4195
575D195q569J319N386J803q244n524J7030j797j6398J2401N650j0059J977M2l39
$$ 4195 -4374 -3055 2331 4134 -4110 -9634 7396 5599 -10799 1602 7252 -2807 -830 -788 -1127
590a127L178l640J502j585L992L704j1495L164J1242q219n551K871N689M3q254
$$ -1127 2051 -1589 -87 -1672 2320 6024 -5471 -2307 8935 716 -4835 -1964 3725 3768 -4486
605d486L763K658l029L802n917k677J2480n802q424P560L156J74o714q62J2341
$$ -4486 -723 1935 -1094 2708 -3209 -5886 6594 792 -7632 -72 3084 3258 -3456 -4318 8023
620H023n718q249P618k68k712M329q544M448Q214q324k531M233R88J818q455K632
$$ 8023 2305 -5944 1674 1406 -1306 3023 -5521 -1073 7141 -1183 -3714 519 1507 3325 -5130 -2498
636b498O993n393k396Q17K386L138l666q73J713J795N84q673M623P893p860m52
$$ -2498 4495 -898 -3294 -2477 -91 3047 -619 -1492 221 2016 2600 -6073 -1450 6443 -1417 -1869
652a869K217P4M069p624m56Q462l637k198M76k768P498j818r704Q173L384o084
$$ -1869 348 422 4491 -3133 -3589 4873 1236 -962 -486 -3254 4244 2426 -7278 895 4279 -1805
668a805R83p19K829J740o742K107O276l457j671j390K521L660n137k402M642J395
$$ -1805 -822 -1541 1288 3028 -3714 -1607 4669 1212 -459 -1849 672 4332 -805 -3207 1435 2830
684B830j737m850M522L325m313K42j278K398L332q889L315L905m055J157k304
$$ 2830 1093 -3757 765 4090 -223 19 -1259 1139 4471 -4418 -1103 2802 -1253 -96 -2400
699b400J39Q525o526l918O737L48k516r11l657O402J467q390L333L240n91j124
$$ -2400 -2261 6264 -262 -4180 2557 2905 389 -522 -4179 2223 3690 -4700 -1367 1873 1282 158
715A58l678L130M685p030n91L895J522K20n414K405M585l200k488o98L723K046
$$ 158 -3520 -390 4295 -2735 -3326 569 2091 2311 -3103 -698 3887 687 -1801 -2499 1224 3270
731C270o579N61M705P0j068m541K537O096n884k290M320l62J085m190p58O460
$$ 3270 -3309 -2748 1957 2027 959 -3582 -1045 5051 -833 -3123 1197 835 1920 -2270 -3028 3432
747C432j297m472M31K231K375l262m532P093R33l822K19o8K641k75m569K013K841
$$ 3432 2135 -2337 -1906 325 2700 -562 -5094 1999 2932 -890 -671 -739 1902 1627 -2942 -929 1912
764A912j685n66j915L846J357m848r7L521q05k01k860K330L532m090o60P72O37
$$ 1912 227 -339 -2254 1592 2949 -1899 -1996 1525 720 519 -2341 -11 3521 -569 -1229 -457 180
781A80J865m057O90L711n46l204m08J211M003m610j820M393j096k43j571N55L306
$$ 180 2045 -2012 -1322 2389 1843 -1361 -1769 -558 3445 -1165 -2985 1408 312 69 -1502 -947 2359
798B359p42m165L59K448J613l265j594M775J145n218P94K953j02n68l689J871
$$ 2359 1617 -2548 -2189 259 1872 -1393 -2987 1788 2933 -2285 -1491 1462 1360 792 -2897 -1026
814a026L786k825j250j135L140K360o085N74O130l479j535L22J206K110k708k191
$$ -1026 2760 -65 -1315 -2450 690 3050 -3035 -2461 3669 190 -1345 -1023 183 2293 -415 -2606
830b606L306K48N31k405j515M812m95n309K013L805r59l457N24L687r81k567R21
$$ -2606 700 948 1479 -926 -2441 2371 1876 -3433 -1420 2385 1426 -2031 -1507 2180 1199 -1368 -447
847d47q54K081R35m020P55M311q09l885L85L748j066l489J638J778p38K11j285
$$ -447 -1301 780 1715 -2305 -1550 2761 1952 -1933 -1548 2200 1134 -2355 -717 1061 323 534 -751
864g51n7L210k768r10k7K577J902o883J535N931l354l537K652J837m52k366L60
$$ -751 -808 2402 -366 -1276 -1303 1274 3176 -3707 -2172 3759 405 -3132 -480 1357 905 -1461 -1101
881a101O13P14N78l039R0N241j240m880K322M282l160k636J947K156q22k079P15
$$ -1101 -488 226 804 -2235 -2145 3096 1856 -3024 -702 3580 420 -2216 -269 1887 1065 -1014 -299
898b99M7J465o24k135l8N659l633k863J825K982j103l861L089K359l329k41J56
$$ -299 -252 1213 589 -1546 -1584 4075 442 -2421 -596 2386 1283 -2578 511 2870 -459 -700 -544
915e44r7L048j402k803R99K481M2n582K783N433m822k599N338p92k198J368j455
$$ -544 -641 2407 1005 -1798 -799 1682 1724 -3858 -1075 4358 -464 -3063 2275 1483 -715 653 -802
932h02j1J836R0k854J050L621k452l723M113J974l676r94K424L68j460R8J228
$$ -802 -813 1023 1113 -1741 -691 2930 478 -3245 868 2842 -834 -1828 596 964 -496 -398 830
949H30r57J080Q2l309J489L964l606l517L678K326k381k063L326J120l570J275
$$ 830 -127 953 1035 -2274 -785 3179 -427 -3944 -266 2060 -321 -2384 942 2062 -1508 -233
965b33O41j324K294n91k851J926K527k080l019K882K685l632j669L254N21k583
$$ -233 408 -916 1378 787 -2064 -138 2389 309 -2710 172 2857 -775 -2444 810 1331 -1252
981a252J525j26J67J318k3k319L21L739l490k267M178M98l205o19K408J65j688
$$ -1252 273 147 314 1632 1609 -710 -389 3350 -140 -2407 1771 2269 -936 -1555 853 1018 -670
998f70l97J417n20k37R24k640K780J932l853o88L475M40l234o78L134K03k188
$$ -670 -1067 350 -170 -407 517 -2123 657 2589 -1264 -1952 1523 1963 -1271 -1949 1185 1388 -800
1015h00J192L85q34J642o85l233K461K608m587j192L945K22k368l65L280m87k134
$$ -800 392 777 -57 1585 900 -2333 128 2736 -1851 -3043 902 1124 -1244 -1609 1671 1184 -950
1032i50L54J035J43J254j865k29J176J725l503j562K471K405m727K174K091k092
$$ -950 -596 439 582 1836 -29 -258 918 2643 -860 -2422 49 2454 -2273 -99 1992 -100
1048a00j76J87o76J134j53l30j154J008K301l081o83K792O55l299M42K216p23
$$ -100 -276 -89 -765 369 216 -114 -1268 -260 2041 -1040 -1723 1069 1724 -1575 -1133 1083 360
1065C60q11J3O16j80J137j858j554L067N11k482j232L599P82m029R6L941j384
$$ 360 -451 -438 178 -2 1135 -723 -2277 790 1301 -1181 -2413 1186 1968 -2061 -1965 1976 592
1082E92k412J494p31J049M48o71r25P69J393k109n89L325p56k749R69K908q79
$$ 592 -1820 -326 -1057 -8 440 -231 -1156 -387 1006 -1103 -1692 1633 877 -1872 -903 2005 1126
1099A126j754m40Q15K76M84k56j630L157J0l528L36K818r66j858O24K188J60j411
$$ 1126 -628 -1068 -253 23 507 251 -1379 1778 1788 -1740 -1404 1414 448 -1410 -786 1402 1562 151
1117A51j623J292J207k71j112r74K167k05k342N20K201l48k285K783mj367j070
$$ 151 -1472 -180 1027 756 -356 -1330 837 632 -1710 -1190 1011 663 -1622 1161 1157 -210 -1280
1134a280L64J802m61M53k127R54J337l55j698k41L243j691j575J392O74K11j865
$$ -1280 -916 886 425 878 -1249 -295 1042 687 -1011 -1252 1991 300 -1275 117 791 1002 -863
1151h63P27M47L97n35j639M24K046N25k911Q09J694L07l196J538J787j441j448
$$ -863 -136 311 708 173 -1466 -1042 1004 1529 -1382 -573 1121 1428 -1768 -230 1557 116 -1332
1168a332J197J599k84j672k69J334N68j431j310J565J430r61j752l38K088L04
$$ -1332 -135 1464 1180 -492 -761 573 1141 -290 -1600 -35 1395 434 -1318 -1656 432 736
1184G36k357P31R34M99q42n29Q09k03N76l58n44J240m70j256Q19J373j084q45
$$ 736 -1621 -890 44 543 -299 -828 -19 -222 354 -4 -548 692 222 -1034 -215 1158 74 -771
1202g71q3K275q46o10j240Q42J895n14j917P27P27n80j575J368J319N09k173N57
$$ -771 -854 1421 575 -35 -1275 -433 1462 948 -969 -242 485 -95 -1670 -302 1017 1526 -647 -90
1220i0J175k65j438m52J726r24l06j78J399J40q61k53n2N25m0j216Q44M83m0l62
$$ -90 1085 820 -618 -1070 656 -268 -574 -752 647 787 -74 -327 -379 146 106 -1110 -266 217 177 -185
1240a85o48J088r4o16j108K358K01j241N90k58M66O17j700o71J604L2n23M48n82
$$ -185 -833 255 161 -455 -1563 795 996 -245 345 87 553 1170 -530 -1201 403 435 -88 360 -222
1259b22R96o17j281J078J083j259j280K857j334o99p47L14J892M69k016R64K81
$$ -222 774 157 -1124 -46 1037 -222 -1502 1355 21 -678 -1425 -1111 781 1250 -766 198 479
1276D79%j188O88O48K65k339P73K30R38p46k02J65P57m50p28o31J599j5K28j026
$$ 479 479 -709 -21 627 892 -1447 -674 -444 494 -252 -454 -289 468 18 -710 -1341 258 243 471 -555
1296e55P54R49j660k37J427P56k107j95N61Q86l45k43q71R82o04K75Q63p06o31
$$ -555 199 1148 -512 -749 678 1434 -673 -868 -307 579 234 -9 -880 102 -502 -227 636 -70 -701
1315g01N18r19J819L29p64m67J85J45M74o67l07P53l67p76M83m90J274r49p58
$$ -701 -183 -1102 717 1046 282 -185 0 145 619 -48 -355 398 31 -745 -262 -752 522 -427 -1185
1334a185J332P83j015R59l75J22K47r74n10J765o90j029k86J635r05l26o5J163
$$ -1185 147 930 -85 874 499 621 868 -106 -616 1149 459 -570 -856 779 -126 -452 -517 646
1352F46q82n71N1R00j66L52j089n11J856M65q11j351J242J142j742p50J805l15
$$ 646 -236 -807 -756 144 -22 330 -759 -1270 586 1051 240 -1111 131 1273 -469 -1219 586 271
1370B71p35J249j247Q91o8j049J199l91l94o50J092J73O4n08m38J582j089o43
$$ 271 -464 785 -462 429 361 -688 511 120 -274 -924 168 341 405 -103 -541 1041 -48 -691
1388f91Q22k14M43m95n14Q55J120j316j06k67J953n64k063R39J064k87k576J652
$$ -691 131 -83 360 -135 -649 206 1326 10 -96 -363 1590 1026 -1037 -98 966 679 -1897 -245
1406b45J681p52j019O26j171R56j23p43k12J696J242l461J745O85j261l07L58
$$ -245 1436 684 -335 291 -880 76 -47 -790 -1002 694 1936 -1525 220 905 -356 -663 -305
1423c05J515j701J011j060K23K26P05j492P11Q93m00j474L41L070k940J00N94
$$ -305 1210 -491 520 -540 -317 -91 614 -878 -167 726 326 -1148 -807 2263 -677 -577 17
1440A7Q41j920J495p85N5O47M05j166q7J242K13k876J912J683k033k74J458k40
$$ 17 858 -1062 433 -352 -297 350 755 -411 -498 744 957 -1919 -7 1676 -357 -631 827 587
1458E87j605R00o0p29J312P44j412l34J657j578j638K023J331k051L87O19M09
$$ 587 -1018 -118 -178 -907 405 1149 -263 -597 1060 -518 -2156 -133 1198 -853 -466 153 562
1475E62j944J416L28j706J320J764l049R07J173o47k164K092J711k151r54K130
$$ 562 -1382 34 362 -1344 -24 1740 -1309 -402 771 124 -2040 52 1763 -388 -1342 788
1491G88k92k028J528L90j449J029L16j585N35K826k664q24J798P27k024j240L098
$$ 788 496 -1532 -4 386 -1063 -34 282 -1303 -768 2058 -606 -1430 368 1095 -929 -2169 929
1508I29k19j265J50M85j568J610J233k509K42L747j776k318J710J749l742K40
$$ 929 710 -555 -405 80 -1488 122 1355 -1154 -912 2835 1059 -1259 451 2200 -1542 -1302
1524a302L770k328j637J864o9j928J395J624k907O09K275j029k519L399M72l430
$$ -1302 2468 140 -1497 367 298 -1630 -235 1389 -1518 -909 1366 337 -2182 1217 1689 -1741
1540a741O22L205k380o70K725j051k613K584J691l840O20K972j661l156L333J045
$$ -1741 -1119 2086 -294 -964 1761 710 -1903 681 2372 -1468 -848 2124 463 -2693 640 1685
1556A685l947J408K135q31k181K870J9m129K847J983l635J931J845k136k807M098
$$ 1685 -2262 -854 1281 450 -1731 1139 1158 -2971 -124 1859 -1776 155 2000 -136 -2943 1155
1572A155R44l827P72L865k782j274L525j503l044K973P41m165J459L830l187k048
$$ 1155 2099 -1728 -956 2909 127 -1147 2378 875 -2169 804 1545 -2620 -1161 2669 -518 -2566
1588b566M570m49l756K556J902k947o88K291p29k379L030R51l623J207M302m331
$$ -2566 2004 1555 -2201 355 2257 -690 -1378 913 184 -2195 835 1786 -1837 -630 3672 -659
1604f59k085L713J014o339L706K940l358j056L683j449k371L443l4l800J943M459
$$ -659 -2744 969 1983 -4356 -650 2290 -1068 -2124 1559 110 -2261 1182 1148 -2652 -709 3750
1620C750m800j679M388L91m621K052L232l119j349L909j655j950K394J242m102
$$ 3750 -1050 -2729 1659 2050 -2571 -519 2713 -406 -1755 2154 499 -1451 943 2185 -1917
1635a917J528L611m199j950N262j121m654L727K881m721R6M235k549k624L992
$$ -1917 -389 3222 -977 -2927 2335 1214 -3440 287 3168 -1553 -1457 2778 229 -2395 1597
1650A597Pm882L224M280n392k083N391j038m692L419L819m949o2M521k164l928
$$ 1597 1604 -3278 -54 4226 -1166 -3249 2142 1104 -3588 -169 3650 -1299 -1361 3160 996 -2932
1666b932O052j890l582J683M260n002k87M919k512m353L014L961n683J064L810
$$ -2932 3120 1230 -2352 -669 3591 -1411 -1698 3221 709 -3644 -630 3331 -2352 -1288 2522
1681B522k889k633M591R11n791L550K842m604j326M953p75n012N117R70m146k80
$$ 2522 -367 -3000 1591 2502 -3289 261 3103 -1501 -2827 2126 1351 -3661 1456 2426 -1720 -2000
1697b000L843k059k484M081lm798L979K758n603j90O860l740l976N131J462m650
$$ -2000 1843 -216 -2700 1381 1378 -3420 559 3317 -2286 -2476 4384 644 -3332 1799 3261 -1389
1713a389L02M174l790j565M389n31l999K259K492m307j87N341k646l665L460K704
$$ -1389 -1087 3087 -703 -2268 2121 1590 -2409 -150 2342 -1965 -2152 3189 543 -3122 338 3042
1729C042n225L36N013m162j619M881j737l683M399J986n143l25M443k084l340
$$ 3042 -2183 -1847 3166 -996 -2615 2266 529 -3154 1245 3231 -1912 -2237 2206 122 -3218
1744c218M638K039o546L308L546m700o88M471j208m602M471J053o112K195M708
$$ -3218 1420 3459 -3087 221 3767 -933 -1621 2850 1642 -2960 1511 2564 -3548 -1353 3355
1759C355l186l172N894q43m622J897L505m670n34M546j041l963L751J745n475
$$ 3355 169 -3003 2891 2048 -2574 -677 2828 -1842 -2376 2170 1129 -2834 917 2662 -2813
1774b813K223N197m739m170O658j10m571J590L872m009n69M326j790m389M059
$$ -2813 -590 4607 -132 -4302 2356 2246 -2325 -735 3137 -872 -1441 2885 1095 -3294 765
1789G65K769o928K670M232l951k280N044N5n523K685K899l816m72N024l174l508
$$ 765 3534 -3394 -724 3508 -443 -2723 2321 2376 -3147 -462 2437 -1379 -1851 3173 -1 -3509
1805c509N318R09n467K391L824l766l287O034j141m698L715K175n129Q12M776
$$ -3509 1809 2718 -2749 -358 3466 -300 -3587 2447 1306 -3392 323 2498 -2631 -1819 2957
1820B957l238k103M570j180m583L418L398m276j593N543j529m990L632L326n762
$$ 2957 -281 -2384 2186 1006 -3577 -159 3239 -1037 -2630 2913 1384 -3606 26 3352 -2410
1835b410Q28M034j855l821O284p82n276K163L646m177K31L401k036k530K611K958
$$ -2410 -1582 2452 597 -3224 3060 2278 -2998 -835 2811 -1366 -1135 2266 230 -2300 311 3269
1851C269n500J190L459l175j794M900r11m516M288J979m954l09M728j670m374
$$ 3269 -2231 -1041 2418 -757 -2551 2349 1438 -3078 1210 3189 -1765 -2074 2654 984 -3390
1866c390L789K249m892J507L522l698j582L917rm541L754K068m629m27N024k335
$$ -3390 399 2648 -2244 -737 2785 -913 -2495 1422 1413 -3128 626 2694 -1935 -2362 2662 327
1882C27l596M245J258m132J913K257k859j601L365m7m439M069J496m658K96M666
$$ 327 -3269 976 2234 -1898 15 2272 -587 -2188 1177 1130 -3309 760 2256 -2402 -2106 2560
1898B560j975m006M313O67m332K564K114l583k43M924j530l696K542K831o091
$$ 2560 585 -3421 892 1559 -2773 -209 1905 -1678 -1921 3003 1473 -2223 319 3150 -2941
1913b941R31M891k579l535M086J438m416K502J811l394p87L608j97m445L905L30
$$ -2941 -2010 2881 302 -3233 853 2291 -2125 377 2188 -1206 -1993 1615 1418 -3027 878 1208
1929A208k957n1N506m436k044M030Q71m672K789J449l001p9L977k450k546L876
$$ 1208 -1749 -1800 3706 -730 -2774 1256 2127 -2545 244 1693 -1308 -1387 2590 140 -2406 1470
1945A470J328m840J239L886k531k714K624K033n137L331N56k361m90L539j438
$$ 1470 2798 -2042 -803 3083 552 -2162 462 2495 -2642 689 1245 -1116 -1606 1933 495
1960D95k245K985J48k879J178K664l513q97L304j1l323K430K063m435q5L601j885
$$ 495 -1750 1235 1383 -1496 -318 2346 -1167 -2064 1240 1229 -2094 336 2399 -2036 -2121 1480 -405
1977d05j317K271J183l127P04L148l076k40L072j115k887J266K393l249O40K454
$$ -405 -1722 549 1732 -1395 -691 2457 -619 -859 2213 1098 -1789 -523 1870 -1379 -739 1715
1993A715k520j006K934O76l972J667K093k308k94L068j554k061K329Q72l252P52
$$ 1715 -805 -1811 1123 1799 -2173 -506 1587 -721 -1015 2053 499 -1562 767 1639 -1613 -861
2009h61K288j368k362L331K27l398K372J735l071M68K212j104k924L266K39k965
$$ -861 1427 59 -2303 1028 1255 -2143 229 1964 -1107 -639 1573 469 -2455 811 1050 -1915
2025a915K339J966k612j784L276o55k846K747J627k341j834L822j223k227L062
$$ -1915 424 2390 -222 -2006 1270 615 -2231 516 2143 -198 -2032 1790 567 -1660 1402
2040A402p86k037J841J654k653l43K422l31k839J670J811l374R4K687j085k416
$$ 1402 616 -1421 420 2074 -579 -922 1500 1169 -1670 0 1811 -1563 -1469 1218 133 -2283
2056b283K322J640m016K843J466k363p43K859j265j495J647N28k464R7L297j893
$$ -2283 39 1679 -2337 506 1972 -391 -1134 1725 460 -1035 612 1140 -1324 -1227 2070 177
2072A77j612L086l78k696J014J457j419n61K705j388k576K259O45j971P6K167
$$ 177 -1435 1651 1273 -1423 -409 1048 -371 -932 1773 385 -2191 68 713 -1258 -1182 985
2088I85j198r28K441r56n01P62O63j423j004K938k40k976J753J107k665M15J897
$$ 985 -213 -1141 1300 344 -157 605 1268 -155 -1159 1779 1539 -1437 316 1423 -1242 -827 1070
2105A070r81r69K075o89j364J252Q11k851J071J685p16k022K452O23k779Q05J517
$$ 1070 89 -880 1195 506 -858 394 1205 -1646 -575 1110 394 -1628 824 1447 -1332 -527 990
2122I90j705j372K175L5j364J579Q72k407J62J186j21j256K584k04k113O35R44
$$ 990 -715 -2087 88 123 -1241 338 1210 -1197 -1035 151 30 -1226 1358 1154 -959 -324 620
2139F20r37N96O69q08k076J457J469j707l69K233j421l21J199m38j053O39J288
$$ 620 -317 279 948 140 -1936 -479 990 -717 -1086 1147 -274 -595 604 166 -887 -248 1040
2156A040k012j72J703M70j839J845j256m39l59L174l223j7J877r89J4k99J466
$$ 1040 -972 -1144 559 1029 -810 1035 -221 -660 -1019 2155 -1068 -1085 792 -197 -183 -482 984
2173I84j382K15P80r49l28Q26k25p55M58J349k52j118N78M08q09P2P77n10r01
$$ 984 -398 -183 597 -352 -680 146 -79 -834 -376 973 721 -397 181 589 -220 -148 629 119 -782
2192g82K100j377j348K100O8j520M7P35k62j303J779K96j353J446J62j403J26
$$ -782 1318 -59 -1407 693 761 -759 -712 23 -239 -1542 237 533 -820 626 788 -615 -489
2209d89M68k15o33J870J5j757J355n90m52M60J430j280n61N49J039j775k16O08
$$ -489 -21 -236 -869 1001 1016 -741 614 24 -428 32 1462 182 -379 170 1209 -566 -782 -174
2227a74L62l41L53K35j122N38J057r48m01J557q25q68L77J067j340L74l49l08
$$ -174 188 -153 200 435 -687 -149 908 -40 -441 1116 291 -577 -200 867 -473 -99 -448 -756
2245g56R20M19j166k77L98Q30R8j444J193p16r93J669N41j529j44J012R69j501
$$ -756 164 583 -583 -860 -462 368 466 -978 215 -501 -1494 175 716 -813 -957 55 1024 -477
2263d77Q98m06n06J144P8j202J71J582j373j327J424J41p10k28P22L87j093J774
$$ -477 421 15 -491 653 731 -471 -300 1282 -91 -1418 6 147 -563 -791 -69 318 -775 999
2281I99l86j004r42J745r37M5J191o18j96J12j78o84M00R35n00k04R4m9Q15p53
$$ 999 613 -391 -1333 412 -525 -480 711 93 -103 9 -169 -853 -453 482 -18 -222 -128 -177 638 -115
2301a15P02j013J70N50o66k20J070l09k12l24O18j502O83j54P34n76J508r51M0
$$ -115 587 -426 -256 294 -372 -592 478 169 -43 -367 251 -1251 -568 -722 12 -564 944 -7 33
2320C3k37l9Q29j296L13k82M31M36J311j770k01O73l17M73r14P65K93j127M00
$$ 33 -204 -243 586 -710 -397 -679 -248 188 1499 -271 -472 201 -116 357 -557 208 501 -626 -226
2339b26k79k10J117O37j796K30J145r51k93L46j13Q73j438J371n76j83O27k58
$$ -226 -505 -715 402 1039 -757 -527 618 -333 -626 -280 -393 480 -958 413 -163 -346 281 23
2357B3j43N1M08l51p65J026o77J64l1o6R39m78J1j100N15O72p1l90J53j39N79
$$ 23 -120 -69 339 -12 -777 249 -428 -264 -295 -361 578 100 111 -989 -474 198 127 -263 -110 -249 330
2378C30K31o84q4l7p5L69k10k39K1R47m76L60q05P37q89P91k60n09Q84%j023R66
$$ 330 561 -123 -207 -244 -319 50 -160 -399 -378 569 93 453 -352 385 -504 287 27 -482 402 402 -621 345
2400C45l21o56O08k43J148j456R11J40J19J46o67p68J096l44k6n1k16M69j025
$$ 345 24 -632 -24 -267 881 -575 336 476 595 741 74 -694 402 58 32 -19 -235 234 -791
2419g91J038r24Q23K00K9l70l02J30l50O0K21p4m04Q1O31J11n44J86M46j12k41
$$ -791 247 -677 146 346 375 5 -297 -167 -517 -457 -236 -310 -714 -633 -2 109 -435 -249 197 85 -156
2440a56L85l92o89Q26q11O36o80Q63m7l47L41N28m27R9Ro6J98o93M81M15r02Q61
$$ -156 229 -163 -852 -26 -837 -201 -881 -18 -65 -412 -71 457 30 129 138 72 270 -423 58 473 -429 432
2462D32J2n80j17L98q08R37r98R69n01k53M43j67Q14M05j237l26m4j95J6J385
$$ 432 444 -136 -253 145 -663 274 -724 245 -256 -509 -66 -233 581 986 -251 -577 -621 -816 -800 585
2482E85j061J115r25J129J9j014l07j83N8O21j29N30k23K76M2r04O09p74J142
$$ 585 -476 639 -286 843 862 -152 -459 -642 -584 37 -92 438 215 491 533 -371 238 -536 606
2501F06j84l67j42J03n05R00J81o16J6P59o13p06m67O17P98m97m11m34O41P23
$$ 606 422 55 -87 16 -489 411 592 -24 -8 751 138 -568 -1035 -418 380 -117 -528 -962 -321 402
2521D02p46O75n45K74K94K20l37o26m02J213n3j094j91Q20N94p84P84n38L69m8
$$ 402 -344 331 -214 60 354 574 237 -389 -791 422 369 -725 -916 -96 498 -286 498 -40 329 281
2541B81m39j18O32r5k23R5n71L93K87Np9q42K07K77M0J032j422R96P3n98j78k07
$$ 281 -158 -276 356 261 38 133 -438 -45 242 247 168 -674 -467 -190 -150 882 -540 456 529 -69 -247 -454
2563d54l7N05l64K21k98Q33j27p12R08m28l83J94L79o4n65k47P39L29k30M57j532
$$ -454 -491 14 -350 -129 -427 406 279 -433 475 47 -336 -142 237 173 -392 -639 100 429 199 656 -876
2584h76R33j089J007m13J393n01j221P77R7K41m7k00O59j273R91j089K50NQ26
$$ -876 57 -1032 -25 -438 955 454 -767 10 107 348 301 101 760 -513 478 -611 -361 -356 470
2603D70o83M85J50l81M09j25l57L73n39M34m30L5K51r57J217l58j09J13q20Q90
$$ 470 -213 272 422 41 450 325 -32 341 -198 236 -194 -159 92 -865 352 -6 -115 -2 -822 68
2623F8l7k53R32j20o63m11L69O86J25l14n43l2m12P13q41Q09j431j03J317K70
$$ 68 31 -222 710 590 -73 -484 -115 571 696 382 -161 -193 -605 108 -733 76 -1355 -1458 -141 129
2643A29j75N63J63j976K684k040J78J064J10n24N74J76r88l46M75l26M26m64M17
$$ 129 -46 517 680 -1296 1388 -652 -474 590 700 176 750 926 -62 -408 67 -259 167 -297 120
2662A20j27q0j40J163j413Q18j634R54p0L49p26P41O7J631k178n4J050n24O68
$$ 120 -7 -87 -227 936 -477 341 -1293 -339 -409 -60 -786 -45 22 1653 -525 -579 471 -53 615
2681F15j091j41O20k00L04m30j03K96O83o46j77O32n73N46k6m18K46p98M55r48
$$ 615 -476 -617 3 -197 107 -323 -426 -130 553 -93 -270 362 -211 335 309 -109 137 -661 -206 -1154
2701a154J620m11q50Q12r73L83l60J580l94p01K05o50N45K34q06N87L35n08N49
$$ -1154 466 55 -795 17 -956 -573 -933 647 253 -448 -243 -893 -348 -114 -920 -333 2 -506 43
2720D3q53R91j72l12O23q59J254j488L19q9k54Q63O62j428O61N84r61j4J31O80
$$ 43 -810 181 9 -303 320 -539 715 -773 -454 -543 -797 66 728 -700 -39 545 -416 -430 -299 381
2740C81j124K11J152n46p06J123j384J214j220R30R6l2r0Mk49p94O02P36O19q26
$$ 381 -743 -532 620 74 -632 491 -893 321 -899 31 127 95 5 9 -240 -1034 -432 304 923 97
2760I7n56k21J099p12N89k04j116J363o56P86L31q38M4r6k90j18P23N59l77q14
$$ 97 -459 -680 419 -293 296 92 -1024 339 -317 469 800 -38 6 -90 -380 -498 225 784 407 -407
2780d07m65L60R98j269J224O22j438r5K88L03m83O59j40j279J405m04P39q09J159
$$ -407 -872 -512 486 -783 441 1063 -375 -470 -182 121 -362 297 157 -1122 283 -121 618 -191 968
2799I68j05j142J74k57L62l53L44N19n19P00n13r6o63Q40l49n7K97j3p48J094
$$ 968 863 -279 -105 -362 0 -353 -9 510 -9 691 178 82 -581 259 -90 -147 150 137 -611 483
2819D83o86N84L95k25N96j155J82P24q36M4O81k55r36m10l89J597q08Q1M40j86
$$ 483 -203 381 776 551 1147 -8 174 898 62 106 787 532 -404 -814 -1203 394 -414 -333 107 -79
2839g9k03m74P35k32p96N92J661j565J249o87o79L84L66m54p6P75m6l75L76m01
$$ -79 -282 -756 -21 -253 -1049 -457 1204 -361 888 201 -478 -94 272 -182 -258 517 471 96 472 71
2859G1l2J43n09J115j93p69K43R6o8l17q12K331j266Q69p16n73K52K03R8m61L40
$$ 71 39 182 -327 788 595 -174 69 165 97 -220 -1032 1299 33 902 186 -387 -135 68 166 -295 45
2880D5jL1k9k73N00M46j308J267Qq25j012J218o57J377o78J22J16j272J101r46
$$ 45 44 75 46 -227 273 719 -589 678 686 -139 -1151 67 -590 787 109 231 347 -925 176 -770
2900g70R91m87R7q18J147l01P11o39o51P37j6p12N77J48L88j222P55n87M10N88
$$ -770 221 -266 -169 -987 160 -141 570 -69 -720 17 1 -711 -134 14 402 -820 -65 -652 -242 346
2920C46p64R12o65n16N38M47l64J75l8L57J15J15j309k18Q38m12L73p5J197l85
$$ 346 -418 494 -171 -687 -149 298 -66 109 71 428 543 658 -651 -869 -31 -443 -70 -145 1052 667
2940F67q94R39r78O1L3n36N16K23j74n56J709j305N66q99p11J352K99k54j16J46
$$ 667 -227 712 -266 -205 -172 -708 -192 31 -143 -699 1010 -295 271 -628 -1339 13 312 58 -58 88
2960H8J224j035l27p5j0M9L75j558P67J204m60j1j262J988j195R12j87j61l50
$$ 88 1312 277 -50 -125 -135 -86 289 -1269 -502 702 242 231 -1031 957 -238 674 487 326 -24
2979b4K61j567K121q15l6K09l06M37P57p35p43Q27j78m07L40j77O04m35n71j68
$$ -24 237 -1330 791 -24 -60 149 -157 280 1037 302 -441 386 208 -199 141 -36 568 133 -438 -606
2999f06J005j341R56M93m31nl11J66K91n44J34k1N50M2M39j829J256M0J37j82
$$ -606 399 -942 14 507 76 71 -240 -74 217 -327 -193 -214 336 378 817 -1012 244 284 421 239
3019B39m46n34J401o5n22L83n26K92k94q90J244n82m01J699j323O6j002J648j522
$$ 239 -207 -741 660 595 73 456 -70 222 -72 -962 282 -300 -701 998 -325 -259 -1261 387 -1135
3038a135J197R58j083j87L88j224K11M6P05J242j290M48k33o04O89k10j44N45
$$ -1135 62 1020 -63 -250 138 -1086 -875 -829 -124 1118 -172 276 43 -561 128 -82 -226 319
3056C19o36K70o3K01KN10r1m41N52j476m79J708o90j55K27r5k77O14q41K068k155
$$ 319 -317 -47 -110 91 93 603 512 71 623 -853 -1332 376 -314 -469 -242 -337 -614 0 -841 1227 -928
3077i28J02L66J138k157J315P95k26k51m05q23J304r07K98R67p82M45n63N90k7
$$ -928 -826 -460 678 -1479 -164 631 405 154 -251 -1074 230 -677 -379 588 -194 251 -312 278 251
3096B51n70N84M19j155M45J83K16m89p12N92p4o1J230o90J54j528J261K85m50
$$ 251 -319 265 684 -471 -26 157 373 -116 -828 -236 -310 -371 859 169 323 -1205 56 341 -109
3115a09j047J388L93j348L1Q90q0l81J083l91r82J326o48J60m22p22J073L1k74
$$ -109 -1156 232 625 -723 -692 198 118 -263 820 429 -553 773 125 285 -137 -859 214 245 -29
3134b9Q5K67n10J207j080QN84k00N93K90r80k86k43P29p06J311r50n75K37K9k59
$$ -29 56 323 -187 1020 -60 -52 532 332 925 1215 235 -51 -294 435 -271 1040 90 -485 -248 -219 -478
3155d78Q53l40M93q41L95k75J37m76l97O67m43P27J76M88p46N30o28R05n72n46
$$ -478 375 35 528 -313 82 -193 -56 -532 -929 -262 -705 22 198 686 -60 470 -158 747 175 -371
3175c71L50r7J034j274M15p35R24j48r14J369m43m22R00k29k4q96P58J02o31N22
$$ -371 -21 -118 916 -358 57 -678 246 98 -816 553 110 -312 588 359 335 -561 197 299 -332 190
3195A90r12J044p11O95o23L45k64n01N46P48k25O7k05l94R16Mk66q35k06N04k35
$$ 190 -722 322 -389 306 -317 28 -236 -737 -191 557 332 399 194 -200 716 720 454 -381 -587 -83 -318
3216c18O85p00L27N37k47m09P51K13p07m04j39L59O5J35N90j193L94Q32p44M07
$$ -318 367 -333 -6 531 284 -125 626 839 132 -272 -411 -52 13 148 738 -455 -61 771 27 434
3236D34k86M46j206M37P80p02l19J551j321N43N11K14j055j01k26R06p4m88R48
$$ 434 148 594 -612 -175 605 -97 -416 1135 -186 357 868 1082 27 -74 -300 606 532 44 992
3255I92J34j343J40Q7O96l34Q4K01j060m96O44J26L24J228j258J5P05j501O30
$$ 992 1126 -217 -77 10 706 372 456 657 -403 -899 -255 -129 195 1423 165 180 885 -616 14
3274A4O6O8n21M13j78m12J215k80n56J04N75j049J23J98Q09n44O13j297R77n94
$$ 14 80 148 -373 40 -138 -550 665 385 -171 -67 508 -541 -418 -220 589 45 658 -639 338 -256
3294b56L71m28K48N68n48L3n71J376j174O17r19J58O32K93j00l83J23J94n00N9
$$ -256 115 -313 -65 503 -45 -12 -583 793 -381 236 -683 -525 107 400 300 -83 40 234 -266 -207
3314b07J2P1O81p38J71r83J548j748J649j54j110J259m7j161Q62N38r21k27Q30
$$ -207 -195 -124 557 -181 -10 -993 555 -1193 456 302 -808 451 404 -757 105 643 -278 -505 325
3333C25p65M18M3j97l14M15L46k80J36Q23j077N04M61j197M91L41N56j079n68
$$ 325 -440 -22 21 -176 -490 -75 271 -9 127 950 -127 377 838 -359 132 473 1029 -50 -618
3352f18o87J452j060P45P09p28p6J089j040k74M55p18j6P23p19Q15l73P20o26
$$ -618 -1305 147 -913 -168 541 -187 -263 826 -214 -488 -33 -751 -767 -44 -763 52 -321 399 -227
3371b27O19k57m7L09p23J98K37K36O6n63N30j445J334m32q40L83M41M00m56N45
$$ -227 392 135 88 397 -326 -128 109 345 411 -152 378 -1067 267 -165 -1005 -622 -181 219 -237 308
3391C08N07j145K93m21K35K53%J14l62N17n83L88k37K1k39M95M0q0l08j35N38
$$ 308 815 -330 -37 -458 -223 30 30 144 -218 299 -284 104 -133 -112 -351 144 184 104 -204 -339 199
3412A99n17K78K24LJ1M74o96p70N42J206m35q65J247p0j584J316j230J252p99
$$ 199 -318 -40 184 187 198 672 -24 -794 -252 954 519 -346 901 831 -753 563 -667 585 -214
3431b14K95k60J8J086n29p81L58J26K79kq39L82O29M50j135p6o68Q79j13K38L67
$$ -214 81 -179 -161 925 396 -385 -27 99 378 376 -463 -81 548 998 -137 -213 -881 -2 -115 123 490
3452D90r9l50R90j042k31l56O37K73M53o59l27n17J00J450p26m83n69R24Lm9m74
$$ 490 391 41 1031 -11 -242 -598 39 312 765 106 -221 -738 -638 812 86 -397 -966 -42 -39 -88 -562
3473e62L11n06J058k39P2o97r8J259j055J121k51m25M17j041J170j418R08p57
$$ -562 -251 -757 301 62 134 -563 -661 598 -457 664 413 -12 405 -636 534 -884 24 -733
3491g33J634q66M43j020P88j275J528l0l83m38j39M37k73q3m79O35L16P56j000
$$ -733 901 35 478 -542 246 -1029 499 469 86 -352 -491 -54 -327 -410 -889 -254 62 818 -182
3510a82l38M46J96m55J15M34r58L38P7J14m69l0J223o28n7J49l92j69J002n7J27
$$ -182 -520 -74 122 -333 -218 216 -742 -404 -327 -213 -682 -712 511 -117 -174 -25 -417 -586 416 359 486
3531D86j60k55M42j69r18K35j83O54K0n9p13O64J70j80l81L84K45m01J267j213
$$ 486 326 71 513 344 -574 -339 -522 132 152 93 -620 44 214 34 -347 37 282 -119 1148 -65
3551f5O49l18On93m87Q48M86j047j034J722N68J17r51M3j50K52j1L47j06K87j292
$$ -65 584 266 272 -321 -808 40 526 -521 -1555 167 735 852 -99 -56 -206 46 35 382 276 563 -729
3572g29M18n54k07R10j3j10j20P6M28q33O39r44N39J205q93k51k67J523m62q46
$$ -729 -311 -865 -1072 -162 -175 -285 -405 -329 99 -734 -95 -1039 -500 705 -188 -439 -706 817 355 -491
3592d91Q07j77J4l84j68P58j432M11J077l59k08J348k76j000LNj73k05K81m94
$$ -491 316 139 153 -231 -399 359 -1073 -662 415 56 -152 1196 920 -80 -77 -72 -245 -450 -169 -663
3612f63K04P7K78L83K2l94j69OJ055k61o78L05M04q25j64J49P51k9o82m67M99
$$ -663 -459 -382 -104 279 301 -93 -262 -256 799 538 -140 165 569 -256 -420 -271 480 451 -231 -698 -199
3633a99l85N44N82p90p21J853r62q88R74K94J52o23O66k42N52j440O8J617j399
$$ -199 -584 -40 542 -248 -969 884 -78 -966 8 302 454 -169 497 255 807 -633 -565 1052 -347
3652c47q4J237q35p28M28K57N40q02P58j72K0l8j065Q16p29J798j021M3q04OL90
$$ -347 -431 806 -29 -757 -329 -72 468 -334 424 252 272 234 -831 -15 -744 1054 33 76 -728 -722 -332
3673c32Q40K38m06k78j213Q68N72r9r0J79p55P10m05M35Q30j396N62Q5r40N96
$$ -332 508 746 340 62 -1151 -283 289 190 100 279 -476 234 -171 264 1094 -302 260 345 -595 1
3693AJ35M3K70j050J082q1k6q32J079p11L69n4j143J018J87j76N35l1p39N25n04
$$ 1 136 179 449 -601 481 400 374 -458 621 -90 279 225 -918 100 287 111 646 615 -124 401 -103
3714a03K21J56l07p94L82O48K8j01j54O41o17M16N15k134J143p47R77r98N87L56
$$ -103 118 274 -33 -827 -445 203 231 130 -24 617 0 416 931 -1203 -60 -807 170 -828 -241 115
3734A15o01l0j42J140J2o80O82j277M76k27j7K67R47j015K41N12J7p06P1M24j94
$$ 115 -486 -516 -658 482 494 -186 496 -781 -305 -532 -549 -282 665 -350 -109 403 420 -286 -215 209 15
3755A5L6r22L63j17Q69p51N24K33K91p22Q24r02Q55m79l79l04P91N74m99n09k6
$$ 15 51 -871 -508 -625 244 -507 17 250 541 -181 643 -259 596 117 -262 -566 225 799 300 -209 -235
3776b35j02N68j84o46J376n48j091J166p1m42M04j18N48L8j065N42m90j95J112
$$ -235 -337 231 47 -599 777 229 -862 304 233 -209 195 77 625 663 -402 140 -350 -545 567
3795E67o74K18r09J218j117L82L54J19M42k97j210N21P2mJ33P26n30P37p33n94
$$ 567 -107 111 -798 420 -697 -315 39 158 600 303 -907 -386 -314 -318 -185 541 11 748 15 -579
3815e79k42J3R09l62N97j05j60J59N07p57j73N11O34q71K77p4L39p37p94L04Q94
$$ -579 -821 -808 101 -261 336 231 71 230 737 -20 -193 318 952 81 358 284 623 -114 -908 -604 290
3836B90M13j108J2O61j51l57L38k63Q80j485J548p92L56K4J9o33j005J109j66
$$ 290 703 -405 -393 268 117 -240 98 -165 715 -770 778 -14 342 366 385 -248 -1253 -144 -310
3855c10Q93j158Q69o90J455j211K5M82o66j16M70P72Mj161R40m08O70p75p49J203
$$ -310 583 -575 294 -396 1059 -152 -127 355 -311 -427 43 815 819 -342 598 190 860 85 -664 539
3875E39n27J2n18J343j339N1O71p71P03M83p53N63j059J73O78j313J191N18r92
$$ 539 12 24 -494 849 -490 -439 232 -539 164 647 -106 457 -602 -429 249 -1064 127 645 -347
3894c47L90N7L37K36l63n68N14K38r09N68j330J226Q2j77N58m04M74q79k22n69
$$ -347 43 100 437 673 310 -258 256 494 -415 153 -1177 49 131 -46 512 108 582 -297 -519 -1088
3914a088J239J46j78k75l69M10P8L2N28n72M43p69p24J017j6P31j520L09N68M3
$$ -1088 151 297 119 -156 -525 -115 -37 -5 523 -49 394 -375 -1099 -82 -98 633 -887 -578 -10 33
3934C3k35o92m05J072N45kj41rJ18p42O14K14l15j22P6R13m93j93o92J044p19
$$ 33 -202 -894 -1299 -227 318 316 175 166 284 -458 156 370 55 -67 9 922 429 236 -456 588 -131
3955a31m4l4j54J02L08Ol45J68M27j082O49J65L69R7j49O54j335P07J02K65o21
$$ -131 -175 -209 -363 -261 47 53 -292 -124 303 -779 -130 35 404 501 352 1006 -329 378 480 745 124
3976A24J145q96L33n76l27O21N44j282M5J6J1K39j38n6jn32J97J28M57j65n70
$$ 124 1269 373 706 130 -197 424 968 -314 -269 -253 -242 -3 -141 -197 -198 -730 -533 -405 52 -113 -683
3997f83K39r5J359j651N99O5j05r1P6Mm81J23M55M18K19K46p26l84O64n9K42r14
$$ -683 -444 -539 820 -831 -232 -167 -272 -363 -287 -283 -764 -641 -186 232 451 697 -29 -413 251 192 434 -480
4019d80J686r14k44pO49n51J4j46O53q02m77L84O72n91M24m28r77J488p08K90
$$ -480 1206 292 48 41 690 139 153 7 660 -142 -619 -235 437 -154 270 -158 -1135 353 -355 -65
4039f5N58l00j118R71M37j067L04O76j091M85K21J86n85Q82p20j52J190j206K37
$$ -65 493 193 -925 46 483 -584 -280 396 -695 -210 11 197 -388 494 -226 -378 812 -394 -157
4058a57N18p08p68Q70M38n00O24j405J359p11K00j33j13L73J043j464N4R64m87
$$ -157 361 -347 -1115 -245 193 -307 317 -1088 271 -440 -240 -373 -486 -113 930 -534 -480 484 -3
4077cp0J119r7j223Q82n59J09l1K5N62o77j46m17J128l39P69j967J310K20j356
$$ -3 -73 1046 949 -274 608 49 158 127 152 714 37 -109 -526 602 263 1032 -935 375 595 -761
4097g61l1K043n81K61q32O69j127k06j33j38L21L06l49Q89r6r86N31j2N2k7n57
$$ -761 -792 1251 670 931 99 768 -359 -565 -698 -836 -515 -209 -558 331 235 -751 -220 -232 -180 -207 -764
4118g64K48K61o49J294m52K26N36j75m84K52p0j3o12P21p36J021o01P55j288N31
$$ -764 -516 -255 -904 390 -62 164 700 525 41 293 223 210 -402 319 -417 604 3 758 -530 1
4138AK33M68m9j317J34Q24K54q77M13o93M55P98r71p18J538p55M91j0q7M5K43
$$ 1 234 702 653 -664 -530 294 548 -329 84 -609 -154 644 -327 -1045 493 -262 229 219 132 177 420
4159D20m26m49J24N05O5M3O0o02Q9l50m83J641r12M72K27L21n04J99q94k0P98
$$ 420 -6 -455 -331 174 239 282 342 -260 -171 -521 -1004 637 -275 197 424 745 241 440 -454 -474 324
4180C24q19N07J14m39Q24m91o50P02J76j59L52j034L46M6p31J101m32Q82m59n03
$$ 324 -495 12 126 -313 511 20 -630 72 248 89 441 -593 -247 -201 -932 169 -263 619 160 -343
4200c43K32l31O83j88Q64l44L3m15n81Lm94J746q77m37R75q19l3N94n94N36Q05
$$ -343 -111 -442 241 53 917 573 606 191 -390 -387 -881 865 -12 -449 526 -293 -326 268 -326 210 1015
4221A015j586Q77LJ52j98l52N81m57J148j157q28L26R19m3k33n87m0j30J14K64
$$ 1015 -571 306 309 461 263 -89 492 35 1183 26 -802 -476 443 400 167 -420 -460 -590 -476 -212
4241b12n62k68N05M06K50L84o94k91O14k59O43J93j821J75M77J043j634M4R80
$$ -212 -774 -1042 -537 -131 119 503 -191 -482 132 -127 516 709 -1112 -937 -460 583 -1051 -1007 -27
4260b7J117j511J30j21j63Q14M13k50l44QK33l90k30M22l89J72N90l27n00n83
$$ -27 1090 -421 -291 -412 -575 239 652 402 58 66 299 -91 -321 101 -288 -116 474 147 -353 -936
4280i36J518j60J79j15k56k78J384j91j267M38p1l52j115J328L33P2k31m08p92
$$ -936 582 422 601 486 230 -48 1336 1145 -122 316 245 -107 -1222 106 439 511 280 -128 -920
4299i20N92J97K98R36j044J48j224J134p62J94M01j50N77k1r10m12O66l98L64
$$ -920 -328 -131 167 1103 59 207 -1017 117 -645 -451 -50 -200 377 356 -554 -966 -300 -698 -334
4318c34P17o32R92j284M24O18p21O23L66j030o56J186N56m63n91l8M08r89J37
$$ -334 383 -249 743 -541 -117 501 -220 403 769 -261 -917 269 825 362 -229 -267 141 -848 -711
4337g11O39J76K29k09j313R58L72k35j94j82J33K15l15Q13j241J392j56k54j82
$$ -711 -72 104 333 124 -1189 -231 141 -94 -288 -470 -337 -122 -437 376 -865 527 371 117 -65
4356f5m64Q54k16J67j122P60l03k97o0J582o20j072O65O22q09O64J028k369P53
$$ -65 -529 325 109 276 -846 -86 -389 -686 -746 836 216 -856 -191 431 -378 286 1314 -1055 -302
4375c02L0j15L73k87J18j04j60N83n27J89M58J7n28N33%m73L13j54j53j42K81
$$ -302 -272 -387 -14 -301 -183 -287 -447 136 -391 -202 256 273 -255 278 278 -195 118 -36 -189 -331 -50
4396e0l86O70N77n06q86O33L00n55o6k73j36Q53k09r31N99PN63N58Kn69Q2L10
$$ -50 -436 234 811 305 -581 52 352 -203 -269 -542 -678 175 -34 -965 -366 -359 204 762 764 195 277 587
4418E87m90p25J423k8j112Q3M87j64R46l05j100M6P14j101R69M35n08O94j051
$$ 587 97 -628 795 767 -345 -262 225 61 1007 702 -398 -352 362 -739 230 665 157 851 -200
4437b00K18K20j83K64n96J25J15O74m37n59M40J4J010j494K98J28L03m40L61l3
$$ -200 18 238 55 319 -277 -152 -37 637 200 -359 81 95 1105 -389 -91 37 340 -100 261 228
4457B28o63J182n64q3O40p77O99q59J97J360p39l57r25O13n6k27M0l75KN97J50
$$ 228 -435 747 183 100 740 -37 662 -197 0 1360 621 264 -661 -48 -104 -331 -291 -666 -664 -67 83
4478H3M69O18j156m36p3R18l38K81O47r4p8j239M69L1k53M25o85J650j053l92
$$ 83 552 1170 14 -422 -495 423 85 366 1013 919 841 -398 71 102 -151 274 -411 1239 186 -206
4498b06j6o15J189k33n12n4O10Q76j348m26N71m7m46R28l95M18N2k30K09m6r79
$$ -206 -222 -837 352 119 -393 -447 163 1039 -309 -735 -164 -211 -657 271 -124 294 346 116 325 279 -700
4519g00R45n16p9R2L63r52Q97N58j213J12j58J092q21J221p32K13j82L25j20k99
$$ -700 245 -271 -350 -258 105 -847 50 608 -605 -493 -651 441 -380 841 109 322 140 465 345 46
4539D6R5q03M89L90J3p09J205j318k66k18O71P28p40J215j97j148K56q05J069
$$ 46 141 -662 -173 217 230 -479 726 -592 -858 -1076 -405 323 -417 798 601 -547 -291 -1096 -27
4558b7R65j277k76j6Q48k4n17M8O07q97L10N6j62K88J15n62K27M07M2o41J580
$$ -27 938 -339 -615 -631 217 193 -324 -276 331 -566 -256 -200 -362 -74 41 -521 -294 113 155 -486 1094
4579A094qj237M33M34l36K90o49L6L10l17j31R4q2k20J26L20k51M40j569K281
$$ 1094 1086 -151 282 716 380 670 21 57 367 50 -81 13 -69 -289 -163 157 -94 346 -1223 1058
4599A058j315m61J348M8q41N55p3j92J34q70O03l76Q28o19K92J13j7j111L02M55
$$ 1058 -257 -718 630 678 -163 392 319 127 261 -609 -6 -382 446 -173 119 232 215 -896 -594 -139
4619a39k09J021j269J595q60J38M19q83J82J222j042o13J319q98O9o3N30j161
$$ -139 -348 673 -596 999 139 277 696 -187 -5 1217 175 -438 881 -17 52 -11 519 -642
4637f42J024j75L31k91j51q67P72m89J60l64O22K47L02K08j87r56N88j60J27J50
$$ -642 382 207 538 247 96 -771 1 -488 -328 -692 -70 177 479 687 500 -456 132 -28 99 249
4657B49q7p27O78ro20K12N62J21n20p59L05K29J59j21L97o7P50m88p81K59L31
$$ 249 162 -565 113 104 -516 -304 258 379 -141 -900 -595 -366 -207 -328 69 2 752 264 -517 -258 73
4678G3m12J22Q84l66k27o33N30Q49n08M15r38j94M74o13Q10l10o3J5K66j32k18
$$ 73 -339 -217 667 301 74 -559 -29 820 312 727 -211 -405 69 -544 266 -44 -107 -92 174 42 -176
4699a76J9p00M49N77N73r41M6Qm95j84J310j22l10J45M35j129j66P91K5p4k58
$$ -176 -157 -857 -408 169 742 -199 -153 -145 -640 -824 486 364 54 199 634 -495 -661 130 155 81 -177
4720a77p6k35Q82J79m72mL38q6K14J56m59l48j82L96l88P95o8k34j78o72P50j61
$$ -177 -253 -488 394 573 101 97 435 349 563 719 260 -88 -270 126 -262 533 465 231 53 -619 131 -30
4742c0J02K25o43R44J69r80J36p48K12M16m43M34M38p45M71j27R6J96Q39k53r82
$$ -30 72 297 -346 598 767 -213 -77 -825 -613 -197 -640 -206 232 -513 -42 -169 -73 123 962 709 -273
4763b73m71J241q51L70J9j070K115k136K85K20O91J5rn75J132p41n11Q16L67k54
$$ -273 -744 497 -354 16 35 -1035 1080 -1056 -771 -551 140 155 146 -429 703 -38 -549 267 634 380
4783C80K54j436O02k42l67J60Q72k22j67L2j10N21j654J232j64q08P38O79l80
$$ 380 634 -802 -200 -442 -809 -649 223 1 -166 -134 -244 277 -1377 -145 -309 -1117 -379 300 -80
4802h0k48L78n86N19O7l1r34J24J008L30j090O18M95p87K96n91J24K89q60J066
$$ -80 -328 50 -536 -17 50 19 -915 -791 217 547 -543 75 570 -217 79 -512 -388 -99 -959 107
4822A07o0o21l98N20J301m79o3J13r46Q89n37P41j51q07L15K98o3n27m21L07J98
$$ 107 47 -574 -972 -452 849 370 307 420 -526 363 -174 567 416 -391 -76 222 159 -368 -789 -482 -284
4843b84J65P54J48j094Q66L35k43j68Nq49Q38m43j91l61N68j3J59p75O42M78r44
$$ -284 -119 635 783 -311 555 890 647 479 484 -365 473 30 -161 -522 46 33 192 -583 59 537 -407
4864d07P68q94N39j2n16N20k88J67n69Q15N05m06k46k90J117j398R34p56m11Q85
$$ -407 361 -533 6 -6 -522 -2 -290 -123 -692 123 628 222 -24 -314 803 -595 339 -417 -828 57
4884E7P78o82n80N79l60m9q4P42j109Q81m44N54l29m36Q06o38m41O93q84P93M00
$$ 57 835 153 -427 152 -208 -257 -341 401 -708 173 -271 283 -46 -482 324 -314 -755 -62 -946 -153 247
4905B47q23J765k20p67M71l24m71m9l4K07j32P06n09j025Q97k88O40p7m50N12
$$ 247 -576 1189 969 202 673 349 -122 -171 -205 2 -130 576 67 -958 -61 -349 291 214 -236 276
4925B76m62m8m51J255j74p74J055m60l46P34J06l74N63j912P13K21q5j32K93Q12
$$ 276 -186 -234 -685 570 396 -378 677 217 -129 605 711 337 900 -1012 -299 -78 -163 -295 -2 810
4945H10j308L98j93J83J58p7j37L95q01J82N54O04r62K7K29l59k33N04M81q04
$$ 810 -498 -100 -293 -110 48 -29 -166 229 -572 -390 164 768 -194 -167 62 -297 -530 -26 455 -349
4965c49k96J89J358p92l07o1O74r3n44R2P1Q21j941R59O67p94L00m05Q7N95p9
$$ -349 -645 -456 902 110 -197 -258 416 323 -221 -129 -58 763 -1178 -219 448 -346 -46 -451 -364 231 152
4986A52p2o29O78j547J449l32M49j11J35n51rL89K56r74O54J61k47J24j32N42
$$ 152 80 -549 129 -1418 31 -301 148 37 172 -379 -388 1 257 -717 -63 98 -149 -25 -157 385
5006C85p42l29M89L00k22k67L94L56q66Q50p35R10m04n89q9N08n59P06K24j46
$$ 385 -357 -686 -197 103 -119 -386 8 364 -502 348 -387 523 119 -470 -559 -51 -610 96 320 174
5026A74j167J576l78j231J791j260J83J461j319j19N66p70j29O24o19R90R53j493
$$ 174 -993 583 205 -1026 765 -495 -312 1149 -170 -289 277 -493 -622 2 -617 373 1326 -167
5044a67J93l45J58p1R0M92L1o78k80J91K13R33k74K26j277O08O32q60j4L1K91
$$ -167 26 -319 -161 -232 -142 350 381 -297 -577 -386 -173 760 486 712 -565 43 675 -185 -199 -168 123
5065A23N9O6l07O02j550J139n39L22m79M46k40Q31L61j241L30J68J12k25L47K50
$$ 123 182 248 -59 543 -1007 132 -407 -85 -564 -118 -358 473 834 -407 -77 91 203 -22 325 575
5085E75r58M46p5m1l77N84j061J63M44N81R50j005r17J216K22l24p13O76m10N25
$$ 575 -383 63 -12 -53 -430 154 -907 -744 -300 281 1231 226 -691 525 747 423 -290 386 -24 501
5105E01l71O7J33j49J83j66p74J24K36J63j73Q3O32j331R47q66J08QM24M59m52
$$ 501 130 197 330 181 364 198 -576 -452 -216 -53 -226 -143 489 -842 105 -761 -653 -645 -221 238 -214
5126b14o71R26n16K64K40p40K90J072j387R65k26L65p39K20m14L34L33n02O15
$$ -214 -885 41 -475 -211 29 -711 -421 651 -736 229 3 368 -371 -151 -565 -231 102 -400 215
5145B15O19o62N0n51P68K42p60M47m13N38l7j147J192j548Q10K48P85j144K42
$$ 215 834 172 222 -329 439 681 -79 368 -45 493 456 -691 501 -1047 -237 11 796 -348 -106
$$ [...]
8191e59
##END NTUPLES=NMR FID
##END=
