##TITLE=1H_SA-29.123
 DMSO-d6, 40 sc, 
 26.7.2019
##JCAMPDX= 6.0         $$ Bruker NMR JCAMP-DX V2.0
##DATA TYPE= NMR FID
##DATA CLASS= NTUPLES
##ORIGIN= UXNMR, Bruker Analytische Messtechnik GmbH
##OWNER= root
$$ XWIN-NMR		Version 3.5
$$ Fri Jul 26 15:53:26 2019 Russian Standard Time (UT+4h)  she@DPX200
##.OBSERVE FREQUENCY= 200.13155
##.OBSERVE NUCLEUS= ^1H
##.DELAY= (6, 6)
##.ACQUISITION MODE= SIMULTANEOUS
##.ACQUISITION SCHEME= undefined
##.AVERAGES= 40
##.DIGITISER RES= 18
##SPECTROMETER/DATA SYSTEM= spect
##.PULSE SEQUENCE= zg30
##.SOLVENT NAME= CDCl3
##.SHIFT REFERENCE= (INTERNAL, CDCl3, 0, 15.7039)
##AUDIT TRAIL= $$ (NUMBER, WHEN, WHO, WHERE, WHAT)
$$ ##TITLE= Audit trail, XWIN-NMR		Version 3.5
$$ ##JCAMPDX= 5.01
$$ ##ORIGIN= Bruker BioSpin GmbH
$$ ##OWNER= she
$$ F:/spectra/data/she/nmr/H-F/1/audita.txt
$$ ##AUDIT TRAIL=  $$ (NUMBER, WHEN, WHO, WHERE, WHAT)
(   1,<2019-07-26 15:51:48.78 +0400>,<she>,<DPX200>,
      <continue with go, POWCHK disabled, PULCHK disabled
       configuration hash MD5:
       00 E9 B6 7A A2 85 ED C7 34 08 36 98 17 FE 4E 26
       data hash MD5: 16K
       22 61 04 3F D9 AD 62 87 7C A3 92 FF 7C 17 5A 25>)
$$ ##END=
$$ 
$$ hash MD5
$$ 20 4E B2 A8 23 19 CD C3 45 86 53 78 12 65 48 FC
##$RELAX= 
##$RELAX= 
##$RELAX= 
##$RELAX= 
##$RELAX= 
##$RELAX= 
$$ Bruker specific parameters
$$ --------------------------
##$DU= <F:/spectra>
##$EXPNO= 1
##$NAME= <H-F>
##$PROCNO= 1
##$TYPE= <nmr>
##$USER= <she>
##$AMP= (0..31)
100 100 100 100 100 100 100 100 100 100 100 100 100 100 100 100 100 100 
100 100 100 100 100 100 100 100 100 100 100 100 100 100 
##$AQSEQ= 0
##$AQ_mod= 1
##$AUNM= <au_zg>
##$AUTOPOS= <>
##$BF1= 200.13
##$BF2= 200.13
##$BF3= 200.13
##$BF4= 200.13
##$BF5= 200.13
##$BF6= 200.13
##$BF7= 200.13
##$BF8= 200.13
##$BYTORDA= 1
##$CFDGTYP= 0
##$CFRGTYP= 5
##$CHEMSTR= <none>
##$CNST= (0..31)
1 1 145 1 1 1 1 1 1 1 1 1 1 1 1 1 1 1 1 1 1 1 1 1 1 1 1 1 1 1 1 1 
##$CPDPRG= <>
##$CPDPRG1= <>
##$CPDPRG2= <>
##$CPDPRG3= <>
##$CPDPRG4= <mlev>
##$CPDPRG5= <mlev>
##$CPDPRG6= <mlev>
##$CPDPRG7= <mlev>
##$CPDPRG8= <mlev>
##$CPDPRGB= <>
##$CPDPRGT= <>
##$D= (0..31)
0 1.2 0 0 0 0 0 0 0 0 0 0.03 0 0 0 0 0 0 0 0 0 0 0 0 0 0 0 0 0 0 0 0 
##$DATE= 1564141766
##$DBL= (0..7)
120 120 120 120 120 120 120 120 
##$DBP= (0..7)
150 150 150 150 150 150 150 150 
##$DBP07= 0
##$DBPNAM0= <>
##$DBPNAM1= <>
##$DBPNAM2= <>
##$DBPNAM3= <>
##$DBPNAM4= <>
##$DBPNAM5= <>
##$DBPNAM6= <>
##$DBPNAM7= <>
##$DBPOAL= (0..7)
0.5 0.5 0.5 0.5 0.5 0.5 0.5 0.5 
##$DBPOFFS= (0..7)
0 0 0 0 0 0 0 0 
##$DE= 6
##$DECBNUC= <off>
##$DECIM= 24
##$DECNUC= <off>
##$DECSTAT= 4
##$DIGMOD= 1
##$DIGTYP= 9
##$DL= (0..7)
0 120 120 120 120 120 120 120 
##$DP= (0..7)
150 150 150 150 150 150 150 150 
##$DP07= 0
##$DPNAME0= <>
##$DPNAME1= <>
##$DPNAME2= <>
##$DPNAME3= <>
##$DPNAME4= <>
##$DPNAME5= <>
##$DPNAME6= <>
##$DPNAME7= <>
##$DPOAL= (0..7)
0.5 0.5 0.5 0.5 0.5 0.5 0.5 0.5 
##$DPOFFS= (0..7)
0 0 0 0 0 0 0 0 
##$DQDMODE= 0
##$DR= 18
##$DS= 0
##$DSLIST= <SSSSSSSSSSSSSSS>
$$ [...]
##$SUBNAM2= <"">
##$SUBNAM3= <"">
##$SUBNAM4= <"">
##$SUBNAM5= <"">
##$SUBNAM6= <"">
##$SUBNAM7= <"">
##$SUBNAM8= <"">
##$SUBNAM9= <"">
##$SW= 24.9336996594482
##$SWIBOX= (0..15)
0 0 2 0 0 0 0 0 0 0 0 0 0 0 0 0 
##$SW_h= 4990.01996007984
##$TD= 16384
##$TD0= 1
##$TE= 0
##$TE2= 300
##$TE3= 300
##$TEG= 300
##$TL= (0..7)
0 120 120 120 120 120 120 120 
##$TP= (0..7)
150 150 150 150 150 150 150 150 
##$TP07= 0
##$TPNAME0= <>
##$TPNAME1= <>
##$TPNAME2= <>
##$TPNAME3= <>
##$TPNAME4= <>
##$TPNAME5= <>
##$TPNAME6= <>
##$TPNAME7= <>
##$TPOAL= (0..7)
0.5 0.5 0.5 0.5 0.5 0.5 0.5 0.5 
##$TPOFFS= (0..7)
0 0 0 0 0 0 0 0 
##$TUNHIN= 0
##$TUNHOUT= 0
##$TUNXOUT= 0
##$USERA1= <user>
##$USERA2= <user>
##$USERA3= <user>
##$USERA4= <user>
##$USERA5= <user>
##$V9= 5
##$VALIST= <valist>
##$VCLIST= <CCCCCCCCCCCCCCC>
##$VD= 0
##$VDLIST= <DDDDDDDDDDDDDDD>
##$VPLIST= <PPPPPPPPPPPPPPP>
##$VTLIST= <TTTTTTTTTTTTTTT>
##$WBST= 1024
##$WBSW= 4
##$XGAIN= (0..3)
0 0 0 0 
##$XL= 0
##$YL= 0
##$YMAX_a= 1128059
##$YMIN_a= -1587273
##$ZGOPTNS= <>
##$ZL1= 120
##$ZL2= 120
##$ZL3= 120
##$ZL4= 120
##$ABSF1= 10
##$ABSF2= 0
##$ABSG= 5
##$ABSL= 3
##$ALPHA= 0
##$AQORDER= 0
##$ASSFAC= 0
##$ASSFACI= 0
##$ASSFACX= 0
##$ASSWID= 0
##$AUNMP= <proc_1d>
##$AZFE= 0.1
##$AZFW= 0.1
##$BCFW= 1
##$BC_mod= 2
##$BYTORDP= 1
##$COROFFS= 0
##$CY= 11.3945322036743
##$DATMOD= 1
##$DC= 2
##$DFILT= <>
##$DTYPP= 0
##$F1P= 20.1537800932815
##$F2P= 0.134698688090026
##$FCOR= 0.5
##$FTSIZE= 0
##$FT_mod= 4
##$GAMMA= 1
##$GB= 0.15
##$INTBC= 1
##$INTSCL= 1
##$ISEN= 128
##$LB= 0.24
##$LEV0= 0
##$LPBIN= 0
##$MAXI= 10000
##$MC2= 0
##$MEAN= 0
##$ME_mod= 0
##$MI= 1.114404
##$NCOEF= 0
##$NC_proc= 0
##$NLEV= 6
##$NOISF1= 3.799351
##$NOISF2= 2.8
##$NSP= 1
##$NTH_PI= 0
##$NZP= 0
##$OFFSET= 15.70392
##$PC= 1
##$PHC0= -9232.903
##$PHC1= 28.60097
##$PH_mod= 1
##$PKNL= yes
##$PPARMOD= 0
##$PSCAL= 0
##$PSIGN= 0
##$REVERSE= no
##$SF= 200.130013532006
##$SI= 16384
##$SIGF1= 3
##$SIGF2= 2
##$SINO= 400
##$SIOLD= 16384
##$SREGLST= <1H.CDCl3>
##$SSB= 0
##$STSI= 0
##$STSR= 0
##$SW_p= 3612.71676300578
##$SYMM= 0
##$S_DEV= 0
##$TDeff= 0
##$TDoff= 0
##$TI= <>
##$TILT= no
##$TM1= 0
##$TM2= 0
##$TOPLEV= 0
##$USERP1= <user>
##$USERP2= <user>
##$USERP3= <user>
##$USERP4= <user>
##$USERP5= <user>
##$WDW= 1
##$XDIM= 8192
##$YMAX_p= 0
##$YMIN_p= 0
$$ End of Bruker specific parameters
$$ ---------------------------------
##NTUPLES= NMR FID
##VAR_NAME=  TIME,          FID/REAL,        FID/IMAG
##SYMBOL=    X,             R,               I
##VAR_TYPE=  INDEPENDENT,   DEPENDENT,       DEPENDENT
##VAR_FORM=  AFFN,          ASDF,            ASDF
##VAR_DIM=   8192,          8192,            8192
##UNITS=     SECONDS,       ARBITRARY UNITS, ARBITRARY UNITS
##FACTOR=    0.0002004,     1,               1
##FIRST=     0,             0,               0
##LAST=      1.6414764,     0,               0
##MIN=       0,             -1587273,        0
##MAX=       1.6414764,     1128059,         0
$$ Real data points
##PAGE= N=1
##DATA TABLE= (X++(R..R)), XYDATA
0@%%%%%%M0q0Q0q0J20j60K00k50K90l60M40n22O35p55Q82j040J202j381J588j829
26i80K096k383K707l064L453l892M370m884N461o094O778p540Q377r289J0297
41E413j1406J2622j3974J5478j7152J9046k1191K3636k6460K9765l3699L8472
53B0550m4399N1998o2171P6572r8685J37462k25327P87928j2001j248128L92715
64b23486Q38785N12760n29169o95350l56350L24990M28321J67315k72023k42186
74d6393o0256J15302J22469K38321J42077k06046n05448j63884M43299N97669
84F77110J0957n86191n59960P1325N65482M20072k20693n96374l03748L06628
94b15392M91391J19531l26135l68052p0331K48806L39001J53915j79154l54896
$$ plain form
0 0 0 0 0 0 0 0 40 -40 40 -40 80 -80 120 -130 160 -200 240 -282 353 -402 480 -560 642 -739 849 -980
26 -980 1116 -1267 1440 -1624 1829 -2063 2307 -2577 2884 -3210 3568 -3972 4405 -4884 5413
41 5413 -5993 6629 -7345 8133 -9019 10027 -11164 12472 -13988 15777 -17922 20550
53 20550 -23849 28149 -34022 42550 -56135 81327 -144000 643928 631927 -616201 -223486
64 -223486 615299 1128059 598890 -96460 -452810 -127820 300501 467816 195793 -46393
74 -46393 -106649 8653 131122 369443 511520 305474 -199974 -363858 79441 677110
84 677110 688067 101876 -458084 -386759 178723 598795 378102 -218272 -522020 -215392
94 -215392 275999 395530 69395 -298657 -368988 -120182 218819 372734 193580 -161316
104a61316j73595K14972M01720J81723k22566l94011j55418K44062L70884P6030
114C82485l10256l57086l8838K78538K93715O2901j69959k27098q8917J45297
124b9218K85960J73915j25425l29916k04753J53812L71773J83820k32660l96897
134a49589r0459L33120L64494m3412m11358l27759O9733L22486J90121j21516
144A35861k59353j21244Q8559J55743Q2884r318n2926o6551l5637O0365J31386
155A09769N7001j19826j87380l0068J91280K02314l7706k74954k39296M4223K73825
166a0818K13202o4671k54634j68357P7956K15270J16954r3282j96922r0537J20782
177a35057K16203Q5185j41017k06737j6297K17783K30356J9634j66891j55110
$$ plain form
104 -161316 -334911 -119939 281781 463504 240938 -153073 -308491 -64429 306455 382485
114 382485 72229 -284857 -323695 -45157 248558 311459 141500 -85598 -174515 -29218
124 -29218 256742 430657 305232 -24684 -229437 -75625 296148 479968 247308 -149589
134 -149589 -240048 93072 457566 414154 2796 -324963 -255230 67256 257377 135861
144 135861 -123492 -244736 -156177 -434 82450 73132 20206 -46345 -81982 -21617 109769
155 109769 166770 46944 -140436 -170504 20776 223090 185384 -89570 -328866 -284643 -10818
166 -10818 202384 137713 -116921 -285278 -207322 7948 124902 31620 -165302 -255839 -135057
177 -135057 81146 166331 25314 -181423 -197720 20063 250419 270053 103162 -51948
187e1948j9210P9902P8163K7495j7600n6126q9584o2306N4506J51904P0459j44348
199B1307k13377P380K62983J99347j40425l20864r8217K52473K94261j4327k82172
210c1631j92115J10183K26086L5994j73468j29483O0744J10181j1129p9004N816
221f7826P0254j3701j17732m8000J30826J64128k7429k01737j10327J51954K41121
232A71531K5276k23793j85471P4596K12262O7171j52389j72686n413J33950J12589
243E7623P625m9403m4122k8936j1700L7159Q9226N7695n6028j12975k5015J10110
255C1259J07517l2429j25828n0603Q8139J12223q022j22801j02076N147O7120
266c0354L9665o186j7372k5892n2654m4148L9007J09373N7169p0262j04596J0973
$$ plain form
187 -51948 -71158 8744 86907 114402 96802 40676 -48908 -111214 -56708 95196 165655 21307
199 21307 -192070 -184690 78293 277640 137215 -183649 -281866 -29393 264868 250541 -31631
210 -31631 -223746 -113563 112523 148517 -24951 -154434 -93690 16491 5362 -73642 -67826
221 -67826 2428 -11273 -129005 -177005 -46179 117949 90520 -111217 -221544 -69590 171531
232 171531 196807 -26986 -212457 -137861 74401 141572 -10817 -183503 -188916 -54966 57623
243 57623 65248 15845 -28277 -57213 -68913 -31754 57472 115167 59139 -53836 -78851 31259
255 31259 138776 106347 -19481 -70084 18055 130278 122256 -545 -102621 -97474 -30354
266 -30354 9311 3125 -14247 -40139 -92793 -136941 -97934 11439 68608 -1654 -106250 -95277
278i5277J25402P8413q0513j37992r192J48230J20761o3771j76347p8995R3247
289g6034J26958J4606p0836l2757L2953J7091m5994l6469L9937O2250j8242q8679
301g5216l2744Q6455R8342k4639j17285m3718J11263J35562r481j42514j01673
312a15648M8620J13597L2282o3736n3339K4549N0801O770k9275j4437J1983J169
324A3336j7666k402K9259K2201l0033n5163r672N0157M2223k1316n2421j0876
336d2373L8985L2999p916k1602k461O856j1P796K7201J0674m5692p3940j5097
349h4581P8561Q7165j2806r9231n9005N8595R4265P056q0594m6219M9133O5729
361E8068j8586p6123k8332M9420M4305k1400l6257K4313N7363p356q9631o4017
$$ plain form
278 -95277 30125 108538 28025 -109967 -119159 29071 149832 86061 -90286 -169281 -76034
289 -76034 50924 65530 -5306 -38063 -5110 11981 -34013 -70482 -30545 31705 13463 -75216
301 -75216 -107960 -21505 76837 52198 -65087 -108805 2458 138020 128539 -13975 -115648
312 -115648 -67028 46569 78851 15115 -38224 -13675 37126 43896 14621 184 12167 13336
324 13336 -4330 -6732 22527 44728 14695 -40468 -50140 17 42240 20924 -31497 -42373
336 -42373 -3388 29611 21695 93 -2368 4488 4477 12273 39474 50148 4456 -69484 -84581
349 -84581 -6020 81145 68339 -30892 -89897 -31302 62963 70019 -10575 -56794 -7661 58068
361 58068 39482 -36641 -64973 -15553 28752 7352 -28905 -4592 52771 45415 -44216 -108233
373a08233N4786J11082K9762q4632p3347L6810R1648K0596o5081m2728N2173P7735
385A00571q385r0520o2377K9997O9278J6506m1777l0388J0696P838k8831l0961
397e8353K1804N6025K0979l7918l6851K2130N2900R340m8416l8936K6929O1982
409E1615J6969m7724n0010J028M1919L2931K957r493q577j4778k4738j2145K0278
422B32K7295q613m2704k4094K8595M6166P397l3430k0813K8791L9751K6l6972
435A1627k3771J3082J6672j3540k6811P92L1364K1752j6896k7845J579K3679K555
448A4239k3658r537L3037L6114j2439n0209k4624L3100M3278q119m7057j8524
460c4399L8176M6578n062m6143k6964K3090L7263O564k0756j7230m583r575j0879
$$ plain form
373 -108233 -53447 57635 87397 2765 -70582 -33772 57876 78472 13391 -29337 22836 100571
385 100571 92186 1666 -60711 -30714 38564 55070 13293 -17095 -6399 1439 -27392 -58353
397 -58353 -36549 19476 40455 2537 -34314 -12184 40716 50056 1640 -37296 -10367 51615
409 51615 68584 20860 -29150 -28122 13797 46728 49685 40192 31615 16837 -7901 -20046 232
422 232 27527 18914 -23790 -47884 -19289 26877 34274 844 -19969 8822 48573 48599 11627
435 11627 -12144 938 17610 4070 -22741 -21949 9415 31167 14271 -13574 -11995 11684 14239
448 14239 -9419 -18956 14081 50195 37756 -12453 -37077 -3977 39301 31182 -15875 -34399
460 -34399 3777 50355 45293 -850 -27814 -4724 32539 39103 18347 1117 -3466 -13041 -23920
473b3920R767L9645L3279j1747m3780k7839J3812K8951O346j4972j1348N087M932
486H213m865o235L143Q067L516L279R149N533j9546l2755j7012J5929K2040k094
500c638j9789m420J6410Q393j7238r760L0168N1233J6669l5913l9324P114L7358
513C7263J1937k7125j9390J6839J9876k3682m8124p669N0263M3211k1296n0296
525a8193l614N3530L7618l1005n9620j2044M4292L2669k1703l9214L431L8246
537B4393J6658k5081k1293K5172L9714j1526o0678l7083L3024N1747P74n1080
549a5259l1145L2902N2953O966m0360k5871K2521L2084l939k7844j758L1013K0064
562E2327k7882m4212k11M5983L3771j8244l8676p495K6977J3169k1037j7203J8935
$$ plain form
473 -23920 -14153 25492 58771 47024 3244 -24595 -10783 18168 24514 9542 -1806 3281 8213
486 8213 3348 -2887 256 8323 11839 15118 24267 29800 10254 -22501 -39513 -23584 -1544 -3638
500 -3638 -23427 -27847 -11437 -3044 -20282 -30042 126 51359 68028 32115 -7209 -95 37263
513 37263 49200 22075 2685 19524 39400 15718 -32406 -40075 10188 53399 32103 -18193
525 -18193 -21807 31723 69341 38336 -21284 -33328 10964 43633 21930 -17284 -13853 24393
537 24393 41051 15970 -5323 19849 59563 48037 -12641 -49724 -16700 35047 35821 -15259
549 -15259 -46404 -13502 39451 46417 6057 -19814 2707 34791 30852 3008 1250 32263 52327
562 52327 24445 -19767 -19978 26005 59776 41532 2856 -4639 22338 35507 14470 -2733 16202
575A6202L2650K315l4486k7260J6266L9032R308k7064j8128K2804L1385q760m1268
588A2996k2003J7646K3499o827k1221l961J3348k183k3158j0565L2670N1259J2330
601G3830m2349m3812Q300L9315J1192k7626k0057J5749K1803j0758k8686j570
613d669L2677K4062j7144l5135n951K6527J2378l0206l7071R008M4015J8004k9614
626F881l3180O025L1372J0141k0937j4269K1261L2412j8l6423k6090J8071L7731
639C2977O956k9229k3234R032K4030O897j2620r821N876J2260j583j5835r642
652c936J0552J4290n747k3518r596K0009L0877O753k0142k2285J419K3757J2607
665C5040j6453k7051m771J9741R549j9771k3018M926K8321J6746j3598k1440J302
$$ plain form
575 16202 48852 51167 16681 -10579 5687 44719 54027 26963 8835 31639 63024 54264 12996
588 12996 -9007 8639 32138 25311 4090 129 13477 11294 -11864 -22429 10241 61500 73830
601 73830 31481 -12331 -4031 35284 46476 18850 -1207 14542 36345 25587 -3099 -4669
613 -4669 28008 52070 34926 -209 -6160 20367 32745 2539 -34532 -25524 18491 36495 6881
626 6881 -26299 -20274 11098 21239 302 -13967 7294 39706 39688 3265 -22825 -4754 32977
639 32977 39933 10704 -12530 -3498 20532 27429 14809 4988 10864 23124 21541 5706 -3936
652 -3936 6616 20906 15159 -8359 -17955 2054 32931 39684 19542 -2743 -1324 22433 35040
665 35040 18587 -8464 -13235 6506 16055 -3716 -26734 -21808 6513 23259 9661 -11779 -10477
678a0477K1521P260k2587k1946J0493L3568J3753k2444k9940K34K3999J2312j2519
691C227j2786J0095J7755o831l0135j3909K2661L2803M898k3116j9199P480J8914
704A1857P887r077l842J6583J9946j848k3739j4703O638J0924n365j5764o395
717f898N805L437r355j4310k205J2690J5151J839j2299j0106J450N569M73J238
731g521J0028Q606l155j2854n289P908R115o17r423n963N774O899p079j1870j33
746a5574J3331P288r704j0093P275J7809M334j5200j2196J0285K0632L825k0884
759A128j4092J3476K0404n751k8458q110K5761K5427r037k8430p084K5714K5138
772C6086r450l2467j1189K5761K3616j6703l7512r547K8252K0936j4314k2156
$$ plain form
678 -10477 11044 18304 -4283 -26229 -15736 17832 31585 9141 -20799 -20565 3434 15746 3227
691 3227 -9559 536 18291 11460 -18675 -32584 -9923 22880 27778 4662 -14537 -7057 11857
704 11857 19744 10667 6825 23408 43354 41506 17767 3064 9702 20626 15261 -503 -6898
717 -6898 -1093 2344 -7011 -21321 -23526 -10836 4315 6154 -6145 -16251 -14801 -9232 -8759 -7521
731 -7521 2507 11113 7958 -4896 -10185 -2277 6838 6221 -3202 -9165 -3391 3508 -3571 -15441 -15574
746 -15574 -2243 5045 -4659 -14752 -7477 10332 14666 -534 -12730 -2445 18187 22012 1128
759 1128 -12964 512 20916 15165 -13293 -21403 4358 29785 20748 -7682 -14766 10948 36086
772 36086 26636 -5831 -17020 8741 32357 15654 -21858 -31405 -3153 17783 3469 -18687
784a8687N359K5367O433k4865k6558O518L2326K0422j9320l1267p36K8234J4269
797A7495j7649j7195R970K2512L684k0285j8141O021K3565J3100j1393k0569k360
810a1245J6891Q577j5623j7852N540K0745J1738j0411j9315o957P860R583k737
823c206o756K871J3437J770j3571j2870J0504K4732J4396q513j8448n380J1846
836A0812J0916p511j5451l639Q956L857r081r599K848P064K798o279o715n71O039
851e556L376m452o181N68O231O454K919Q54j106o351l593N679Q729J255r536p148
867g858j381M331K294l252n092j688J160l73n0O833R825K891r326r792N012J5779
883I313J0436p947j7160q925L617Q423J455m831r88O244M416l565o945K007J0270
$$ plain form
784 -18687 -13328 12039 18472 -6393 -32951 -26433 5893 26315 6995 -24272 -25008 3226 17495
797 17495 -154 -17349 -7379 15133 18817 -1468 -19609 -13588 9977 23077 11684 -8885 -11245
810 -11245 5646 14223 -1400 -19252 -13712 7033 18771 8360 -10955 -17912 -10052 -469 -3206
823 -3206 -9962 -7091 6346 8116 -5455 -18325 -7821 16911 31307 22794 4346 -1034 10812
836 10812 21728 14217 -1234 -4873 4083 7940 -1141 -10740 -7892 -828 1970 -4309 -11024 -11595 -5556
851 -5556 -2180 -6632 -12813 -12245 -6014 440 3359 4213 3107 -3244 -6837 -1158 7571 8826 -710 -7858
867 -7858 -9239 -4908 -2614 -5866 -10958 -12646 -11486 -11859 -11909 -5076 4749 7640 -1686 -11478 -6466 9313
883 9313 19749 11802 -5358 -14283 -10666 -2243 -788 -5619 -6607 -363 4053 488 -6457 -4450 5820
898E820R301l074j2985q534O647J3359j639j5542j0225Q758J8042L390j4920j6351
912a7953k069J1859R072m711p998K116J0195k557j5893l757K0326K2752j670k3021
926c309j4239R725K0058O844j4286j3836M600J3081q76j5196q397J3672J6834
939A4675l001j6104m391J4677J2698p794k0200j0867J1374J8635L637j4505j4267
952a5433M937J6098R535k774l816O27K371l205n988k077O350O626m307j3775q043
967a2874Q797J4417L965j3396j3305J79J2237P920o457j1814k207N880K946n816
981i528k781P252J1677R6j1063o643Q088J4270K759j1049j1497K362R780L308
995G031o953q800n20M806J912p31J726M449j434q387l745L929R198L529n900r785
$$ plain form
898 5820 15121 12047 -938 -9472 -2825 10534 8895 -6647 -16872 -8114 9928 13318 -1602 -17953
912 -17953 -20022 -8163 909 -3802 -11800 -9684 511 -2046 -17939 -21696 -1370 21382 19712 -3309
926 -3309 -17548 -7823 12235 19079 4793 -9043 -4443 8638 7762 -7434 -15831 -2159 14675
939 14675 11674 -4430 -8821 5856 18554 10760 -9440 -20307 -8933 9702 13339 -1166 -15433
952 -15433 -10496 5602 15137 12363 8547 9174 11545 8340 2352 275 6625 13251 8944 -4831 -12874
967 -12874 -4077 10340 14305 909 -12396 -12217 20 7940 1483 -10331 -12538 -6658 -3712 -9528
981 -9528 -12309 -5057 6620 6716 -4347 -10990 -2902 11368 14127 3078 -8419 -6057 3723 7031
995 7031 78 -8722 -9242 -4436 -2524 -3255 -1529 2920 1486 -6901 -10646 -6717 2481 6010 110 -9675
1011i675m798K466Q301O389M600p31o127o859k119O188N320q99o180k917L904
1026c137N147M23j617L58M465K106j097l015J037J407m141q795n801K791Q604
1041a265L928o815j1827l345R641J4223M784l502o648j351M427K232r41l54L759
1056F946L53m622q741j262J1244J0770n436j3818o128J0671J4227k786j6443j1193
1070a6218P566J3136m9j2466m702J1019J2258n049j4879j232J6096J2891q922
1083I449j9983n399J6770J5446m837j7012n743J3001J3475l772j0912k970Q124
1096E637M108r666j0751M253J5560N041j3910j6798M58J7716J2329k917j3860
1109b800l240J0033Q827l490q142j481Q393L867o275j0514j525J0496P045m437
$$ plain form
1011 -9675 -14473 -12007 -3706 2683 7283 6552 425 -6434 -8553 -2365 2955 2056 -4124 -7041 -3137
1026 -3137 2010 2433 816 1174 5639 7745 6648 3633 4670 6077 1936 -6859 -12660 -9869 -1265
1041 -1265 2663 -4152 -15979 -19324 -9683 4540 9324 5822 -826 -2177 2250 4482 3541 3187 6946
1056 6946 7299 2677 -6064 -7326 3918 14688 9252 -4566 -10694 -23 14204 11418 -5025 -16218
1070 -16218 -8652 4484 4435 -8031 -12733 -1714 10544 5495 -9384 -10616 5480 18371 9449
1083 9449 -10534 -15933 837 16283 11446 -5566 -11309 1692 15167 11395 483 -2487 5637
1096 5637 9745 79 -10672 -6419 9141 14182 272 -16526 -16068 1648 13977 11060 -2800
1109 -2800 -6040 3993 12820 9330 1188 -293 8100 11967 5692 -4822 -6347 4149 11194 6757
1123F757j1528m15J0750Q301p334j4172n410Q625R544q35r017m361M073N097k074
1138a999l197N499Q774J089j1279j0434K784J1081M417q766q805K435P907K933
1152B439l750j125N383O349j125n261j950M647K820m191o760L41N860J085n755
1167i93l647J118L223j514m099J773O002K418n438n609R62P940P154m003p155
1182a868n95P832N685k274n002n47K694q90n552m941J750N008L1o210o892M163
1198g608R368N487l957q543M72O682N058m669p011J478Q217L584o864p867K580
1213c593J0702M763p070q971J840J1121N125j0477j1950J420J2573O901r994j0790
1227h400K000J1439L983r577p555P857J2288N40j5003j0908Q689J5350K925j4784
$$ plain form
1123 6757 -4771 -5186 5564 13865 6531 -7641 -13051 -4426 5118 4283 -4734 -9095 -5022 75 -1999
1138 -1999 -5196 303 9077 10166 -1113 -11547 -8763 2318 6735 -2031 -10836 -8401 -494 2439
1152 2439 -1311 -2436 2947 9296 8171 2910 960 5607 8427 4236 -2524 -2183 3677 4762 -993
1167 -993 -4640 -3522 -299 -1813 -5912 -4139 1863 4281 -1157 -6766 -5804 2136 9290 5287 -1868
1182 -1868 -2463 5369 11054 8780 3778 3231 5925 5035 -517 -5458 -3708 1300 1331 -4879 -11771 -7608
1198 -7608 1760 7247 3290 -5253 -4781 1901 6959 2290 -4721 -3243 4974 8558 1694 -6173 -3593
1213 -3593 7109 11872 4802 -4169 -2329 8792 13917 3440 -8510 -7090 5483 12384 2390 -8400
1227 -8400 -6400 5039 9022 -555 -8110 -253 12035 12575 -2428 -13336 -4647 10703 13628 -1156
1241a156j0227N389J2619m73j1084l997R436J1812l911j2769n869J0321J1188
1254A1279l364j2038n589Q083R510k614j1188l584P583P524l621o388k022M634
1268a795L627m091n980K179Q632N111o365j0086K97J0599P952k589q904k505O390
1283B472O838k841n110j206L771K935n935m053Q68O801K551o214p061O52P641
1298B109K056l635n672J402M519m74l160K8P615M011k593n547J791Q784M051o154
1314I131r888j377P050K785o070q227n50L414J777k880K12N590M461l853p503
1329e928N08P995Q696j293j0296m397O026N039m79m742L53L820l88m643l335L115
1345E1O060J770o697p293J635Q895M531n603o559r45P273N102j549l200l927j263
$$ plain form
1241 -1156 -11383 -5994 6625 6152 -4932 -8929 507 12319 8408 -4361 -10230 91 11279
1254 11279 7915 -4123 -9712 -1629 7881 5267 -5921 -9505 -1922 5602 1981 -4407 -6429 -1795
1268 -1795 1832 -2259 -8239 -6060 2572 7683 1318 -8768 -8471 2128 10080 7491 -1413 -3918 2472
1283 2472 9310 6469 1359 153 3924 6859 924 -3129 -2261 4540 7091 877 -6184 -5532 2109
1298 2109 4165 530 -5142 -3740 779 305 -2855 -2827 4788 8799 6206 659 2450 11234 15285 9131
1314 9131 -757 -2134 4916 7701 1631 -6596 -7146 -3732 -1955 -4835 -4623 967 5428 1575 -5928
1329 -5928 -5420 2575 11271 9978 -318 -4715 1311 6350 5871 1129 1482 5302 4914 271 -3064 51
1345 51 6111 7881 1184 -6109 -4474 4421 8952 3349 -3210 -4155 3118 8220 6671 3471 -456 -1719
1361a719J400j32k189k8L121J374o225n670L671J0018N060m912p978j987O276
1376H0O325j270o000k776L678M430l729n731L171P688M91r102o969N055R944J591
1392F876r675r989J371J0108O260m156q020K270N965J342l565o79O034M861m372
1407D631q443k589P366Q597k306j1899o052N062R600J574n015k671j11J461q48
1422a643j383O51K342J250n670o404n71R322O529k721p030j705N204M622J131
1437C924k936k966j013K237J451k211j377L260R19m756m180K986Q359J451p554
1452b406m726m90N518N763n6k929m004K775K199j527L36M821L142n511q303J14
1468e284P785L467l866o664j511K484L760J1j517J28L741J228m827p23N036N905
$$ plain form
1361 -1719 -319 -451 -2640 -2668 453 1827 -4398 -10068 -6397 3621 8681 3769 -4209 -6196 80
1376 80 6405 5135 -865 -3641 37 4467 738 -4993 -1822 5866 6357 -2745 -9714 -4659 5285 6876
1392 6876 -2799 -12788 -11417 -1309 4951 795 -7225 -4955 1010 2352 -1213 -1892 4142 9003 4631
1407 4631 -3812 -6401 965 9562 7256 -4643 -10695 -5633 3967 5541 526 -2145 -2256 -795 -1643
1422 -1643 -3026 -2375 -33 1217 -4453 -10857 -11428 -2106 4423 1702 -5328 -7033 -1829 2793 3924
1437 3924 988 -1978 -2991 -754 697 -1514 -2891 369 1288 -3468 -7648 -4662 3697 5148 -2406
1452 -2406 -7132 -7622 -2104 3659 3603 674 -3330 -555 1644 117 453 5274 8416 2905 -5398 -5284
1468 -5284 2501 5968 2102 -4562 -6073 -3589 171 182 -1335 -1207 2534 3762 -1065 -1788 3248 9153
1484I153m222r625l310N079N914j006o705l465J816M014J614n18j25L004q51m005
1500c238j381N629M535L06o227n524J937O753M759l068o087j477L408K390j549
1515A166k404R15p25j606j589k394K641L889M55j786m205J028N333M152j609m638
1531a377j806K791J995M38j772k330J866J507j917j664L139M235p83p031m595
1546g304K620P046K490o109o726R2O900M724j841l699J249L487K5n057q84L880
1562H93L389k225n132j724L193O006J086l816l427J981L258L86k217p37K29j979
1578h36j017r38K465O82r0p29k528j033M830M347N88m079l492J235J180K009o19
1595A975k423j918k74J819Q53l35R79J752o78k808K9K508J905j118l384j085O54
$$ plain form
1484 9153 4931 -4694 -8004 -2925 2989 1983 -4722 -8187 -6371 -2357 -743 -1261 -1386 1618 767 -3238
1500 -3238 -4619 1010 5545 5851 -376 -5900 -3963 2790 7549 4481 -1606 -3083 325 2715 1166
1515 1166 -1238 -323 -1048 -2654 -4243 -6637 -3996 -107 348 -1438 -5643 -4615 718 4870 3261 -1377
1531 -1377 -3183 -392 1603 2041 269 -2061 -195 1312 -605 -2269 870 5105 4322 -2709 -7304
1546 -7304 -4684 2362 4852 -1257 -7983 -7891 -991 3733 1892 -1807 -558 2929 2954 -2103 -2987 893
1562 893 4282 2057 -3075 -4799 -1606 4400 5486 1670 -1757 224 3482 3868 1651 914 1143 -836
1578 -836 -1853 -2791 -326 356 266 -463 -2991 -4024 806 5153 5741 1662 -1830 -595 585 2594 1975
1595 1975 -448 -2366 -2640 -821 32 -303 676 2428 1750 -1058 -1029 1479 3384 2266 -1118 -2203 -1549
1612a549J924j12r64j181N31k7o48j673K213J448j161l210r11L300K546L03j558
1629g29Q2J073J302M42m02J622J099q74m626k464M271M188k199n712j818K533
1645b212K839j93j720o44Q53K728j566k848L68M509J746l523n187K808M627N35
1661C120j441k661J010J425J433p32k834o96J499M4k431j975J374L603N70l435
1677b127j761J015M806J165l91l846j665J064L901Q49l400j677J290J571j20k207
1693a533j35K311K654j378l022p34K281L681n50m450k179K201L100k51k940q42
1709a786J210J231j757k391J609L344K66l523l003J129M573K465k591l301j107
1724c632L070J959J262j451j279p86J215K97L8L36k90l2n43Q8j67J382N23L35
$$ plain form
1612 -1549 375 263 -701 -1882 -1351 -1378 -2026 -3699 -1486 -38 -1199 -4409 -5320 -2020 526 829 -729
1629 -729 -647 426 1728 2170 1768 3390 4489 3615 -1011 -3475 796 4984 2785 -2927 -4745 -2212
1645 -2212 627 434 -1286 -1930 -1077 1651 85 -2763 -2395 2114 3860 337 -4850 -2042 2585 3120
1661 3120 1679 -982 28 1453 2886 2154 -680 -1376 123 167 -2264 -4239 -2865 738 1308 -2127
1677 -2127 -3888 -2873 1933 3098 2707 -1139 -2804 -1740 2161 3010 -390 -2067 -777 794 674 -1533
1693 -1533 -1668 643 3297 1919 -1103 -1837 444 4125 3575 -875 -3054 -853 2247 1996 -944 -1786
1709 -1786 -576 655 -1102 -3493 -1884 1460 1726 -1797 -4800 -3671 902 3367 776 -2525 -3632
1724 -3632 -562 1397 2659 1208 -71 -857 358 655 693 1029 739 707 164 252 85 1467 1990 2325
1742B325j170k253n57J230J473o51j246j969p45M63J683J427K43j40P5m78k61
1759e51K975J417n90k549k093P76K183J082j533k601j450M62J877J453K23j174
1775i3j731n01P71J994R50r40o66n40l73k91R32K395J401p30l246k171K525M230
1793C916O24l694m255k9L647K041o84k089K45J34O76r11N83J624J127k821l278
1810c144R1M113L570k190l866k612K211L922J007j588j515m14J053j84n83Q84
1826G55M58M42j028j503m23K548L268k71k242l488P16K336K960j543l862k313
1842c190J676J651o14p2K37J092p94j257q98L302L553m46l878l831J511M497K250
1859D789l033l679j375L078K456l01j577j03o14m07j215L32K363J093k173k779
$$ plain form
1742 2325 1155 -1098 -1655 -425 1048 397 -849 -2818 -3563 -3100 -1417 10 253 113 188 -290 -551
1759 -551 2424 3841 3251 702 -1391 -615 1568 2650 1117 -1484 -2934 -2472 -595 858 1081 -93
1775 -93 -1824 -2325 -1554 440 1390 450 -216 -756 -1129 -1420 -488 1907 3308 2578 -668 -2839 -314 3916
1793 3916 4540 846 -3409 -3438 209 2250 1566 -523 -278 -144 532 -379 204 1828 2955 134 -3144
1810 -3144 -3053 1060 4630 2440 -1426 -4038 -1827 2095 3102 1514 -1 -415 638 454 -129 755
1826 755 1213 1655 627 -876 -1299 1249 4517 4246 2004 -1484 -768 1568 4528 2985 -877 -3190
1842 -3190 -1514 137 -477 -549 -312 780 -14 -1271 -2169 1133 4686 4240 362 -3469 -1958 2539 4789
1859 4789 1756 -1923 -3298 -220 2236 1935 358 255 -359 -766 -1981 -1649 714 1807 -366 -3145
1875c145j874K418L424p63k47j765p24J335J852J476q1j134j641r59J067J405
1891F44M63M55k051j487m19Q40J416J344m59l609k523R27L113K939j413l262j248
1908d330J620K479K696j00j408j684l51J189J260N91m90j231j340m54L05J777
1924E29J529L69j364k208n94J516L448j20l158k861J38J819K411j612j731K1O47
1941a221N20j314R13K970M33l019n297J306N442K928k040n873j205M011M601n45
1957B610k559j109K588Q31j204k306J822K065L82l670l220O55M273K364k967m054
1973c499j463L513L496M84k587m30M34J210j045l77K282J164m67l058j670K208
1989A95L526J287l779m274n00K158K473p38k770j075J714R05j70k20O65J460o02
$$ plain form
1875 -3145 -5019 -2601 823 60 -187 -1952 -2676 -1341 511 1987 1906 772 -869 -1828 -761 644
1891 644 1107 1562 -489 -1976 -2395 -1555 -139 1205 746 -2863 -5386 -4459 -1346 1593 180 -3082 -4330
1908 -4330 -2710 -231 2465 2365 957 -727 -1078 111 1371 1962 1472 241 -1099 -1553 -1248 529
1924 529 2058 2427 1063 -1145 -1739 -223 3225 3105 -53 -2914 -2776 -957 1454 -158 -1889 -1868 -1221
1941 -1221 -701 -2015 -1102 1868 2301 -718 -6015 -4709 733 3661 1621 -4252 -5457 -1446 3155 2610
1957 2610 51 -1058 1530 2361 1157 -1149 673 2738 3120 -550 -3770 -3115 1158 3522 555 -3499
1973 -3499 -4962 -1449 2047 2531 -56 -486 -52 1158 113 -264 2018 3182 2715 -343 -2013 195
1989 195 3721 5008 1229 -3045 -3545 -1387 1086 348 -2422 -3497 -1783 -878 -1048 -1268 -603 857 255
2006B55k001q55J705K504P74k903l026J208J894L127j512j552P06N35k52n38M30
2023D99K797j259l548k001Q10L787Q81j791k513m45J908J528K26j34M87l07o81
2040B44j519R97K983J69l047j030N6K300J883j299j954J54J222N56j183p55J083
2057H60ro07j761m36K370J301l40k312j676R30J893M75p40j907K40K22J032k96
2075g61K60J52k5R44r80n59J210K519M06l203k306J506K238O11k656j650J031
2092a263J443J472j436j840Q53J070J272k711k512K426L822l26l540j300K228
2107c42L177J80r54j981j98L251R9j794j676J321J984k858l740j04L554J455j801
2124d27l617k88K613K426O3l275j359K631J491k64k466k30K562K95j845j148N27
$$ plain form
2006 255 -1746 -2601 -896 1608 2382 -521 -3547 -2339 -445 2682 1170 -382 324 859 607 69 499
2023 499 3296 2037 -1511 -3512 -2702 1085 1966 175 -2338 -2783 -875 653 879 745 1232 925 244
2040 244 -1275 -278 2705 2874 -173 -1203 -1147 1153 3036 1737 -217 -63 1159 1715 532 -223 860
2057 860 851 244 -1517 -1953 417 1718 1378 -934 -2610 -1680 213 688 -52 -1959 -1719 -1497 -465 -761
2075 -761 -501 -349 -374 570 -410 -969 241 2760 3166 -37 -2343 -837 1401 2012 -644 -2294 -1263
2092 -1263 180 1652 216 -1624 -771 299 1571 -1140 -3652 -1226 2596 2270 -1270 -2570 -342
2107 -342 2835 3015 2061 80 -118 3133 3232 1438 -238 1083 3067 209 -3531 -3635 -81 1374 -427
2124 -427 -4044 -4332 -1719 707 770 -2505 -3864 -1233 258 -6 -2472 -2702 -140 155 -1690 -2838 -2311
2141b311J485K478k054j831o51K201J611j029j708j77K217o94j323o18K408N34
2157E38l00k067k026K406L608l20m149j300K165K725l14j655l03J414O44r50j661
2174a545N95K348P41k465k303O17K967J207k364l359K506K499j468k223L06J822
2190a19J516j176k438r66L167J554j396m236n37M051L388j825k463Q9K319pj092
2207a71m82J684J178r26k119j671K644K758p12l767j883L091K276r44j893l94
2223a331Q57P55k76j660J340J687j40k133q50J29L987O42k021r67j69P99N1M23
2241A123J089o24j709j114Q67L87P01J40j256j868R38O34Q06K81o18p08j580l57
2259b868J970J853j45p18j352Q45O85J622o60p18j300Q49r0J85p56J909o11j171
$$ plain form
2141 -2311 -826 1652 -402 -2233 -2884 -683 928 -101 -1809 -1986 231 -463 -1786 -2404 4 538
2157 538 238 -1829 -3855 -1449 2159 1839 -2310 -3610 -1445 1280 966 -689 -992 422 1066 116 -1545
2174 -1545 -950 1398 2139 -326 -2629 -2012 955 2162 -202 -3561 -1055 1444 -24 -2247 -1941 -119
2190 -119 1397 221 -2217 -3183 -16 1538 142 -4094 -4631 -580 2808 983 -1480 -1391 928 921 -171
2207 -171 -653 1031 2209 1283 -836 -2507 137 2895 2183 -1584 -3467 -376 1900 956 -937 -1331
2223 -1331 -474 281 5 -1655 -315 1372 1232 -901 -1751 -1622 2365 3007 986 19 -150 649 700 1123
2241 1123 2212 1588 -121 -1235 -368 19 720 860 -396 -2264 -1326 -692 114 395 -223 -931 -2511 -2868
2259 -2868 -898 955 810 92 -1260 -415 270 1892 1232 514 -786 63 -27 158 -598 1311 700 -471
2277d71j561P77K463J103r41j630r32M50J586J002j260n36J53o35p38k45K325
2294I10J693o33k377k077K083K784K290k643l383L87K650N56j920k69P04O57j782
2311c70n74Q46K620K33k156l682Q9L182L292k716l369J28K352O36l85j277J306
2328A55J654k089j526P34K398K547j902l827r78L365L313m62l765j360K960n2
2344A165o71j600K232J918o37m830m52L075L764k04m967k302J978M077j69k436
2360e9m33J682K37j659p14J332K385M55m193j785Q44M391L77l139k095J080J737
2377D43N61r11m89J251j41k159j446Q98L613J347l524l177J030M282J958j773
2393A763k857L41J597J10j180K81J086P5k426k063J685L189J221j952l075l2K265
$$ plain form
2277 -471 -2032 -1255 1208 2311 1370 -260 -1192 -742 844 1846 586 50 203 -432 -1170 -1415 910
2294 910 2603 1970 -407 -2484 -401 2383 4673 2030 -1353 -966 1684 2240 320 51 755 1412 -370
2311 -370 -944 -98 2522 2755 599 -3083 -2994 188 3480 764 -2605 -2477 -125 511 126 -1151 155
2328 155 1809 -280 -1806 -1072 1326 3873 1971 -1856 -2834 531 3844 3382 -383 -1743 1217 1165
2344 1165 494 -1106 1126 3044 2407 -2423 -2875 200 3964 3760 -1207 -3509 -1531 2546 2377 -59
2360 -59 -492 1190 1427 -232 -946 386 2771 3226 -967 -2752 -1908 2483 2860 -279 -2374 -1294 443
2377 443 1004 93 -396 855 714 -1445 -2891 -1993 1620 2967 -557 -3734 -2704 1578 3536 1763
2393 1763 -1094 -753 844 954 -226 55 1141 1216 -1210 -3273 -1588 1601 2822 870 -2205 -2237 28
2410B8J669j130q94N0L03m71j000L43J971J296k032k693J64L349J432n68k726
2427i09l23J349M77j272N38O11N91j103j556n15L665J021j395l603j125K763K783
2444A997p59k382j796K412Q11j416o30K106J837j311k867r28K839K647j42l837
2460a419k350L104K981o63k200k71J603J775k110k666J832L632k24l497l225J367
2476b331N209N43k813l430J152L428N55k272j216K270J618k081l075J136L296
2491A989K238l550l361L81L443J611k284k360N69K538L64k106j667K516K769l081
2507Ik971k80M036J718k370k712O68K209J218k003j244J009K340o43k137j147
2523b300K675K445o09m449j240L828L228q78m322n25K676J740j406k539J390J686
$$ plain form
2410 28 1697 567 -327 -277 26 -445 -1445 -1102 869 2165 133 -2560 -2396 953 2385 1817 -909
2427 -909 -1232 117 594 -678 -140 471 1062 -41 -1597 -2112 1553 2574 1179 -2424 -3549 -786 1997
2444 1997 1238 -1144 -2940 -528 283 -1133 -1763 343 2180 869 -1998 -2926 -87 2560 2418 -1419
2460 -1419 -3769 -665 2316 1653 -547 -818 785 2560 450 -2216 -384 3248 3024 -473 -3698 -2331
2476 -2331 2878 3421 608 -2822 -1670 1758 2313 41 -1175 1095 2713 632 -2443 -1307 1989
2491 1989 4227 677 -2684 -2303 1140 2751 467 -1893 -1324 1214 1578 -528 -2195 321 3090 9
2507 9 -2962 -3242 794 2512 142 -2570 -1902 307 1525 -478 -1722 -713 1627 984 -1153 -2300
2523 -2300 375 2820 2211 -2238 -3478 350 3578 2700 -1622 -2147 529 2269 863 -1676 -286 1400
2539A400R32l171j088K077K085P26l624j763J536K844j59k673j015J943J666j497
2555B19j917L79K798J335l149j299K71L032P34k268j879O4K140M87k177q85J681
2572d34J691j712j305J40K274J045j962k203P98K143J288k165j215N42K349o99
2588E75j921l42J313J774r56k834R05K380J008k396j719L71K199Q04j758q53Q37
2605f13K582j081k550q12K958K678k418k992kK777K448j636k602o48L055O50k172
2622c78j795J577K291o34k825j768L398K897j012l558j008L014J753q98k612O0
2638a498K846L81k250k442J181L773J77l334k487J954M168m28l315j508J716L118
2654B052j590j929p69L674R59l154k253J351M101K73l358k949J940L629K13k628
$$ plain form
2539 1400 2332 -839 -1927 150 2235 2961 -663 -2426 -890 1954 1795 -878 -1893 50 1716 219
2555 219 -1698 -1319 1479 2814 -335 -1634 -1363 1669 2403 135 -1744 -1680 460 947 -1230 -2115 -434
2572 -434 1257 -455 -1760 -1620 654 1699 -263 -2466 -1668 475 1763 -402 -1617 -1075 1274 575
2588 575 -1346 -1688 -375 1399 443 -2391 -1486 894 1902 -494 -2213 -1842 357 1161 -597 -1450 -613
2605 -613 1969 888 -1662 -2474 484 3162 744 -2248 -2250 527 2975 1339 -1263 -1911 1144 1794 -378
2622 -378 -2173 -596 1695 1061 -1764 -3532 -134 2763 1751 -1807 -2815 199 1952 1054 -1558 -1498
2638 -1498 1348 1729 -521 -2963 -1782 1991 2168 -1166 -3653 -1699 2469 2041 -1274 -2782 -1066 2052
2654 2052 462 -1467 -2236 1438 2397 -757 -3010 -1659 2442 2715 -643 -3592 -1652 1977 2190 -438
2670d38j614R56L145q60l003L45K806J184k015l874J309L300K403k688l667J1
2686b700L388J395k530j276P10L289q46l748r94L215L075j314n053q03L800K895
2702B503r03l876q31K511J693q20k606R45K483M97l197j822K768L638r59l066
2718a042k563K334L406N1k779j274J134J952k23k484K53K912J216l186j690Q4
2734a899M219K53k290k140M57K495Q10k139n50N77J592j503k383J269K908J265
2750B941l258k560J161K691J990k215l260P87J702K000k587p25J757R23j607j314
2766a574j136L751J379k130k203r88K960J591r56j908j81J731Q35k041p11K175
2782E94J495p18l601p81L008K753j378k895j058K091J935p02j291q0J255k0j955
$$ plain form
2670 -438 -2052 -1096 2049 1189 -1814 -1469 1337 2521 506 -3368 -2059 1241 3644 956 -2711 -2700
2686 -2700 688 2083 -447 -1723 -1013 2276 1430 -2318 -3312 -97 2978 1664 -3389 -4192 -392 2503
2702 2503 1600 -2276 -3107 -596 1097 277 -2329 -1384 1099 1596 -1601 -3423 -655 2983 2024 -1042
2718 -1042 -3605 -1271 2135 2186 -593 -1867 -733 1219 996 -1488 -1235 1677 2893 -293 -1983 -1899
2734 -1899 2320 2573 283 -1857 -1400 1095 1905 -234 -784 -207 1385 -118 -2501 -1232 1676 2941
2750 2941 -317 -2877 -1716 975 2965 750 -2510 -1723 -21 1979 -608 -1333 424 1347 -260 -1574
2766 -1574 -2710 1041 2420 290 -1913 -2901 59 1650 694 -1214 -1395 336 1171 -870 -1581 594
2782 594 2089 1371 -2230 -3011 -3 2750 1372 -1523 -2581 -490 1445 743 -548 -628 627 607 -1348
2799a348l39K598J637j233l061n88K976J558q99j896p9J183P25j190o77J109J660
2816B136l36l205l41K301J795q13k149j373J342J882j39k148J58R13l1r82j307
2833b297K491J679o13l017j780L287K051J87k685k126K411J245j1o81q34J228
2849E35O12j023k229M29M531m04k410k310J043K730Q04j797j732M24J356P92j496
2866a45p39K235Q96k385j415p97L791J465j938k505q26L255J404j643j980L40
2882i87J897L06j521j069K272R86j572k041j085L510J045q27j722j250K143J629
2898A714n23k478P9J845O46k342r23J869J767n69k839o95K073J765n6j218j894
2915a779J699J410k78k194R12J681N39j721k317J541K423K14k478j974R82K725
$$ plain form
2799 -1348 -1687 911 2548 1315 -1746 -2334 642 2200 1301 -595 -674 509 1234 44 -633 476 2136
2816 2136 1800 -1405 -1746 555 2350 1537 -612 -1985 -643 1239 1100 -1048 -890 23 -8 -990 -2297
2833 -2297 194 1873 1260 -1757 -3537 -250 1801 1988 -697 -2823 -412 833 822 141 -693 535
2849 535 1147 124 -2105 -1676 2855 2451 41 -2269 -1226 1504 2308 511 -1221 -797 559 1351 -145
2866 -145 -884 1351 2247 -138 -1553 -2350 1441 2906 968 -1537 -2363 892 2296 653 -1327 -987
2882 -987 910 1216 -305 -1374 898 1884 312 -1729 -2814 696 1741 914 -808 -2058 85 1714
2898 1714 1191 -1287 -1208 637 1283 -1059 -1982 -113 1654 1085 -1754 -2449 -376 1389 1333 115 -1779
2915 -1779 -80 1330 1052 -1142 -230 1451 1990 269 -2048 -507 1916 2130 -348 -2322 -1340 1385
2931A385J118j900j453P05J294q97p68j2J413Q04j656j565K33K635O91j254j919
2948a146J41J982O31j871p66P31J633j547o78l90J504J657k199j129k31J228J332
2965H82j91r20j108J122M02k31o03R06P97j234j974Q90K496N92j426j034l51J714
2983G29Q89m04j533k38J486r8q08m61O92J823r04j949M4P98J665j103n80j099
3001a051R29J312l38j307Q20R59l46j199j256K117J174m64j377j117K29K292o89
3018F88n73j184P00J172j762k00M92R22N54j303o36J027N74l4q25j118J179J291
3036I64j76j206j104J617J250q11j649m0K831J45j390j463O05J400R13j083k068
3053a265J256J094N93j399r73J250J066q89j515n32J891J280j438n77r52J389
$$ plain form
2931 1385 2503 603 -850 -145 1149 252 -516 -528 885 1689 33 -1532 -1299 1336 2027 773 -1146
2948 -1146 -1005 977 1608 -263 -1029 -298 1335 -212 -890 -1280 224 1881 -318 -1447 -1678 -450 882
2965 882 691 -229 -1337 -215 187 -44 -647 259 1056 -178 -2152 -1262 1234 1826 400 -634 -985 729
2983 729 1618 1214 -319 -557 929 831 23 -438 254 2077 1173 -776 -732 66 1731 628 48 -1051
3001 -1051 -122 1190 852 -455 365 1324 978 -221 -1477 640 1814 1350 -27 -1144 -915 1377 688
3018 688 115 -1069 -369 803 -959 -1159 -667 255 809 -494 -1130 -103 471 437 -388 -1506 -327 964
3036 964 788 -418 -1522 95 1345 534 -1115 -1155 1676 1821 431 -1032 -427 973 1886 803 -1265
3053 -1265 -9 1085 1678 279 -694 556 1622 733 -782 -1314 577 1857 419 -158 -1110 279
3069B79Q31m20j734P05Q94N14j662o40O70J373J50p97j799J138J474L80k240L30
3087e54Q31N00q05L1j65L93R10j789o56N11K359l64n89j632K95Q07P80J11j541
3106e67K50O47J56j349K09J526j54r60j111O75Q80N78n59r77O56k25N16n05K88
3125b6K6L61p71n85O05J009J47r29o69M9J084M93Q9j025k85O05Kr72L51J162k5
3146F96p10j339N71M50M31q6o62m36N88K91M20o78j88M22N39n14J58Q71k48j028
3166d52m23J86O25R51l25r03K60k53J352n61j337P50Q49j63j216J73M27J430m17
3185I53j582m22J296L27K50m35o74j13J230j126K24j76Q94L88j441p02M40J902
3203A233l88j341q35K05J309J090j421J05J31M37p45O6k08J245or88k36j93J163
$$ plain form
3069 279 1110 690 -1044 -339 555 1069 -593 -1233 -563 810 960 163 -1636 -498 976 1356 -884 -554
3087 -554 277 777 -28 3 -162 231 1141 -648 -1304 -793 1566 1202 613 -1019 -724 83 863 974 -567
3106 -567 -317 330 486 -863 -654 872 718 -242 -1353 -678 202 780 221 -756 -100 -325 191 -314 -26
3125 -26 0 361 -410 -995 -390 619 766 -163 -832 -783 301 794 883 -142 -427 178 180 -792 -441 721 696
3146 696 -14 -1353 -782 -332 99 13 -649 -1085 -497 -206 214 -464 -652 -230 309 -205 -47 824 576 -452
3166 -452 -875 -689 -64 887 562 -341 -81 -334 1018 457 -880 -130 719 556 -660 -487 -60 1370 953
3185 953 -629 -1051 245 572 822 387 -287 -400 830 -296 -72 -248 646 1034 -407 -1109 -669 1233
3203 1233 845 -496 -1331 -1126 183 1273 -148 -43 88 525 -220 -154 -362 883 877 -111 -347 -540 623
3222F23K43l34j487O19j36M18O4L47J44J53j209n58J122Q07K78n81j159r88K188
3241E54N97j46j347l05J3J004k88k16K32J36kj117J29J109N37n24j094m11N09
3260f30J050l24K44n07J81k22n30P88M37k77L23j342L64K70O61K53n08q29j96
3279g94L34N85K06L42Q0j205lm7O23O05K47j533n71M94P46P37j13m86j041k2P11
3300a05L39p45L91m36n06J04L99Q62N05j137q07KQ46K14O53O59j031p27k44n3
3320h17J407m36j90q61M73k61J287L60j048R7o81N74J22Q61l10n60o42L21n70
3339h74M61J313k12q27n47J64M39Q32q42k50j70j24L93k68N32M97j86n20q85L20
3359g54O33L39l69J1o42O9K20k55J015o64L91K87n63kJ049M49j035j142k74N48
$$ plain form
3222 623 866 532 -955 -336 -472 -54 10 357 501 654 -555 -1113 9 816 1094 513 -646 -1634 554
3241 554 1151 1005 -342 -647 -634 370 82 -134 98 234 232 -885 -756 353 890 366 -728 -1139 -630
3260 -630 420 96 340 -167 14 -208 -738 50 487 210 533 -809 -445 -175 486 739 231 -598 -794
3279 -794 -460 125 331 673 753 -452 -455 -502 121 726 973 -560 -1131 -637 109 846 733 247 -794 -816 -105
3300 -105 234 -511 -120 -556 -1062 -958 -559 303 808 -329 -1136 -1134 -288 -74 579 1238 207 -520 -764 -817
3320 -817 590 154 -36 -897 -424 -685 602 962 -86 11 -670 -96 26 887 577 17 -625 -304 -874
3339 -874 -413 900 688 -139 -686 -522 -83 749 -93 -343 -513 -637 -244 -512 20 517 331 -189 -1074 -754
3359 -754 -121 218 -151 -140 -782 -713 -493 -748 267 -397 -6 281 -282 -284 765 1214 179 -963 -1237 -689
3379f89O16N67p41l48Q19m71N53Q61p41o94M47o40O0N97O79r65J15o96L92N77
3399B98M20p57j48l78J66K83j104R61N68o21l12QN1K99j41j96k96J63J90P26l45
3420a65j42l42P7m56L63O91Ql4k14l08m3N11N69o3l70m93K61j1N80J09j214N45
3442a41K05n02m69J060M55m89O2q59L04J87R96m21O35j730K98J174m21j59l16
3461a31O95r86M6P20k04j81P06p55m81J24O9K33l69K91J07p04J267n7k93j014
3481i17N84K28j84K9K57j37Q2k44J88l47l89R91j29J40k51l16l46J098K26M29
3501I92o99p88P87n60J4N61rm7j254J367M7O67l97j06l63J75j86J73J58n27j52
3522a47M26n76O4K84L42k27N9n06N61M86o28n5l15q1l8q6k17R10M3J63j026K01
$$ plain form
3379 -689 -73 494 -247 -595 224 -247 306 1167 426 -268 179 -461 -401 196 875 -90 25 -671 -279 298
3399 298 718 -39 -187 -565 -399 -116 -1220 -259 309 -312 -624 -616 -565 -266 -407 -603 -899 -736 -546 180 -165
3420 -165 -307 -649 -572 -1028 -665 26 34 0 -214 -522 -565 -54 515 452 82 -411 -150 -161 419 528 -686 -141
3442 -141 64 -438 -907 153 608 119 181 -678 -374 -187 809 388 1023 -707 -409 765 344 185 -131
3461 -131 564 -422 -376 344 140 -41 665 -90 -571 -447 -378 -145 -514 -223 -116 -820 447 390 97 -917
3481 -917 -333 -105 -289 -260 -3 -140 -58 -302 -114 -461 -850 141 12 152 -99 -415 -761 337 563 992
3501 992 293 -495 292 -268 -254 307 298 251 -1003 364 411 1078 681 575 212 387 201 374 532 5 -147
3522 -147 279 -297 -233 51 393 166 225 -281 280 766 138 83 -232 -313 -351 -437 -654 256 299 462 -564 -363
3544c63J26R61q72j39K57l75j69Q77L01r39K06O7O36l66N7J6o51K78k27M84O21
3565G86L46r97kJ40n95J49R71j161R20k90j12j8J72n74L45P41p18o0K71j56R30
3586A088j94p85l35j39N20k33M68n80k06P47n90M70k60L16m37m7n06K26P63J52
3606D38n9j022K4M94N58j36n91j26N14k85J7M82n4J46o45j63L78K63L33k41l17
3627HJ26R0L5K54n15J33n85j60M4J033K01j38J16J53j449J215n14M76jM5r56j75
3649e64J381r2l40M11o63q28M81O62Q74j345m86L62m06O92j04N35j473J015m16
3668c04k87M40M13l24j31l14J96J57LJ60N40m95n54j58P38K23k37L55p25k53K6
3689e31R08J90j62o91K50J65k90L36P84n56n40j83J53j51P04K28l21r9k5J23j68
$$ plain form
3544 -363 -237 724 -148 -287 -30 -405 -574 303 604 -335 -129 -62 574 208 265 281 -370 -92 -319 165 786
3565 786 1132 135 133 273 -322 -173 798 -363 557 267 155 137 309 -265 80 821 103 43 314 158 1088
3586 1088 894 109 -226 -365 155 -78 390 -190 -396 351 -239 231 -29 287 -150 -197 -703 -477 286 438
3606 438 379 -643 -619 -125 433 297 -294 -420 94 -191 -174 308 254 400 -245 -408 -30 233 566 325 8
3627 8 134 224 259 513 -2 131 -454 -614 -570 463 664 526 642 795 -654 561 47 523 522 567 -389 -564
3649 -564 817 725 385 796 133 -695 -214 448 1322 -23 -509 -147 -553 139 35 570 -903 112 -304
3668 -304 -591 -151 262 -62 -193 -507 -311 -154 -151 9 549 54 -500 -658 80 303 66 421 -304 -557 -531
3689 -531 377 567 405 -286 -36 129 -161 175 959 403 -137 -320 -167 -318 386 614 293 194 169 292 124
3710A24j44K5r3j19l3rM62Q0l70n12N27K9j36N48j13r91M32J30N89p17L55L53
3732D17r39k78P02j17N32O00n90r26q8J160l47J90ml97o82J698q49J35J71p8m50
3753a40L35m75P00n83r2N38m64k5O68m18o2M04j149L26N34n7J83j72J81m16k70
3774d54L8K20K19j78J05o95R01P99j062L35n93l35N27P0j20K85P1R3q88N13k29
3795c78M10Q33p72K50n94J044l61j16k00q46j7N72k5K98M78j162N14m51L27N59
3815C63M38o42l52L66k49K14n1M1L00l21j143J98R66m30N14q2n59L23L53n88J118
3836G77n47l09k47J41M59n21L45m15n54L91M91J15J0P2j76j96l19Q56p33J08k50
3857e02N51o63O97n08O96q63K22K36q27P25k40P37j85j67m46O25m98R78n47m93
$$ plain form
3710 124 -20 5 -88 -207 -240 -249 213 293 -77 -589 -62 -33 -169 379 266 -725 -293 -163 426 -291 64 417
3732 417 -522 -800 -98 -215 317 917 327 -599 -687 473 126 316 312 -85 -767 931 82 217 388 310 -140
3753 -140 195 -280 420 -163 -255 283 -181 -206 462 44 -18 386 -763 -437 97 40 223 51 232 -184 -454
3774 -454 -416 -196 23 -155 -50 -745 156 955 -107 228 -365 -700 -173 -103 -223 62 133 226 -662 -149 -378
3795 -378 32 865 93 343 -251 793 432 316 116 -730 -747 -175 -200 98 576 -586 -72 -523 -196 363
3815 363 801 159 -193 173 -76 138 87 128 428 107 -1036 -838 128 -302 212 130 -429 -106 247 -341 777
3836 777 230 -79 -326 -185 274 -247 98 -317 -871 -480 11 126 136 208 32 -164 -483 373 -360 -252 -502
3857 -502 49 -614 83 -425 271 -592 -370 -134 -961 -236 -476 261 76 -91 -537 88 -410 568 21 -472
3877d72O91K40j77J13K08p86N90n49N0j90N14k36O57j003L66M05p01J88R7l61
3897c56P5O67o61K39K78j49r43P96M81o6j31m68K39o11J95Q10n01N30m69j12n60
3918g17L57J53O32k17k59J08m89N16K5J81l71n5J7q0N18n03O40j213J191l49R26
3939A011n75m48L33k39l01K48n27J095n42k38L77l56l93R16m76M3L04m19K62M09
3959D84p06n9k73j10O73J39q8j63L09j23m24L38L96p62J006m49j5j35k81K45O36
3980F38m96m3j79N72l46J96K24l97n45L68q1K7K25p4N5l77k35j72J016n09J06
4001b7k2M86j8m66N20P4j031L03Q6m4J4J39k17M51m48O12j037O49K62m71K8M04
4023B47j36o5J05j91L13p99O70p3L7l05k34L10J24N3l47K51N12k78N39l57p19
$$ plain form
3877 -472 219 459 282 395 603 -183 407 -142 -92 -282 232 -4 653 -350 16 421 -280 -92 5 -356
3897 -356 -281 386 -275 -36 242 93 -850 -54 427 361 230 -238 1 -610 -415 395 -106 424 -45 -157 -717
3918 -717 -360 -207 425 208 -51 57 -432 84 109 290 -81 -136 -119 -199 319 -184 456 -757 434 85 1011
3939 1011 436 -12 321 82 -219 29 -498 597 55 -183 194 -162 -555 361 -115 -72 232 -187 75 484
3959 484 -222 -281 -554 -664 9 148 60 -103 206 83 -341 -3 393 -369 637 188 173 38 -243 2 638
3980 638 142 99 -80 492 146 342 566 169 -376 -8 -89 -62 163 89 144 -233 -468 -640 376 -133 -27
4001 -27 -49 437 419 -47 473 547 -484 -181 -95 -139 -125 14 -203 248 -200 412 -625 24 286 -185 -157 247
4023 247 111 46 151 -40 273 -526 144 71 108 -197 -431 -121 3 56 -291 -40 472 194 733 376 -343
4044c43P09j84o16M46k40J22k77r6N64j72Q9m62K10J02N28l50J3j37J55m17O5
4065b91R17n92j53O2K35P8k23l76O31m31p01J138j95N7R58q78K0l7k75N9K38m40
4087a99K47r2n52L28L75l55j63L52k36m14L25P16k62j83m4o57R18K45l64L40k73
4108E2l54J96N45m28N71m14q75Q71l93J27L8J35p7j76M54o5k67l46L85M79OL38
4130H02n51n1L35J68k46o27R7K41o8L51m39k16l22L40J1J80K90l50j65M21J7k11
4152Gj43O05n95k01N87pj64J39j13l18j03N37j78O5m03L1j24Q40m74J61m77M18
4174I0O4k68m70L69M97m79K55m39J21m96Q82N6k26k61K20K06K93l21L0k22k80
4195c79O61m68P40l39K72n21m83L85nJ206j270k26N72O3k61n4L89m89M3P77o93
$$ plain form
4044 -343 366 182 -434 12 -228 -106 -383 -479 85 -87 2 -460 -250 -148 380 30 43 -94 61 -356 -291
4065 -291 626 34 -119 -57 178 256 33 -343 288 -143 -844 294 99 156 1114 236 256 219 -56 3 241 -199
4087 -199 48 -44 -596 -268 107 -248 -411 -59 -295 -709 -384 332 70 -113 -157 -814 104 349 -15 325 52
4108 52 -302 -106 439 11 582 168 -707 164 -229 -102 -64 71 -6 -182 272 207 -60 -406 -21 458 464 802
4130 802 251 200 535 703 457 -170 -73 168 100 451 12 -204 -526 -186 -175 5 295 -55 -220 201 218 7
4152 7 -136 469 -126 -327 260 253 89 228 115 -203 -306 231 53 118 -285 -254 -378 462 -12 149 -328 90
4174 90 154 -114 -584 -215 282 -197 58 -381 -260 -756 126 182 -44 -305 -85 121 414 93 123 -99 -379
4195 -379 282 -186 554 215 487 -34 -517 -132 -137 1069 -201 -427 145 208 -53 -107 282 -207 -164 613 -80
4216h0j60Q1Q4L02n74M30j66M85j48k06j18K65J09K86m10k5J00q92J266l97m11
4237a79K43K7R0q19J046k56M75o45J33k61r6O25J49n59N43K09P4r13M17O9o50
4258b78Q32m97n00L39k02Q04j88q61K55O10m78k98N04pk27L40k69P67m4J67m25
4279C44o35N4Q34K9q75J30o8m30K41l63K58O61j56J45j70l99L22P72n23n33J73
4300a89J40o1m0M66m7m20Q7q8J26l23N44l47K18j00Ro18Q19J27r66K48j70N85
4322@J79r6K54J01p82J53Q3k6O24m79RJ3o17K19L0O02n14L07k47Q95m69o2l24
4345a47L60j71M5N12p19R18r31r4j25L24R4m64L96l52l91K76J65N39r71M42k46
4366e40P32l99J4O3Q4J71J72q91L25O94j77J95q76K60k45M25R6N6J10j57m56K77
$$ plain form
4216 -80 -240 -159 -75 227 -347 83 -83 402 254 48 -70 195 304 590 180 155 255 -637 629 232 -179
4237 -179 64 91 181 -638 408 152 627 -18 115 -146 -242 383 532 -27 516 725 799 -114 303 372 -278
4258 -278 554 57 -443 -104 -306 498 310 -551 -296 314 -164 -462 42 35 -192 148 -121 646 602 769 344
4279 344 -291 -237 597 626 -249 -119 -187 -617 -376 -739 -481 180 24 169 -1 -400 -78 694 171 -362 -189
4300 -189 -49 -110 -150 316 269 -151 -64 -152 -26 -349 195 -152 66 -34 -25 -643 176 303 -663 -415 -585 0
4322 0 179 83 337 438 -344 -191 -108 -134 490 11 20 33 -584 -365 -335 267 -247 60 -187 708 239 177 -147
4345 -147 213 42 87 599 -120 798 -133 -227 -352 -28 66 -398 -2 -354 -745 -469 -304 235 -736 -294 -540
4366 -540 192 -207 -193 -130 -46 125 297 -594 -269 425 248 443 -433 -173 -418 7 103 159 269 112 -344 -67
4388f7J61m58p85J553k06j36k22N92j9p93K45n90P61j70P48r92J84O1M54l93O06
4409E34j14l80K5l05n09P81j90R46r85M78q3m21P24j67k21J39M0l67k94M32p2
4430il9J87p50M51L63k21L19m15o73J128j57M48r79N14Kn50K30J21K19o04Q74
4451D59q60P15k6n72J139p74p82J50J32N2L28L2l81N83m58j66j27R26m48M10k40
4472I2j35O83l13M05j028k49J171o53M3k55M74p54Q95l07l66O51P1p35J0J14k27
4493d13R90n64L9J72r41J557r54j9K72m36J124j075Q5L54k66o2N00q30M75l2L
4514b1n77N91l24m17K75J68L49O0O6Q2m28K85M66l97j64Ol13J40M12r39P42j21
4536e9l67J97J53p71J095j21k64N9L37m69O92r57K10P20m31Rj28O41n0j78K03
$$ plain form
4388 -67 94 -364 -1149 404 198 62 -160 432 413 -380 -135 -725 36 -134 614 -378 -194 -133 321 -72 534
4409 534 420 40 65 -240 -749 32 -158 788 -197 281 198 -223 501 334 113 252 292 -75 -369 63 -9
4430 -9 -48 139 -611 -160 203 -18 301 -114 -787 341 184 632 -347 167 169 -381 -151 -30 189 -415 459
4451 459 -401 314 288 -284 855 81 -701 -551 -419 -367 -39 -7 -388 195 -263 -429 -556 370 -78 332 92
4472 92 -43 640 327 732 -296 -545 626 -27 16 -239 235 -519 376 69 -297 354 425 -310 -300 -186 -413
4493 -413 577 13 52 224 -717 840 -114 -133 139 -297 827 -248 -163 191 -75 -137 363 -467 8 -24 -21
4514 -21 -598 -7 -331 -748 -473 -305 44 104 170 252 -176 109 575 178 14 20 -293 -153 259 -680 62 -59
4536 -59 -426 -229 -76 -847 248 127 -137 -78 259 -210 482 -475 -265 455 24 33 -95 546 496 318 521
4557E21p43N74m27K72m45K78n30N62K1n4M35m08l84l72N65j06r2N53j33q57L12
4578d58K98O18K32p60kn50N84n13K09P91l51K91n79k59J083r31N03J11m13j74
4598b70J94Q1K78k57k94j31P93j172Q12K24k92M08p36O82q33P36o02M16n35m20
4618i18J303K34k76n73L4n72O65l31N24j61j45J86K87n6j51N21n92K6j30M16l72
4639h1Q6K70l09N10l84m0N23o29M49o48q5R31n91j68L33k88K31n80J23L74j33
4660a06K68l28j7N61J94m96L57l63O12j014M93L68n74l01N1K54M10p85K34L83
4680B01k68N03m07j95KL74o35M76n42P95l89L15K17J24r10K82L1k35j88P82m87
4701a54l01K83Lq4Q07o17j78j00J98L01l83%Q1k7n3O45j66m45N81K6Lq20O49o26
$$ plain form
4557 521 -222 352 -75 197 -248 30 -500 62 83 29 464 56 -328 -700 -135 -241 -333 220 87 -770 -458
4578 -458 -160 458 690 -70 -72 -622 -38 -551 -342 449 98 389 -190 -449 634 -297 206 317 -96 -270
4598 -270 -76 5 283 26 -268 -399 394 -778 34 258 -34 374 -362 320 -513 223 -379 37 -498 -918
4618 -918 385 619 343 -230 -196 -768 -103 -434 90 -71 -216 -30 257 201 50 571 -21 5 -125 291 -81
4639 -81 5 275 -34 476 92 52 575 -54 395 -253 -338 593 2 -166 167 -121 110 -470 -347 27 -106
4660 -106 162 -166 -183 378 572 76 433 70 682 -332 161 529 -45 -346 -295 -41 369 -416 -182 201
4680 201 -67 436 29 -166 -164 210 -425 51 -491 304 -85 230 447 571 -339 -57 -26 -261 -449 333 -154
4701 -154 -455 -172 -169 -253 554 -63 -241 -341 -143 158 -225 -225 -144 -171 -224 421 255 -190 391 417 420 -400 249 -377
4725c77N51l78O00O9n98K90l8L40k51j61J32k94J23K57k72q7l76o4L07k84M01
4746a10L52j01n91k24O04N89n43Q85j286m7N12K95J64r52k02J96p1J141m23Jn
4767A84O0o8L1k81L76Po35N5P25k19k57l78L60J074j028m89J111o21J14r4R5J58
4789B80j63o1%M18j8m01L47l78k71o2M79o22k42O99j88O40m29M82p61k16N42l98
4811c23M42k12J87n23N79M39k10j47j35m72N02L7K38m76K8j001J434k05l21O63
4831E24m74o50N37j41q9O10l64r8K19m49M25K95K12j93k13j69J31j03J25N5J77
4852C67M5o89M50j25R8r9j28q39J318K7n78J0M23K92q39K58J15o65J005p24J44
4873a34J94J51j94m47k34J114K91l82n16J23k44L53l92L6J67m26j40M24M05k81
$$ plain form
4725 -377 174 -204 396 465 -133 157 119 459 208 47 179 -115 8 265 -7 -94 -470 -534 -227 -511 -110
4746 -110 242 141 -450 -674 -70 519 -24 861 -425 -472 40 335 499 -453 -655 -459 -530 611 188 189 184
4767 184 244 176 207 -74 302 309 -326 -271 454 235 -22 -400 -40 1034 6 -483 628 7 121 27 122 280
4789 280 117 56 56 474 456 55 402 24 -247 -309 170 -452 -694 5 -183 457 28 510 -251 -467 75 -323
4811 -323 119 -93 94 -429 150 589 379 232 97 -375 127 164 402 -74 -46 -1047 387 182 -139 524
4831 524 50 -600 -63 -204 -293 317 -47 -145 74 -375 50 345 557 364 151 -18 113 10 135 190 367
4852 367 412 -277 173 48 146 47 -81 -920 398 425 -153 -143 280 572 -267 -9 106 -559 446 -278 -134
4873 -134 60 211 17 -430 -664 450 741 359 -157 -34 -278 75 -317 -281 -114 -540 -680 -256 149 -132
4893a32K44n93O29M0m3k82r5j77L00J92p00P39l35K60n9N04n14m5K83K87l53m8
4915A02L8L7j55l11J04O4K67m16L03M79o89O67k23n58j26J97K34o67N63M98n42
4936a34O00J69l96r14O50j55j79M84k55J11L58m34R6L45j22k36K70L02m82k03
4956a25N55n69k13K07l20O27l21N5K94k68mR4nl75M73p1k46N26j13q3J67M08j028
4979c35N65m93K10J72o1K93n54j98L79L8k62K42L98j81J57N41o99K51j45p40N01
5000G9P27m86m00J17J75m21k00M72J33K77j85m30O17o7r09P39K69n59k01J90J28
5021F5k53O29k68J40o58O30O03j130M28l47O00k58J4O37o85m35M00Q8l86K49J43
5042B06r34Q62J59n21P37m56k32k44O48q11M24PO56r22L61m62O15p75N07l4K48
$$ plain form
4893 -132 112 -481 148 188 145 -137 -232 -409 -109 83 -617 122 -213 47 -12 492 -22 -67 216 503 150 102
4915 102 140 177 22 -289 -185 -121 146 -270 33 512 -177 490 267 -291 -417 -220 14 -653 -90 408 -134
4936 -134 466 635 239 -675 -25 -180 -359 125 -130 -19 339 -95 1 346 224 -12 258 560 78 -125
4956 -125 430 -139 -352 -145 -465 162 -159 -104 190 -78 -82 12 7 -368 105 34 -212 314 201 118 285 693 -335
4979 -335 230 -263 -53 119 58 351 -203 -401 -22 16 -246 -4 394 213 370 911 212 463 318 -422 79
5000 79 806 320 -80 37 212 -209 -409 63 196 473 288 -142 475 408 -501 238 507 -52 -253 -63 65
5021 65 -188 441 173 313 -345 285 888 -242 186 -161 439 181 195 832 147 -288 112 200 -186 63 206
5042 206 -728 134 293 -228 509 53 -179 -423 225 -586 -162 -155 501 -421 -60 -522 93 -682 -175 -209 39
5063C9p11N75O1L40n16N96J45J1r48J244r03j31J55Q0J58m15J28L30L85p06M27
5084C44n60K81O9j26Q6m04O6J73K73K01j62j3p83R58q63N52j46j90o54Q12l72
5105d58M75j90J45J15j48K18m09M45l53j65R90p02J55j15j29M8m21O82k25j76
5125b18l76M00P48k15K38j163M14j19Q75k73j492L36Q00m8M32o56L24m02K05l6
5145b26m7M88j25n14L08K7J55M09j28m02j1j96K24l36O39k98j93M50m06j04K61
5166b5l54P57k60J92p15O26m11k56M5L31O62l90K83n16j5j50j98oK19l66Q17o53
5188c83J030n71K72l34k24O01n83r0M37j33K59m69j60J37m5k33M47k70P66L9o12
5209a19j82M33l60O05p9q10J38M25N01n10l62K54J38k53J06O72o83M73n04k43
$$ plain form
5063 39 -672 -97 -36 304 -212 384 529 540 -408 836 -67 -198 -43 37 195 -220 -92 238 623 -83 344
5084 344 -216 65 134 8 94 -310 -244 -71 202 403 241 228 -555 403 -460 92 -54 -244 -898 -86 -458
5105 -458 17 -173 -28 87 -61 157 -252 193 -160 -325 665 -37 118 3 -126 -78 -499 183 -42 -218
5125 -218 -594 -194 554 339 577 -586 -172 -291 584 311 -1181 -845 -45 -93 339 -317 7 -395 -190 -226
5145 -226 -273 215 90 -424 -116 -89 66 475 347 -55 -66 -262 -38 -374 265 -33 -226 224 -182 -286 -25
5166 -25 -379 378 118 310 -405 221 -190 -446 -401 -70 592 202 485 -31 -46 -196 -394 -400 -181 -547 270 -383
5188 -383 647 76 348 14 -210 391 -192 -282 155 22 281 -188 -348 -211 -256 -489 -42 -312 454 493 -119
5209 -119 -301 132 -228 377 298 -512 -374 51 552 42 -320 -66 72 -181 -75 597 -86 387 -117 -360
5229c60O69j61m05m91P78l6L17j47l7L80j044M1L49k45P12J00j46o88L35J56n64
5250d87J89Q88n43o5O0l04L32J34Q0m83P70m54k92mL06j65o30Q74K44o98JP55
5272E08r9l94J34j76J000r22N34n32m69M94O35q84M51j01r1j39J5O60m15n74R52
5293E87l91j11j07m32L10k94M34K8l54O74L65m76k31J92l88k44K66k69O48l74
5313a67K26M22n82o16P14n2J03n17M94r4k83Q81l34L5n08L44J45J46NK36l75l1
5335A92K75j66k66j71J87m03k9M90N3K21K5o30M25j12q06L02J43j71L21k47O96
5356C29j47m42K91l75L9K19K76m27J37j62j59P6L5N30q50M95P9K08R0n50k03N41
5378C0O5o38J12N15L56m85M72K2l80K0o58P26k68j38r9p7O31m57L04p38P99j47
$$ plain form
5229 -360 309 148 -257 -748 30 -6 311 164 127 507 -537 -496 -147 -392 320 420 274 -414 -79 77 -487
5250 -487 -298 590 47 -18 42 -262 70 204 284 -199 571 117 -175 -179 127 -38 -668 206 450 -248 -247 508
5272 508 409 15 149 -27 973 51 585 53 -416 78 713 -171 280 179 88 -51 -36 624 209 -365 587
5293 587 196 85 -22 -454 -144 -438 -4 24 -330 344 709 233 2 194 -194 -438 -172 -441 207 -167
5313 -167 59 481 -101 -717 -3 -55 48 -469 25 -69 -352 529 195 230 -278 66 211 357 362 598 223 192
5335 192 467 301 35 -136 51 -352 -381 109 162 383 408 -222 203 91 -715 -413 -270 -441 -120 -367 329
5356 329 182 -260 31 -344 -305 -86 190 -237 -100 -262 -421 -345 -310 220 -630 -135 -56 152 242 -308 -511 30
5378 30 95 -543 -431 84 440 -45 427 449 69 89 -569 157 -111 -249 -348 -425 206 -251 53 -685 114 -33
5400c3L67m22Q96r95M3N82m15Lm70P19O2j99j86K44m04j14J14j60L4L37L87j077
5422f87J361o61j81OR0l80O78q75R04j88Q3p17O0R44o40K49n40R11k94N65l99
5443B89J43n97M33j42J21l26K45K83j28l9m77P0mM70o15L3o9L42Q35j434M71M09
5465C13P4J52n02J58p22Q83j01n33K12J38l23p5N84o22j97R67p07L40k30M29j97
5486D1j97o57O53m9n5O60%o18j74q2J331q29K13J30n13P93m30j65n07L14K0Rj06
5509b18J10K41J73l75l90N65o0K55K0m31P83o08L5k39M58n4n04M22k77J70k39
5530a63J16l92J87N77R4l29J4L97m11j015J199j54L35q59J015m85p1P1o9Kl6J40
5552A63n6k84q8N28m77L22l38L32l30N81K24m1n38Jk45M99J46j61P8o2n58K78
$$ plain form
5400 -33 334 -88 808 -187 -144 438 23 26 -444 275 337 138 -48 196 -208 -322 -208 -368 -334 3 390 -687
5422 -687 674 13 -168 -162 -72 -452 226 -649 255 67 150 -567 -507 437 -203 46 -494 417 123 688 289
5443 289 432 -165 268 126 247 -79 166 449 321 282 -195 -125 -129 341 -274 -241 -310 32 867 -567 -96 313
5465 313 387 539 37 195 -527 356 255 -278 -66 72 -251 -326 258 -364 -561 406 -301 39 -191 238 41
5486 41 -156 -813 -160 -209 -264 396 396 -222 -396 -478 853 24 237 367 -146 647 217 52 -455 -141 -121 -112 -218
5509 -218 -108 133 306 -69 -459 106 46 301 321 -110 673 65 100 -139 319 265 -239 183 -94 76 -163
5530 -163 -47 -439 -252 325 419 90 104 501 90 -925 274 120 455 -404 611 126 55 126 57 59 23 163
5552 163 107 -177 -265 263 -214 108 -230 102 -228 353 577 536 -2 -1 -246 253 399 238 316 254 -304 -26
5574b6p7Q4M24k19m92p6O84p50J64L88m15J01K05j38P03n95k49M33o04P61l50
5595d4L63k14K89k92k71L07m07N99k93l84L89m08L98J47PJ57q59P69o54Q14k57
5616A56j2m6Mp38N64J28k15l5k07Q01j68m2k79M00n7k06n59N37j75q2j62L68L46
5639C21k09j26M7j66l79J38j4JR74r23K8L7K75K40L18l79q39L88P3l12J61J76
5661a70J61O08q94m5K8K90M06L5j24o75Q48l49n63M38p91O92J85K63l06m65M64
5682C6q41J170n36N80n05j84M83k21n69R40p5J62k90L43o66J88M27p17K80K14
5702B19l29m30O36L38m21K37l28k56j8N90n12R43l47k00J68l79j75L54P5m32J95
5723g2L21m16m4j37M85J51rl08J83k6J49m40J32p8K22L24r52j95L09l22Q52M61
$$ plain form
5574 -26 -103 -19 405 186 -306 -382 302 -448 -284 104 -311 -210 -5 -143 560 -35 -284 149 -455 306 -44
5595 -44 319 105 394 102 -169 138 -269 330 37 -347 42 -366 32 179 186 343 -516 253 -401 413 156
5616 156 144 98 102 -636 -72 56 -159 -194 -401 400 232 190 -89 311 254 48 -511 26 -149 -231 -393 -25 321
5639 321 112 -14 33 -133 -512 -374 -388 -387 587 -336 -308 -271 4 244 562 183 -656 -268 -195 -507 -346 -170
5661 -170 -9 599 -295 -340 -312 -22 384 419 295 -380 468 119 -444 -6 -797 -105 80 343 37 -428 36
5682 36 -805 365 -171 409 -96 -280 203 -18 -587 353 278 440 150 493 -173 15 442 -275 5 219
5702 219 -110 -540 96 434 13 250 -78 -334 -352 238 -274 669 322 122 290 -89 -264 90 165 -267 -72
5723 -72 249 -167 -211 -348 137 288 279 -29 154 128 277 -163 -31 -109 113 437 -515 -710 -401 -723 129 590
5745E90p35L83j40LJ99K91p22M50k11L66o85k80M83R9k21o9J98L77k07j049J328
5766D48j085Q25k00m27L63N6K83o55M89n18J24j69J46L97k92K76K01k48l56J55
5786a87J40K03l5l72L84J28m55m41J87L68j14L0K86n34J17Q14m97k36K55l61N42
5807B22q2R9l01K93p2J69k92M70o70O63r65k66Q01j72L74o25K34M63j217N28J08
5828b38N62o08l6K04J54K21k01M41j035j35O39J96l34Q50r59J33j39J28K07j34
5848h4K29N6j42O39l60l47l61K8J89j64K06M97m61k50J9L26j41p33N03M96o7j41
5870f3K61p29L43M35k84r3O62l86m62N70m23K44m54M55l26k46M65K13Q5o80O49
5891B36o8L25j88L86n81J18r5L9M36q25N76M9o61M72o11K90p1R6l22N8L90j58
$$ plain form
5745 590 -145 238 98 101 300 591 -131 319 108 474 -211 -491 -8 91 -130 -199 -1 376 169 -880 448
5766 448 -637 188 -12 -439 -76 -20 263 -392 97 -421 -297 -466 -320 77 -215 61 262 14 -342 -187
5786 -187 -47 156 121 -251 133 261 -194 -635 -448 -80 -194 -164 122 -412 -295 519 22 -214 41 -320 222
5807 222 140 239 -62 231 159 328 36 506 -164 499 -466 -732 69 -103 271 -354 -120 343 -874 -346 -238
5828 -238 324 -284 -320 -116 38 259 58 499 -536 -671 -32 164 -170 680 -279 -146 -285 -157 50 -84
5848 -84 145 201 59 698 338 -9 -370 -342 -153 -317 -111 386 -75 -325 -306 20 -121 -854 -351 145 78 -63
5870 -63 198 -531 -188 247 -37 -130 532 146 -316 254 -169 75 -379 76 -250 -496 -31 182 267 -413 236
5891 236 168 493 305 691 110 228 133 172 608 -217 359 408 -253 219 -392 -102 -173 -77 -399 -341 49 -109
5913a09J56mp82M89L05j51j08q9N77l84J67m72K68K83J99r0o11R15o54k90M44
5934E9k28O38q40j31K18J38K91k49m47P45l19L41o75P53n61P89q24J81j9l25N83
5955A18l90K82m95%M69J07N4p8j45M08k38J79k40j95L9l14R07l71n98P41l34L17
5977B23p5k12l46L10rk62M77Q9m73NJ06M09l89Q14r22Q97m11k9j89P0m11K11L95
6000B78m20j96n2L97o18M01J92j01L60m5K21k40l5j02l88K41m58J243j80j193
6020f95M09P17j375L63P04q04K43P08kn75R44o13J85j45N9j32Q9o03R71r40O5
6041d27P82l37K76k13M15k40N08p03K2K67n04J04n02K59L28j43J65K73o30lP06
6062D03m58jN07l82l29P38n99j8M61k76L02n41k52M99J62l45K29j93m60L86P4
$$ plain form
5913 -109 47 43 -739 -250 55 -96 -204 -293 284 -100 67 -405 -137 146 345 255 -356 559 -95 -385 59
5934 59 -169 469 -371 -502 -284 -146 145 -104 -551 194 -125 216 -459 294 -267 522 -302 -121 -140 -465 118
5955 118 -272 10 -485 -485 -16 91 145 67 -78 330 92 271 31 -164 -125 -439 468 97 -501 240 -94 223
5977 223 148 -64 -410 -100 -109 -371 106 195 -278 -273 -167 242 -147 667 -255 642 231 202 13 83 -328 -117 278
6000 278 -142 -338 -390 7 -611 -210 -18 -119 241 196 417 177 142 40 -348 -107 -565 678 498 -695
6020 -695 -286 431 -944 -581 123 -681 -438 270 268 -307 637 24 209 64 123 -9 80 -523 448 -492 -427
6041 -427 355 18 294 81 496 256 764 61 83 350 -154 -50 -552 -293 35 -108 57 330 -300 -303 403
6062 403 -55 -56 451 69 -260 478 -121 -139 322 46 348 -193 -445 54 216 -129 100 -93 -553 -167 -93
6083i3M81p47N56LpJ50j15m48L40K13m10M1K51l52M66k7l72l4o9K47k71J26j2
6106h3M70K35Q0o64M16K3m65mR4R7M67o79o59Q90J8j30k19M17n25M02j85L92o
6129C82j087Q92l34k6M66n56L75m60L59P64m8r85K2M77q54M40j07J63j91j19J42
6150b85P13n20K34l88j41J049k85l26l28K75j72J74o6n6K73p88J111m56k05Q55
6170F68l56m32K01lm96Q59j50p3J59l99J95l14K76L46j180M29N56m33o0Q30k37
6191C86k15p28O93j3k82O44j367O4R57m89K40J54j58k86M39M52o92m5LL99k40
6212h4P27p22l59O93l2k54n6QN71J02l61j33L52qk38j90j57k42k38R74k67l95
6234c09k06P08n75M26M7L28l89M32Pl97m46M03K57k88k24L38j40k1M67m46K44
$$ plain form
6083 -93 388 -359 197 200 193 343 228 -220 120 333 -77 -36 215 -137 329 302 -70 -104 -173 74 -197 -71 -83
6106 -83 387 622 702 38 454 477 12 8 102 199 666 -13 -672 218 236 106 -113 304 -221 181 -4 388 382
6129 382 -705 187 -147 -173 293 -263 112 -348 11 775 727 -258 -236 241 -613 -173 -280 -117 -308 -427 -285
6150 -285 428 -92 142 -246 -387 662 377 51 -277 -2 -174 0 -66 -122 151 -637 474 18 -187 668
6170 668 312 -120 81 78 -418 441 291 218 377 -22 173 -141 135 481 -699 -270 286 -147 -207 623 386
6191 386 171 -557 136 123 -159 485 -882 -818 139 -350 -110 44 -114 -400 39 491 -201 -246 -243 156 -84
6212 -84 643 -79 -438 255 223 -31 -87 -79 492 594 233 100 452 444 206 16 -141 -383 -621 353 86 -309
6234 -309 -515 193 -382 44 91 419 30 462 469 72 -374 29 286 -2 -226 112 -28 -49 418 -28 216
6255B16l88J80o6L03M5n10N56l33L36m85K06J68L2r63O57L21j116P30N78r97O95
6276A65j66m97J103k66n88P49j67l59L56K05n18k58M00j37k63m57Q06L64o9n88
6296a85m5N98M95j114O25l06p43M28l48K55R3P60o00j6O09l34n50Q98J69m85l32
6317a28J70p6N8n16L26P35l00L52J58m84p44O35j31l64N77k43k42k23O83m80k67
6338e04J57N10r2m03l89R55k94j12L43o06O53j25J75l47N86n29M5k35P22m48L2
6359I4L90P4k85R5k37L16l82m93O74l60J48j89j40L44rO57j014M37M5K7j143Q34
6381a17M14p0n20k6J09N91P5m90K10M9n6m76L47K5j65j82P10l12O05p96j48P83
6403E60m99J06k34J31m81k14J433m13n25J173j153k22N87J31o31Q15j268N31J02
$$ plain form
6255 216 -172 8 -58 245 290 -220 336 3 339 -146 60 228 260 -703 -46 275 -841 -111 467 -530 165
6276 165 -1 -498 605 339 -249 500 333 -26 330 535 17 -241 159 22 -241 -698 108 472 403 -185
6296 -185 -230 368 863 -251 374 68 -675 -247 -595 -340 -247 513 -87 -103 506 172 -378 520 689 204 -128
6317 -128 42 -34 24 -492 -166 569 269 621 779 295 -449 186 55 -309 268 25 -217 -440 243 -237 -504
6338 -504 -347 163 71 -332 -721 234 -60 -172 171 -435 218 93 268 -79 507 -22 23 -212 510 62 94
6359 94 484 558 273 368 131 447 65 -428 246 -114 34 -155 -295 49 40 697 -317 120 165 192 -951 -117
6381 -117 297 227 -293 -319 -210 381 456 -34 176 225 169 -307 40 65 -100 -282 428 116 721 -75 -223 560
6403 560 61 167 -67 64 -417 -631 802 389 -136 1037 -116 -338 249 380 -251 564 -704 -173 -71
6422g1j08N2n70N73O19m63k22m60N62mm3N9m3J84k55L74J17K36l08L91o84l5Q4
6445a5j52N80r52L70M85p43N88k21JM86q03K4L71j5R5j44k68M72l83P92j52k46
6467A70l08Q47q39L0N79n92R8K82q77Q47n00K64N4k04R5N96n94l22M88L7l86N67
6489C32l65P7R1p38P45l01K47j85N65j14K11j70p19Q13n88J55n61O75J37o21J17
6510a97k07M34j4l39L87o90Q43j54O05j189L09P03l01j105O35N90m18j82N52J9
6530B81o75L22k91Q82p58P67p89K33L48k91k88J339j019l29J94P2M19j161J220
6549D76l30l1n41K05K2P24j254O16O89n01o0k79N60k21k82k74R29o81L00n43M13
6570f3P7j28k47L27k11M19j16o38Q95k58j24%j29k28M57j83M96O2J8J43m66J40
$$ plain form
6422 -71 -179 -127 -697 -124 495 32 -190 -650 -88 -92 -135 -76 -119 65 -190 184 301 537 229 620 -64 -99 -15
6445 -15 -167 413 -539 -169 316 -427 161 -60 -59 427 -376 -352 19 4 99 -45 -313 159 -224 568 416 170
6467 170 -138 709 -130 -100 479 -113 -15 267 -610 237 -263 1 55 -149 -54 542 -52 -374 114 151 -235 332
6489 332 -33 44 135 -603 142 -159 88 -97 468 354 565 395 -324 489 -99 56 -505 170 307 -314 -197
6510 -197 -404 30 16 -323 64 -626 217 63 668 -521 -212 491 190 -915 -280 310 -108 -290 262 281
6530 281 -394 -72 -363 519 -239 528 -261 -28 320 29 -259 1080 61 -268 -74 -2 417 -744 476
6549 476 146 115 -426 -221 -199 525 -729 -113 576 75 15 -264 296 75 -207 -481 448 -233 67 -476 -63
6570 -63 14 -114 -361 -34 -245 174 58 -580 315 57 -67 -67 -196 -424 33 -150 346 408 426 569 103 243
6592B43m08j92O93m47J49L70m72K59l14j3j0M66l20L50j6m54L30k66n93N23J08
6613a4p00O73O33j171R00o0o89N18Q5k77L10k72j11K10k45K80M65l52J95p2p58
6634d52%M05J27l77L69K42m44P15k86o59N08l16q9q8K19J35O8j67L73o57R07o68
6656a35M36q9P2j86j0n83P02k6k60O47k56K54q54k08O5K37m8N01J2o11N7J24N43
6679C84k55n67O16o7p68J81L68m52J082p63K00k02M9l32P59n39N6M96k3o95l7
6700e09o9R07m02J39k66M82j12o5k55m9O36l85j04K29K61p75L43k21Q0J10N15
6721D90j291P79j8P31p74L66K7K91k3q55j21J063j59j80j38n77P1O94%l66N0m61
6743d01p4P78n55P21p97M72r3J35O44o54K08j065Q12N94o94L16p40M04pK12r51
$$ plain form
6592 243 -165 -357 336 -111 38 408 -64 195 -119 -132 -142 324 4 354 338 -116 214 -52 -645 -122 -14
6613 -14 -714 -41 592 -579 321 261 -428 90 175 -102 208 -64 -175 35 -210 70 535 183 378 306 -452
6634 -452 -452 -47 80 -297 72 314 -130 585 299 -360 148 -168 -257 -345 -126 9 77 -90 283 -374 533 -135
6656 -135 301 212 284 98 88 -495 207 181 -79 568 312 566 -288 -496 -431 -194 -242 259 271 -340 -283 -159 384
6679 384 129 -438 178 111 -657 -476 -108 -560 522 -241 -41 -243 -194 -526 233 -306 -250 246 223 -472 -509
6700 -509 -578 329 -73 66 -200 282 170 105 -150 -199 437 52 -52 177 438 -337 6 -215 -135 -25 490
6721 490 -801 -22 -40 691 -83 283 310 601 578 -277 -398 665 506 326 188 -389 -318 376 376 10 60 -401
6743 -401 -475 303 -252 469 -328 144 51 186 830 176 384 -681 131 725 31 347 -393 11 4 216 -735
6764g35P80L38j99m19P16j86o62k89J001j29k69l30M15m75P79n7j174O96j18M47
6784A30r22J196l55j99J67m27M39n89P84j89q5O87o09k96K97K86Q9k70q41R06
6804A99m10P82q85N06k2o35M28L50o73R97q48j78K63M13K32q95L71N31m74n08
6824d56R71j095O97l04o1K93R3m47m67L20M35k22k22j5R2l36M91L63m4J60o33
6845c87N12j84m8o7l09R13p71J00j90L04j55J38N10K69n71J66K49r29O43k62J40
6866G1O46o45M21KJ8n38o0N36o07O25k29J60p08M08O67o86J53O9K18q85O71l18
6888a1J56o93K8J55K28l2L23M33n17J44k61L68K71o22L00j82j64P55p69n13P35
6909A32R8p48O10j81N49m74J02J19m88N51K2J98l04M35j116L79j65M83n36l2M66
$$ plain form
6764 -735 45 383 184 -235 481 295 -367 -656 345 216 -53 -383 32 -443 336 279 -895 -199 -317 130
6784 130 -792 404 49 -150 17 -410 29 -560 224 35 -50 637 28 -268 29 315 404 134 -707 199
6804 199 -211 571 -314 192 170 -465 -37 313 -360 637 -211 -389 -126 287 519 -376 -5 526 52 -456
6824 -456 515 -580 117 -187 -248 45 138 -309 -776 -456 -21 -243 -465 -480 -388 -724 -233 130 86 246 -387
6845 -387 125 -59 -107 -174 -483 430 -341 -241 -431 -127 -282 -144 366 635 64 230 479 -450 193 -69 71
6866 71 717 72 493 495 513 -25 -85 451 -156 469 240 400 -308 100 767 81 234 303 521 -364 307 -11
6888 -11 145 -548 -520 -365 -137 -169 154 587 70 214 -47 321 592 -30 270 88 -76 679 -90 -603 132
6909 132 230 -518 92 -89 460 -14 88 207 -281 270 292 490 186 621 -495 -116 -281 202 -334 -366 100
6930A00j1l98L67n09P5k34J286m74l92p8K7N92l44j99K07O5K52j049N21j70n1
6951d17L62n8K39k98j73J23N09o8J02m14M19k79K40k93N62l13n06M91l5p78O65
6972H0K32j97J31K10p12P41l48n56K66J35k03M55K9n04J60l12j9Q06m51N61p29
6993b25r4O2q30J016N41k92r5m02L7N00n44J36K11K5k73K96k52M37n23O52m75
7014i2k52M81m0j39M07l44k71J32N33n13j71K88K43L4K35o37M07p09L77L07n28
7035b52J193l36m23L02o46M63j98l62O87l41K6k26M13k76L08j47r41P81o34J28
7055d81K64n0M64l72K1N1r5J39nK69k30L02o23J22m37N59J44r5k74N94o58j23
7077e14K88k73J021n76K13M58p88Q3K0P1J48J10n32j3L76j81K38k65K74P0P40
$$ plain form
6930 100 89 -309 58 -451 -376 -610 676 202 -190 -268 -241 351 7 -192 15 80 332 -717 -196 -366 -417
6951 -417 -55 -113 126 -172 -345 -222 287 219 321 -93 326 47 287 -6 556 243 -263 228 193 -585 80
6972 80 312 115 246 456 -256 485 137 -419 -153 -18 -221 234 263 -241 -81 -393 -412 394 -57 504 -225
6993 -225 -319 -257 -1087 -71 470 178 83 -319 -282 218 -326 -190 21 46 -227 69 -183 254 -269 383 -92
7014 -92 -344 137 97 -42 365 21 -250 -118 415 -98 -269 19 262 296 531 -106 301 -408 -31 276 -252
7035 -252 941 605 182 484 -162 301 103 -259 428 87 113 -113 300 24 332 185 -756 25 -609 -481
7055 -481 -217 -267 197 -175 -154 -103 -198 -59 -64 205 -25 277 -346 -224 -661 -102 42 -53 -327 267 -391 -514
7077 -514 -226 -499 522 -54 159 617 -171 -88 -68 3 151 261 -271 -284 92 -89 149 -116 158 228 968
7098I68r71L01N5j81l49k34M50N74m29k23j0L14o55N06J00N2m90K90k19J91J29
7119A69q29K81L20n99J067j85j61J36k77R47p35l6j61o86O56N38j51r49N85P8
7139HJ5M93k50j01l32O99q47l68J405m44k95O24o65k52k50N62j39j39L31K49o09
7160c05m35N93J46n94N63j1K96k97K37k18k11Q74o94N07k68p88M23M11j2j48K48
7181C17l60k18J52M33p89J142j073R45q79K70q9P70o58l99L12J14j57o78J180
7200C35m6j9j004M97O45m56J26M40Mo86K04j01k49L02J1n22M54J8p9n1N48k62
7222A09j96N92n48m14L31P12k84l57Q6j45M92m81j65M74Q4n22K74NM16o96J68
7243f5k27N05l12n0J96J38J12j15q01Q06P8r20N12K15l31k58K71P64p65K01k76
$$ plain form
7098 968 -3 298 353 172 -177 -411 39 613 184 -39 -49 265 -390 116 216 268 -222 68 -151 40 169
7119 169 -660 -379 -59 -658 409 224 63 199 -78 869 134 98 -63 -749 -93 445 294 -655 -70 8
7139 8 23 516 266 165 -167 532 -315 -683 722 278 -17 607 -58 -310 -560 2 -137 -276 55 304 -305
7160 -305 -740 -147 -1 -595 -32 -43 253 -44 193 -25 -236 638 -56 451 183 -605 -182 229 217 69 317
7181 317 -43 -261 -109 324 -465 677 -396 549 -330 -60 -149 621 -37 -436 -124 -10 -167 -845 335
7200 335 289 270 -734 -237 408 -48 78 518 522 -164 40 -61 -310 -8 3 -519 -65 -47 -126 -177 371 109
7222 109 -87 505 -43 -457 -126 586 302 -55 31 -114 378 -103 -268 206 290 -232 42 47 463 -233 -65
7243 -65 -292 213 -99 -149 47 185 297 182 -619 187 265 -655 -143 72 -259 -517 -246 518 -247 -46 -322
7264c22K31O7J81M05j365R74L99j227J4P42l09K83n67P87m64K03K73o63K2M59
7284A23l36n7L93L07k24J04l7J1k21m03K82O57r33P23o62K79j29J05j0m61R61
7305D72q31K5L14m75N21j24K43N17m87n5o14L41L70n03J22m70K13N58K98m90l11
7326c66J75L27n97N81J16m96N41o80L44N18r15J33Q62m53q38N40l97Q69q8q4o89
7347e97P83rN3K3k16n1K14j74K51k82J88KK01m23K53K89m52j96P0J17O64o65k01
7370a58k65J91j65k7N09J17j51j03K76K12l45J64J87n35k82M49j16q23J282r39
7390e22N93O75p56J13m29Q13q13N01k3p80J094q70N96k44P11j90n09J79J49k48
7410D0O31q09p37J535r26N28L07j93k89m47J70K32k7M49k05m16k28O08M00j356
$$ plain form
7264 -322 -91 -24 157 562 -803 171 570 -657 -643 99 -210 73 -494 293 -171 32 305 -358 -336 123
7284 123 -213 -270 123 430 206 310 273 284 63 -340 -58 599 -334 389 -273 6 -123 -18 -28 -489 472
7305 472 -359 -334 -20 -495 26 -98 145 662 175 120 -494 -153 217 -286 -164 -634 -421 137 435 -55 -366
7326 -366 -191 136 -461 120 236 -260 281 -399 -55 463 -452 -319 543 90 -748 -208 -605 264 176 92 -597
7347 -597 186 177 230 253 37 -14 200 26 277 -5 183 185 386 -37 216 505 53 -143 -73 44 708 43 -158
7370 -158 -423 -232 -397 -424 85 202 51 -52 224 436 91 255 442 -93 -375 74 -42 -865 417 -522
7390 -522 71 746 -10 103 -326 487 -326 175 152 -628 466 -404 192 -52 659 469 -40 139 288 40
7410 40 671 -138 -875 660 -266 262 569 376 87 -360 -190 42 15 464 259 -157 -385 223 623 -733
7430g33N32J03n25L38K29l55Q02l24K94m61k16j94L27K8K24j11L53k47J5p0L39
7451C48J1l48K83K31n64N7n37O75n1l6m3j52M36k32O56r18l3j16K00K6K27L30
7473D50m46K20o8m3j27p40R12n92M01M1j29L09k61o2Q6J77O4j066J399j36p58
7494c69M42m00L64K43q45M25j72K85nk43L75n64M36J78m49O63o26P70o45Q95j209
7515d51Q85o74J64L12k13J55K9J24n27M46q46P8L6P56j30R7n93O6K1P49j86n77
7537b79M80q44R20l31L4M2L82l37L8k28k64n87J003j19M75j113P17k21N81m26
7557g7J91l95q9R06o52k82J16M58K92m58k93N50k98l35j06K52K0O32j145Q28l42
7578b27M96n00L51l47L00o73P81J92k25m35P67n81M04Q9o28J42P41j298J146k87
$$ plain form
7430 -733 -201 -98 -623 -285 -56 -411 391 67 361 -100 -316 -510 -183 -155 69 -42 311 64 79 9 348
7451 348 359 11 294 525 -39 18 -519 156 105 69 26 -126 310 78 734 -184 -217 -333 -133 -107 120 450
7473 450 4 224 156 113 -14 -754 158 -434 -33 8 -121 188 -73 -135 -49 128 192 -874 525 389 -369
7494 -369 73 -327 37 280 -565 -140 -312 -27 -32 -275 100 -464 -28 150 -299 364 -262 508 -137 758 -451
7515 -451 434 -240 -76 236 23 178 207 331 -196 250 -596 -518 -482 274 144 241 -352 -286 -265 484 298 -279
7537 -279 201 -643 277 -54 -20 22 404 67 105 -123 -387 -974 29 -90 385 -728 -11 -232 349 -77
7557 -77 114 -281 -370 536 -116 -398 -282 176 468 10 -283 267 -31 -366 -472 -220 -200 432 -713 115 -227
7578 -227 269 -231 120 -227 73 -600 181 373 148 -287 480 -101 303 392 -236 -94 647 -651 495 208
7598B08k60M31k42j03Q21q90L00l51J43K0P29o96K98L6o09j99P54o73J54K92k02
7619c9O3N32m79m06R04m69q3N75k2q90M11J64K75m82L70o91j3N66m56j43N64j41
7641A10m41O13L93r30J11J37J22k63L22L13n22J36M7p84O06M59p78K87n6M6K54
7662A82J48k87j83K78N5k19L62r95R34k82J33K19n67K28M19m25l67K80J88pM46
7683E40o85O19o35Q33k68j17n84M60J73l04L1M11m95p27R29k62J01j17m9m1O97
7704E10l9l1n22k60j74N74k21J3P0m86L27l15J014K37p60L06n62L91j76j66K68
7725bN36k76k62k56O9M28J2P1m87J30j06k85q0K78k9j56M00K46l71p06R34q87
7747g99O63N49q30Q0K03k49P27m45J39n05K35L62j24j1P9J72m77O88q65J02O24
$$ plain form
7598 208 -52 379 137 34 855 -35 265 -86 57 77 806 110 408 444 -165 -364 390 -283 -129 163 -39
7619 -39 24 556 77 -329 575 106 23 598 576 -314 97 261 536 54 424 -267 -280 286 -170 -313 251 110
7641 110 -331 282 675 -255 -144 -7 115 -148 174 487 -35 101 148 -636 -30 429 -349 -62 -118 -72 182
7662 182 330 43 -140 138 193 -26 336 -659 275 -7 126 345 -222 6 425 0 -367 -87 101 94 540
7683 540 -145 474 -161 672 404 287 -297 163 336 32 63 474 -21 -748 181 -81 20 -97 -146 -187 510
7704 510 471 440 -82 -342 -516 58 -163 -150 -80 -566 -239 -554 460 697 -63 243 -319 72 -104 -270 -2
7725 -2 534 258 -4 -260 -191 237 249 320 -167 -37 -143 -428 -508 -230 -259 -415 -15 231 -140 -846 88 -799
7747 -799 -136 413 -417 -337 -134 -383 344 -101 38 -467 -232 130 6 -5 74 246 -231 457 -408 -306 318
7768C18m53J34L93o11M05j31R1M5k2P1L00J68r73K21n43P67J59K60k64m36J51
7789E0l72J98nn1O76j6k45nl88n3J72j84KN32o34M30r9k25J1K58m35k38Q73k64
7813a2q4K70k70N79j42ln50J23l2K04m14J69N90j70k47L42r7l62P3K95K26p25
7835b37J45J4P7M02l53K36l05N43j99q62J030L0r23L37J04j55jK45lj03m93o5
7857e36L69j38M66M23r87O24j61m58l15M23P04m48L47k8o53Q50k98p37j34K37
7877d50O32k73M30m20Q8J38P7m00J33op71J371q42j79O75o61K08Q20j154Q64q17
7898e37J20M02J97O1k54K41n93N18k8K2m6l39O7j37M52M25q10m08J201N4q00N13
7920C21l58q21R61n3m21P68Kr09P53O22j144M6N41k43j27J90o02Q75l3j72j24
$$ plain form
7768 318 -135 -1 392 -219 186 55 146 191 169 240 540 708 -265 -44 -587 180 339 599 335 -101 50
7789 50 -322 -124 -129 -180 496 480 235 230 -158 -211 -39 -223 -221 311 -323 107 8 -217 -206 52 -383 -621 252 -12
7813 -12 -96 174 -96 483 341 338 -212 -89 -121 83 -331 -162 428 258 11 353 256 -106 -33 262 488 -237
7835 -237 -92 -78 -1 401 48 284 -21 522 323 -539 491 521 -402 -65 39 -116 -117 128 125 22 -471 -536
7857 -536 -167 -305 161 584 -403 221 60 -398 -713 -290 414 -34 313 285 -368 482 184 -553 -687 -450
7877 -450 182 -91 339 -81 7 145 222 -178 -45 -51 -822 549 -293 -472 203 -458 -250 570 -584 280 -537
7898 -537 -417 -15 182 243 -11 230 -363 155 127 149 103 -236 -169 -306 146 571 -239 -647 554 608 -192 321
7920 321 -37 -858 103 50 -371 397 399 -510 243 865 -279 -233 308 65 -62 128 -474 401 368 196 72
7941G2K94o7j108Q59j23M4m5R8k6K03j09j80m62N07l33L68N20L5o60L64r82O08
7963a23R8L58L67m75j26k98J38J23L65m40M5k21l35k9N78M9l99j15Q67p9m43R5
7985@l03P37l80n20L37K37l30j33K50p25L45j41N37L75r28l7L41N03K90r09J01
8006c53Q13k58o8m4k35Q1J32J24j82r2J20L07m70R9K66l2l24N65k88m26m5j25
8028d35J95O50n66k00K85j3Jn19Q60j21l86K52m66O20o95k44O18k94N14j75K12
8049I3M07n40P1J42o31R61N26j008O38m00o5n2j02J08n73K19O72r05M94N2M5o61
8071e09J27K30K28o4J39l47K05J67K90N96p18p61J187o17m44L18l34J75k54J34
8091b52lj31K91j39K41j85j07L80k57J32N6o2M18j54k65N3O42l33J03k99L29l06
$$ plain form
7941 72 366 299 -809 50 -73 -29 -74 24 -2 201 92 -88 -550 -43 -376 -8 512 547 -113 251 -731 -123
7963 -123 -25 333 700 225 99 -199 -61 62 427 -13 32 -189 -524 -553 25 74 -325 -440 427 348 -95 0
7985 0 -303 434 54 -466 -129 108 -222 -355 -105 -830 -485 -626 -89 286 -642 -679 -338 165 455 -454 -353
8006 -353 460 202 134 90 -145 -64 68 192 10 -82 38 345 -125 -26 240 208 -116 449 161 -265 -310 -435
8028 -435 -240 410 -156 -356 -71 -84 -83 -602 258 137 -249 3 -463 157 -538 -782 -164 -458 56 -119 93
8049 93 500 -40 31 173 -458 503 1029 21 659 259 194 142 40 148 -425 -206 466 -439 55 107 152 -509
8071 -509 -382 -152 76 12 151 -196 9 176 466 1062 344 -417 770 153 -291 27 -307 -132 -386 -252
8091 -252 -255 -386 -95 -234 7 -178 -285 95 -162 -30 26 -36 382 228 -37 16 658 325 428 129 458 152
8113A52l35k84J31M50q3J08J94m56R00o93m98J99K0R28o01k01l05Q55M78j263
8133c04l1j14L85Q4o7K31l42k64J32P56m88K18J01j25o7J33n51k34N35k21N18
8154B85p46L61k89m0M61j35M6p95J191l56K34m45P2P1l09nP45P8m14m15O35m7
8176A83O37j021R11n59k88O27n62K82m0m56K30M24k00l21Q90
$$ plain form
8113 152 -183 -467 -336 114 31 139 333 -123 777 84 -414 -215 -195 733 132 -69 -374 481 959 -304
8133 -304 -335 -449 -64 20 -47 184 -158 -422 -290 466 -22 196 297 172 105 238 -313 -547 -12 -233 285
8154 285 -461 -100 -389 -429 32 -103 -57 -852 339 -17 217 -228 -156 -85 -394 -399 346 424 10 -405 230 183
8176 183 820 -201 710 151 -137 490 -72 210 170 -286 -56 368 168 -153 737
8191G37
$$ Imaginary data points
##PAGE= N=2
##DATA TABLE= (X++(I..I)), XYDATA
0@%%%%%%m0Q0q0Q0q0Q1j21J60k00K43k83L60m40N18n98O82p87R09j047J204j366
27g25J558j772J995k254K541k842L180l556L964m414M904n436O025o678P390q177
43d297R061j0040J1129j2367J3768j5372J7241j9434K2057k5269K9291l4519M1637
56B2886n1916O8183r7993J70442o65681j033194R94177J085056K70622p52669
66I913o17319N082N63116M06320m2309m07359k26470R3363K56912J54195J02263
77B97707l9634k76109l60968O1100N22030L99937k80910o75002l38709L52024
87c38534O09176J95011m37667n66810o0722N00960M61638o8086m40307k76756
97d22097J38548L65856K51453n7506l18988l08537m551L17604L12699l5484l65642
$$ plain form
0 0 0 0 0 0 0 0 -40 40 -40 40 -40 41 -80 80 -120 123 -160 200 -240 278 -320 362 -425 484 -563 641 -725
27 -725 833 -939 1056 -1198 1343 -1499 1681 -1875 2089 -2325 2579 -2857 3168 -3510 3880 -4297
43 -4297 4764 -5276 5853 -6514 7254 -8118 9123 -10311 11746 -13523 15768 -18751 22886
56 22886 -29030 39153 -58840 111602 -554079 -1587273 -593096 491960 762582 9913
66 9913 -607406 -602324 -39208 367112 324803 -82556 -309026 -215663 41249 195444 297707
77 297707 258073 -18036 -379004 -317904 204126 604063 323153 -351849 -690558 -338534
87 -338534 270642 465653 27986 -538824 -599546 -98586 363052 294966 -145341 -422097
97 -422097 -283549 82307 333760 276254 -42734 -351271 -355822 -38218 274481 238997 -126645
108a26645l34673K7643L49040K86241r8454l89749k61169J29099L48116J93216
118A22665j14826k63223j58458P7830K66902K64545M7564k13402k68341l3091
128b71835K68863L03158j0335l55258l26315Q1643M12196K68538j86600m07063
138b23008j47357K68989L63856O5980k63619k81916l0454J85602J73932K1760
148A33765p9067p5927l1789J9171P6456Q5490j5621j46069j28381O0239K09610
159A07877J15832j46778k87885j30930J65603K79824Q8070j96087k64526n3797
169c22797K05478K44680N2871j52553j70663j792J63688J49664m5743k28299j84943
180b90409N5699K27949J37733j02242k16303r9013Q9194J54650Q3219r679n2540
$$ plain form
108 -126645 -461318 -433675 -84635 201606 103152 -286597 -547766 -418667 -70551 122665
118 122665 7839 -255384 -413842 -336012 -69110 195435 242999 29597 -238744 -271835
128 -271835 -2972 300186 289851 -65407 -391722 -310079 102117 370655 184055 -223008
138 -223008 -370365 -101376 262480 328460 64841 -217075 -247529 -61927 112005 133765
148 133765 54698 -21229 -53018 -33847 42609 128099 112478 -33591 -161972 -101733 107877
159 107877 223709 76931 -210954 -341884 -176281 103543 191613 -4474 -269000 -322797
169 -322797 -117319 127361 180232 27679 -142984 -144776 18912 168576 122833 -105466 -290409
180 -290409 -234710 -6761 130972 28730 -187573 -286586 -197392 -42742 40477 30798 -21742
191b1742n4809m2064J0366R6858J28320J6114j46796j33709R9077K60330R3988
202C05933k29336k88727J2824K98858K02508j51624l19269j04271K07102K31499
212A65497k9021k11590r7678J14322J29095k7103q8722R622P6074k650q4032m621
224e0807J28909R1517j08807k11876m9797J90056J91254o3242k40353j06168J63598
235f5716K12549j3212k14964j55732N6456J59029O9918o0405q8227l0817J8674
246a12447L7198N7398O3759O813q6016r7225J6018J20993P2848p2042j20545n499
258a18747J20257R3435m4216j21596m7284P4482J00215K7588m2181m4470k7369
269b9886k5782n999N7955Q4497O770j00330r0687L7322J15776L0020j08428j07074
$$ plain form
191 -21742 -76551 -118615 -108249 -11391 116929 133043 -13753 -147462 -48385 211945 305933
202 305933 76597 -212130 -199306 99552 302060 150436 -168833 -273104 -66002 165497
212 165497 136476 -75114 -172792 -58470 70625 43522 -45200 -35578 40496 37846 -46186 -50807
224 -50807 78102 169619 60812 -151064 -200861 -10805 180449 117207 -123146 -229314 -65716
235 -65716 146833 133621 -81343 -237075 -180619 -21590 48328 -12077 -100304 -131121 -112447
246 -112447 -75249 -17851 45908 52721 -33295 -130520 -114502 6491 79339 7297 -113248 -118747
258 -118747 1510 94945 50729 -70867 -118151 -43669 56546 84134 41953 -2517 -29886
269 -29886 -55668 -61667 -3712 80785 87555 -12775 -103462 -66140 49636 79656 -28772 -135846
281a35846M7041J58848O8212j20304j68668j8834J37767J08979m1381j08022l0804
292a03012N6825L8745j8421o883N5626N2503l8237q8012j9185P7519N2497o8542
304h577j15352j596J30826J02918o2109j50263n4029R7574J12481r497r7998n2509
316a08131M2776O0098M531k6704R39L1000J8761n945M712K6607R096l4797m2041
329a9098J0798N3693K2578m5442o0036p056L6863J5292k9330l1787K305J8979
341c2241J1655J1809K1229M567l5325l9004K3835Q4800N1076n6954j07439k8212
353i0204Q3728Q5564j9543q6629k4391O7890N6298m1528q4085j4780N7686L5973
365B5979l3280l7110K6585N1925j3908o8615j9619Q1235R0804k1229j13686o4717
$$ plain form
281 -135846 -88805 70043 138255 17951 -150717 -169551 -31784 77195 35814 -72208 -103012
292 -103012 -46187 -7442 -25863 -32746 22880 75383 37146 -50866 -70051 7468 59965 -8577
304 -8577 -123929 -125525 5301 108219 46110 -104153 -158182 -60608 51873 42376 -55622 -108131
316 -108131 -65355 -5257 -726 -27430 -26491 4509 23270 17325 22037 48644 57740 22943 -19098
329 -19098 -8300 45393 67971 22529 -37507 -44563 -7700 7592 -21738 -53525 -51220 -32241
341 -32241 -20586 -8777 12452 17019 -18306 -57310 -33475 51325 102401 45447 -61992 -90204
353 -90204 -6476 79088 59545 -27084 -51475 16415 72713 31185 -52900 -67680 -9994 25979
365 25979 -7301 -44411 -17826 34099 20191 -48424 -68043 13192 103996 82767 -30919 -95636
377i5636N6214Q6030m040p5473k6521O5580O4044l1369r0107l0445O6116P3784
389E8177l273n6392k7204K2331J6663j9556j8338K5363M0324n882n4309l2976
401e5072L1014N1581m76m7459k1463M0689M9296j3706o8575m8091J9717M9796
413a2749K1680j3777j8356j498L547J629J4561L2091K2489j7679m2742j5580K8299
426A915K9089j8012m5672j3453L5964L7702q076l5738j0603K3357J6745j8596
438e378k9053J556K5459Q673k7686k5973J0080K7104L494k0390j959L3303K6978
451B6208j8347l8841K037N2128L7595k2069n3419j6595L5541K6437k7754n1736
463d8815r246M4317M2475j978k9740j6971L00L2k949J4342L0639J4270k4084l6940
$$ plain form
377 -95636 -39422 46608 42568 -32905 -59426 6154 70198 38829 -51278 -81723 -15607 58177
389 58177 54904 -1488 -28692 -6361 10302 -9254 -27592 -2229 38095 32213 -22096 -55072
401 -55072 -24058 27523 27047 -20412 -41875 -1186 48110 34404 -34171 -82262 -62545 -12749
413 -12749 8931 -4846 -23202 -24700 -21153 -19524 -4963 27128 49617 31938 -10804 -26384 1915
426 1915 31004 12992 -32680 -46133 -10169 27533 19457 -16281 -26884 -3527 13218 -5378
438 -5378 -34431 -32875 -7416 1257 -26429 -52402 -42322 -15218 -11724 -32114 -34073 -770 26208
451 26208 7861 -30980 -28943 23185 60780 38711 -14708 -31303 4238 30675 2921 -48815
463 -48815 -58061 -13744 28731 26753 -2987 -19958 -19658 -19626 -22575 -8233 22406 36676 12592 -24348
477b4348k520L8304L8216J318k4589j6545N53j898j3676j2193O7O580L509K272
491d950Q186N990r943j2743N893L0422K2025j1736k8512j0294Q317j311k1981
504b0637j0329K5244L1465r567m7742k9441K4835M5660Q147k6470j3414K1556
516f93J9813k2658l4024J0560N0363K5233l8135m7369J3011N9558K8381l7925
528B6115m7425J0834N2866J7764m4990m9917L52L1685L861l1004j1195L6621L8180
541C3747j2502m7592r629M8998M3865k0155o1322k0758M3754M5890j0701m6149
553a2554j4782L2888L1457j2153l1042k699K7133N936l5241l4855J4536M7500
565A6124J6464l5521m2503L012L3892J4717j8184j0179K4167K8450q155l5984
$$ plain form
477 -24348 -26868 11436 49652 50970 26381 9836 10389 8491 -5185 -17378 -17311 -10731 -7222 -4950
491 -4950 3236 9226 -717 -13460 -7567 22855 44880 33144 4632 -5662 2655 1344 -20637
504 -20637 -30966 -5722 25743 16176 -31566 -61007 -36172 9488 17635 -8835 -22249 -693
516 -693 19120 -3538 -37562 -27002 23361 48594 10459 -36910 -23899 35659 64040 26115
528 26115 -21310 -10476 42390 60154 15164 -34753 -34401 -2716 1145 -29859 -41054 -4433 33747
541 33747 21245 -26347 -35976 13022 56887 36732 -24590 -45348 -1594 44296 33595 -12554
553 -12554 -27336 5552 37009 24856 -6186 -8885 18248 24184 -11057 -45912 -31376 16124
565 16124 32588 -2933 -45436 -42424 -8532 6185 -11999 -22178 1989 30439 22284 -13700
577a3700j6600K4615L4990l202l4932j4041K6644K7081j4201l4808l994L2424
589A0276K5513j3402k7494p033P361p210k2980k927L0797L4101r081m3809k2983
602d8871L6032N3714R756l2656k0321J4662J1258k2302l0679L515L1114J5413
614B0635k2088k6476P680L3666R705l0965k5863K1998M1873O291l8707k8109J6899
627a3461L2133M89k9370j6188J7459K0912j3183l7086j2883L0531L4365o432l7699
640c0413j9664J7829K5883K416j4270l508J6058J9238K168q884k420J4872J1109
653C0414j2860k3445m733J8235J7373j2249l0972j8364J3514K7244R426j7345
665c762j8546N927K2964N583k3292j9112J0389K9418Q098j9568j7470J1283K4472
$$ plain form
577 -13700 -30300 -5685 29305 26103 -8829 -22870 3774 30855 16654 -18154 -22148 10276
589 10276 35789 22387 -5107 -12140 -4779 -11989 -34969 -37896 -7099 27002 17921 -25888 -48871
602 -48871 -12839 40875 50631 17975 -2346 12316 23574 1272 -29407 -25892 5222 20635
614 20635 -1453 -27929 -20249 13417 23122 -7843 -33706 -11708 30165 36456 -2251 -30360 -13461
627 -13461 18672 19161 -10209 -26397 -8938 11974 -1209 -38295 -51178 -20647 13718 7286 -30413
640 -30413 -50077 -32248 -6365 -3949 -18219 -21727 -5669 13569 15737 6853 4433 19305 30414
653 30414 17554 -5891 -10624 7611 24984 12735 -18237 -36601 -23087 4157 13583 -3762
665 -3762 -22308 -16381 6583 12166 -11126 -30238 -19849 9569 17667 -1901 -19371 -8088 16384
678A6384L845k2200j5440J5715K3714l204l5448k6695R124K6897P525j7950j3822
691c1555J1015J2789j1330k4130j07L0919K9834p729l0130j3100J4005J9330p26
704i15j4650n683J4304J3287p478j8666k333K1280J7855m490j4525m512O919R95
718A388j1329r287M235J5890J2102m633j4659p097N405P423j253k479K600O79
732a015j0379j3290p55R614Q202k805r741j615Q464N935m657q665M286J3329L338
747B46j1873q692Q328J4830j729j6047q537J2580J7605n216k3212j1523J4816
760a8424J5426j2565k7116k307K5398J6484j9492k8252L878L1914K2739j1532
772c849k3555N842L5957K1618k1206l5142N27L1053J2192k6323k4601Q146K1673
$$ plain form
678 16384 20229 -1971 -17411 -1696 22018 18814 -16634 -43329 -34205 -7308 217 -17733 -31555
691 -31555 -20540 -7751 -19081 -43211 -43318 -12399 17435 9706 -20424 -33524 -19519 -189 -915
704 -915 -15565 -21248 -6944 6343 -1135 -19801 -22134 -854 17001 12511 -2014 -6526 393 1388
718 1388 -9941 -19228 -14993 897 12999 8366 -6293 -13390 -7985 -562 -1815 -4294 -1694 -1015
732 -1015 -11394 -24684 -25439 -15825 -7623 -10428 -20169 -21784 -13320 -7385 -12042 -20707 -16421 -3092 246
747 246 -11627 -20319 -11991 2839 1110 -14937 -23474 -10894 6711 1495 -21717 -33240 -18424
760 -18424 -2998 -15563 -42679 -44986 -19588 -3104 -22596 -50848 -46970 -15056 7683 -3849
772 -3849 -27404 -21562 14395 36013 14807 -20335 -19808 11245 23437 -2886 -27487 -19341 2332
785B332j000k7128j7882J6549K9550N281l0524k8818R393L1949J2234j9968j2603
798c0635J6423K1641m181k3651r031J4964K3241O004j7958j8928L588J8395K718
811B590j8078j5356R656J9021K351j6078j7286J340J5851J1961k436p243L057
824a0650R808j861j5125p603J3540K1062K843j7192j6923M229J9392J2672p339
837F853j1017J203J1602K285j0743p278N373R761K870n348l932L404P160Q53o682
852F364q726L56M863J565l646n141m486m897J28O059P870j129q687k825O307R418
868C393M430l775l507l35K465J012j214J760K916l148j1067n475R460J5970M343
883A7228j1810j5482j931R748Q192l580q598l697L852J908m546k692P464J2580
$$ plain form
785 2332 1332 -25796 -43678 -27129 2421 7702 -22822 -51640 -42247 -10298 1936 -18032 -30635
798 -30635 -14212 7429 3248 -20403 -29434 -14470 8771 14775 -3183 -22111 -18523 -128 2590
811 2590 -15488 -30844 -21188 -2167 184 -15894 -33180 -31840 -15989 -4028 -6464 -13707 -10650
824 -10650 -842 -2703 -17828 -25431 -11891 9171 12014 -5178 -22101 -17872 1520 14192 6853
837 6853 -4164 -2961 8641 10926 183 -7095 -1722 8039 10909 5561 1629 5033 12193 13046 6364
852 6364 -2362 -2006 2857 4422 776 -4365 -8851 -13748 -13620 -7561 309 -820 -9507 -12332 -6025 3393
868 3393 7823 4048 541 206 2671 3683 2469 4229 7145 3997 -7070 -12545 -3085 12885 17228
883 17228 5418 -10064 -11995 -2247 5945 2365 -6233 -9930 -6078 -4170 -8716 -11408 -3944 8636
897H636P063m440r353j363J1324J0937l728j6357n244J2397J3291l997j8247j3374
911a2455N854J4745M900r879j1589M16O552m020j2082P10J9778J6873j1134k2558
925a3889o495J9184K3091K33j6607r964R113J3500m513j6663o950J2852R810r845
939B857j7664n19J7378J0701r935j5201O62J6979J4340o888k1713j3447Q770J5114
953A434L955q099n782M213N242P37k076K856P145K639p939j1247k466J1728J0835
968A3175j452j5162p386Q766J6856N499q495j0186J165P719J185q487n773L384
982H08M807n961j2532m805J1443J3709k071j2535n869P703J2618K031q080o722
996e456L878Q005M78k996L22J193k263m503j92Q508P977p63j0758j1016k799M358
$$ plain form
897 8636 15699 11259 1906 543 11867 22804 19076 2719 -2525 9872 23163 19166 919 -12455
911 -12455 -6601 8144 13044 3165 -8424 -8008 -1456 -5476 -17558 -16848 2930 19803 8669 -13889
925 -13889 -20384 -1200 21891 22124 5517 -4447 4666 18166 13653 -3010 -9960 2892 12702 2857
939 2857 -14807 -15326 2052 12753 2818 -12383 -11721 5258 19598 12710 -9003 -22450 -13680 1434
953 1434 5389 -2710 -8492 -4279 963 1700 -376 2480 9625 12264 4325 -6922 -9388 2340 13175
968 13175 11723 -3439 -10825 -2059 14797 20296 11801 1615 2780 10499 11684 3197 -2576 808
982 808 5615 -346 -12878 -17683 -6240 7469 5398 -7137 -13006 -5303 7315 9346 1266 -5456
996 -5456 -1578 6427 6905 3909 4231 5424 3161 -1342 -1534 6974 14951 14188 3430 -7586 -10385 -6027
1012f027M967J342k080m551n101k352N691J0374O472l242o576k705M633M780j812
1027C813k867R79M146J536j077j137J557K250k617o209j407M967N798l279j3302
1042f849j2560N67J0228Q993j636q923o270M159P446N533J127Q44L651M74n098
1057A686n813K566Q833M437q867j4025N59J4295J0961o152j5978l873J3383J1758
1071A3770m978j4681l365J0826O773p309j2526L912J7489Q424j2559j6846L47
1084a0723J8667R678j3566j8850k353J5877J0981p251j1014Q13J2421M412q040
1097A052o000Q331J3105m44j6502j2737O745J7823N311j1512j5992p58J2666P005
1111H093m941q158K221Q705M459q236r062K041J0289N262p911q916L548J3810
$$ plain form
1012 -6027 -1060 282 -1798 -6349 -11450 -13802 -8111 2263 8735 5493 -1083 -3788 845 5625 3813
1027 3813 946 1925 6071 7607 6530 5393 6950 9200 6583 374 -1033 3934 9732 6453 -6849
1042 -6849 -19409 -18842 -8614 379 -1257 -10180 -16450 -12291 -4845 688 1815 2659 6310 6784 1686
1057 1686 -4127 -1561 7272 11709 2842 -11183 -10624 3671 14632 8480 -7498 -11371 2012 13770
1071 13770 8792 -5889 -9254 1572 8345 1036 -11490 -7578 9911 18335 5776 -11070 -10723
1084 -10723 7944 17622 4056 -14794 -17147 -1270 9711 2460 -8554 -7741 4680 9092 1052
1097 1052 -4948 3383 16488 16044 -458 -13195 -6450 11373 16684 5172 -10820 -11578 1088 8093
1111 8093 3152 -5006 -2785 5920 10379 2143 -6919 -4878 5411 10673 2762 -6154 -2606 11204
1125A1204O721p304j0890J211J2332Q439p556j3039n471L461K277n129m361L040
1139e065M980k369j0410m176Q408J3036J484j0964p586M300Q018L82n351q93N915
1154b91N989j882n420J039N833K259m999n428K030M789P3p183l667L029L145j483
1170b167l911J830N259J237n719m054M505R782K295p415p853J159P843K473m634
1185F30m156J025N545N51l232k489L950L755l038q629k953N406P289K089p454
1200a711o206M039Q705K439n851m122J580O724Q4q191p376M213R260J413r777
1215d777p595N168J2412K577j0419p149O017J4565L019j2338j0280N861J1505
1228H566O88j0830o772Q178J0058m710j4752n544J2580J3971k973j6083p264R638
$$ plain form
1125 11204 17925 10621 -269 942 13274 21713 14157 1118 -4353 -892 1385 -3744 -8105 -5065
1139 -5065 -85 -2454 -12864 -17040 -8632 4404 5888 -5076 -12662 -8362 -344 38 -5313 -6206 -291
1154 -291 5698 3816 -1604 -565 5268 7527 2528 -2900 -870 3919 3992 -3191 -6858 -3829 -684 -2167
1170 -2167 -6078 -4248 1011 2248 -3471 -7525 -3020 6762 9057 1642 -6211 -5052 2791 5264 630
1185 630 -3526 -2501 3044 3595 363 -2126 1824 5579 2541 -6088 -9041 -3635 3654 5743 -1711
1200 -1711 -7917 -3878 4827 7266 1415 -2707 -1127 5597 5681 -2510 -9886 -5673 3587 5000 -4777
1215 -4777 -12372 -7204 5208 7785 -2634 -9783 -3766 10799 13818 1480 -8800 -2939 8566
1228 8566 9254 -1576 -8348 -170 9888 5178 -9574 -15118 -2538 11433 8460 -7623 -14887 -5249
1242e249J1243l699j1537k061J1276R337o544j1138J065J3858J0205o131j2228
1255a603r95J0277P479o960j1571k417Q100O831o167r077j337M813K431m555n238
1270i989K836Q159Q89p750o957M849J1398N576o412q887Q06P581M603l964m803
1285b065k11L523J287n589m235K353O239n76o595m454M076R386J199n071m586
1300e319L905M216o50m485k56L484J058n859n019L115Q417K430o420o373M421
1315c335R088K875o644p897J335N448m04l766k372L934J864m494n453J750J0369
1330B298M221n236j0516j833P313M850k561n190N11L548n31l905p12N709O934
1345D900n77n517l862M067J0010J342p521q437L498Q102K855l355m641j558K409
$$ plain form
1242 -5249 5994 2295 -9242 -11303 -27 9310 2766 -8372 -7307 6551 16756 10625 -1603
1255 -1603 -2598 7679 15158 8198 -3373 -5790 2310 9141 2974 -6103 -7440 -2627 -196 -4751 -9989
1270 -9989 -7153 1006 1895 -5855 -12812 -7963 3435 9011 2599 -6288 -5482 2099 6702 2738 -2065
1285 -2065 -2276 1247 2534 -3055 -7290 -4937 1302 726 -5869 -10323 -6247 3139 4338 -733 -5319
1300 -5319 -1414 2802 2152 -2333 -2589 895 1953 -3906 -8925 -5810 2607 5037 -1383 -7756 -3335
1315 -3335 5753 8628 1984 -5913 -4578 870 466 -3300 -5672 -1738 126 -4368 -9821 -8071 2298
1330 2298 6519 1283 -9233 -11066 -3753 1097 -1464 -6654 -6143 -2595 -3126 -7031 -7743 -2034 4900
1345 4900 4323 -1194 -5056 -989 9021 10363 2842 -5595 -2097 6005 8860 5505 864 -694 1715
1360A715K022R16k014k061Q79k067o456k999M569Q275J040p124n954K660R155
1375B556N800k452n648j893N682K560m121m549K593N852j973r247k966P981Q962
1390I137k048j1119p125M721R625L597q184q384L360O944O89m217K25N446L722
1405F389n228n341K048R598N002o389j1920l242Q700P331k898p947l195K251L439
1420a402L88N97J066K888L18m367n220K983P765K962n762r270j91P110M443j676
1436B632m204k654J533L261J370k507r99K457J098m428k589N727O658j652q197
1451b494l929M265O487K568k718o337l088K510K351o72o11L085O45n484n891N161
1467d152Q575L018n407n998J068M653J437j120l061l12K866L90l435O00N934L681
$$ plain form
1360 1715 3737 4653 2639 578 1457 -610 -7066 -10065 -5496 2779 3819 -3305 -9259 -6599 2556
1375 2556 8356 5904 256 -1637 4045 6605 2484 -2065 528 6380 4407 -4840 -7806 175 9137
1390 9137 7089 -4030 -11155 -6434 3191 6788 -1396 -9780 -6420 524 1213 -3004 -2779 2667 6389
1405 6389 1161 -4180 -2132 7466 12468 6079 -5841 -9083 -383 6948 4050 -3897 -7092 -4841 -1402
1420 -1402 -1014 -417 649 3537 3855 -512 -5732 -2749 5016 7978 2216 -7054 -7245 -135 4308 2632
1436 2632 -1572 -4226 -2693 568 1938 -569 -1568 889 1987 -2441 -5030 697 7355 5703 -2494
1451 -2494 -6423 -2158 4329 6897 4179 -2158 -5246 -2736 -385 -1057 -1668 1417 2062 -3422 -9313 -4152
1467 -4152 4423 7441 2034 -3964 -2896 1757 3194 2074 -987 -1299 1567 1957 -1478 -878 5056 8737
1483H737m650o826k46P423M536m751p803l541K654L127L92k486m02K202j96k367
1499d197N91N945M454k881o915l302N812N317R32n578o497J762M721K449j969
1514F44j783J499j169p47j010l99K073K560j376m398j970K255N789K252l475l939
1530c194M63M367K855j086l112j726N21J424j693n08K231M283k075n890j754O004
1546A110O641p34p969n592J610O603K737n068m417J824L238K49l361L48M435J761
1562C415k768n505p46L728L908r87n100k484L853M884J93k355r9K201K27j067
1578A298J539J361l00j844k790k354l91L959K712k539l879j571L385L567J257
1593C410j227j971k525R73K015M87j230P3J748j177k255J497L204J272j605k611
$$ plain form
1483 8737 4087 -2739 -2985 4438 8974 4223 -3580 -7121 -4467 -1340 -948 -3434 -3836 -1634 -1830 -4197
1499 -4197 -3606 2339 6793 3912 -3003 -6305 -493 4824 5756 178 -6319 -4557 164 2613 644
1514 644 -1139 360 -809 -1556 -2566 -2965 -892 1668 292 -4106 -6076 -3821 1968 4220 745 -3194
1530 -3194 -2731 1636 4491 3405 293 -1433 -912 512 -1181 -1689 542 4825 2750 -3140 -4894 1110
1546 1110 7751 7017 -952 -6544 -4934 1669 4406 -662 -5079 -3255 -17 232 -3129 -2781 1654 3415
1562 3415 647 -4858 -5604 -1876 2032 1045 -4055 -6539 -2686 2198 2391 36 -63 2138 2365 1298
1578 1298 2837 4198 3898 2054 -736 -3090 -3481 478 3190 651 -3228 -4799 -1414 2153 3410
1593 3410 2183 212 -2313 -1340 675 1162 -68 5 1753 576 -1679 -182 3022 4294 2689 78
1609G8J5K33J629m6j381k092M98O48p95n49L032J458j739k482j61L676J877j661
1627B238k696q21J611M83Q54p51J177J746r34l847M19M917J909l181n634p51L098
1644a63K771o21l364l42J086K199r78k422J859L370N14n091l506K652M447P68
1660C179m400k805K564J863J737j863r96L79K123N38j943j814K028K015j092m380
1676b867j137K505K958J143k167l250j583M007L582o92m178j379K061J875j607
$$ plain form
1609 78 93 326 1955 1909 528 -1564 -1066 -418 -1213 -1762 1270 2728 989 -1493 -1654 2022 3899 2238
1627 2238 -458 -1279 332 815 1669 918 2095 3841 2907 -940 -521 4396 6305 3124 -2510 -3261 -163
1644 -163 2608 1987 -1377 -1719 -633 1566 588 -1834 25 3395 3909 -1182 -4688 -2036 2411 3179
1660 3179 -1221 -4026 -1462 401 2138 275 -721 -342 1781 2319 376 -1438 590 2605 1513 -2867
1676 -2867 -4004 -1499 1459 2602 435 -2815 -4398 -391 3191 2499 -1679 -3058 -997 878 -729
$$ [...]
8191C3
##END NTUPLES=NMR FID
##END=
