##TITLE=1H_SA_28.amide2
 D2O, 8 sc, 
 27.3.2020
##JCAMPDX= 6.0         $$ Bruker NMR JCAMP-DX V2.0
##DATA TYPE= NMR FID
##DATA CLASS= NTUPLES
##ORIGIN= UXNMR, Bruker Analytische Messtechnik GmbH
##OWNER= root
$$ XWIN-NMR		Version 3.5
$$ Fri Mar 27 14:20:47 2020 Russian Standard Time (UT+4h)  she@DPX200
##.OBSERVE FREQUENCY= 200.1315
##.OBSERVE NUCLEUS= ^1H
##.DELAY= (6, 6)
##.ACQUISITION MODE= SIMULTANEOUS
##.ACQUISITION SCHEME= undefined
##.AVERAGES= 8
##.DIGITISER RES= 18
##SPECTROMETER/DATA SYSTEM= spect
##.PULSE SEQUENCE= zg30
##.SOLVENT NAME= D2O
##.SHIFT REFERENCE= (INTERNAL, D2O, 0, 15.7039)
##AUDIT TRAIL= $$ (NUMBER, WHEN, WHO, WHERE, WHAT)
$$ ##TITLE= Audit trail, XWIN-NMR		Version 3.5
$$ ##JCAMPDX= 5.01
$$ ##ORIGIN= Bruker BioSpin GmbH
$$ ##OWNER= she
$$ F:/spectra/data/she/nmr/H-F/1/audita.txt
$$ ##AUDIT TRAIL=  $$ (NUMBER, WHEN, WHO, WHERE, WHAT)
(   1,<2020-03-27 14:19:18.20 +0400>,<she>,<DPX200>,
      <created by zg, POWCHK disabled, PULCHK disabled
       configuration hash MD5:
       00 E9 B6 7A A2 85 ED C7 34 08 36 98 17 FE 4E 26
       data hash MD5: 16K
       A9 E4 83 F2 C7 76 4D 3D D7 58 2B B8 E4 BE 2D E1>)
$$ ##END=
$$ 
$$ hash MD5
$$ 13 89 C7 71 E1 45 9B 40 78 63 7B 66 E1 27 8C 78
##$RELAX= 
##$RELAX= 
##$RELAX= 
##$RELAX= 
##$RELAX= 
##$RELAX= 
$$ Bruker specific parameters
$$ --------------------------
##$DU= <F:/spectra>
##$EXPNO= 1
##$NAME= <H-F>
##$PROCNO= 1
##$TYPE= <nmr>
##$USER= <she>
##$AMP= (0..31)
100 100 100 100 100 100 100 100 100 100 100 100 100 100 100 100 100 100 
100 100 100 100 100 100 100 100 100 100 100 100 100 100 
##$AQSEQ= 0
##$AQ_mod= 1
##$AUNM= <au_zg>
##$AUTOPOS= <>
##$BF1= 200.13
##$BF2= 200.13
##$BF3= 200.13
##$BF4= 200.13
##$BF5= 200.13
##$BF6= 200.13
##$BF7= 200.13
##$BF8= 200.13
##$BYTORDA= 1
##$CFDGTYP= 0
##$CFRGTYP= 5
##$CHEMSTR= <none>
##$CNST= (0..31)
1 1 145 1 1 1 1 1 1 1 1 1 1 1 1 1 1 1 1 1 1 1 1 1 1 1 1 1 1 1 1 1 
##$CPDPRG= <>
##$CPDPRG1= <>
##$CPDPRG2= <>
##$CPDPRG3= <>
##$CPDPRG4= <mlev>
##$CPDPRG5= <mlev>
##$CPDPRG6= <mlev>
##$CPDPRG7= <mlev>
##$CPDPRG8= <mlev>
##$CPDPRGB= <>
##$CPDPRGT= <>
##$D= (0..31)
0 1.2 0 0 0 0 0 0 0 0.06 0 0.03 0 0 0 0 0.0002 0 0 0 0 0 0 0 0 0 0 0 0 
0 0 0 
##$DATE= 1585304357
##$DBL= (0..7)
120 120 120 120 120 120 120 120 
##$DBP= (0..7)
150 150 150 150 150 150 150 150 
##$DBP07= 0
##$DBPNAM0= <>
##$DBPNAM1= <>
##$DBPNAM2= <>
##$DBPNAM3= <>
##$DBPNAM4= <>
##$DBPNAM5= <>
##$DBPNAM6= <>
##$DBPNAM7= <>
##$DBPOAL= (0..7)
0.5 0.5 0.5 0.5 0.5 0.5 0.5 0.5 
##$DBPOFFS= (0..7)
0 0 0 0 0 0 0 0 
##$DE= 6
##$DECBNUC= <off>
##$DECIM= 24
##$DECNUC= <off>
##$DECSTAT= 4
##$DIGMOD= 1
##$DIGTYP= 9
##$DL= (0..7)
0 120 120 120 120 120 120 120 
##$DP= (0..7)
150 150 150 150 150 150 150 150 
##$DP07= 0
##$DPNAME0= <>
##$DPNAME1= <>
##$DPNAME2= <>
##$DPNAME3= <>
##$DPNAME4= <>
##$DPNAME5= <>
##$DPNAME6= <>
##$DPNAME7= <>
##$DPOAL= (0..7)
0.5 0.5 0.5 0.5 0.5 0.5 0.5 0.5 
##$DPOFFS= (0..7)
0 0 0 0 0 0 0 0 
##$DQDMODE= 0
##$DR= 18
##$DS= 0
##$DSLIST= <SSSSSSSSSSSSSSS>
$$ [...]
##$SUBNAM2= <"">
##$SUBNAM3= <"">
##$SUBNAM4= <"">
##$SUBNAM5= <"">
##$SUBNAM6= <"">
##$SUBNAM7= <"">
##$SUBNAM8= <"">
##$SUBNAM9= <"">
##$SW= 24.9337058887773
##$SWIBOX= (0..15)
0 0 2 0 0 0 0 0 0 0 0 0 0 0 0 0 
##$SW_h= 4990.01996007984
##$TD= 16384
##$TD0= 1
##$TE= 0
##$TE2= 300
##$TE3= 300
##$TEG= 300
##$TL= (0..7)
0 120 120 120 120 120 120 120 
##$TP= (0..7)
150 150 150 150 150 150 150 150 
##$TP07= 0
##$TPNAME0= <>
##$TPNAME1= <>
##$TPNAME2= <>
##$TPNAME3= <>
##$TPNAME4= <>
##$TPNAME5= <>
##$TPNAME6= <>
##$TPNAME7= <>
##$TPOAL= (0..7)
0.5 0.5 0.5 0.5 0.5 0.5 0.5 0.5 
##$TPOFFS= (0..7)
0 0 0 0 0 0 0 0 
##$TUNHIN= 0
##$TUNHOUT= 0
##$TUNXOUT= 0
##$USERA1= <user>
##$USERA2= <user>
##$USERA3= <user>
##$USERA4= <user>
##$USERA5= <user>
##$V9= 5
##$VALIST= <valist>
##$VCLIST= <CCCCCCCCCCCCCCC>
##$VD= 0
##$VDLIST= <DDDDDDDDDDDDDDD>
##$VPLIST= <PPPPPPPPPPPPPPP>
##$VTLIST= <TTTTTTTTTTTTTTT>
##$WBST= 1024
##$WBSW= 4
##$XGAIN= (0..3)
0 0 0 0 
##$XL= 0
##$YL= 0
##$YMAX_a= 152312
##$YMIN_a= -109931
##$ZGOPTNS= <>
##$ZL1= 120
##$ZL2= 120
##$ZL3= 120
##$ZL4= 120
##$ABSF1= 10
##$ABSF2= 0
##$ABSG= 5
##$ABSL= 3
##$ALPHA= 0
##$AQORDER= 0
##$ASSFAC= 0
##$ASSFACI= 0
##$ASSFACX= 0
##$ASSWID= 0
##$AUNMP= <proc_1d>
##$AZFE= 0.1
##$AZFW= 0.1
##$BCFW= 1
##$BC_mod= 2
##$BYTORDP= 1
##$COROFFS= 0
##$CY= 11.3945322036743
##$DATMOD= 1
##$DC= 2
##$DFILT= <>
##$DTYPP= 0
##$F1P= 16.9975609425685
##$F2P= -3.02152046262296
##$FCOR= 0.5
##$FTSIZE= 0
##$FT_mod= 4
##$GAMMA= 1
##$GB= 0.15
##$INTBC= 1
##$INTSCL= 1
##$ISEN= 128
##$LB= 0.24
##$LEV0= 0
##$LPBIN= 0
##$MAXI= 10000
##$MC2= 0
##$MEAN= 0
##$ME_mod= 0
##$MI= 1.114404
##$NCOEF= 0
##$NC_proc= 0
##$NLEV= 6
##$NOISF1= 3.799351
##$NOISF2= 2.8
##$NSP= 1
##$NTH_PI= 0
##$NZP= 0
##$OFFSET= 15.70392
##$PC= 1
##$PHC0= -9787.987
##$PHC1= 8.600821
##$PH_mod= 1
##$PKNL= yes
##$PPARMOD= 0
##$PSCAL= 0
##$PSIGN= 0
##$REVERSE= no
##$SF= 200.130013532006
##$SI= 16384
##$SIGF1= 3
##$SIGF2= 2
##$SINO= 400
##$SIOLD= 16384
##$SREGLST= <1H.CDCl3>
##$SSB= 0
##$STSI= 0
##$STSR= 0
##$SW_p= 3612.71676300578
##$SYMM= 0
##$S_DEV= 0
##$TDeff= 0
##$TDoff= 0
##$TI= <>
##$TILT= no
##$TM1= 0
##$TM2= 0
##$TOPLEV= 0
##$USERP1= <user>
##$USERP2= <user>
##$USERP3= <user>
##$USERP4= <user>
##$USERP5= <user>
##$WDW= 1
##$XDIM= 8192
##$YMAX_p= 0
##$YMIN_p= 0
$$ End of Bruker specific parameters
$$ ---------------------------------
##NTUPLES= NMR FID
##VAR_NAME=  TIME,          FID/REAL,        FID/IMAG
##SYMBOL=    X,             R,               I
##VAR_TYPE=  INDEPENDENT,   DEPENDENT,       DEPENDENT
##VAR_FORM=  AFFN,          ASDF,            ASDF
##VAR_DIM=   8192,          8192,            8192
##UNITS=     SECONDS,       ARBITRARY UNITS, ARBITRARY UNITS
##FACTOR=    0.0002004,     1,               1
##FIRST=     0,             0,               0
##LAST=      1.6414764,     0,               0
##MIN=       0,             -109931,         0
##MAX=       1.6414764,     152312,          0
$$ Real data points
##PAGE= N=1
##DATA TABLE= (X++(R..R)), XYDATA
0@%%%%%%%%%%jRj6J6j6J7k4L1l3M1m9N6o5P5q8J01j12J27j48J67j87K11k37K65
34A40k96L30l68M11m56N05n61O20o85P60q41R30j035J153j284J436j615J826k082
53a112K401k805L340m094N239p206J1541m2204M6332Q3284j7135m1766m5080k6755
67c6020l8011k3966J6793P7790Q7221L5317m6329p7920n2081o823P368J3423L6555
80f683O7639M9263j9502q4857q2416k5373L1339M4515L3918K9793L1135O939m6764
93B8946q3878n4999J9774P1998O2203K3384l684q904k3955n2646n9847j3700N3511
106d1797Q1629M8022j0808m2311l8004k7463l0876k0793K3440P1868P1667J3319
118I7893n0799o6806l7012m544Q103J7438M0375N9183L6873k5313p5598o8062
$$ y = [0, 0, 0, 0, 0, 0, 0, 0, 0, 0, 0, -1, 8, -8, 8, -8, 9, -15, 16, -17, 24, -25, 31, -34, 41, -47, 54, -58, 69, -79, 88, -99, 112, -125, 140, -156, 174, -194, 217, -239, 266, -295, 325, -360, 400, -441, 489, -546, 607, -677, 759, -856, 970, -1112, 1289, -1516, 1824, -2270, 2969, -4237, 7304, -34900, 11432, 94716, 77581, 35815, -9265, -36020, -74031, -97997, -81204, -3414, 83807, 119124, 72795, -5125, -57206, -64029, -56661, -43238, -6683, 60956, 110219, 90717, 5860, -76556, -101929, -70590, -26075, 7843, 37636, 68771, 75710, 28946, -54932, -109931, -90157, -18159, 44044, 67428, 63744, 54840, 30885, -21761, -81608, -95308, -41797, 39832, 87854, 77046, 34735, -3269, -30732, -61608, -82401, -58961, 12907, 84574, 97893, 47094, -19712, -56724, -61268, -53165, -35727, 4648, 63831, 100704, 75391, -207, -68269]
130f8269j2720L4268M0630K9147K6590K5571m537n3076p5295m0140K4887O3941
142i003N1635J6632n708j1693k7751m9985m7673K60N9179P4482L5578j6349l8419
155C1185l3206k6129k5814r736L0429O5640N5741M02n2165n9797l0581k336Q726
168d7641J9211M0538N0927K2042l3016o7944n1452l076L3255L7690K8686K5582
180E4802J8755j1462n2752o3469k5966L0387N6464L9988J0812o074j4466l1184
192E835m7814l7222R419N6145O2844K4839j8093l4074k8805k4278k2410k739L6420
205a9933O1922M3437p322m8534m9598k4485j693P557K0454L9922M4449J2462l8417
218D0221o3579m1616K130K9518L1610K7088K6129J5059j7381n2030n4634j5876
$$ y = [-68269, -80989, -46721, -6091, 23056, 49646, 75217, 70680, 17604, -57691, -97831, -72944, -9003, 42632, 59264, 53556, 41863, 14112, -35873, -83546, -83286, -24107, 50375, 85953, 69604, 31185, -2021, -28150, -53964, -63700, -33271, 32369, 88110, 88512, 36347, -23450, -54031, -56367, -47641, -28430, 12108, 63035, 85077, 52061, -15883, -67335, -70411, -37156, 534, 29220, 54802, 73557, 62095, 9343, -54126, -80092, -49705, 6759, 46747, 57559, 51485, 37019, 5835, -41979, -79201, -69782, -13637, 49207, 74046, 55953, 21879, -6926, -31204, -53614, -56353, -19933, 41989, 85426, 78104, 29570, -20028, -44513, -46206, -38649, -18195, 21727, 66176, 78638, 40221, -23358, -64974, -62844, -33326, -1716, 25372, 51501, 66560, 49179, -2851, -57485, -73361]
230g3361L3521N2278L4831R446m538j4394l4145m6533k8763J6186N4703N2744
242E1975J6517j9999l1901k8798k5995k0019K653L9657N8102L4569j3939m6351
254A6471m2408j8656k09R560K4941M1422L8453L106m1040n7294l3518O160K8236
267b4776K7809K4131K2537Q374k3292n2350m6545n962L5063M6125K8478P206m072
280D2726j4384l2052m1647k1082K2668N3842M5183R168k1231k8342k5138k4713
292c5002j8955N934L9598N1165K5016j8820m4547l6956j4169k47R731K5393M1462
305B9603L4879j950m1845n1031k4288R964K6443K5907K3844K1479M430k7268n2395
318b2228m0799j168L6024M1052K3408M322n569j7662l3577l8419j2279K8820N0337
$$ y = [-73361, -39840, 12438, 47269, 56715, 52177, 37783, 3638, -42895, -71658, -55472, -769, 51975, 68492, 48493, 16592, -12206, -38201, -58220, -55567, -15910, 42192, 76761, 62822, 16471, -25937, -44593, -44802, -35242, -10301, 31121, 69574, 72680, 31640, -25654, -59172, -53012, -24776, 3033, 27164, 49701, 58075, 34783, -17567, -64112, -70074, -35011, 11114, 39592, 46798, 42726, 28342, -3710, -45357, -66439, -43771, 10071, 55254, 64422, 43191, 14849, -10289, -35002, -53957, -48023, -8425, 42740, 67756, 48936, 4389, -32567, -46736, -46983, -37252, -11859, 29603, 64482, 62532, 20687, -30344, -54632, -44668, -18225, 7682, 31526, 53005, 57435, 30167, -22228, -63027, -64195, -28171, 12881, 36289, 40611, 35042, 17380, -16197, -54616, -66895, -38075, 12262]
331A2262L8289M623k1132k6367k2871k0929j3288J1671M0801M5913J6203k4904
343D0271m2487l1779j1267J863J0705K5416L7978K5597r149m3662m4449j7221
355e8184J4615K7196K3413K1645J9327j80k9229m7051l1604O743L6678L5872J7908
368C7149J389p703j8245l3627l4719q038L1887M7676L0587j940k2791k3468k1289
381b3132k0025j0136J6825M3156M1452J1516k6678l9227k7203q272L492J2297
393b5935K7761L5336K0646j6349m4067m1955j1753J4280K5088K2603K1462J5696
405D2813m254l2821m4685k5040J3445L7765L4333J5754J304p967k0862l4103l0141
418e4459l32L4141M4885K4408o629k3268k4286k2398j9327n641K1192M2498L6418
$$ y = [12262, 50551, 55174, 34042, 7675, -15196, -36125, -49413, -37742, 3059, 48972, 65175, 40271, -2216, -33995, -45262, -43399, -32694, -7278, 30700, 56297, 47148, 3486, -40963, -58184, -43569, -16373, 7040, 28685, 48012, 47832, 18603, -28448, -60052, -53309, -16631, 19241, 37149, 38538, 30835, 12590, -21037, -55756, -63794, -31907, 15769, 46356, 44416, 21625, -1843, -23132, -43157, -53293, -36468, 6688, 48140, 59656, 32978, -6249, -33452, -41724, -38232, -25935, 1826, 37162, 57808, 41459, -2608, -44563, -56316, -42036, -16948, 5655, 27117, 42813, 38559, 5738, -38947, -63987, -50542, -12777, 21556, 37310, 38614, 30647, 9785, -24318, -54459, -54791, -20650, 24235, 48643, 42014, 18746, -5540, -27938, -47265, -52906, -31714, 10784, 47202]
431D7202L221k9051l6700k1800m872M767J5999K9529L4401J3723k0781m3258l5290
444d2910o370J6855K3131K1017J8385J2900r679l5681m1980j7200J7752L6112
456g668K9604J1643j585p756k1722l2356k3701O262L5898M1542J7830r124k1592
469A7275k2133k0348j6532j435K2567L9808K8663l588l0151l1864j8269l179M121
482c5065J6776K6496L1621R697k3551m0484k5758k929J6749K2821K0119J7860
494C4352J0288j2958l6348l6865j2183K0378L4335K2713R192j291j0049k3618
506b054l2968j9196J0779L7922L6615J3388j1506k0434j9875j8565j5097K699
518c8292K7846L8241K4810q791l1007l0555j5461k472O878J6712K9231K7286K622
$$ y = [47202, 50423, 21372, -15328, -37128, -42000, -37233, -21234, 8295, 42696, 56419, 35638, -7620, -42910, -49280, -32425, -9294, 11723, 30108, 43008, 33329, -2352, -44332, -61532, -43780, -7668, 21936, 33579, 31994, 24238, 2516, -29840, -53541, -47279, -11381, 30161, 47991, 38867, 17275, -4858, -25206, -41738, -43173, -20606, 19202, 47865, 44277, 14126, -17738, -36007, -39186, -35065, -18289, 8207, 39828, 49525, 25974, -14510, -40268, -43197, -26448, -3627, 16492, 34352, 44640, 31682, -4666, -41531, -53714, -33336, 999, 23712, 32904, 31613, 21564, -2054, -35022, -54218, -43439, -5517, 31098, 44486, 32980, 12546, -7329, -25894, -40991, -38292, -10446, 27795, 52605, 43814, 12807, -17748, -33209, -35681, -28803, -12091, 17140, 44426, 47048]
531D7048k9191l9537k2258K708J8174K0996J9347J7780P359j6641l6047l1953
543d2215m717K3209L2120K1934O806l897j1926k4683k9775j4372J4128L4790L1118
556C2520R180j3291k0324j8987j8696j1532O748K7898L7467J8946j0763l0501
568H665k6569j2308n23P774K0494K8926K1885k114l0675l6449j9844L735J7514
581a9489K0444J8947J5722K753j9429l5391k8438j31K4457L1052K0125O409m283
594C2748j3555k6075k6542j0213J9540L5842K7015M389j4301k0970j9858j8132
606c0112j0102J1082K8981L4093J2203j3980k9552k3338j1110O9J1579K2109K8662
619C0584J6843o037l0381l3152j5088P555J7464J9607J8157J3403j582k3202l4938
$$ y = [47048, 17857, -21680, -43938, -41230, -23056, -2060, 17287, 35067, 42426, 25785, -10262, -42215, -46932, -23723, 8397, 30331, 37137, 33240, 21314, -3369, -33144, -47516, -33388, 1402, 32520, 41700, 28409, 8085, -10902, -29598, -41130, -34382, -6484, 30983, 49929, 39166, 8665, -17904, -30212, -30735, -22961, -2467, 26459, 48344, 46230, 15555, -20894, -40738, -37003, -19489, 955, 19902, 35624, 38377, 18948, -16443, -44881, -45012, -20555, 10497, 30622, 37031, 32748, 19193, -6882, -33424, -43637, -24097, 11745, 38760, 43149, 28848, 7878, -11980, -30112, -40214, -29132, -151, 33942, 46145, 32165, 2613, -20725, -31835, -31766, -20187, 1922, 30584, 47427, 41390, 11009, -22143, -37231, -29676, -12212, 7395, 25552, 38955, 37373, 14171, -20767]
632b0767k1649M402K3417K7905J5362N381m989j5838k6002k3213n578K2973L1879
645A3283K4196K611j5134j6779k0248j6392o822J4369L0260K9786N887j6546k7601
658H70k1935r810j00J1468K2842K7611J4572j2415l1017k8514j0927Q790J8153
671a0412J9703J9303J2689n387k4725l3062j7563O980K5433K4418J4222L941p023
684B8517j9433k7907k1722Q31K4451L1885J9400p32j4309j8768j9318j5851k092
697c5048J7668L2829K6319K924j9338k6761j8856q733J659J3056K4053K4589Q747
710D3108j6072l1412k5596p295R899J6957J9949J8378J0287q533k7216k9440j2503
723c9489J1365K4956K2322J2506K164p664k0192k6982j8447M702K6042K8926J4611
$$ y = [-20767, -42416, -38014, -14597, 13308, 28670, 34051, 29062, 13224, -12778, -35991, -41569, -18596, 13283, 37479, 40090, 24956, 8177, -12071, -28463, -35285, -20916, 9344, 39130, 45017, 28471, 870, -21065, -30875, -30975, -19507, 3335, 30946, 45518, 33103, 2086, -26428, -37355, -28565, -10412, 9291, 28594, 41283, 35896, 11171, -21891, -39454, -32474, -7041, 17377, 31599, 35540, 28517, 9084, -18823, -40545, -39714, -15263, 16622, 36022, 35290, 20981, 2213, -17105, -32956, -35048, -17380, 15449, 41768, 44692, 25354, -1407, -20263, -28996, -27337, -14281, 9772, 34361, 43108, 27036, -4376, -29972, -37267, -27368, -10411, 9538, 27916, 38203, 29670, 2454, -26986, -39489, -28124, -3168, 19154, 31660, 33824, 26160, 5968, -21014, -39461, -34759, -8717, 20209, 34820]
736C4820m255j3851j8239j8885j4793K3K0267L1663K1933q45k0537k3453j6087
749b2239o622K363J3951K5640K3676N488j9089l0348k2744l769J0243J6369J7997
762A0916J7340P934j1390k8668k8472q820J4414K4030K0286J0416J920q702k0774
775D30k5891j4472Q888K7417K7216J1642o117j4890j7211j8245j3199K259K2120
788a0053K9816J8127n781k1784k2822j3898m625M063J5410K4659K1527K315k0684
801A6270k9095j8392q6J2127J6407J7016J5686M968j3845k8427k5562n450J5993
814b2390K2750J7618P167m51r827k0619k4584j1547J2366K8062K5024Q521p701
827B4389j3940j5948j6381j0118M156K2787K8578J4723q482k2447k1309j1928
$$ y = [34820, 30565, 16714, -1525, -20410, -35203, -35180, -14913, 16750, 38683, 37838, 17301, -6152, -22239, -28861, -26498, -12547, 13093, 36769, 42257, 23168, -7180, -29924, -33693, -23450, -7081, 10916, 28256, 36190, 24800, -3868, -32340, -41160, -26746, -2716, 17570, 27986, 29906, 21204, 430, -25461, -39933, -31045, -3628, 23588, 35230, 29113, 14223, -2988, -21233, -34432, -32173, -10053, 19763, 37890, 32109, 10325, -12497, -26395, -31020, -26957, -11547, 13112, 34639, 36954, 16270, -12825, -31217, -31303, -19176, -2769, 14247, 29933, 34901, 21056, -7371, -32933, -38383, -22390, 360, 17978, 25145, 24694, 14867, -5752, -30336, -41883, -29517, -1455, 23569, 32090, 24389, 10449, -5499, -21880, -31998, -27842, -5055, 23523, 38246, 29764, 7317, -13992, -25920]
839b5920m269N782J4996K4165J8122j345k2960k7422j4552K199J3297J6058J6788
852A4939J4110L609j5605k8068k2574j322J7533K2688J5210N885j939j1770k1310
865h614k2748q150J3656K7529K1996N253r209j4452j5769j5293p948Q107K4543
878a099K6427J1343j1216k1812j8136j0414k170P322J6552K2399J5292n447k3491
891E550k5709j2536M105J3304J5223J5780J2232p47j7057k7019j8228K281J8211
904a4610K1938J4266M632k872j2879k1203j9763m352J6922K5792J8796K317r858
917A9126j5057j6222j4343o104J0039K4204K3676P146j2207k1155j6676r212K21
930b6564Q329J8714K2276J2211p819k3449k2968r692M804J3083J5377J5402R716
$$ y = [-25920, -30189, -24407, -9411, 14754, 32876, 31531, 8571, -18851, -33403, -31204, -17907, -1849, 14939, 29049, 32658, 17053, -11015, -33589, -34911, -17378, 5310, 20520, 26405, 24466, 12696, -8614, -31362, -39512, -25856, 1673, 23669, 28922, 19713, 5261, -10508, -25801, -33749, -25642, -1099, 25328, 36671, 25455, 3643, -14493, -24907, -27077, -19755, -3203, 19196, 34488, 29041, 5550, -20159, -32695, -28590, -15286, -63, 15717, 27949, 27202, 10145, -16874, -35102, -32821, -14610, 7328, 21594, 26226, 23354, 10475, -10728, -30491, -34843, -17921, 7871, 26667, 28984, 19126, 4069, -12153, -26496, -32600, -22561, 1643, 25319, 32465, 20258, -897, -17573, -26785, -26564, -18235, 479, 22755, 34966, 27147, 3698, -19270, -28962, -24158, -11075, 4302, 19704, 29420]
943B9420l639j9736k5813j5119M212J8330J9530J2794M466m008j4106k1071j7123
956c1863K68J8445K5137J6086Q62r828j4797j6484j3586l055J2519K4100J9814
969B7618L231j3741k0234j6176p553N77J0262J9564K0501Q405j0532k2812j9899
982b0789o408O705J2400J5611J5174Q073o226k0923k3853j1489P207J7956J7016
995A0454J0852L532n917j5983k0785j4140L577J9230K2624J2963m00j0280j3991
1008A736j5927j1668l97J5665K3653J7178k59j4248j8208j4311o769R87J1651
1021a0917J9343J8210M488j3134k2353j7767m516O907J2840J5519J4521O484r378
1034B0247k1054k0668p305R203J7271J7067R058J463n920j7847j9490j0508M677
$$ y = [29420, 25781, 6045, -19768, -34887, -30675, -12345, 7185, 19979, 24445, 20437, 6331, -14740, -31863, -31595, -13150, 11987, 28073, 28935, 19107, 4310, -12174, -25760, -28815, -16296, 7804, 27618, 30849, 17108, -3126, -19302, -26855, -26278, -16016, 3548, 24049, 32454, 21922, -890, -20789, -27197, -20492, -8092, 7519, 22693, 30766, 24540, 3617, -20236, -31725, -24518, -6562, 10454, 21306, 24838, 18921, 2938, -17847, -31987, -28410, -9180, 13444, 26407, 26007, 15727, 1736, -14191, -25859, -26256, -10591, 13062, 30240, 29981, 15733, -2475, -16786, -23555, -22568, -10917, 8426, 26636, 31124, 17990, -4363, -22130, -26646, -19739, -6899, 8620, 23141, 29625, 20247, -807, -21475, -28780, -19577, -2306, 14761, 23819, 25282, 19362, 1515, -17975, -28483, -23806]
1047b3806K0083J9623R293l017r265j4593j5322j0128K222J7465K3079J3850k377
1060B7107j4629j6870j2434n089L191J2926J9760J6231Q04j5548k1427j5179k705
1073b3862P246J2734J4673J3117L361j1615k1562j8852l714J1021J7249J5030
1085A4826R033J085q243j7433j8448q037Q710K0046J8267P576m571j1201j4950
1098c340j4809q508M834J8159K1005J0495n144j4773j5840j0936l852M489J4266
1111c954J9963J3654j334j6540j9875j2616q25Q409J2821J4833J1105R21j3386
1124A3176k1608j5922j734J1205J6301J3627P483k81j0294j7718j6699m914J0922
1137a6456K0079J6214N515m445j1195j4450j3361o726P214J8815J9208P733p016
$$ y = [-23806, -3723, 15900, 25193, 22176, 12911, -1682, -17004, -27132, -24910, -7445, 15634, 29484, 27107, 12478, -4392, -16826, -21915, -18724, -5798, 13962, 30193, 30997, 15449, -5978, -21157, -23862, -16616, -3882, 10791, 23908, 27269, 15654, -5908, -24760, -28474, -17453, -204, 14826, 23859, 24944, 16701, -732, -19180, -27217, -18507, 1539, 19806, 27382, 22811, 11610, -3340, -18149, -26657, -21823, -3664, 17341, 27836, 22692, 7919, -7921, -18857, -22709, -18220, -3954, 16009, 29663, 28329, 11789, -8086, -20702, -21527, -13118, -297, 14536, 25641, 26562, 13176, -8432, -24354, -26088, -14883, 1418, 15045, 22528, 22247, 11953, -5765, -22464, -27378, -16456, 3623, 19837, 25352, 20907, 9712, -4738, -18099, -24825, -17611, 1204, 20412, 28145, 21129]
1150B1129j5443j5532r506l168N434J5354J8367J1078m537j7116j8451j0095Q02
1163b1684R302J2993J4692J0168j238j4595k0263j3685J286J2405J5290J2234
1175A6905N587j784j2025j7704j5143k362J2440J8868J3841L358n480j1409j3682
1188h590j2457l972R602J9208J7365N607q262j4600j4223q646j673P045J5192
1201A596J6857Q476p221j7443j7399q139K073R175J2960J3841Q645l332j5782
1214D307j8689j0618L449J3062J5141J0923M880l623j2321j7410j2917P68J2297
1227a0751J7946J1169K727p801j1173j3914j1169j969J1555J7928J5132L657r130
1240A4207j4616j2574o656P89Q007J6205J5389M692p965j7095j5077o337K913
$$ y = [21129, 5686, -9846, -19352, -22520, -17086, -1732, 16635, 27713, 23176, 6060, -12391, -22486, -21684, -12382, 611, 15303, 25471, 24233, 9638, -10625, -24310, -23024, -10619, 4671, 16905, 22492, 20708, 8683, -9021, -24164, -26526, -14086, 4782, 18623, 21981, 16501, 5092, -8590, -21047, -25019, -15417, 3791, 21156, 26763, 18501, 3901, -10322, -18968, -20641, -13596, 1596, 18453, 26929, 19708, 2265, -15134, -23273, -21200, -12025, 935, 14776, 23421, 20089, 4307, -14382, -25000, -21551, -8489, 6652, 17575, 22455, 18832, 6511, -10899, -23816, -23048, -10751, 7195, 18364, 21091, 13290, 2117, -11797, -22966, -24935, -13380, 4548, 19680, 23337, 14207, -409, -12983, -19639, -18850, -10843, 5362, 20751, 25443, 17478, 383, -14694, -21031, -18118]
1253a8118J0232J1553J2760O147o187j5625j8060q186M955J3192J4524R383L273
1266A9843m149j2861j6521j0606K307J4822J7779J0124k26p422j1995j3239r753
1279b1897m17J2147J7794J3479P02j0784j4548j1825n555P26J0045J5361J4576
1292A9804L796j0240j6825j3681m120N102J0188J2372J1594M617o982j6417j6831
1305a7623o837O678J3198J2912Q252J757n948j3560j5810q483M767J5209J6056
1318A0568Q838q14q397j1660j2002q107K072J3620J7173J1231j489j1439j4405
1331d811j0525m912K515J0097J5201J2281J269j1487j6542j1887k419N939J0485
1344d796J3002J0149K842q378j6534j4149m166P700J3742J1865P107L3p408j3584
$$ y = [-18118, -7886, 3667, 16427, 22574, 16387, 762, -17298, -25484, -20529, -7337, 7187, 16570, 19843, 15694, 2833, -13688, -24294, -21987, -7165, 10614, 20738, 20512, 13090, 1095, -12144, -21897, -22314, -10167, 7627, 21106, 21808, 11024, -3524, -15349, -20904, -20178, -10133, 5228, 19804, 23600, 13360, -3465, -17146, -21266, -16164, -5976, 6396, 17990, 22607, 15625, -792, -17623, -24460, -17782, -4584, 8328, 16580, 18337, 12389, -1171, -16981, -25464, -20697, -5488, 10568, 19406, 18592, 10195, -1465, -13467, -21574, -19502, -5882, 11291, 22522, 21033, 9594, -4811, -15336, -20248, -17733, -7636, 7565, 19846, 21115, 9628, -6914, -18801, -21220, -15281, -4796, 8206, 18355, 21197, 12819, -3715, -17864, -22030, -14330, -588, 11277, 18384, 18417, 11009, -2575]
1358b575j5075o190N868J5200J4615O748k437r650j1295j0265p230M816J4109
1371c361J5907Q260k516j0550j3154q731l862L468J0868J4159J0614j844j2082
1384G176j4982j0549j263N956J0835J1916R200N81r772j5871j1986k247Q508J3035
1398E37J1615O223n25q321j3781j2986l915P560J4794J2461M958l008r447j1401
1412e236j0854m362N316J4539J4599N971l711j1512j2172q804k357N510J2363
1425g10J4152Q079k858j2329j4715q753N2O690J1111J1274P604j317j1389j5685
1439h794j0243j58Q522J2296J1049M595j663r557j3685r992j270Q405J4235J1351
1453A5091L622l150r478j1719j0268k819P380J4366J2994M207o010j0992j1389
$$ y = [-2575, -17650, -23840, -17972, -2772, 11843, 18591, 16154, 6504, -4791, -15056, -22286, -17470, -3361, 12546, 20806, 18290, 7740, -5414, -14145, -18007, -14539, -3671, 10488, 21102, 19258, 7176, -7806, -18355, -19618, -13662, -2827, 9089, 18289, 18870, 9098, -6773, -18759, -21006, -12498, 537, 12152, 18375, 17850, 9529, -4252, -17238, -21153, -13593, 1201, 13662, 18620, 15612, 6165, -5236, -16090, -20452, -15136, -597, 14002, 19973, 16262, 4750, -7422, -16226, -18583, -13073, -710, 13442, 21521, 18663, 6334, -8381, -17134, -17082, -10392, 719, 11993, 19597, 18280, 6891, -8794, -19037, -19195, -10673, 1623, 12672, 17267, 15604, 6047, -7638, -17630, -18900, -10495, 3740, 15091, 18713, 15563, 6085, -5634, -15902, -18721, -11341, 3025, 16019, 20226, 14216, 3224, -8165]
1466h165q023j712O280J2311J3497O108m770j2183j3165o891J244O866J1570J1467
1480A4434O000l180j1995j4646q440J477R448J1192R292M386l480r886j3711j0142
1494a9251P24R983J3840R714K848m656r269j1488q637j250R071J4338J1413K615
1508A9995o945j0897j0470o932r48P280J2694J2233M043o869j2937j1355n890
1521a6998K091P290J0848J1091N233m379j3162j3447o164L723R307J0547Q898
1534A4878K970l787j0776j3438q317K191J0984J2624Q106Q79n037r328j1493q015
1548a7559N63J0059J4359R867M00p118j0551r325n742L63P861J3152J1252K424
1562B0005q250j2635j0793l495K234P564J0617R535L476n979j2952j2829m324
$$ y = [-8165, -16188, -17900, -11620, 691, 14188, 20296, 15526, 3343, -9822, -16713, -15469, -8603, 2967, 14434, 20434, 17254, 5259, -9387, -17827, -16350, -6902, 4290, 13582, 17968, 14488, 4602, -9109, -19251, -18527, -8544, 5296, 15010, 17858, 13202, 3933, -7555, -16192, -17442, -8371, 5967, 17380, 19995, 13050, 2153, -8317, -15249, -16197, -8917, 3777, 16010, 20053, 13184, 247, -11108, -16998, -14907, -7617, 3231, 14322, 19555, 15176, 2014, -11433, -17597, -13874, -4567, 5980, 14878, 17848, 14061, 3285, -10153, -18470, -16279, -5295, 7329, 15435, 16314, 11277, 1949, -9544, -17559, -16996, -6937, 7422, 17289, 17689, 10571, 20, -9305, -15047, -14684, -6823, 6329, 17581, 20005, 11755, -880, -11673, -15168, -12934, -5370, 5247, 14782, 18258, 12279, -673, -13502, -17826]
1575a7826M330R912J0376P475K267m268j1373j2231o484M193J1218J1600O806
1588A5995L2n745r670j0768o732J320J0548J3615Q053j014q142j0247q528m673
1602a5956J783Q772J2850R737Q28q980j1971r003l015L843P803J0620Q539J865
1616A7715p352j3340j0974l527N482R552R504O845Q43m921j1576j1657m828N523
1630a2711J1607J1138N669q69o381r550r848n378L255J0812J2617O410k087q769
1644E915j0006q079l977K865R423J2146P703l51r297j1595p927j955M390Q850
1658a895R900P764N56q015j2788r547k241O041R937Q772N819j20o790j1522j0096
1673a4225l393O218J0834J0301M925k068o662r700q990m168N088J1231J1709N287
$$ y = [-17826, -13496, -3584, 6792, 14267, 16534, 12266, 893, -11338, -17822, -13629, -2411, 9189, 15995, 16027, 10282, 612, -10156, -16888, -15568, -5020, 8595, 16648, 15634, 7492, -2755, -11283, -15956, -14173, -5401, 7449, 17186, 18014, 9034, -2937, -11940, -14955, -11112, -3309, 7311, 15850, 17715, 10363, -2977, -13951, -17478, -11996, -2444, 7060, 13905, 14748, 9827, -1749, -13406, -18234, -12711, -1104, 10034, 15703, 14834, 8453, -1097, -10945, -16323, -13068, -2256, 10361, 16771, 14684, 5915, -4091, -12170, -16147, -13282, -3859, 8287, 15990, 15639, 6342, -5253, -13180, -15135, -10745, -1895, 8005, 15769, 16325, 8310, -4478, -14025, -16266, -10225, -288, 8484, 14303, 14183, 7393, -4129, -14225, -17618, -11400, -566, 9735, 14660, 12592, 5930, -3770, -12760, -16928, -11840, -609, 11100, 16387]
1687A6387l230q638r401p164k651M266R244J1272O282k910r377j0648p261r44
1701a4773M641R620Q427O319l74r442j1158q500L01O570J0305O874M431M42p998
1716E685j0775r453j384O285J0988Q472M819l456p322r766p841k641N649J1210
1730D70R865M708l519r258q288o588k024O092R027R860N409l942r884r317n342
1745a2731o14N523P427J0452M147k545q239j1005p792P64P621P652R128L884k126
1760A1546p863j0777o981J41O689J1205P446K662l495p942r377p805r7O682J0899
1775B933Q952J969m389q851q547n164q23N756J0118R556L824n432r576r025m189
1790a2888J093N579Q437R424L332n003q397j1103m439K256N927Q865P070K201
$$ y = [16387, 13157, 4519, -4882, -12046, -14697, -10431, -1187, 10085, 16367, 13457, 4080, -6568, -13829, -14773, -10132, -512, 7915, 14234, 13860, 4418, -6740, -15240, -14939, -8369, 1936, 8810, 13241, 13683, 5685, -5090, -14543, -15927, -9642, 1346, 9818, 14637, 11181, 3859, -5907, -13748, -16389, -10740, 470, 10335, 15043, 11524, 2266, -6022, -12610, -14634, -8542, 485, 10345, 15754, 11812, 1928, -7389, -12731, -13345, -7822, -395, 10057, 14204, 11659, 3420, -7585, -15377, -14613, -6992, 660, 9788, 13672, 11546, 3683, -7094, -14075, -13934, -7245, 3960, 11406, 14068, 10573, 2631, -6746, -14551, -14648, -7966, 2933, 11885, 13854, 9465, 614, -7933, -13097, -13920, -8164, 1954, 11510, 15334, 9902, 326, -8699, -12888, -11795, -6216, 2221, 11645, 14977, 9974, 1577, -9526, -13965, -11709, -5782, 3083, 10153, 12354]
1804A2354k484q472r558o977J354Q527R801P451R77l778q112q853o006P54P720
1819e302J0134P793N26m899p396q680m351m53P131R196Q301J858o050r102q259
1834i553l713J650O075Q612P568L590n119j0231p886l098L117O079Q086N546L320
1849A4043m323r398r687l716J781P529Q309O568L28m624o931j0286l471J973Q330
1864c575J0326N353R24n579p479q542l175P55O663J0345Q096j57o921r709n841
1879h516l477J099O811R315O756J026n729j0232o507l210L629O335Q493N958J441
1894A3192m742r858r180k684L318R555P725M585o51m181q526q006l850K098Q737
1909b468R691M567q10n787o984o367m049K244Q392R317O132j589o946q774o061
$$ y = [12354, 9870, 1398, -8160, -15137, -13783, -5256, 4545, 11996, 12973, 9195, 1083, -7770, -13776, -13022, -5302, 4832, 12625, 13151, 8252, 856, -7824, -12175, -12628, -5497, 3699, 12000, 13858, 7808, -1294, -9553, -13266, -11616, -5541, 3071, 10639, 14229, 9110, -1121, -9007, -12105, -8988, -2909, 5177, 10723, 14043, 9720, 322, -9365, -13081, -11300, -3771, 4538, 11106, 11434, 6810, -121, -10407, -13878, -11905, -3575, 6751, 12104, 13028, 7449, -30, -8572, -11747, -10992, -4329, 6016, 14112, 13955, 7034, -2675, -8516, -11993, -10894, -4083, 5232, 11988, 13014, 7285, -2947, -9454, -12664, -9035, -2700, 5793, 11751, 13192, 8450, -1408, -10588, -13272, -9954, -399, 7326, 11911, 11260, 7079, -1447, -9453, -13303, -11205, -2468, 7223, 11790, 10980, 5193, -1791, -8158, -12207, -9963, -1571, 7746, 13878, 12289, 5343, -3431, -9492]
1924i492j953K952N976Q736O756m81o310r979p073j486L962P265P536M711J101
1939A2221n784r732p747j855N350Q283P007L468J01n292p361q951k895N094R168
1954A075P659L899j840o843p158o440k195K495Q047R389N381l294o388q504n554
1969a0271o21L097P560Q469N079m62p764r395o049o65M800O258P200M866m25o725
1985D952r801p380n97N893P486P310L093q96n370q310p242j465N199R154Q120
2000A0146J992k425o163p194n943j947L598Q611Q744L707l459p663p395m662p61
2015a0814L902P285Q367M501k579q071q737m681Q81M920O621O326L826j238o826
2030C683r232n948J97O085P721O007K175j794n894p972o780n59O122Q960O033
$$ y = [-9492, -11445, -8493, -2517, 6219, 12975, 12494, 6184, -3795, -10868, -12354, -8392, -1127, 6409, 11120, 12221, 6437, -3295, -11042, -12897, -7547, 736, 7743, 11211, 11312, 6020, -1341, -10292, -13187, -8093, 1075, 8734, 12633, 10793, 3950, -3208, -9648, -11843, -9348, -1301, 8088, 13469, 10175, 3787, -4717, -10271, -10892, -7795, -235, 8234, 13313, 12851, 5087, -4308, -10357, -11022, -6222, 36, 7236, 12102, 11677, 4952, -4849, -12229, -12826, -6933, 553, 7863, 10956, 10060, 4690, -3620, -10862, -12327, -7128, 2026, 10146, 12138, 9713, 3550, -3644, -9587, -11534, -7936, 675, 9419, 13126, 9667, 2004, -5391, -10053, -10814, -6912, 373, 8740, 13241, 10662, 2591, -6146, -10827, -9946, -5026, 1595, 7921, 11747, 10509, 3683, -5549, -11497, -11300, -5215, 2506, 8513, 10688, 8894, 3000, -4972, -11752, -12311, -6189, 2771, 8804]
2045H804K653l318o082o660n303n73L725R222P427K030l749p054p070l872m13
2060a0233M245P687P295L216l953p144p757m006N60N266O962O204K544j658p283
2075A945r026m033R79O503P945M234J752k430n742p612n806Q07O166P955O014
2090I651Q54l738o516o456m392O34M671Q539O770P03l202p697o199l796O42N331
2106d201P160P220J399l817q224p413l327K208N013P532L949L124l338p507p695
2121g917l771J498P786O111N276J232m037n380p004m751J730O023P558N535m09
2136I480m511n963n298m096K04O558P697N643L16n528o655n012k743J581M952
2151c375P471O343J017n113q250o362k050K839N208O556M709Q39l041q460p008
$$ y = [8804, 11457, 8139, 2057, -4603, -9906, -10479, -6754, 2468, 9895, 11925, 8176, 1122, -5948, -9820, -10233, -5988, 1699, 8994, 12210, 8257, 1113, -6644, -10650, -10090, -4824, 2138, 8342, 10886, 9228, 1945, -7081, -11114, -10135, -3632, 4313, 8547, 10299, 7869, 2127, -5485, -11291, -10484, -4318, 3637, 9651, 10505, 6767, 251, -6205, -10597, -9963, -5292, 3247, 10017, 10720, 7518, -179, -6378, -10174, -9532, -4201, 2959, 10179, 11578, 7761, -463, -7876, -11203, -8995, -3982, 3550, 7499, 10623, 7285, -222, -7917, -11688, -10190, -2404, 3707, 8983, 10215, 6178, 798, -6206, -10957, -9227, -3204, 4354, 9889, 9480, 4969, -994, -6292, -10388, -10184, -3626, 4071, 9714, 10030, 4502, -2153, -7165, -9908, -8327, -3375, 4096, 10439, 11456, 6343, -1907, -8269, -10319, -7480, -2272, 4284, 8993, 9832, 6791, -1669, -8677]
2166h677k123K718O634O650L718n0k973o880p563j493R38P359P660K941L67m240
2182D986n960n813l572J836O335P425N181o43n405o692n538k072J487N693P458
2197D706N114K45n234p515n822j301K875N619O119M538L59m551p578o608j259
2212a0293L422O480N890L480L6m287o907o771k590L628P095O604L376j455l650
2227D058o319n767k830K399P813O729M503j661n745o637m242j535K579O042O005
2242E392M183n52n649p916m386l25K983N572N538M372L1n227p998n143m50L947
2258e628O595N032K857j42m605o928o301j115M202O769O266K113j899m603n999
2273c386m967j656K799P476O790K897k264n723o183l379j107K967N413P310L824
$$ y = [-8677, -10800, -8082, -1448, 5202, 8920, 8870, 5897, -983, -8546, -10039, -9101, -1742, 5918, 8859, 9226, 4986, -974, -6787, -10359, -8523, -2188, 5237, 10418, 9775, 4370, -2322, -7860, -9932, -8445, -2752, 4706, 9820, 10065, 4831, -2684, -8506, -9807, -6932, -1313, 4806, 9344, 9703, 5152, -2426, -9034, -10293, -6871, -391, 5499, 8979, 9015, 4728, -2179, -8950, -11540, -7912, -817, 5787, 9163, 7708, 4058, -2261, -8028, -10858, -8459, -646, 6083, 10586, 8925, 3180, -3457, -7699, -9234, -6655, -613, 5392, 9575, 9023, 3374, -4542, -8928, -9253, -6270, -698, 4840, 9212, 9243, 4016, -3982, -9125, -9575, -5628, 967, 5999, 8856, 8714, 4109, -2819, -9120, -10235, -6033, 736, 7002, 9115, 7216, 2613, -3386, -8353, -10009, -7210, 266, 7056, 9953, 7689, 1966, -4217, -7596, -8703, -5736, -323, 6987, 10811]
2288A0811k240o474o938l485j47L446N137N929L260j238n436p498m661K36M895
2303d403N879M789K630n83n539o870n050m29N133O697N325J396k312m805n383
2318c525m534j242L577P094O575J687l103n753n522l222m40L239N981O527K782
2333A0121k786o485o447l150J294L972N113N116K685j631o397o829m203J277N158
2348c192N956M042J692j802n027o616m561O47N432O547M884M51k530n015m852
2363c944m438j26M570O785N548R93l762n688m806k914L92L264O084N681K058l637
2379F060o734n638j994J497L924M948N075K404k688o174o773l065K214N158N482
2394C696L697P89k293n139o540l536J202N618O647L646P7l021m569n530l380P93
$$ y = [10811, 8571, 2097, -4841, -8326, -8473, -5027, 110, 6039, 9299, 8061, 2625, -4873, -9534, -9298, -4403, 1476, 6265, 8895, 8312, 2773, -4097, -9147, -9576, -4443, 2254, 7579, 8975, 6663, 1858, -3525, -8059, -9301, -5724, 1370, 7945, 9632, 6529, 776, -4746, -7968, -8408, -5169, 812, 7339, 10121, 7335, 850, -5597, -8747, -7453, -3481, 1632, 6748, 9433, 7802, 1405, -5424, -9627, -8350, -3192, 2764, 6806, 8498, 6696, 1669, -4947, -9508, -8861, -3429, 3118, 8002, 8453, 5923, 908, -3944, -8382, -8508, -3938, 2847, 8395, 9388, 5626, -62, -4868, -7782, -7390, -4126, 1958, 7639, 9697, 6060, -674, -6312, -8306, -6809, -2885, 2063, 7138, 9542, 6854, 680, -6093, -9158, -6944, -1786, 3696, 7393, 8182, 5889, 750, -5790, -9326, -8124, -2506, 4141, 7787, 7864, 4843, 274, -5256, -8636, -7843]
2410g843M785O974M631j03l627n688m496k145N53M118N978M643J135l546o481
2425a112n468j434J749M414M919M317J277l286o115o322j860K473N581M948L255
2440G336P39l105n081n894k985K096N777N775L324p42l073m887n017k734J130
2455g341N191O864L880p54m306n461l851j896J355M410O155M231K67m666o152
2470b074m522j033K132M103N254L563Q96l856o491n055j476K802N492M558K722
2485G015K63l006n431n837j951K886N884N255K404n31l474m632m639k149J550
2500f393N992N772K877j333m361n046l505j612J890M874N586L488o79m855n723
2515c028m231K96K510L959N246K823r0m041o393m373n74L753M720L910K878n83
$$ y = [-7843, -3058, 3916, 8547, 8444, 4817, -871, -5367, -7512, -6959, -2841, 3137, 7780, 8915, 5369, -1112, -6580, -8014, -6265, -1851, 3068, 7385, 8662, 5376, -739, -7061, -8921, -6448, -867, 4081, 7336, 8075, 4970, -111, -6005, -8990, -6894, -1117, 4658, 7982, 7240, 4167, -720, -5737, -8471, -7341, -2150, 4714, 8594, 7840, 3534, -1927, -5778, -7674, -6319, -1909, 4246, 8477, 8744, 4078, -2074, -6596, -7629, -5497, -1394, 3860, 7423, 8319, 4463, -2028, -7083, -8559, -5757, -265, 4293, 7015, 7278, 4272, -1159, -6996, -8947, -6061, -177, 5078, 7482, 6951, 3477, -1155, -5794, -7943, -6393, -401, 5371, 8248, 6915, 2554, -2492, -5997, -7609, -5719, -845, 4741, 8229, 7550, 2695, -3028, -7259, -6963, -4453, -494, 4752, 7575, 7485, 3444, -2949, -7322, -7896, -4143, 577, 4487, 7365, 6782]
2531F782l533n875m612j207L429N791M681J935j524l567m194m706j162K127O010
2546C75M703L196k576m453l875l866n75K329M638N585K811j573n651n440k303
2561f675r26L179L594O643J636j719m171m977m126N18M479M022L377K383j218
2576F019m218n405m563l67M030O223M236J807k818l658n091k639j054L063N945
2591A510M902J192k138m308m330k962p95K641N130N166K292k284n307m908k629
2606f828L19L231M231M040K668j599m948n700l135J064L878M565L623J165j061
2621E513l968n244l780P09M235N017L544Q11k202l705m337l601j40L707N288M346
2637F193J014k892m257m022k627o3L034N320M723J559l013n025m710j933R06L253
$$ y = [6782, 3249, -2626, -7238, -8445, -5016, 775, 5456, 7391, 5867, 2300, -1894, -6600, -7762, -5635, 375, 5078, 8274, 5698, 1245, -2630, -6496, -7071, -4742, -104, 5481, 8292, 6719, 1068, -4372, -6675, -7601, -4422, -828, 5815, 7451, 5732, 1561, -3416, -7542, -7024, -2545, 1477, 4854, 7237, 6019, 1801, -3604, -8167, -8534, -4504, 1719, 5955, 7762, 4944, 1286, -3805, -6444, -7498, -4435, 1510, 6412, 7604, 5466, 1158, -3172, -6134, -6929, -4288, 842, 6008, 8300, 6016, 709, -4199, -6828, -6509, -3278, 953, 4993, 7661, 6062, 1114, -4586, -7721, -6657, -2779, 1786, 5409, 6574, 5513, 1545, -3699, -7479, -6770, -2535, 2482, 6026, 6837, 4635, 930, -3407, -7008, -7148, -3441, 1847, 6193, 7207, 4315, 58, -3964, -6591, -6654, -3620, 1700, 6423, 7982, 4969, -56, -4766, -6699, -5793, -2540]
2653b540M486L578J825k488m791n449j780J171M107M175L204R55k003l863m737
2668d150l397R85M601M772L299J60k112l998m152l262O69M217N539L435k74l675
2684B657l767l191k426P64L162M698M399n65k576m224m210r54P33L085M842L457
2700E884J018k580n757l900j472J795L802L522L367O67k350m089m552k889J914
2715e620M896M183K855o12k527l808m066k407J288M441N171K996m69l532l877
2730a088l589j458O64L716M875L496l2l730n008l067q70J285L522M020L664J75
2746F575l003n192m278p78K201L968M076K091K28k246m439m600j785K062N051
2761f9M132J893n90k784l822l894j735J834M189N190K554j512l379l706k842j310
$$ y = [-2540, 1946, 5524, 7349, 4861, 70, -5379, -7159, -5988, -1881, 2294, 5498, 6453, 4450, 587, -4150, -7547, -6562, -1961, 2811, 6110, 6270, 4158, 160, -3992, -7254, -6585, -2368, 3171, 6606, 6332, 2657, -1110, -4301, -6727, -5963, -2801, 1897, 6296, 5731, 3155, -1069, -5279, -6233, -5500, -2415, 2427, 5884, 6902, 4322, -1435, -5335, -6807, -5012, -1210, 2312, 5679, 6346, 3996, -93, -4645, -7534, -5620, -724, 3459, 6314, 5702, 3175, -633, -4699, -7106, -5818, -1377, 3794, 6790, 6321, 2789, -1088, -4677, -6135, -5471, -1755, 3120, 6616, 6584, 2854, -2154, -5221, -6091, -4806, -1284, 2736, 6400, 6575, 3572, -1620, -5898, -6676, -4475, -507, 3569, 5660, 5888, 3642, -797, -5397, -7182, -5120, -69, 4063, 5956, 5366, 2582, -1240, -5134, -6869, -5035, -846, 4344, 6898, 5386, 2007, -1699, -4541, -5851]
2777e851J265L600M798L277p52l832m990k844m29K082L335L794K652J55l788m874
2793b402l754j00K603L831L619K099n42k713m538l800j218K666M950L689J676
2808F066j336l126l310l310j602K076M770M556J451j230l806l832k553o63J311
2823d538M508M497J881k59m136m796k518n90L014L019L733K299l79m039m470k790
2839e564l06K733L802L031J996n57k874m214m527L23K800M241L767P10q39l968
2855E54k937k866q35K832M273L713J649j550m091l138k719o98K469M092L473K259
2871F480j167m843m295j801Q14K180L463L670J498q94m030m494k797R23K872L941
2887A520K904J171r19l584m041l205P44L002L626L619P73j524l250l717k354m54
$$ y = [-5851, -4586, -986, 3812, 7089, 6337, 2505, -2485, -5329, -5758, -3676, -341, 3453, 6105, 6260, 2472, -2402, -6156, -6256, -3653, 178, 3797, 5896, 5354, 2641, -1897, -5697, -6915, -4249, 701, 4390, 6066, 4730, 1604, -1706, -5016, -6618, -4542, 228, 4784, 6235, 5005, 1199, -2633, -5186, -5849, -4538, -30, 4467, 6348, 6089, 1953, -2843, -5361, -5951, -2937, 82, 3815, 6114, 5735, 1696, -2774, -5564, -5870, -3137, 665, 3696, 5692, 5135, 2261, -1953, -6480, -6157, -3357, 884, 4651, 5361, 4522, 554, -2383, -5249, -6084, -3252, 1021, 4734, 6383, 4833, 742, -2396, -5115, -5813, -3344, 748, 4221, 6480, 5313, 470, -3825, -5626, -4812, -2632, 831, 4501, 5999, 5105, 1075, -3419, -6216, -5293, -2421, 1520, 4424, 5595, 4676, 1092, -2949, -6154, -5410, -2408, 1218, 4837, 5610, 4086, 836, -2881, -5235, -5689]
2903e689K748M700L340P55k045l720l193j721k4K258L895L860J097k435l796l897
2919c867j512N41K552L457L452J255j488m352m133j814J168L310L212L022P05
2934E508j520l597m355k111J013L587L926K314L26j534l347l543k704Q89K814
2949b334M719K882K25k473l440k764j902L17K770M040L320O31k923l847l235j334
2965e348J141K469L566L112P88k144m076l923j433J725K919L260K660M00j748
2980C368l818l810j605J377L461L833K202k83j696l534l133j929J057L491M249
2995C230K093m72k765l021k754j463Q15K905M198K710l2l050l846k571q07J035
3011c795K831L411K719L86k690m361l179q47J909K991L313J875L76k086l841l456
$$ y = [-5689, -2941, 1759, 5099, 5854, 3809, 89, -3104, -4825, -4849, -2591, 1304, 5164, 6261, 3826, 30, -3867, -5379, -4838, -2286, 1171, 4623, 5878, 4390, 38, -4095, -5909, -4741, -1431, 1781, 4803, 5508, 3988, 391, -3964, -6075, -5062, -1475, 2451, 4765, 5091, 3557, 210, -3333, -6037, -5148, -2334, 2385, 5267, 5492, 3019, -421, -3185, -5087, -4770, -2000, 2040, 5360, 5991, 3068, -779, -4014, -5348, -4207, -1738, 1828, 4940, 5728, 3584, -492, -4415, -5848, -4123, -1204, 2056, 4716, 5116, 3368, -450, -4260, -5865, -4488, -1027, 2806, 5008, 4725, 3029, -505, -3638, -5567, -4510, -1019, 3230, 5323, 4851, 2086, -935, -3689, -5152, -4337, -1432, 2766, 5476, 5444, 2394, -1452, -4023, -4830, -3795, -964, 2447, 5166, 5552, 2862, -1499, -4678, -5525, -3616, -625, 2688, 4563, 4939, 2853, -988, -4444]
3027d444j383K046L471L549J420l04k094l357l040j414J390L602L965J870q73
3042D404k213l655k506j082J234L086M278K002p72k995l799k285p73J897K409
3057g70L559K522m88k717l911l153j62K137K976L214J771l44k330l637l426r80
3073e739K768L503L059J413r61k283l115l167r59J726M176L657J287j510k415
3088A440k722k933n63J710K857M639J184j463l311l298j714l50J573K985L052
3103C086J785k66l473l476k822L53K292L074K577J523l01k896l646k663m49K728
3119b574L626K710P58j080k156l332k259p18K044L902L009J248j884k365l065
3134b136k120n90K053L290L437J218j334l424l346j603O4K271L042K623J401j090
$$ y = [-4444, -5827, -3781, -310, 3239, 4659, 4355, 2261, -1096, -4136, -5550, -4160, -558, 3407, 5277, 4404, 2191, -1464, -3970, -5052, -3818, -732, 3546, 5548, 4776, 1781, -2018, -4303, -5076, -3179, -770, 2789, 5311, 4823, 2106, -1805, -4958, -5120, -2983, -7, 3207, 4978, 4634, 2304, -1333, -4759, -5739, -2971, 532, 3591, 5004, 4043, 1760, -1355, -4522, -5481, -3755, 421, 4078, 5365, 3855, 1440, -1282, -4215, -4778, -3068, -211, 4428, 5612, 4149, 838, -2460, -4174, -4524, -2951, 34, 3086, 4871, 4605, 1132, -2344, -5166, -4813, -2521, 553, 3130, 4653, 4352, 1456, -2190, -4853, -5302, -2574, 1052, 3762, 4520, 3440, 1284, -2048, -4307, -5025, -2981, 921, 3930, 5178, 3294, 929, -2136, -4256, -4846, -2793, 497, 3934, 5152, 3818, 394, -2952, -4555, -4491, -2220, 822, 3445, 4846, 3756]
3150C756k955l900j997O32K618L106K394R74j117k636l397k537L61K786L442K720
3166D250M48j611k569k987k183J12K228L648K963M41j688k832k872j649J38J563
3182b600L666L297J005k033l448l327r69N48K075L080K922P30j635l110l815j425
3198e039J308K298K785K445M90r64l150l131j892M37L014L478K158J13j625k704
3214B1k914j666N34K734L204K533K20k255k735k567j577M46K378L397K756L56
3230D865k210l341k686j086R83K401K635K403Q07j670l526l105j094J166K618
3245h40L082J581P54j652l249k990j228P04K982L322J710P1k093k521k579j748
3261d694Q55K903L672J432M8k016k959k457j111J085K146L604K071l89k016l233
$$ y = [3756, 801, -3099, -5096, -4464, -1846, 1260, 3654, 4628, 3511, 875, -2522, -5059, -4698, -1912, 1530, 4250, 4698, 3087, 518, -2469, -4652, -4540, -2312, 1336, 4299, 4740, 3052, 220, -2652, -4301, -4163, -2600, 1066, 4363, 5368, 3335, -113, -3440, -4409, -3861, -1786, 1294, 4216, 4946, 3311, 201, -3614, -5039, -3731, -1433, 1352, 3797, 4287, 3323, 173, -2958, -4850, -4413, -1399, 2079, 4237, 4350, 2725, 21, -2893, -4559, -4025, -1291, 1913, 4446, 4666, 2411, -324, -2891, -4468, -4022, -1644, 1753, 4509, 4865, 2655, -686, -3372, -4458, -3475, -1074, 1561, 3964, 4771, 3101, -425, -3530, -4624, -3458, -840, 2242, 3823, 4577, 2925, -324, -3314, -4542, -3838, -856, 2466, 4176, 4247, 2154, -367, -2946, -4694, -3839, -936, 2736, 4168, 4216, 2200, -759, -3216, -4327, -3242, -1096, 2508, 4579, 4190, 2174, -1059]
3277a059k103j065J200K245K994J755M85k357l193k627n74J384K484K956J296
3292C821K08j684l082l020r58J559K879L011J176j84j629k403k934j363J142K933
3308e28L402J576n73k444k609k130r92J188K525L047J907n73j732l640j854j019
3324d449J705K832K031K201n09j598l559l709L36J911K827L206l22J089k384l167
3340a559k733n46K588K047L126J088R1k799k480k642p60J445L418K948O87q73
3356C046j847k736j849r02J590K829L018J232p75k719k619k097J39J695K158K620
3372B783J318m21k557l273k088K89J800K251K592J096n40k158l033k128Q4J768
3388b217K996K216R66p72k349k565k014j96J805K803K684N67j014k145k637k075
$$ y = [-1059, -3162, -4227, -3027, -782, 2212, 3967, 4452, 2095, -1098, -3725, -4299, -2915, -431, 2525, 3821, 4029, 2345, -737, -3757, -4715, -3156, -277, 2734, 3910, 3726, 2097, -306, -3240, -4603, -3461, -528, 2874, 4450, 3877, 1433, -1176, -3306, -4298, -3110, -585, 2462, 4369, 3796, 2064, -1576, -3430, -4449, -2744, 88, 2119, 4320, 3811, 2213, -1346, -5055, -4719, -2808, 19, 3225, 2903, 3992, 1608, -1559, -4292, -4838, -2250, -203, 2923, 4011, 4102, 1303, -1177, -3819, -4579, -3134, 284, 3232, 3919, 3046, 1199, -1537, -3386, -4288, -2698, 131, 3149, 4381, 3606, 887, -1732, -3829, -3690, -1995, 163, 2783, 4101, 3680, 1123, -2150, -4238, -3949, -2149, 102, 2694, 3790, 3250, 1092, -1941, -4069, -3985, -2217, 779, 2995, 3961, 3189, 840, -1725, -3739, -3935, -2130, 673, 3357, 3924, 2910, 765, -1872, -3947]
3404c947N4J545K886K832J009j399k587k588j588J61J720K732K207R73n48k808
3420F54l176j460M60J857K324K344R68p07k558l100j716K78K215K847J977O37
3436C844j068k413k315j953O6J906L286K002N67j413k557k372j226K7J419L205
3452A005K504N60j529k502k522j130L59J705K522K297R95j533k835k651j049P46
3468c058J764K373J909P04r42k766j944k274R38K984J622J935L09j249k296k282
3484b273j465N18J891L227J680l8j392k425j892j267K07J915K895K125J14j514
3500B306k689k322n66P50J266K903J111P72j524l106k103L9K7K397K005J930L94
3517C590j649k308k494j087Q47K327K181J722K16j336k340k093j581Q70K647K460
$$ y = [-3947, -3893, -2348, 538, 3370, 4379, 2980, 393, -2195, -3783, -3622, -1902, 830, 3037, 4010, 3462, 654, -2522, -3982, -3522, -1665, 659, 3003, 3971, 3264, 706, -2394, -4110, -3832, -1617, 1230, 3207, 3844, 2776, 363, -1952, -3905, -3839, -1933, 1353, 3355, 3922, 2509, -48, -2420, -3646, -3619, -2200, 1005, 3509, 4069, 2540, 38, -2484, -3614, -3255, -1550, 972, 3269, 4264, 2731, -104, -2755, -3804, -3058, -1294, 1079, 2988, 3692, 2750, -16, -1960, -4234, -3296, -312, 1310, 3245, 3554, 2305, 9, -2273, -3738, -3220, -1329, 1898, 3578, 3540, 2148, -277, -2169, -3436, -3229, -1314, 1581, 3706, 3820, 2306, -383, -2705, -3271, -2521, -1255, 1648, 2759, 3531, 2007, -1099, -3202, -3163, -3136, -739, 1266, 3196, 3590, 1941, -367, -2861, -3948, -3101, -774, 1407, 3129, 3345, 2009, -331, -2424, -4005, -3135, -488, 1972]
3533A972J850m93j651k311k098j041J002J785L096J746l14j695k957j916o98J067
3549b656K111K101K224m62j468k400k612m93J195J819K400J691k07j629k491k262
3565c139p74J375K480K319J351r29r61j875k440q88J76M116J168K37J088k250
3581A054j765j646j033O80K636K006K486l80l462k706n69j35L53K951J023K145
3597C638m67j260l425j868N4J297K460J518K169k203k40k836j272j411J946J594
3613c06K752O50j225k59l144m08k043J762K946K228J8n55j940j352k391M96N13
3630b258K039K062J625j099k153k036r74J45J741P82J655K283o36k813k528j176
3646c341O86J213J781J416J071l30j619j684l045J54J420L052J851L29L1j930
$$ y = [1972, 3822, 3329, 1678, -633, -2731, -3772, -2770, -985, 2111, 3857, 3543, 1848, -1109, -3025, -3723, -2656, -545, 1556, 3780, 3318, 1850, -550, -3162, -3655, -2460, -641, 1759, 3450, 3243, 1614, -877, -3139, -3913, -2538, -58, 2261, 3612, 2683, 1722, -153, -2593, -3481, -3305, 811, 1979, 2216, 3304, 1054, -711, -2357, -3390, -2710, -74, 1932, 4418, 4038, 576, -2130, -2699, -2834, -2481, 470, 1493, 3638, 3171, 1911, -1514, -3382, -3328, -2031, 429, 1947, 4116, 1913, 1673, -1163, -2435, -3846, -1900, -306, 2446, 3096, 1871, 1612, -1532, -1940, -3983, -2221, 725, 2953, 2971, 2416, 476, -876, -3267, -2771, -2258, -219, 1843, 3468, 2369, 216, -1820, -2794, -2649, -908, -126, 1529, 3812, 3176, 363, -2165, -3341, -2655, -1442, 339, 1755, 2826, 2496, 877, -807, -3852, -3698, -2278, 774, 2625, 2954, 2985, 1055]
3662A055k701j404R0J006K565K266M73q85k122j882j268m97J619K308K056P47
3678C426r28k134j774k109q6K064K423J249J534r77k163k060k078J78J735J825
3694A25J686R60K6j406l481j182L61P86K885Q69J615j496j719k371r60Q6J972
3711a244K207K171Q26j581j887l238r1j59J746L524K61J239j537k624p89k379
3727c555J094J426J306K085J150j408k518j356k5p86J931K028J003P18j18k750
3743B25j431j800L95J360K459J789l25r85j375k188r28K12J480K346J989l3j293
3760A897k193j895q90L50J637K427J666L60j434k500j726p71M38J709K317J471
3776B863M17j224k488j879q72R21J468K246J222J91j216k346j735q88O49J966
$$ y = [1055, -1646, -3050, -2960, -1954, 611, 2877, 3350, 2465, 343, -1539, -2807, -3304, -1685, 623, 2679, 3426, 2498, 364, -1410, -3519, -3605, -1541, 882, 2131, 3665, 2688, 525, -1535, -3613, -3435, -1700, 125, 1811, 2771, 2797, 1391, -2090, -3272, -2911, -2125, 760, 1629, 3244, 1748, 29, -2342, -3302, -3216, -1244, 963, 3134, 3960, 2379, 492, -2746, -2837, -2996, -1250, 2274, 2535, 3774, 2237, -387, -1176, -3555, -2461, -1035, 271, 2356, 3506, 2098, -420, -1776, -1801, -2587, -656, 1372, 2375, 3093, 2975, 225, -1206, -3006, -2611, -1251, 1208, 2997, 2672, 1687, 312, -1876, -2804, -2592, -1112, 1234, 3223, 3190, 1897, -296, -2191, -3081, -2731, -1094, 1333, 2999, 3359, 1925, -575, -2301, -3072, -2634, -925, 1392, 2863, 3280, 2056, -432, -2311, -3183, -2262, -794, 1452, 2674, 2865, 1649, -697, -2432, -3320, -2671, -705]
3792g05K111J193K06j261j619j852j336Q21J815K290J282J09j782j544j793r61
3808c026N52J830K275J016L94j830j908j474o37L83K085J825J367J11j422k302
3824g61j622m63R57J468J844J629m00p97k321k028o11Q26K122J764J230k93j152
3841A392k121j328q31O02J925K214J111l37j437k036j638k77N02J673K351J228
3857B993m23j361j933j673n30P20J684K523R33m70j380j806k044j69J071J834
3873c1J831Q56Jj410k306j645m3J114J478K134N58k9j710j806j295m32R97J834
3891I6K000Q87q31j295j706j595k97Q70K009J925J058q02j447k238j344j14J313
3908a511J874J517J258n34j715k053j176m70J279J646J729P19l55j496j854j459
$$ y = [-705, 1406, 2599, 2805, 1544, -75, -1927, -3263, -2442, -627, 1663, 2945, 3054, 1272, -272, -2065, -3026, -2474, -644, 1631, 2647, 3041, 1211, -697, -2171, -2808, -2425, -340, 1485, 2852, 2963, 1541, -761, -2383, -2846, -1889, -421, 1423, 3052, 2652, 1855, -466, -2494, -3105, -2279, -157, 1607, 2837, 2544, 1392, -729, -2057, -2888, -2286, -361, 1853, 2964, 2627, 1190, -846, -2484, -2761, -2259, -586, 1765, 2993, 2570, 1209, -724, -2397, -2927, -2207, -523, 2000, 2933, 2463, 1083, -723, -2767, -2936, -1865, -31, 1800, 2656, 2657, 1247, -1059, -2704, -2747, -1633, -155, 1979, 2537, 2508, 798, -1008, -2303, -2735, -1738, 96, 2096, 2983, 2152, 857, -849, -2444, -2741, -1871, 138, 2063, 3121, 2319, 872, -1366, -2710, -2824, -1511, 363, 1880, 3138, 2604, 889, -1164, -2340, -2810, -1531, 115, 1844, 2563, 2208, 712, -1142, -2601]
3924b601n2J022K032J696O67o47j828j248j682k22J243K108J749N44q64j407j545
3941a035j561QJ043K052J702O81q18j676j909j099K5J184J906J470Q80p34j589
3958E30j949j257J70J331J919J231P29o70j523k217r87K06J547J613J602M38j071
3975A642j216j721j492K13J487J921J376K55m90k042j403r34j55J361J912J530
3991B244O87j210j565j842r60K99J364J906J405L81q06j710j944p22M04R52K033
4008I16J574J98r45j542k144q75M79J632J931R42Q42j684j205j702j103J89J782
4025g15J904J053K09p81j628j849q03J30J615J996J140N51r03k102j817k67K84
4042a983J267J564J506Nr21j486j939l21L36J461J523J256L01j142j573j593j173
$$ y = [-2601, -2653, -1631, 401, 2097, 2764, 2117, 289, -959, -2641, -2863, -1620, 488, 2237, 2781, 1917, 510, -1035, -2596, -2588, -1545, 507, 2209, 2890, 2072, 396, -1513, -2612, -2587, -1403, 503, 1973, 2853, 2119, 530, -1419, -2676, -2506, -1175, 744, 1975, 2704, 2034, 511, -1706, -2693, -2487, -940, 673, 2275, 2713, 1642, 426, -1295, -2787, -2574, -1087, 834, 2210, 2465, 1975, -67, -1470, -2404, -2559, -1198, 714, 2244, 2931, 1721, 156, -1686, -2646, -2347, -983, 923, 2328, 2709, 1903, 193, -1751, -2473, -2069, -1117, 916, 2490, 2688, 1743, 201, -1943, -2818, -2339, -707, 1224, 2166, 3008, 1324, 119, -1583, -2686, -2497, -715, 1189, 2242, 2451, 1670, 42, -1807, -2610, -2480, -865, 1131, 2271, 2822, 1919, -183, -2000, -2267, -1983, -716, 848, 2354, 2359, 1438, -48, -1987, -2308, -1972, -511, 1012, 2268, 2569, 1427, -146, -1739, -2912]
4059b912Q36J417J972J225M6j105j818j661n38M84J387K104R78J07j335j567j251
4076a631p03L35J519J319J483n7j399j499j475l92K74J818J498J295J44j543j711
4093g25j201o72Q85J569J266J092J5j170j656j359o35Q83J510J691M48K26j081
4110A086j748j325o00R12J215J630J639r76r48r84j865k3R25J343Q99J469l33
4127B316j689r88j343l92Q42O18K212O64p6j258j703j121n57Q07J770J328O54
4144B084R9j176j492j474l72N61J724J809N38l08r76k132n03p96Q43J382J137
4161I48J600o93q89j910j213n40J902J346J189N79m80j452q97j948J6J170J404
4178A32J623N39k84j398j670j442L06O13J708J396Q79j0j570k244k83n38O04J755
$$ y = [-2912, -2076, -659, 1313, 2538, 2584, 1479, -339, -2000, -2538, -2054, -667, 1437, 2415, 2522, 1187, -380, -1631, -2334, -1999, -480, 839, 2322, 2265, 866, -633, -2108, -2500, -2226, -408, 1090, 2385, 2529, 986, -725, -1926, -2598, -1713, -144, 1122, 2214, 2229, 1059, -597, -1956, -2591, -1708, -198, 1493, 1941, 2167, 1086, -662, -1987, -2587, -1675, -460, 1170, 2809, 1833, 885, -99, -1964, -1987, -1062, 281, 1180, 2649, 2316, 627, -361, -1704, -2096, -1254, -636, 1576, 2240, 2164, 906, -797, -1918, -2475, -1668, 102, 1430, 2084, 2183, 1007, -485, -1959, -2331, -1770, -46, 1763, 2301, 1993, 1017, -1115, -1618, -2414, -1571, -189, 948, 2548, 1855, 966, -944, -2157, -2697, -795, 551, 1740, 2319, 1839, 387, -510, -2458, -2442, -1272, 132, 1755, 2294, 2010, 612, -1058, -2500, -2194, -1581, 127, 1523, 2402, 2392, 822, -1422, -1705, -2243, -1639, 116]
4196A16J700M60K48j953j778q83k90Q84J542J731Q53q48k018m66j652P72k90J944
4214G2J748N81p52j641r74j206J95O85J931J654j51N6j601k224r79O74N04K101
4232F73J231J60j07j717j893m51l91R58J875J838k14m77j605n82j672J75J253
4249i46j10K672j91L82j609j700p13R2J294J429J232O54q28j455j489j083M92
4266a877P75J643J432J86o40j457j537m91L18P09J712P19J051r93j472j672n89
4283b183K92J164J431J236J17n37j473j359r78M90J001J843J182k81l62j821j001
4300a239r87K33J366J608J185l7r90j354j452o31N51J090J403R30N11q42j680
4317c35j427q32P51J106K123J148R23k295j132j369j199J387N44J654P69M1p01
$$ y = [116, 1816, 2276, 2524, 571, -1207, -2090, -2380, -1496, 46, 1777, 2630, 1782, -236, -702, -2354, -1582, -1872, 72, 1820, 2401, 1649, 8, -966, -2172, -1977, -1292, 639, 2293, 2142, 2198, 597, -1627, -2606, -1932, -1428, 673, 1904, 2064, 1957, 240, -1653, -2104, -2495, -1537, 338, 2176, 1962, 1485, -120, -702, -2374, -2199, -946, -1056, 1616, 1425, 1807, 198, -1502, -2215, -2123, -829, 600, 1832, 2486, 1658, 203, -1286, -2369, -1877, -1102, 541, 1973, 2159, 1519, 62, -1475, -1966, -1648, -939, 773, 1492, 2543, 1550, 78, -1594, -2183, -1891, -727, 704, 1940, 2057, 1520, 47, -1312, -2290, -1800, -799, 1044, 2226, 1945, 1583, -238, -1239, -2226, -1993, -627, 981, 2166, 2129, 1139, -215, -1667, -2298, -1747, -657, 746, 1676, 2187, 1345, -335, -1762, -2594, -1843, -737, 1386, 2534, 3457, 1162, 30, -1339, -2538, -1151, -607, 1047, 1816, 1857, 1156]
4334A156j189r58q90M74O85J375J488l83q14j066j510n09j00J920J357Q22M80
4351B338k41k561j004l24L2J444J039J175k90O9j182k182p63O97J152K289j97
4368A491P47q70k013o86o16K96J407J146J128k48q33j428j071o39P36J579R22
4385A048J109k90j173j084p80o24l26J897J388J859l54j427k541n24K31L14J177
4402a00J496R07l06j552L94l246J002k8J739J690M16K24k292j890p12o86K339
4419f05N83R87J067j396K68j761q78j81N79J688J516k1j359n43q92r64m62J069
4437a305R83K049K7p47J5j476j371l88O57J914L24O79n7j421l48n02j776J546
4455a197J785L14N74l3j347j404J47p55J012J205L24J013J96j730r89m69q12M79
$$ y = [1156, -33, -991, -1881, -1407, -722, 653, 2141, 1758, 944, -122, -1632, -2141, -2241, -321, 1036, 1858, 2338, 2097, -464, -1468, -1792, -1760, -316, 723, 1898, 1608, 1677, 495, -1687, -2450, -1753, -601, 1688, 1491, 2238, 1368, -645, -1331, -1947, -1651, -244, 902, 2030, 1782, 949, -479, -1550, -2189, -1453, 126, 1048, 2157, 1867, 694, -390, -1170, -1794, -2120, -223, 1165, 3024, 2670, 1243, -1298, -1822, -1591, -1277, -100, 1396, 2303, 1997, 445, 839, -2407, -1405, -1433, 306, 1996, 2412, 2636, 344, -1546, -2258, -2944, -605, -22, 965, 2032, 636, 904, -857, -1735, -1916, -1337, 351, 1867, 1846, 487, -56, -948, -1912, -2374, -1305, -322, 1727, 1754, 1007, 1022, -454, -1825, -2213, -1556, 358, 682, 1361, 1304, -117, -465, -967, -2743, -1197, 588, 902, 1476, 1443, 96, -1308, -1161, -1916, -904, 301, 625, 1638, 1834, 104, -885, -1354, -2166, -1687]
4473a687K600J307j36o96j505q87l8m18Q31M06J801j02m59j81j932n23N28n22
4491a613K448N74O77p15j516p00r65m39J435J423R28K4k12n39k008o87j11R64
4509a032J614R94M17m92j167j744m50K49O95J557O40P53q05j034j375n59l20R82
4527a077J676O89P05n63j189j172r72M54N63J468J050J3l09j209j200n66j34J029
4545g44J533O36M31m92j062j292r58J28J165J214J159j10m57q07j499o20K43J215
4563c17R74Q07M60q81j109r94q69J61J200J272P08o7k13j529j158k30j5J317J180
4582F97R73L59j055j166j032j47J72P47J227M54P11q50j064j480m14M58N02K666
4600A758M74n23n14j249j821j90J009O76K012j18K87p68j126j389n23N75J110
$$ y = [-1687, 913, 2220, 2084, 1388, -117, -1004, -1042, -1460, -629, -223, 1578, 1476, 1017, 836, -1096, -1619, -1091, -1613, 835, 1409, 2086, 1371, -145, -845, -1810, -2249, -814, 609, 1537, 1561, 1349, 810, -1198, -1885, -1996, -1032, 582, 1576, 1993, 1501, 334, -1410, -1860, -1611, -916, 641, 1281, 2034, 1229, 195, -1180, -1739, -2059, -1077, 599, 1288, 1993, 1430, 241, -931, -1903, -1449, -886, 582, 1632, 1645, 1336, 127, -1073, -1639, -1773, -744, 789, 1425, 1856, 1364, 302, -990, -1948, -1820, -655, 559, 1718, 1608, 1151, 344, -1155, -1775, -1532, -317, 657, 1464, 1924, 1043, -66, -1060, -1929, -1768, -568, 704, 1412, 1345, 1132, -397, -1555, -1785, -1800, -483, 697, 1670, 2029, 974, -192, -1224, -1371, -1199, -452, 775, 1229, 1940, 1090, 26, -1454, -1868, -1410, -908, 1758, 2232, 1709, 1195, -54, -1875, -2065, -1056, -380, 1632, 1514, 1801, 1033, -93, -1482, -2005, -1430, -320]
4617c20P59J544m22j252p09j299m38P87P30J102J485m37n74j137j461M45M96K45
4635d56J409N92N88q32j480j455M64o9J119J430L78n9q43l03j756n04M76R90J207
4654H96M91K28q78j065r76k53N75J136J005Q39l78j121r69j205l79Q86J489J010
4672A331l2J37r04n68r60n10L95O74J537R72r1j228j421p55j77L52J026J472L22
4691A572J91j462p14j135k03O53J027J111Q05r7j359p48j283L09O23J477Q04L71
4709A942n25r51j202j24l74PJ056J091k13O84q43j165r25k32J016J187N92J93
4727A214l83l16j541j06o27R71M0J818J80o2j043j576m29P01O70N55N60J322M68
4746B416k336n43r02J12K89Q12J134J326j034q55j772K28k62O48P68J227L17l08
$$ y = [-320, 439, 1983, 1561, 309, -400, -1699, -2137, -1350, -620, 482, 1967, 1530, 956, -181, -1642, -1197, -701, -456, 953, 1545, 2133, 1301, -179, -1634, -1170, -1239, -120, 1310, 1688, 1629, 786, 483, -1273, -1777, -1301, -311, 896, 1387, 1615, 737, -328, -1304, -1557, -982, 154, 1159, 1998, 1620, 499, -470, -1675, -2054, -1168, 321, 1331, 1299, 1436, 532, -36, -996, -1506, -1111, -437, 1100, 2072, 1981, 753, -668, -1423, -1600, -1248, -222, 1250, 1572, 1763, 301, -413, -1548, -1751, -1098, -71, 1040, 1845, 1748, 389, -359, -1642, -1333, -710, 767, 1571, 1942, 1417, 466, -736, -860, -1234, -1227, -171, 920, 707, 1391, 548, -617, -1542, -1774, -758, 429, 1021, 1214, 831, 515, -1026, -1132, -1759, -788, -748, 1070, 1250, 1188, 145, -1431, -1860, -1159, -489, 66, 626, 1948, 2416, 80, -463, -1365, -1253, -964, -152, 982, 2308, 1274, 419, -1353, -1125, -1387, -739, 29, 1256, 1573, 1265]
4764A265q79j277m61l2P44O76J375J75k93j109r52o73K7M91J310R40M85m20j143
4783B49j304m29pP08J219J090M4k8j332j182m85k72J065J378N42J63l78j098p71
4802h28p67L52M28J487P54K15l44j263j114o27M88Q15J013N03K87r3j252o43r13
4821a502M6J019Q89J164M1n23j068r06p55m6J256R45Q88R6o31o84j570k64L03
4840a302Q95Q31J283J04p31j203q56m10K16O48R11J067K26m52j542r26j12n3J187
4859b19J345K70M17j190k89j619k11j45J873L92J5L32k75m78j787K81Q89M25Q05
4878H31O93k24r72p20o51o13N50J188O28P76p86o29J83j003m99L96J165M10Q57
4897A580n0r06o97j164k86N86N94J087M09N5o26p24j330K03o5Q13J439K67L23
$$ y = [1265, 386, -891, -1352, -1384, -640, 36, 1411, 1586, 1293, 184, -768, -1441, -1414, -923, 387, 1327, 1812, 1392, 249, -1055, -1484, -1491, -783, 436, 1526, 1570, 1542, 210, -972, -1457, -1729, -664, 714, 1256, 1419, 1041, -57, -828, -1595, -1243, -815, 672, 1426, 1641, 1297, 34, -1080, -1707, -1219, -404, 609, 1112, 1399, 1306, 54, -589, -1502, -1456, -437, 452, 1616, 1657, 1134, 66, -840, -1595, -1641, -385, 560, 1448, 1544, 913, 229, -1341, -1605, -1302, -407, 424, 1707, 1811, 1080, -123, -979, -1389, -1173, -525, 386, 1453, 1679, 1227, -315, -1241, -1353, -1406, -219, 1126, 1396, 1813, 623, 334, -1285, -1496, -1641, 232, 624, 639, 971, 696, 218, -1569, -1288, -399, 26, 831, 1524, 1300, 328, -392, -1043, -1656, -1106, 82, 710, 1486, 700, 71, 254, -749, -1248, -852, 313, 723, 1580, 1530, 624, -73, -1237, -1523, -937, -343, 744, 1153, 1208, 582, -142, -1472, -1269, -1334, -521, 918, 1185, 1508]
4916A508r98r85o58j03N6J070P49O56O6p33j180p28k57O30P99J133L28k13n47
4935E93q79r05k51Q07L10J310P08n58l92j123j011r8N32J096R05L83j10q43j060
4954e86p80j85Q26O43Q83N41p3o31j264m81j35Q1J259N87O81J01r42j108o52l72
4974a607P03R73Q65L74J18j201n95o70k56J24J016J054N09k53p30j004q86p6M86
4993a056J392O42L28p6j051p93m82l95O87Q43R46N37n87r35m72r17K99M31P89
5012A30Q08P50n33q57q57n63n45Q61R58Q37M87k51q51j044o49j77P09J109O58
5031I80M19k99q82r72m21l62Q88J170L78J93L38j974N08q06m96P62J97J108L73
5050A102J84n44r13p83m45N34J491O51P4m53r12r47l83J05N34J300L02O95m69
$$ y = [1508, 510, -475, -1133, -1236, -1180, -110, 639, 1295, 1361, 628, -552, -1280, -1537, -907, -108, 1025, 1353, 1140, 593, -286, -1191, -1442, -635, -325, 985, 1693, 1135, 743, -380, -1391, -1489, -957, 139, 1044, 1427, 1317, 474, -586, -1366, -1551, -725, -82, 801, 1342, 1269, 638, -626, -1107, -1242, -1161, 98, 685, 1366, 1467, 525, -583, -1235, -1607, -904, 69, 934, 1308, 1426, 225, -370, -1040, -1296, -1172, -156, 898, 1407, 1154, 424, -580, -1466, -1542, -1056, 336, 978, 1306, 1230, 179, -614, -1096, -1491, -804, 39, 985, 1522, 935, 0, -472, -1389, -1090, -659, 130, 938, 1688, 1155, 298, -559, -1122, -1667, -806, 152, 989, 1476, 1225, 374, -670, -1319, -1496, -787, 322, 980, 1399, 1100, 218, -754, -1175, -1537, -649, 521, 899, 1092, 1430, -544, -36, -842, -1338, -576, -379, 729, 1102, 1286, 742, -171, -954, -1399, -865, 626, 1277, 1351, 898, -14, -961, -1344, -1239, -705, 595, 897, 1592, 1123]
5069A123q10j324k70J36M04J125P54K18k79q99q85o75M24M67R82P25J12k03j010
5088A15j113k47n7P46R95N70M62q11q49q85k33M8Q50Q76O90L30l43r23j288k06
5108a273J49Q49O51P40L98m67r82q89l84JO40J192N05lk68r28j072m58L84Q07
5128d08P40J195n63l07j348j96r06J102J16J600l44R13l88m77j931m42L45J015
5146b84Q27N26K51l16j019j023m62o2J818J44J081k65l91r06p02o22K18R32R42
5165F87L90L49p67p39q22k21L59N06P24R34m58n24m07q66k15J37O66J080O43l38
5185A118o20o65p89j97L73M52P08R04l58m74p19r70PM74P82P88K93r4m75r80l82
5206h24n47N98R38P76J63P2q43p17o87j48N65M88Q85O18j80m80q08j148J23L81
$$ y = [1123, 313, -1011, -1281, -1145, -741, 384, 1138, 1356, 1077, 178, -707, -1382, -958, -491, 491, 1216, 1328, 1125, 115, -998, -1245, -1302, -556, 439, 1009, 1471, 660, -189, -1074, -1307, -1259, -409, 467, 1157, 1487, 1144, 221, -1067, -1273, -1124, -275, 376, 1116, 1514, 1047, 65, -824, -1208, -1207, -567, 625, 1130, 1127, 859, -69, -1141, -1599, -1215, -408, 332, 1527, 964, 657, -691, -887, -1793, -691, -575, 1025, 681, 1594, 1206, 729, -1202, -1644, -1299, -284, 543, 1069, 1320, 1004, -15, -1038, -1500, -1562, 256, 400, 1481, 1216, 825, -81, -783, -1405, -1187, -255, 687, 1077, 1426, 659, -80, -902, -1123, -764, -258, 466, 1400, 942, 418, 11, -855, -1070, -933, -267, 813, 1456, 1118, 498, -167, -956, -1153, -780, -328, 380, 1284, 926, 452, -267, -1237, -1230, -756, 26, 814, 1107, 1013, 538, -442, -824, -1371, -773, 165, 941, 1104, 1176, 333, -384, -1071, -1219, -654, -166, 719, 1337, 1157, 677, -131, -1279, -1156, -775]
5226g75R01M40P07l19n03r09m29o21M06J358N38O58k97n77j344k97m18O39P15
5245a27Q43N27m94k81p05q30m7O45M48J100K84l10p58q46n80R5P11O93L85M89
5265A242l32r15l52o39N0L13K79J236N44n17l21j667p3j47M75R48J282l69m11
5284F26j98q09m28k50K48J142J031o67Q81j564n03q04R19Q3K67P18L08n20m98
5303a8q83P20q53J794n87K32P08l08r79r46L43n04Q48P45P06K94k46j239l25l97
5323h95k07L05J052N50K49l0r86p11m59j77Q44P80O91O2k29o47p62n57R5M13R27
5344C08P15P7k74q34n70o73J29R17P61M12J68m20o08o30p70O72K44Q16N24K61
5364A225n13o76o87M6l8J85Q72M34L99m76p16p73m06J2O10J192j6Q7q7m87r72
$$ y = [-775, 126, 566, 1273, 954, 451, -458, -887, -1508, -1102, 256, 794, 1452, 1155, 578, -766, -1063, -1481, -842, -127, 716, 1243, 749, 468, -237, -1067, -1114, -469, -21, 1079, 1363, 1053, 295, -551, -1131, -1036, -325, 368, 753, 1242, 910, -5, -357, -996, -946, -633, -354, 882, 1426, 909, 588, -1079, -1152, -1299, -824, 124, 1406, 1037, 626, 428, -381, -809, -1059, -811, 331, 1362, 695, 1576, 12, -491, -1295, -376, -293, -26, 692, 1000, 480, -18, -901, -181, -1034, 760, 173, 405, 1113, 805, -174, -1120, -777, -1281, -433, 312, 1018, 1312, 1066, -173, -498, -895, -1102, -797, 255, 805, 1054, 1024, 38, -673, -1132, -1309, -465, 315, 1006, 1068, 839, 192, -570, -1127, -1032, -619, 308, 1023, 1100, 826, -8, -578, -1251, -1122, -205, 556, 968, 1136, 716, 108, -522, -1292, -620, -376, 440, 964, 1225, 712, 36, -651, -605, -643, -458, 414, 848, 1247, 771, 55, -718, -1124, -1112, -502, 690, 674, 761, 674, 187, -785]
5385g85m63n3O17J124O08j76j97l44j199j66j8J024M00N57k9l03o69n09n75j4
5405a170P26R61L85M16o05p23j182j30N23Q77L97M88L76r12n17p20k00N9R04M99
5425D52O46M1p02m54n59l48M4Q48O71J03K20o18r64j17k89L33N90L20P55n51o60
5446b39M30j031j59oK98J311N97N6j147j2o15m80J7J538o91P95J75O8p23j013
5466h31j98L03O64M26O54l0n57q13m71R4J66N18L56J086n96m98o57j199J028M23
5486a32j38O12L31P14n52j318n03j22O28o3Q45Q59l9p17o22n32m01N44O92O45
5506G31L43j47l63r74n15J44j9R01O81J37P2p38n25p41l4L86O60R63J56j15p00
5527C03p90m10p7M96L97Q88L54m37l68p47n64N3L66N34O97L00m0r22m49l28j31
$$ y = [-785, -1248, -1301, -684, 440, 1048, 872, 675, 331, -868, -1034, -1052, -28, 372, 929, 900, 597, -72, -581, -1156, -1170, -444, 517, 902, 1318, 713, -10, -1192, -1322, -799, 78, 475, 963, 1339, 427, -90, -810, -1010, -951, -47, 452, 1098, 1139, 437, -17, -576, -924, -880, -32, 639, 742, 962, 344, -620, -737, -1026, -693, -103, 217, 972, 421, -239, 191, -840, -999, -1005, -707, 604, 1201, 1257, 110, 98, -517, -997, -980, 558, -133, 662, 837, 905, 182, -831, -1029, -726, -62, 364, 1018, 988, 431, -382, -853, -759, -593, -75, 281, 1367, 771, 273, -384, -1583, -555, -132, -270, 342, 673, 1387, 835, -483, -986, -1108, -480, -543, 302, 1161, 1122, 405, -217, -749, -1150, -606, 86, 731, 1074, 927, 564, -410, -925, -781, -800, 101, 782, 919, 991, 253, -272, -1013, -1047, -661, -1, 962, 1118, 1003, 303, -487, -897, -974, -478, -81, 807, 1161, 724, 356, -391, -955, -902, -536, -2, 695, 995, 955, 33, -416, -744, -875]
5548h75M21M71M85N90m23j96j048m28J81L15J026L28K41j30j121l93p4l82L42
5567f70P67M66N87l87n98p18l04l5N12O61M04L18r4p88l82j024L84L41N07O91
5587F38L76l05o99l77l71j66N78O33O24o0l87m40m93m20L5L13R43L31J08O4p19
5608B06p33l13KK32Q73N20K10o05l75p29Nk02J66P30O27J72j05m38o73q39K37
5629a032R40N86M13R5m40m82l91m90N8K37P35O86j29k45n48n39m16l4Q08N37M32
5650G81J57J5j036m37j87o7N04L5Q11k00N4n08j58m96k20J081M83J0L58l47m55
5671A78p30j03o2N07N21N64k66P3o48n74l96O6R17L21K91K26l46p08o39JJ91L78
5693b38O06K69L60o38o51m17n35L35Q17L93O35q6m49o88l33m07O14P7P39L85J59
$$ y = [-875, -454, 17, 502, 1092, 669, 473, -575, -1003, -822, -507, 519, 847, 1088, 958, -163, -556, -630, -1012, -670, 97, 563, 1150, 763, 165, -553, -857, -892, -380, 281, 685, 1003, 909, 121, -261, -1285, -901, -560, -53, 638, 1014, 709, 10, -367, -738, -904, -326, 307, 931, 871, 484, 44, -449, -869, -834, -521, 422, 753, 861, 925, 206, -527, -840, -838, -606, 267, 787, 997, 392, 17, -712, -707, -909, -743, -13, 614, 786, 681, 243, -430, -1269, -1032, -92, 494, 907, 1002, 562, 80, -311, -801, -743, -506, 229, 915, 786, 541, -7, -546, -962, -996, -188, 349, 781, 938, 953, -83, -520, -707, -774, -270, -235, 576, 376, 430, -78, -236, -732, -952, 129, 612, 622, 980, 633, 178, -552, -655, -717, -210, 311, 875, 609, 682, 34, -540, -936, -870, 47, 368, 659, 885, 539, -169, -808, -807, -616, -238, 368, 637, 997, 359, -292, -709, -1244, -909, -92, 301, 936, 850, 401, -287, -620, -1027, -413, -336, 403, 788, 947]
5714I47o75n13l96l6K62K55M71L70L03l93m04o07l07n5M13R59J44M71j025m55
5734b71m28m08M07O49N68M64k58q6r21j78m66M23K23P04N21l15j30q59m92q4K83
5755f54N39N52P53m87k30o08n92K2M5M06J035N3j42n29n45l21J4R9N21O72L86
5776I89n07m60l7o69J2J37M86O19K06J02p67k51p45k95P78K02Q33L16n33O7o98
5797b15p63O9J93O83L48O93n28j94m43o83j0Q4N38Q80K89rq46m52k20k50M78M04
5819D6P78j77K72l98n78o63K22M73K5L43P54m11j33q90L9j9k84J277M67k56l57
5840E30J79q82p48J52k26P74N95O90k79o84r62J3l60Q33P66o1Q38m75j87k13j079
5861g86M65N5M28M46N11n58o56k12p53L36N22N82n68L54O72l91r41l01O13oK47
$$ y = [947, 272, -241, -637, -673, -411, -156, 315, 685, 988, 595, 191, -416, -723, -778, -365, 594, 738, 1209, 184, -271, -699, -1107, -700, -51, 517, 981, 723, 637, -284, -462, -928, -505, -282, 422, 943, 628, 498, -361, -853, -937, -654, -115, 437, 1190, 703, 473, -135, -727, -705, -660, -254, 781, 834, 692, 163, -382, -703, -689, -590, -69, 603, 989, 482, 22, -15, -684, -672, -535, -49, 570, 776, 878, 111, -140, -885, -1180, -402, -200, 633, 949, 416, 483, -215, -978, -909, -716, -33, 315, 1008, 480, 286, -157, -840, -850, -766, -228, 652, 941, 932, 86, -366, -586, -836, -358, 46, 824, 647, 919, 521, -57, -720, -498, -25, 0, 343, 1097, 686, 553, -337, -298, -317, -601, 676, 1143, 887, 530, 709, -173, -921, -769, -995, -221, 374, 1064, 785, 101, -861, -848, -1208, -375, 391, 330, 1168, 693, 506, 293, -786, -321, -266, 162, 608, 1119, 561, -95, -307, -1060, -724, -202, 380, -188, 166, 838, 447, -494, -795, -182, -188, 59]
5882E9J270m39j073j29k83L47j237J063L37P82m61J005r49j76n07n82J469K69
5900G65l09K75N09j459O5p23j29J49M81J439j17r74j62o57Q9L16N24j66J002k82
5920F36N7n27p77m15J19J286k6P15j10p75m23n33l03J326n22N14K13Qm10p5J58
5941A36j362O84K77J058L70j26K54j306q37P31j430R81O16N50J004j328n73j06
5959d07j437J008R91M38M93r69J112j409j3j511R28J030J257r60J66J47j270k02
5977f08l5M19J1O15M6L04p28k75k69m51J50P67O86L3l3l86j36q21k94P47K64N66
5999E72K38j60k68o65l41K1o2M23R06K28l18J7p04q39M68k29N85N35M23R4p69
6020A55j83o84pP54o98J167o1O76q66j141m01J409J03M3J31L01m45j41q40O49
$$ y = [59, 1329, 890, -183, -312, -595, -248, -1485, -422, -85, 697, 236, 1241, 292, 116, -391, -973, 496, 765, 456, 731, 1240, -219, -154, -877, -1006, -857, -376, 1063, 946, -28, -190, -847, -758, -442, 82, -84, 918, 636, 693, 166, -611, -1026, -907, 379, 353, 1068, 958, 183, -240, -773, -1076, 250, -272, 242, 455, 463, 53, -22, 136, -1226, -542, -265, 793, 1163, 1037, 1291, -15, -852, -121, -1551, -570, 46, 596, 1600, 272, -301, -407, -1844, -836, 155, 593, 1086, 117, 1229, -180, -193, -1704, -776, 254, 1511, 551, 717, 864, -406, -608, -643, -224, -213, 402, 448, 752, 24, -251, -520, -971, -821, -54, 632, 665, 632, 246, 110, -711, -1005, -258, 6, 572, 810, 650, 382, -283, -624, -603, -665, -242, 664, 892, 574, 591, -113, -952, -484, -713, -128, 407, 830, 924, 155, -28, -712, -719, 35, -663, 504, 443, 1119, 253, -888, -1289, 120, 223, 266, 397, 698, 253, 112, -728, -79]
6040g9n21J11M70M24N95k0p15o21n82K96N7M93J023q8n61k60k31m27l82N28J66
6061c24J941j121J68o99n6mp88J83J49J110j49L34o33k71n78J88L91J57O96nj45
6082E44j93o59m43q4L45O34N29J16j50k50o52o46K63R4O16N32Q4j08l07m82l44
6103e61l24K86Q62L54J61l20k91n10l34q1K77P35K40m1J42m66m72j77j52K75P16
6124C19L24J69m89k74l98m20K55L4P10L49Ll2n85j35n25M9L09N85Q0M58j80o64
6146e8k80n50K59N95J63M43L89m78m85n86o0j32N16L10J63L46Q7j020k03p5k19
6167h75M56P36L39k11Q5o54l93k75J32L34O23K35O7L6o47o40r0j1N66J30P63J61
6189H67l24p53q4j65m3K55P08J13L93m23n45k87l79n1M35M11M81qn90Q0n66k05
$$ y = [-79, -600, -489, -19, 405, 1000, 980, 265, -356, -938, -642, -585, -92, 931, 843, 282, 22, -209, -636, -1018, -490, -324, 1617, 496, 664, -35, -91, -95, -883, -700, -551, 559, 410, 744, 111, -160, -738, -550, -159, -2, 694, 689, 544, 351, -308, -751, -835, -490, 144, 673, 789, 639, 389, -263, -909, -646, -552, 64, 596, 680, 572, 265, -217, -561, -885, -599, 263, 617, 778, 458, 167, -343, -677, -758, -481, 254, 494, 453, 595, 129, -343, -520, -672, -397, 319, 643, 812, 323, 49, -349, -769, -514, -480, 230, 579, 582, 550, -35, -170, -695, -646, -337, 248, 328, 786, 606, -58, -338, -888, -629, -34, 129, 572, 961, 483, -2, -588, -648, -780, -264, 46, 209, 555, 642, -378, -581, -656, -875, -419, 317, 656, 445, 530, -124, -517, -792, -660, -326, 297, 532, 599, 635, -12, -652, -742, -753, -187, -57, 706, 867, 543, -210, -294, -459, -502, -247, 461, 574, 967, 544, -1, -288, -667, -718, -283, 128, 609, 601, 11, 91, -475, -680]
6211f80J41O51q7N18k6L7o14n62m2K1N57K20O78k67k45q5m99j15j81L98M92K28
6233E38K07l6n61o02j36N4M46O90l38M25k06m73p24J54J39M06P26Mq6m16k07n31
6255e27j61J65J95N67L77J2k70m18m57j61J86N46K45M65k30l08k26q29J71K15
6275d43K91N13N56n29l54o4l60KK9L51L17L81K9o15j59n42m8K23N26J90L36j01
6297E29j29l95n53k55M90j5P86J47j2l95m36j48j44j40M72O99M3K26m54m45j14
6318b43n58M92M49M28R8L8n87n40k15M5M79N6O81j84K82m99n82o4j73k03Q00M77
6340D77K22k45l91l52l20q7K60N81j5O31k60k96m92j65j03J94L07M58M03k48k81
6361B78k20j67o30K82M57L86L84k28m60k38o71L22Q0N20L05K1K47m93m25m91L04
$$ y = [-680, -539, 112, 25, 543, 517, 554, -60, -622, -664, -643, -86, 134, 812, 545, 300, 215, -284, -399, -580, -182, 310, 538, 745, 709, 148, -454, -590, -536, -90, 600, 262, 687, 481, 8, -716, -562, -423, -17, 709, 713, 627, 211, 4, -527, -688, -523, -328, 239, 616, 628, 358, -60, -517, -678, -492, 54, 299, 764, 534, 226, 0, -829, -658, -443, -152, 361, 917, 388, 34, -30, -390, -388, -359, -8, 309, 690, 719, 104, -55, -597, -645, -422, 104, 294, 630, 529, 400, 5, -548, -803, -313, -328, 458, 605, 593, 198, -238, -386, -530, -670, -198, 501, 544, 770, 316, -129, -243, -801, -309, 140, 568, 666, 704, 117, -423, -638, -593, -114, -58, 623, 439, 721, 222, -360, -424, -597, -800, 0, 477, 699, 454, 63, -289, -609, -696, -436, 145, 130, 761, 501, 205, -287, -452, -555, -361, -54, 404, 807, 559, 278, 58, -109, -739, -457, 0, 386, 770, 542, 82, -156, -827, -505, -425, 95, 400, 421, 668, 175, -250, -741, -437]
6382d37L41K99M51q3n9k63o17k92Q8K04K42O78K04nm89p76K6M8J60Q36l4J27j89
6405D60K9j219K53k02M92O73k32q4M18m13m10n95O95j67P22P6jq6m77j71l48m8
6427f35L90L38M08K59l87q4o61k64R9L46K46K74L47j95j56p33j18j17M74N59K10
6448F00L0m3m98m29k00J44j91P40J55J08n3j94n10o52N25R7O83K74J47l82m87
6469a36k37j02n9L03L27M15K91m19j52n10l89K79J39K27L98j34l4j70n76kQ2R3
6491c66O85l2M54l23m06p71J43J57L04M93M00l61j88J02n54l79J23N94j32N50
6511D93K77l03k99q02j64K53M19L22L40Q2j40m03o33j55K66J31M66N70l32j28
6531B60j83o74oJ92N89O4K90J1l36l83n22J55l0M97K94Q6N06n31j19q93OJ13N60
$$ y = [-437, -96, 203, 654, 571, 512, 249, -368, -660, -572, -368, -126, 552, 756, 751, 262, -514, -488, -440, -280, 556, 522, 649, 460, 489, -730, -477, -679, -187, 486, 254, 170, 588, 175, -235, -830, -135, -302, 420, 496, 495, 409, -68, -239, -587, -635, -245, 93, 501, 760, 373, 289, -372, -636, -537, -191, 55, 329, 676, 481, 325, -408, -526, -643, -169, 390, 600, 630, 587, 89, -340, -540, -396, -587, 153, 308, 416, 363, 169, -341, -993, -468, -371, 312, 586, 733, 351, -136, -373, -475, -534, -231, 96, 511, 802, 383, 231, -279, -668, -389, -250, -23, 375, 241, 207, 37, -539, -541, -459, -366, 319, 287, 741, 418, 12, -759, -616, -459, -155, 338, 738, 377, 189, 291, -263, -642, -519, 75, -57, 493, 770, 467, 168, -634, -798, -545, -126, 196, 536, 618, 478, 75, -558, -713, -447, -316, 150, 720, 388, 260, 77, -597, -603, -411, 178, 242, 532, 543, 207, -176, -698, -543, -573, -76, 218, 304, 810, 279, 160, -733, -727, -614, -54]
6554e4M03L20j21k03l55l36j87L21o22J009N04L1q4n06j78p20O55n3N88k66O19
6575G65p77l52k68Pm8N64K55O08j93k41n91j22j74L93J47L41K01J26o32K5o39
6596f05R5k28J322o0Q0k91N0o34m60K88N27L25J59j093J505o00j005J93J56J12
6616a64J0J22N13J84m62l30l28J37j28M63N09J39J9m20m44j78j50J48N62j36L91
6637D57P5l58o06J54k44L61K14J58J24j9j59n83j2Q2p3M78M68K1m18J58n07l15
6659e44J21rN12K27r2p1J60m47l76J6L45J93M23l68N39n63j27m77J6O02j92O12
6681E00k27J80m85J5m76m4L24J52O13j7J47o74j13j68k74L13L46L18Q0k72m29
6702a91J20n71M83P2J48N98j85k65R7p82l2J1J92L35L03J05k34l62j60k48p6M61
$$ y = [-54, 349, 669, 548, 345, -10, -346, -533, -212, -834, 175, 679, 710, 626, 120, -58, -778, -123, -176, 412, 146, 765, -12, -364, -632, -625, -673, -109, 146, 754, 561, 320, -271, -393, -567, -174, -27, 314, 515, 641, 9, 34, -605, -510, -738, 584, 524, 604, 313, 363, -271, -731, -443, 84, 409, 568, -525, 980, 380, -625, -432, -276, -164, -154, -32, 481, 665, 203, -127, -455, -318, -446, 17, 526, 665, 684, 264, -180, -358, -508, -360, 202, 66, 457, 532, 174, -432, -278, -522, -161, 53, 211, 335, 316, 157, -426, -438, -356, -429, 49, 517, 538, 120, 278, -229, -544, -423, -432, 80, 307, 215, 144, 304, -143, -519, -503, -158, 35, 458, 90, 629, 66, -61, -538, -522, 80, -112, 500, 273, 453, -32, -17, -493, -537, -213, -61, 552, 535, 682, 8, -105, -273, -547, -234, 112, 430, 510, 238, -191, -71, -642, -159, -87, 61, 659, 474, 209, 306, -476, -508, -497, -305, 30, 333, 438, 204, -158, -318, -566, -642, -181]
6724a81L18L25J07k74k11m96q2O4O2O43J43O6k90R3o23k00M1J60L01M72j50K58
6746E46n32k15l16J89J31L80K78kn9j34q02J15J30L5J49N18j32m9l27m53J02L1
6768d17L13L29p5K35J24m74n05J45l60O17N26M6j03r2n29j35l0l5J84M37K97j01
6790C97k6n27l36j69K04K61N41J81J25m90j61n18J2J34O55p3QL25l72l12l95L71
6812a65M2K69L28k03K56l71m47J98k79O6M39K02K17P4p06J17m59J05L81l6K14
6833B42L70Q8l68l50k13k47J1N19N05k07J59l03m24k26oK88L46k01L55m2j68p2
6855E6o09Q2J70J16M29L22k25l42k35k68J4O2K55L72J51J55m83l03j42O4R1K04
6877f4K05M90l28l63m13p0J31K65J12K75M9k1j01k35j85O4j21K63K36M10l53j86
$$ y = [-181, 137, 462, 569, 295, 84, -412, -494, -430, -368, 275, 418, 484, 194, 287, -336, -536, -495, -335, -34, 438, 288, 546, 14, -201, -517, -328, -197, 183, 461, 459, 400, 266, -536, -421, -291, -256, -107, 411, 279, 230, -97, -550, -448, -417, -104, 225, 150, 385, 509, 35, -470, -325, -685, -68, 458, 504, 401, 309, -220, -355, -385, -420, -236, 201, 498, 397, 371, -156, -492, -661, -457, -196, 345, 526, 651, 161, 0, -518, -506, -372, 283, 210, 218, 543, 171, -141, -536, -165, -123, 146, 474, 271, 527, 156, -291, -93, -372, -306, 133, 335, 552, 626, -80, 37, -422, -317, 64, 28, 242, 612, 700, 332, -18, -231, -478, -467, 52, 557, 350, 509, 206, -218, -444, -450, -162, 184, -17, 338, 296, 128, 56, -553, -471, -301, -185, 244, 566, 341, -1, -236, -504, -490, -428, -173, 199, 350, 505, 22, -281, -423, -359, -268, -64, 141, 631, 303, -60, -473, -543, -412, -147, -35, 240, 289, 268, 167, -68, -253, -189, -310, -47, 189, 599, 246, 60]
6899F0k08o0m3j25O41p7M44j57k09k81l62l9L0L54M77k13K27k63m24k33j4L59
6921a16K04K22M9q2j71l40j90j05L61K49K34K38l13k9m71j77K7K6N27M39j24j10
6943C48q2n59P7k68N07K69P4L54l05m92%k65k23L54L36J42J53Lk20n61j00K00
6965b58j32L15J55K96K7k58k93l55O8J02N55k9K31l04J5l00j59j02M4L51K24J30
6987C23j66k08o4k76O5KJ57N71K7l05k0j66k10J09J20K96K46k18j39J67n28k15
7009d32J4L15K89L85l56N1j62j14Q5k22L9J49K88m4J3n12O0k53K12K04j12K50
7031A47K32j09m01n18L93O5K49N2J80J89l41l67j36j4j9L43L05J65j36q7j35m83
7053d26K64N1m5L25J72J55k05k29k42k95M77k53P30K81j83m26n52l0J88RK55L39
$$ y = [60, -148, -208, -251, -376, 265, 188, 632, 475, 266, -15, -377, -416, -386, -32, 445, 232, 459, 196, -228, -461, -475, -116, 88, 310, 359, 277, 106, -234, -424, -529, -168, 81, 315, 553, 240, 211, -260, -437, -410, -384, 143, 582, 458, 348, 266, -293, -216, -484, 23, 292, 366, 720, 415, -77, -77, -342, -565, -211, 125, 267, 420, 423, 203, -358, -458, -258, -390, -75, 80, 376, 403, 145, -148, -503, -435, -333, 222, 193, 424, 120, 135, -165, -324, -426, -382, -31, 193, 323, 157, -51, -115, -391, -326, -324, -167, 404, 431, 126, 106, -60, -270, -161, -41, 255, 501, 283, 144, 311, -217, -432, -418, -103, 186, 571, 215, 266, 104, -10, 75, -147, -108, 41, 329, 285, 298, -214, -154, -407, -195, 9, -103, 147, 379, 270, -131, -649, -256, -191, 58, 110, 290, 479, 138, -229, -365, -379, -398, -55, 250, 415, 279, 192, 57, -426, -162, -111, -156, 169, 341, 496, 291, 62, -180, -475, 2, -251, 479, 760, 577, 151, -401, -431, -243, -234, 21, 360]
7075C60j96K86j49k06n69Q1k04K92M68p3J75l41r4k06j33N73p44Q07N4Jj17m31
7097c66L04l84J039n27K66j19M39o50O57r11P6M58J94J45l54j43L36p53k85O38
7117F0O5L06L67m09n1K92j68q34Q93l18j75L61k3q97K86K9l66N50J33Q6l36L48
7139A99M71m73l38q3J04L93k29k37K03M42l78k28KK64j58m3n5P53m34j66j27l79
7161d97L06L2L38Q6J30M3l23p2k39k17J42J91J53K37K03l47l31p4M9Q4L59k9P0
7184B94j39k23l21K33j19L22J01K3J86j01l87n9m6N7L55j02K50k73L3R1l02l2
7206a59l34L63K07r8J57k74L79m56n0j2K89rL77n30N40k45m42K34n04M44L89j97
7228F9J37J94l29J43l41k4L19L39m87K77k35j98J03j38k68L16L05L28k8k42k02
$$ y = [360, 164, 450, 301, 95, -474, -393, -597, -305, 163, 90, 265, -76, -170, -376, -509, 64, -680, 127, 181, 182, 65, -366, -62, -446, 593, 66, 332, 213, 652, 2, 659, -252, -176, 282, 476, 621, 267, 124, 460, -293, -578, 60, 125, 431, 798, 389, 338, 630, 462, -372, 521, 203, 28, 389, 366, -531, -245, -216, -582, -32, 101, 187, -149, 199, 670, 197, -141, -224, -120, 273, 44, -193, 10, 452, 74, -154, -152, 112, -46, -89, -144, 609, 175, 9, -118, -497, -191, -159, 179, 265, 395, 438, 115, 43, -196, -413, -271, -80, 73, 310, 513, 166, -165, -239, -190, -106, 253, 224, 294, 155, -68, -389, -156, -275, 47, 148, 171, 357, 256, -131, -190, -236, -179, 176, 74, 324, 51, 84, 175, -127, -159, -493, -130, 77, -21, 136, -138, 241, -215, -265, -277, 12, 3, 380, -150, 390, 145, -297, -63, -567, -123, 266, 69, 206, 400, 71, 214, -127, -151, 168, 507, 20, 297, 62, -136, -33, -171, -439, -123, 182, 510, 482, 240, 38]
7249C8K7k75L6J62M25K26l99m5k51k38k8J46q0N22J25R9n49l9k79K81k1O7K32
7272A82o1K87l05n52N01L15j19n5K65k57M94q35K70n25N8K01K47J80K36j3l04
7293B10o7m14J07k66R68n45O65o68J49o7j25o30Q58j33k67P16n13R51j001k69
7313c41n18K32M53J47J85O45j296M20k37q7j00M52N05l84K55l87L01j04n04P69
7333D06k59j9M39o41K18K57r55N5j37O53oO51o04K59q0n65K23k75N01K21k5q2
7355B35j33j55q9k13J79o7K08K17J47J4l07j50o3j2L88R8j41K18l0l54j63j28
7377c01R9K59N5J65j23J24k93j70r7L36k34M06o8M09l64k96k52q0J86K50K69k84
7399dL36l27k16o4j23J47N68n7j0J40k24k29j47L33l42K78O8K12Q6o61J85j21
$$ y = [38, 65, -210, -174, -12, 413, 639, 240, 195, -56, -294, -322, -176, -256, 266, 391, 490, -59, -98, -377, -96, -117, -50, 182, 121, 408, 103, -449, 52, 367, 248, 193, 458, 201, 695, -140, 130, -395, -337, -136, 111, 291, 527, 514, 210, 143, -271, -164, -430, 538, -7, 658, -10, 139, 72, -53, -683, 175, 42, -225, 491, -22, 929, -72, -341, -859, -627, -174, -27, 158, 803, -493, -73, -310, -397, -497, -45, 460, 76, 331, -56, 245, 141, -363, 406, 147, 128, 567, -74, 144, 401, -554, -499, -636, 17, 11, 662, 58, 317, 237, -328, -105, -380, 121, 342, 317, 235, 102, -53, -142, -355, -176, -243, -35, 182, 329, 343, 36, -114, -177, -189, 199, 297, 156, 374, 344, -10, -173, -301, -202, 57, 112, 277, 154, 278, -15, -185, -282, 54, -180, 226, 158, 567, 203, -93, -345, -425, -239, 11, 280, -4, 332, 5, -211, -275, -398, -251, 317, 260, 250, 390, 166, -63, -210, 123, -219, 59, 127, 339, 425, -236, -51, -172]
7421a72o2l29R04j5n64M61M48r30m52K17K44N52j10J42o5j11j56l10K43P1M8K04
7443B58J5k92P5m18R2k56M73l6L81l42K62l00k48J83J46J95n0K8J18k15m72K80
7465a23J0n5J28j8K54%Q0j69l85r2kJ63N84O6j07P1n55J47j31j62L87l64N78J40
7489D45m26O7j83m7j69L79J86r9n9J79n60L35J91m80K24o1L01K31j74n45K47j5
7511c3m17M94MK36J29l78j78J61p2m9L2L19lk8k3l28K33j02k23K76O9K32j46r4
7535A11q0k96K98P8l77L62M78l60k37P7n38K22L69j7q7M9K81q3J2n15J40j21M62
7558B28j26j17K01j67J5m03J96o8J13K38J80k02J98n09L6k72N45k69J09M94k37
7579A83Pl76K11j42r0K20o3L34K4m29J14l3l5k2J74Pj86L40j38k15r0J20k82J01
$$ y = [-172, -234, -563, 341, 326, -238, 223, 671, -259, -711, -494, -250, 302, 192, 334, 269, 158, 2, -308, -65, 6, 54, 258, 273, -19, 56, -362, -270, -526, -53, -89, 292, -50, 212, -88, -336, -153, -7, 188, 138, 166, 284, 69, -403, -123, -113, -168, -40, -58, 196, 196, 276, 107, -278, -370, -372, -209, 375, 441, 334, 405, -150, -3, -134, -296, 91, -273, 305, 445, 19, 86, -97, -144, -313, 66, 252, 153, 94, 273, -287, 48, 239, -241, -17, -78, 223, 454, 280, -265, -18, -33, -450, 44, 48, 284, 413, 35, -143, 18, -54, -103, -71, 248, 245, 217, 194, -134, 99, -3, -226, 50, 119, 351, 205, 111, 31, -265, 33, 111, -266, 96, 574, 214, -23, 54, -484, -262, 107, 90, 3, 52, 333, 250, 262, -253, -113, -234, 228, 102, -15, 186, 19, 34, -369, -173, -241, -128, 110, 290, 88, 286, -223, -187, -459, 86, -183, -74, 420, 183, 190, -186, 25, -117, -207, 13, -50, 284, 308, -121, -7, -40, -75, -97, 77, 84, -102, 238, 100, -115, -205, -85, -367, -266]
7603b66M87R6j25k09J41m22L32j18J2J39j17L31k12j76q2k38N57n3P9n8q6j9j02
7626a09j49K75l9j87O05k40Q2m06K59k33R6N4k4J76no7j77K17j52J19K2M2K32
7649C91k61j63J68k13o0j53M34k8J0J99l54JP4l32J87l1R2J04j47K2K29n61M17
7672B5l35L71L80k53j18J88n92L56k86L4K93q5J88J72m75j21M66l25L3J41J29
7693A86K6K89k39l17k14k32L67M01j93K64k00j4j03l83P8J01J51J63k28K83Kj09
7715G9l3j04j33K33j7K59M1j15n2k36o8l67P64k51J80J77l92J00k48J42k14P7
7737a78Q7K84r2Jk39J0r2J89J08j82J58L34l32m06l6j58j86P35n50J111p97k96
7759e27M87k35K39l02K85K9M44m16l9k07L3J24LO4L1K40j01j38k78k9p0K63K17
$$ y = [-266, 221, 317, 192, -17, 124, -298, 34, -84, -72, 67, -50, 281, 69, -107, -189, -427, 130, 77, 156, 98, 12, -7, -109, -258, 17, -22, -209, 396, 156, 238, -168, 91, -142, -46, 8, -16, 160, 155, 88, -89, 128, -24, 95, 117, 159, 391, 130, -33, 135, -78, -138, -291, 143, 115, 125, 324, -30, -29, 45, -287, -100, -131, -39, 65, -82, -60, 169, -392, 25, -310, 61, 441, 188, 70, 258, -334, 22, -264, -230, 63, -22, 166, 338, -137, -258, 208, -117, -84, 57, 186, 212, 501, 262, -55, -269, -501, -134, 267, 74, 338, 138, 124, 21, -362, -284, -183, -32, 131, -97, 186, 188, 79, 46, -58, -191, 42, 25, 284, 325, 210, 158, -78, -146, -513, 251, 0, 180, 357, -35, 65, -183, -41, -255, -178, -91, 193, 101, 102, -137, -127, -219, -30, 78, -104, 54, 388, 56, -350, -386, -544, -730, 5, -545, 566, -231, -527, -40, -275, -36, -338, -53, -24, 420, 4, -35, -242, -209, -85, -82, -18, 13, 253, 152, 14, -264, -293, -363, -100, 117]
7782A17j07J31J98l90oj5j1r7K09LL13j66j07l80J81lnJ73j05K79M5k43j61K51
7806A04k03k2k0L70j95l7n3J03j2p05Q87l05J16M12k30n2J05k20m18M77k48O67
7828E21K96n72N97o15l21J80N04j46p3l70M8K64m84N6K64j28N2K77k13J24l25
7849f4N0j83M8m6M71m90O2J79l64L36p5L7m10M21j92M43k66k8J1n3J64k64M74
7872B61m60Q2N17m65q2r3K32j04J12K35k58P0m4j89j0K50J50k44L37m54L82m01
7894a76K21k06J89j34J16j07L87k54q2k3j44K42j20L3L58j14k57m8j32m5J22M88
7916C14L31q32O33n26L34m09J7P74j406Q5J453j030O09j22j227J005R35r06L48
7935C80o74P86J15k38R7j79m96M1O9k87Q64o17k62P38r72R13K87K5J53j043J017
$$ y = [117, 10, 141, 339, -51, -57, -72, -83, -180, 29, 32, 345, 179, 72, -308, -127, -130, -135, 38, -67, 212, 257, 14, -147, 104, -99, -121, -141, 229, 34, -3, -56, 47, 35, -670, 217, -88, 28, 440, 210, 158, 263, 43, -375, 102, -146, 521, 817, 245, 842, 227, -94, 86, 590, 444, 371, 1, 49, 313, -171, -115, 149, 21, 73, 350, 137, 261, -64, -14, -197, -149, -195, 276, -214, -152, 27, -337, -1, -76, -39, -449, -28, -220, 223, -43, -71, -60, -113, 51, -213, 261, -199, -117, 400, -65, -147, -240, -8, -112, 0, 235, -23, 47, 3, -186, -196, 54, 204, -40, 297, -157, 225, -176, 45, -161, 28, -106, 10, -97, 290, 36, -46, -69, -213, 29, -91, -58, 300, 186, -71, -119, -251, -296, -174, 314, 645, -187, 446, -80, 254, -155, -138, 636, -770, -685, 768, -262, 347, 225, -1002, 3, 938, 32, 380, -294, 492, 607, 369, 466, 287, -209, -168, -99, -386, 478, -139, -401, 337, -635, 278, 565, 590, 743, -300, 717]
7956G17n69M9m29N06m0J79L27m46l2J18r3l37l98Q45J86p38l3m3M86k78j90n6
7978b69O10j24l08P98o51j61l79P91K18q91O71m58N47j40m25o25J641m37k61J41
7998B88k70j048J160L76q85j77J080m94n96J008n87K91l5m41L4N19k7M63n37N4
8018A76k36k58M11j10k67M04L19l62M9j28j07m6K88j16k2K03j9l01J51J9j53J46
8040D1K37p8l9k02K03Jk50j26L0J27m4J48R2L2p8j96j48L99L7R0k86K48m55N03
8064B86l77k63K56J88Q5M8k09m4P5N1Q8k28l7J93k57K37M2j41k96K03J57k22Q7
8087g8K18K3J6j54m8M9J29j95L46k83N9N0k87k2J12j01m9K32K48l47J31Jk50J82
8111a8J94o9n2J73n3J60l13L0k31J84k7J51j98J12j66J1j22K22j60L77k43R9J24
$$ y = [717, 148, 197, -232, 274, 234, 413, 740, 294, 262, 380, 287, -50, -448, 397, 583, -155, -188, -231, 255, -23, -213, -269, 341, 217, -91, 707, 56, -105, -484, 307, 525, -366, 305, -153, 394, 254, -171, -796, 845, 408, 147, 288, 18, -1030, 130, 506, -379, -556, 524, 30, -566, 442, -145, 146, 111, -330, -296, 223, 196, 659, 122, 176, -60, -318, 93, -17, -284, 120, 439, 77, 126, -2, -109, -155, 133, 17, -5, 198, 179, -122, 29, 48, -105, 41, 278, 200, 161, -41, 162, 163, -87, -213, -183, -56, -100, 48, 140, 172, 94, -102, -250, 149, 186, 276, -10, 238, -217, 286, -91, -354, -98, 90, 175, 223, 14, -30, 45, 96, 184, -44, -81, 112, -145, 92, 134, -7, -303, -100, 57, -165, -78, 140, 163, 179, 25, -23, 26, 155, -40, 306, 23, 82, 132, -155, -177, -65, -166, -215, 17, 265, -82, 49, 50, -200, -18, 176, 107, 55, 228, 175, 335, 22, 52, -179, 5, -22, 129, -69, 43, -123, -112, -234, -12, -172, 205, -38, 61, 185]
8134A85k94j28K28j45J50j2o2M9l4k69J46K4JK57J44j94K2L6k0j70J15j4j01K15
8158A29k01K95k33j18N5j13k37P64r8N8K4r7j96J05k17k2j20K47K29M1k63q3o2
8181a13l28M07l10N13J40k61J43m25k8O0
$$ y = [185, -109, -237, -9, -154, -4, -16, -78, -29, -63, -332, -186, -162, -161, 96, 240, 46, 68, 104, 84, -86, 29, 15, -86, 129, -72, 223, -10, -128, -73, -186, -423, 341, 243, 301, 325, 228, 32, 137, -80, -102, -222, 25, 254, 295, 32, -51, -113, -441, -34, -344, 169, 309, 48, 191, -234, -262, -202]
8191b02
$$ Imaginary data points
##PAGE= N=2
##DATA TABLE= (X++(I..I)), XYDATA
0@%%%%%%%%Kj0J6j6J6j9K7l2L9m8N5o5P6r0J05j21J40j59J81k07K35k65K98l36
32a78L77m22M71n24N84o51P22p99Q86r82J087j205J336j481J643j827K041k287
50a209K574k917L334l856M531n444O749q786J2459k1182Q1188Q4871r2903p1422
64a2013m8532J960j918J9479M3899P1865L7545k8797r0936p5457j3561M5008M7616
77c842L4863L1644L5086k836o3093q9799m1936L3527P5272N4502J4789p610j3533
90E7034l3310o0432n7972j073O8635Q6103L6752k3193m3976l3696k6603k9687
102f1418j2841L7366P8810O4195k359n8964o4480l0361O78Q016J8063M4270O0742
115H1717K5870m2509q3120n8792r14L7048L9028K9291K9238K2533j2430o1204
$$ y = [0, 0, 0, 0, 0, 0, 0, 0, 0, 2, -8, 8, -8, 8, -11, 16, -16, 23, -25, 30, -35, 41, -49, 56, -65, 75, -84, 97, -110, 125, -140, 158, -178, 199, -223, 248, -276, 308, -343, 379, -420, 466, -516, 571, -634, 702, -779, 864, -963, 1078, -1209, 1365, -1552, 1782, -2074, 2457, -2987, 3762, -5024, 7435, -13747, 67441, 152312, 59409, -12013, -60545, -58585, -60503, -41024, 2875, 74740, 112285, 83488, -7448, -82905, -96466, -51458, -3842, 31021, 62665, 97751, 94915, 31822, -57977, -99913, -66386, 8886, 63388, 78177, 70567, 57034, 23724, -36708, -94680, -95753, -27118, 58985, 95737, 72544, 28568, -5128, -31731, -61418, -74259, -36893, 41917, 106112, 103753, 44789, -19691, -50052, -49374, -41358, -23295, 20975, 81717, 107587, 65078, -18042, -76834, -77748, -40700, -1672, 27619, 56857, 79390, 66960, 5756]
127E756p4635k8408L9696O9550M6213R824o756j2619l3370n5618m3269J2758O6907
140c971P1456K4276k6327m2241l3232k7044k6410m828M0945P1608M8971j3023
152H0180n8913n4837k2275K762J1727K4951M6464N0679J3163m5307p2425m5344
164f9175O637L6711L4824K5222K4792J3371k2656o0898o1583j4338M0481N8592
176A1980L6746O891p937j5401l3880m8865k9479K2161O5149N8826J3903k5705
188E4389l5805k8901k6525k1312L065M2608O2033L5218k0206n4745m6969j7734
200e4884K112J0641K6349M5479M2046K482m6952o1965l2060J0254L3227L1582
212H311K5468K3874J0084k6702n8854n2295m738M1051N0202K8412N028o411j8533
$$ y = [5756, -68879, -97287, -57591, 11959, 58172, 67996, 61240, 48621, 15251, -40367, -83636, -70878, -3971, 67485, 91761, 65434, 23193, -10039, -37083, -63493, -68321, -27376, 44232, 93203, 80180, 21267, -33570, -55845, -53083, -41356, -16405, 30059, 80738, 93901, 48594, -23831, -69175, -62538, -25827, 8997, 34219, 59011, 72382, 49726, -11172, -72755, -87093, -46612, 11980, 48726, 55617, 47680, 32279, -1601, -50466, -79945, -57784, 7365, 66191, 80094, 54389, 18584, -10317, -36842, -58154, -55089, -12481, 49552, 84770, 64564, 9819, -37150, -54884, -52772, -42131, -15782, 29697, 71743, 74225, 27273, -34692, -66752, -56498, -23271, 8311, 33779, 57653, 67737, 41035, -17819, -70114, -74852, -33801, 16401, 44813, 49841, 43430, 24897]
225B4897l7482m6086k1055K7120O0600M9112Q561k4710l1533k6826k5262j8049
237f0713J0906M6918N6996K5184k3915m9758m0119j5490J590J1659K8162M3828
249C5248L3744o714m9493n7026k5042J4052L0597K8549K5857K3099L449l0995
261B5325n4516m0863M163M2385M5767K3959K898p141j9620l8072m1393j3293L1612
274c8789N4784L8590K42k5281k8709k5061k3898j3690J4130M7116N1702J6982
286F8118k6920m4778l1204r613K731J2081K9246M1823K7841j2427m9265m9826
298d2193j8810J4534K6723K4284K2966K0141k46l4065n2998l3084J0461M1358
310b0929M0603K0092L937o673k0092l7182l6228o057L5315N2943L1926m125k5976
$$ y = [24897, -12585, -58671, -79726, -52606, 7994, 57106, 65667, 40957, 9424, -17402, -42664, -60713, -49807, -2889, 54107, 79291, 55376, 5618, -34501, -49991, -48401, -36742, -8580, 35248, 68992, 62278, 12785, -44241, -69283, -55231, -24634, 3915, 29772, 52871, 56320, 25325, -29191, -70054, -65891, -23506, 22261, 46220, 49118, 41977, 22357, -15715, -57108, -70401, -38789, 15995, 54585, 54827, 29546, 837, -24224, -48122, -61812, -47682, -566, 51136, 68118, 41198, -3580, -34784, -44397, -41666, -29585, -339, 41484, 69325, 56898, 7633, -42193, -61003, -46469, -19746, 4538, 27504, 47645, 47399, 13334, -39664, -72748, -62287, -20929, 19674, 39766, 43703, 37030, 16938, -20244, -56472, -62529, -27214, 25729, 57655, 53530, 27554]
323B7554k7233k5130k3372j0009J8490M7090M2995P593l0018m1481k7212o847
335d7580M555J6451L0306L9282K0507j7378m7882m2132q967J6883K5556K3267
347A2868K1163J4871o100l6816m8752k4666J5455M0059L3883J4365r71p297k1931
360F131l5249k9611J560L7367M8397K4420p280k4077k3224k1655j9927n910K3175
373b5883M4763L7471J014l3177l9080k3367m695M254J5081L0313L5822J5390k3052
386C4854m6662l6663m312J9915K5440K3025K1107J3545r478l8093m3826j8178
398e9326K0394L8350L0560J1226j649j1145k4799l6260k6439P142L9904M3699
410C1657J8392j0923k3865k2990k0775j7027l65K8294M4848L2190m392l3699l5540
$$ y = [27554, 321, -24809, -48181, -58190, -39700, 7390, 50385, 57978, 27960, -13521, -40733, -47580, -43025, -26574, 3732, 43014, 63521, 46143, -1739, -43871, -52838, -35955, -10399, 12868, 34031, 48902, 42802, 5986, -42766, -67432, -51977, -11918, 21965, 36330, 35359, 28062, 6131, -29118, -58729, -57169, -19802, 28595, 53015, 45735, 21658, -1566, -23221, -43148, -49058, -25883, 18880, 56351, 57365, 24188, -14892, -38259, -42954, -38700, -23619, 6694, 42516, 57906, 34854, -11808, -48471, -52783, -32868, -7428, 15597, 36704, 50249, 40771, 2678, -41148, -59326, -38932, -582, 29978, 41204, 39555, 28410, 3611, -32649, -59088, -51946, -12042, 31657, 50049, 39126, 15261, -7729, -28504, -45531, -45896, -17602, 27246, 59436, 55044, 21345, -14195]
423a4195j9670l026N967J7622L1641L1497P258k9009m5657l1126N4K0051K4404
436d189K1231K0029J0284j4734l9107l8925j0234K5123L8163K6151Q967l089j1456
449B8214k6415l3810j9424J2512L9437L7562J2093j4462k4123k1447k0590j4260
461d4713K745L0689M1992K5561j0514l3241l0086j4114n72O695J9337L0449K7071
474E1299K061k9869m0744k4529L684J8924K1303J8816J7041N697j7057l8583l3712
487d5669l742K5735L2994K1975P117l377j2384k5960l0802j3342J6523M0585L2106
500D1759P988j4389k2136k1476j8307j3149N807L1420L9922J7059j5038l3405
512F055k8303j1831K72Q938K1605L0436K4901m141l2653l8567j7828P493K0884
$$ y = [-14195, -33865, -36891, -30924, -13302, 18339, 49836, 57094, 28085, -17572, -48698, -48644, -28593, -4189, 17042, 37071, 47355, 32621, -6486, -45411, -55645, -30522, 7641, 33792, 42759, 39670, 28214, 1799, -32011, -51435, -38923, 514, 38076, 50169, 35707, 11584, -9863, -30453, -44713, -41968, -11279, 30713, 56274, 45760, 12519, -17567, -31681, -32253, -25558, -6221, 24228, 51299, 53360, 23491, -17253, -41782, -38098, -19174, 2129, 20945, 37986, 43683, 26626, -11957, -45669, -49411, -23676, 9318, 31293, 38410, 35033, 22649, -3311, -34113, -47455, -30932, 9653, 41759, 49747, 35358, 13222, -8254, -26561, -39710, -33903, -2483, 37439, 54498, 39460, 6055, -22248, -34079, -33807, -24869, -3264, 27172, 52073, 47932, 15279, -23288, -41116, -33623, -12739]
525a2739K1141J9405J6327Q24k1762l8604k9513J464K7134L0677J8338M090n660
538C1122j4639k7381k8237q906K2516L9016K8141K757j5600j9776j8865j7752
550b7604r539J2001L1997L5030J1919j7402l2794k3426j1124N96Q384K2036K9575
563B9649J7798q163l3392l4112j4774R258K1958J8445K1227J3529P8k5435l5823
576a9757k2674M730K9001K7643J7488K359o726j7651k8255k6167m664K4110L6310
589A5747K3683l87j6455j9791k0115j5788n250J5367L4288L2342O688j9624k9830
602H75k2117p858J898J1923K3149K7312J4199j3973l4661l1540j0352J1474J8242
615a1429J9901J9047J1827o592k5887l3377j8534J0252K7685K6881J3439J650
$$ y = [-12739, 8402, 27807, 44134, 44958, 23196, -15408, -44921, -43457, -16323, 14354, 32692, 36782, 31122, 16483, -10898, -39135, -48041, -25525, 13491, 41632, 44389, 28789, 9013, -9852, -27604, -37143, -25142, 6855, 41885, 53804, 36402, 3608, -19818, -30942, -30346, -21962, 74, 29649, 47447, 39284, 5892, -28220, -42994, -33736, -11778, 6667, 27894, 41423, 41501, 16066, -19757, -42431, -37701, -8700, 18943, 36431, 38790, 32064, 14413, -13842, -40009, -44673, -20563, 15747, 39430, 39043, 22588, 2797, -17318, -33106, -38356, -22989, 11299, 43641, 50329, 30705, 875, -21242, -29100, -27202, -15279, 7870, 35182, 49381, 35408, 747, -30793, -41145, -29671, -11429, 8472, 27519, 39346, 32754, 6867, -26510, -45044, -34792, -7107, 19774, 33213, 34863]
627C4863o762j9596k6236k2007J567K6372L3693J7621k854j7008k1119j8182j5619
640c5267j077J6833L3781K5384J764k0574k6746j9432o448L479J4036K4026K5857
653C5616R829j7883l0900k6776o413J1125J9115J8742J8269Q317j0126k7873l1747
666c0705j4075J2156K6416K3886J1840J287q718k0662k7007j7513N982K8844L1756
679B3487J5031m015j6203j9674j9002j4930J156K1800L2147K1652k889k3103k6516
692a1059j7477o109L632J6081K6323K4366M429k0646l1571k2058k515J2745J8849
705e010K0167J7628O305j3248k9913k8969q491J5420K5260K0169R880J98j1367
718A8029k2991k6617j3507J0963K8836K8007J1511o531j5324j8115j8265j2217
$$ y = [34863, 28101, 8505, -17731, -39738, -38171, -11799, 21894, 39515, 36661, 19653, -1466, -19648, -35267, -36344, -19511, 14270, 39654, 41418, 20844, -5902, -25334, -31782, -28303, -14267, 9759, 35616, 45445, 27562, -3338, -30114, -36527, -25402, -6287, 12455, 30724, 39041, 28915, 1042, -30705, -44780, -32624, -6208, 17678, 29518, 30805, 22087, 1425, -25582, -43095, -37113, -8269, 23487, 38518, 34503, 18300, -1374, -20376, -35306, -34150, -12350, 19797, 41449, 38560, 15457, -11059, -28536, -34645, -31013, -14932, 11391, 35757, 40186, 19540, -12031, -34089, -36604, -23859, -5010, 15157, 32785, 39090, 25842, -4071, -33040, -41531, -26111, -851, 19318, 29198, 29396, 18029, -4962, -31579, -45086, -34123, -5287, 22720, 34231, 27700, 12376, -5739, -24004, -36221]
730c6221M276K4405L1169J7685o808k2885k3806j4784n116M402J6737K5802K1035
743C5891L99k2813l0163j9028L73J2846J7097J9032J6951M695j5360l0564k5076
756c5720l657J7703K4005J8733Q397m50j1635k3160k5869j1136J3656K9809K4846
769B5522P267q635j5686j7922j8033j0885P316K5885K9556J4479j0085k2972k1151
782a5344j1577l674O941J8245K5886J8517l605k5042k8747j5101K835J3255J6075
795a336J7423J4165J182j8097k9616k2429L8K0095K3295J5982O323j087j2185
808A3753k2597k2497p014J6726K9105K1965M367j0453j5899j6805j6618q948Q255
821b6660K6321K6980R677j2932k2989j9268r352j202P365J8862K4677J5768o499
$$ y = [-36221, -31945, -7540, 23629, 41314, 34506, 11621, -12185, -26969, -32085, -27683, -10946, 14856, 35891, 36290, 13477, -16686, -35714, -35341, -22495, -5398, 13634, 30585, 35280, 19920, -10644, -35720, -39377, -21674, 2331, 21064, 29461, 29011, 17376, -5784, -31653, -42789, -29133, 676, 25522, 32789, 24154, 8468, -9454, -27487, -38372, -31056, -5171, 24385, 38864, 28779, 5807, -15344, -26921, -30595, -23654, -5409, 20477, 38994, 35389, 10347, -18400, -33501, -30666, -17411, -1336, 16087, 30252, 31434, 13337, -16279, -38708, -38670, -18575, 4720, 20702, 27025, 25938, 13753, -8844, -31341, -38355, -21629, 7476, 29441, 33808, 23355, 7456, -9349, -25967, -34915, -26660, -339, 26641, 36318, 23386, 397, -18871, -28223, -29425, -22060, -3198, 21479, 37247, 30748]
834C0748k3820k6511j1477N607J4190J5250J6611J1459p62k0012k8919j7930K635
847c2931J9366K1575J2937M543l390j2929k2359k0830k863J9315K8925J8996J680
860C2035j0644j5566j5834j4722o371J1479K6418K4345O271j4822k3462j7606
872a8479q575M38Q694J9078K3338J1153r173k5559k3129q184O503J4498J6458
885G061J5931J0302m162k1220k6828j5381O969K0528K0105J1227K766m941j4927
898G430k2413j7988K05K0357K6145J6020j166j1480j5394j5763j3044k568J4488
911a5171K6098K1556K623j5326k1075j6059o773J744J0211J9917K1035Q074j2733
924B4121k5842k1360o392P363J3709J5948J5052P910o844k1530k4203j1667Q965
$$ y = [30748, 6928, -19583, -31060, -25453, -11263, 3987, 20598, 32057, 31295, 11283, -17636, -35566, -32931, -13565, 8010, 20947, 25490, 22100, 9171, -13188, -34018, -36881, -17566, 11359, 30355, 32035, 21391, 5825, -10009, -24731, -31102, -19623, 6795, 31140, 37411, 22589, -873, -18479, -27054, -26616, -17922, 1156, 24494, 35647, 26474, 915, -22214, -30398, -23895, -9397, 7061, 22992, 33294, 29132, 7912, -18916, -34297, -27328, -6800, 13305, 24532, 27298, 22357, 7430, -14983, -32971, -32766, -12409, 13736, 29756, 28590, 17110, 1716, -14047, -27091, -29659, -15171, 10927, 32483, 35106, 19780, -1295, -17354, -24127, -22383, -12172, 7745, 28780, 36854, 24121, -1721, -23081, -29473, -22110, -8401, 7547, 22599, 30509, 23665, 2135, -22068, -33735, -24770]
937b4770K0514J9304J0893K633n816j6384k1849j4991L529K0747K4098J2708k885
950B7731j2013j5859j6095j2143m11J6476K5276J8343m2j6375j9547j3866n367
963b3892K591J2715K1031J9035M474j4723k4346j8532m425P728J3753J5389J3933
976B4731N679r996k3146k1985p696J0664J9293J7472R459J998p437j7501k0380
989a8845j1500P342K1687K2155R257l730j1675j5489j5581j0473K344J7935K3839
1002A7266J3713k993j6761j8221j2705m452L395J3373K1030J7100P41j6246k2755
1015g515j5029j736Q697J3536J5701J3494L181j2204k2808j9615m739J2411J7793
1028A167J4741Q365N18r777j8628j9007q540R672K1644J9672P104m230j1816j4474
$$ y = [-24770, -4256, 15048, 25941, 28574, 22758, 6374, -15475, -30466, -26937, -6190, 17908, 30616, 27731, 15718, -141, -16236, -28379, -28790, -12314, 12962, 31305, 31263, 14888, -4659, -18525, -23892, -21301, -8586, 12445, 31480, 35954, 21231, -3115, -21647, -26072, -18344, -4591, 10798, 24731, 30410, 20414, -2732, -24717, -32413, -21749, -2456, 15016, 24475, 26473, 19036, 1535, -18845, -30345, -23003, -1316, 20839, 30096, 26366, 14691, -798, -16379, -26852, -24508, -6573, 17266, 30979, 27986, 11225, -6996, -19701, -24153, -20758, -7385, 13645, 30745, 31486, 15240, -7515, -22544, -24280, -15583, -2047, 13654, 27148, 30329, 18125, -4683, -24298, -29037, -16626, 1167, 15908, 24273, 24791, 15014, -3614, -22621, -31161, -21489, 155, 19827, 26931, 22701, 10885, -3589]
1042c589j4787p910N937J9073K2400J0512o073j6219j7321j2302k785M977J3862
1055d225J9872J3894k813j8014k1143j2715N58R113J3953J5475J2116J261j4202
1068A3130k2287j6011o49J3391J7081J3389O740j167j0807j9180j8110n369J2263
1081a7586K0889J6292M672n894j1872j4648j4113n708Q583K0029K0808Q444p925
1094B1971j5981j5587r833k563N988J6202J9048J0984o030j8569j9727j0233J007
1107b3323R362J3728J4892J0197j536j5853k1341j3530K200J3584J6735J2780
1119A7895N915j982j2557j8381j5801j828J3517K0195J4143K591o157j2923j5162
1132a0535j2814m202J0669K0289J7787M966r362j5863j4162q890j141Q442J7178
$$ y = [-3589, -18376, -26286, -20349, -1276, 21124, 31636, 25563, 9344, -7977, -20279, -23064, -18087, -4225, 15647, 29541, 26728, 8714, -12429, -25144, -24586, -15473, -1520, 13955, 26071, 27332, 13130, -9157, -25168, -25817, -12426, 4655, 18044, 24784, 23617, 12810, -6370, -24480, -29849, -17586, 3303, 19595, 24267, 18373, 6501, -8147, -22260, -27968, -19385, 644, 21452, 29896, 21971, 5990, -9597, -19430, -21993, -16005, 197, 19245, 30229, 24199, 5630, -14097, -24330, -23323, -13961, -233, 14659, 24856, 23320, 7467, -13874, -27404, -25204, -11620, 5115, 17895, 23810, 21828, 9271, -9110, -24911, -26739, -13222, 6973, 21116, 23707, 17550, 4627, -10535, -23349, -27551, -16882, 3407, 21194, 26160, 16798, 935, -13227, -22117, -23258, -14816, 2362]
$$ [...]
8191b03
##END NTUPLES=NMR FID
##END=
