##TITLE=1H_SA_28.amide1
 DMSO-d6, 40 sc, 
 27.3.2020
##JCAMPDX= 6.0         $$ Bruker NMR JCAMP-DX V2.0
##DATA TYPE= NMR FID
##DATA CLASS= NTUPLES
##ORIGIN= UXNMR, Bruker Analytische Messtechnik GmbH
##OWNER= root
$$ XWIN-NMR		Version 3.5
$$ Fri Mar 27 14:33:22 2020 Russian Standard Time (UT+4h)  she@DPX200
##.OBSERVE FREQUENCY= 200.1315
##.OBSERVE NUCLEUS= ^1H
##.DELAY= (6, 6)
##.ACQUISITION MODE= SIMULTANEOUS
##.ACQUISITION SCHEME= undefined
##.AVERAGES= 40
##.DIGITISER RES= 18
##SPECTROMETER/DATA SYSTEM= spect
##.PULSE SEQUENCE= zg30
##.SOLVENT NAME= DMSO
##.SHIFT REFERENCE= (INTERNAL, DMSO, 0, 15.7039)
##AUDIT TRAIL= $$ (NUMBER, WHEN, WHO, WHERE, WHAT)
$$ ##TITLE= Audit trail, XWIN-NMR		Version 3.5
$$ ##JCAMPDX= 5.01
$$ ##ORIGIN= Bruker BioSpin GmbH
$$ ##OWNER= she
$$ F:/spectra/data/she/nmr/H-F/1/audita.txt
$$ ##AUDIT TRAIL=  $$ (NUMBER, WHEN, WHO, WHERE, WHAT)
(   1,<2020-03-27 14:31:32.40 +0400>,<she>,<DPX200>,
      <continue with go, POWCHK disabled, PULCHK disabled
       configuration hash MD5:
       00 E9 B6 7A A2 85 ED C7 34 08 36 98 17 FE 4E 26
       data hash MD5: 16K
       FF 27 B1 94 B5 55 AF F2 57 82 07 46 6B 30 04 26>)
$$ ##END=
$$ 
$$ hash MD5
$$ 3E 01 0F 25 9B D3 20 E1 3B 44 BD 52 17 F5 E5 72
##$RELAX= 
##$RELAX= 
##$RELAX= 
##$RELAX= 
##$RELAX= 
##$RELAX= 
$$ Bruker specific parameters
$$ --------------------------
##$DU= <F:/spectra>
##$EXPNO= 1
##$NAME= <H-F>
##$PROCNO= 1
##$TYPE= <nmr>
##$USER= <she>
##$AMP= (0..31)
100 100 100 100 100 100 100 100 100 100 100 100 100 100 100 100 100 100 
100 100 100 100 100 100 100 100 100 100 100 100 100 100 
##$AQSEQ= 0
##$AQ_mod= 1
##$AUNM= <au_zg>
##$AUTOPOS= <>
##$BF1= 200.13
##$BF2= 200.13
##$BF3= 200.13
##$BF4= 200.13
##$BF5= 200.13
##$BF6= 200.13
##$BF7= 200.13
##$BF8= 200.13
##$BYTORDA= 1
##$CFDGTYP= 0
##$CFRGTYP= 5
##$CHEMSTR= <none>
##$CNST= (0..31)
1 1 145 1 1 1 1 1 1 1 1 1 1 1 1 1 1 1 1 1 1 1 1 1 1 1 1 1 1 1 1 1 
##$CPDPRG= <>
##$CPDPRG1= <>
##$CPDPRG2= <>
##$CPDPRG3= <>
##$CPDPRG4= <mlev>
##$CPDPRG5= <mlev>
##$CPDPRG6= <mlev>
##$CPDPRG7= <mlev>
##$CPDPRG8= <mlev>
##$CPDPRGB= <>
##$CPDPRGT= <>
##$D= (0..31)
0 1.2 0 0 0 0 0 0 0 0.06 0 0.03 0 0 0 0 0.0002 0 0 0 0 0 0 0 0 0 0 0 0 
0 0 0 
##$DATE= 1585304958
##$DBL= (0..7)
120 120 120 120 120 120 120 120 
##$DBP= (0..7)
150 150 150 150 150 150 150 150 
##$DBP07= 0
##$DBPNAM0= <>
##$DBPNAM1= <>
##$DBPNAM2= <>
##$DBPNAM3= <>
##$DBPNAM4= <>
##$DBPNAM5= <>
##$DBPNAM6= <>
##$DBPNAM7= <>
##$DBPOAL= (0..7)
0.5 0.5 0.5 0.5 0.5 0.5 0.5 0.5 
##$DBPOFFS= (0..7)
0 0 0 0 0 0 0 0 
##$DE= 6
##$DECBNUC= <off>
##$DECIM= 24
##$DECNUC= <off>
##$DECSTAT= 4
##$DIGMOD= 1
##$DIGTYP= 9
##$DL= (0..7)
0 120 120 120 120 120 120 120 
##$DP= (0..7)
150 150 150 150 150 150 150 150 
##$DP07= 0
##$DPNAME0= <>
##$DPNAME1= <>
##$DPNAME2= <>
##$DPNAME3= <>
##$DPNAME4= <>
##$DPNAME5= <>
##$DPNAME6= <>
##$DPNAME7= <>
##$DPOAL= (0..7)
0.5 0.5 0.5 0.5 0.5 0.5 0.5 0.5 
##$DPOFFS= (0..7)
0 0 0 0 0 0 0 0 
##$DQDMODE= 0
##$DR= 18
##$DS= 0
##$DSLIST= <SSSSSSSSSSSSSSS>
$$ [...]
##$SUBNAM2= <"">
##$SUBNAM3= <"">
##$SUBNAM4= <"">
##$SUBNAM5= <"">
##$SUBNAM6= <"">
##$SUBNAM7= <"">
##$SUBNAM8= <"">
##$SUBNAM9= <"">
##$SW= 24.9337058887773
##$SWIBOX= (0..15)
0 0 2 0 0 0 0 0 0 0 0 0 0 0 0 0 
##$SW_h= 4990.01996007984
##$TD= 16384
##$TD0= 1
##$TE= 0
##$TE2= 300
##$TE3= 300
##$TEG= 300
##$TL= (0..7)
0 120 120 120 120 120 120 120 
##$TP= (0..7)
150 150 150 150 150 150 150 150 
##$TP07= 0
##$TPNAME0= <>
##$TPNAME1= <>
##$TPNAME2= <>
##$TPNAME3= <>
##$TPNAME4= <>
##$TPNAME5= <>
##$TPNAME6= <>
##$TPNAME7= <>
##$TPOAL= (0..7)
0.5 0.5 0.5 0.5 0.5 0.5 0.5 0.5 
##$TPOFFS= (0..7)
0 0 0 0 0 0 0 0 
##$TUNHIN= 0
##$TUNHOUT= 0
##$TUNXOUT= 0
##$USERA1= <user>
##$USERA2= <user>
##$USERA3= <user>
##$USERA4= <user>
##$USERA5= <user>
##$V9= 5
##$VALIST= <valist>
##$VCLIST= <CCCCCCCCCCCCCCC>
##$VD= 0
##$VDLIST= <DDDDDDDDDDDDDDD>
##$VPLIST= <PPPPPPPPPPPPPPP>
##$VTLIST= <TTTTTTTTTTTTTTT>
##$WBST= 1024
##$WBSW= 4
##$XGAIN= (0..3)
0 0 0 0 
##$XL= 0
##$YL= 0
##$YMAX_a= 924658
##$YMIN_a= -615526
##$ZGOPTNS= <>
##$ZL1= 120
##$ZL2= 120
##$ZL3= 120
##$ZL4= 120
##$ABSF1= 10
##$ABSF2= 0
##$ABSG= 5
##$ABSL= 3
##$ALPHA= 0
##$AQORDER= 0
##$ASSFAC= 0
##$ASSFACI= 0
##$ASSFACX= 0
##$ASSWID= 0
##$AUNMP= <proc_1d>
##$AZFE= 0.1
##$AZFW= 0.1
##$BCFW= 1
##$BC_mod= 2
##$BYTORDP= 1
##$COROFFS= 0
##$CY= 11.3945322036743
##$DATMOD= 1
##$DC= 2
##$DFILT= <>
##$DTYPP= 0
##$F1P= 16.9975609425685
##$F2P= -3.02152046262296
##$FCOR= 0.5
##$FTSIZE= 0
##$FT_mod= 4
##$GAMMA= 1
##$GB= 0.15
##$INTBC= 1
##$INTSCL= 1
##$ISEN= 128
##$LB= 0.24
##$LEV0= 0
##$LPBIN= 0
##$MAXI= 10000
##$MC2= 0
##$MEAN= 0
##$ME_mod= 0
##$MI= 1.114404
##$NCOEF= 0
##$NC_proc= 0
##$NLEV= 6
##$NOISF1= 3.799351
##$NOISF2= 2.8
##$NSP= 1
##$NTH_PI= 0
##$NZP= 0
##$OFFSET= 15.70392
##$PC= 1
##$PHC0= -9801.837
##$PHC1= 30.80082
##$PH_mod= 1
##$PKNL= yes
##$PPARMOD= 0
##$PSCAL= 0
##$PSIGN= 0
##$REVERSE= no
##$SF= 200.130013532006
##$SI= 16384
##$SIGF1= 3
##$SIGF2= 2
##$SINO= 400
##$SIOLD= 16384
##$SREGLST= <1H.CDCl3>
##$SSB= 0
##$STSI= 0
##$STSR= 0
##$SW_p= 3612.71676300578
##$SYMM= 0
##$S_DEV= 0
##$TDeff= 0
##$TDoff= 0
##$TI= <>
##$TILT= no
##$TM1= 0
##$TM2= 0
##$TOPLEV= 0
##$USERP1= <user>
##$USERP2= <user>
##$USERP3= <user>
##$USERP4= <user>
##$USERP5= <user>
##$WDW= 1
##$XDIM= 8192
##$YMAX_p= 0
##$YMIN_p= 0
$$ End of Bruker specific parameters
$$ ---------------------------------
##NTUPLES= NMR FID
##VAR_NAME=  TIME,          FID/REAL,        FID/IMAG
##SYMBOL=    X,             R,               I
##VAR_TYPE=  INDEPENDENT,   DEPENDENT,       DEPENDENT
##VAR_FORM=  AFFN,          ASDF,            ASDF
##VAR_DIM=   8192,          8192,            8192
##UNITS=     SECONDS,       ARBITRARY UNITS, ARBITRARY UNITS
##FACTOR=    0.0002004,     1,               1
##FIRST=     0,             0,               0
##LAST=      1.6414764,     0,               0
##MIN=       0,             -615526,         0
##MAX=       1.6414764,     924658,          0
$$ Real data points
##PAGE= N=1
##DATA TABLE= (X++(R..R)), XYDATA
$$ [...]
2694a364M750m97l444m861L189N494J461n787l695L172L704J678n892l181M853
2709d20N333r01n907k201K661N692O07n445l817L756L906m00l600l446J640N346
2725B804J114n420l153J405P341N04m574m017P98O059N41m172l013J768M301K137
2741D423l630n621J970N587J808m379m375J779M610K082k834m883K34M819M008
2756E598m219m428n24M856L669n221k163q73M352K752k422m106l48N193J385j867
2772A634l278j187M091L178l425l420q20L149L677j567n056k13M458J245j116
2787A350m434N46L355M520m289l706N4M336J832j871m334L41K963K783k520m577
2803c651J037K782K416j461l448J50M031J818k165l075j320M286K611k319m074
$$ plain form
2694 -1364 3386 2889 -555 -5416 -2227 3267 4728 -1059 -4754 -1582 2122 3800 -2092 -5273 -420
2709 -420 4913 4012 -1895 -4096 -1435 4257 4864 -581 -4398 -642 3264 2864 -736 -4182 -2542 2804
2725 2804 3918 -1502 -4655 -3250 4091 4595 21 -3996 -3198 2861 3402 -770 -3783 -2015 2286 4423
2741 4423 793 -4828 -2858 2729 4537 158 -4217 -2438 2172 4254 1420 -3463 -3229 1590 5598
2756 5598 1379 -3049 -3573 1283 4952 -269 -2432 -3305 1047 3799 1377 -2729 -3077 2116 3501 1634
2772 1634 -1644 -2831 1260 4438 1013 -2407 -3227 -78 3599 2032 -3024 -3237 1221 2466 1350
2787 1350 -3084 -2538 817 5337 1048 -2658 -2604 1732 3564 1693 -2641 -2300 663 3446 926 -3651
2803 -3651 -2614 168 2584 1123 -2325 -2175 1856 3674 1509 -1566 -2886 1400 4011 1692 -2382
2818b382j94K814L136k658l379n62L487L168k297l429j18K785K794k606k658o35
2834b734L806K676k419l071q86L134K183j032m684L47L066L532k126m045r55L800
2850E92K276j085l316k293L776L156q37m526K99K002L546r30n271n05L092L333
2866C309j232m365j294L724K988j360l433j731L400L403p27m600q42K128L992
2881C360j248l806k092K698L968p10l661k319L350L793n18l043l106K470L961
2896C097n17l347k877K836L471K29l663k020K212L255N87m096k243K571K797K99
2912B591k376l580K488L373q9l623k736K290L931l79k418k731J660L868K57j806
2928G20l333O92L238K425l455l371J303L352J13j913k805L92L092K441k679k270
$$ plain form
2818 -2382 -2576 238 3374 716 -2663 -3225 262 3430 1133 -2296 -2414 371 3165 559 -2099 -2734
2834 -2734 1072 3748 1329 -1742 -2628 506 2689 1657 -3027 -2680 386 3918 1792 -2253 -3208 592
2850 592 2868 1783 -1533 -3826 -50 3106 2269 -2257 -1958 44 3590 2660 -2611 -3116 -24 3309
2866 3309 2077 -2288 -3582 142 3130 1770 -1663 -3394 6 3409 2682 -1918 -2760 -632 3360
2881 3360 2112 -1694 -3786 -1088 2880 2170 -1491 -3810 -460 3333 2815 -228 -3334 -864 3097
2896 3097 2580 -767 -3644 -808 2663 2892 -771 -2791 -579 2676 3263 -833 -3076 -505 2292 2591
2912 2591 215 -3365 -877 2496 2407 -1216 -3952 -1662 2269 1890 -528 -3259 -1599 2269 2526 720
2928 720 -2613 -1921 1317 3742 287 -3084 -1781 1571 1684 -229 -3034 -2642 450 2891 212 -2058
2944b058L0L333J941j841m197K46L038K808k554l022J3L734K659j988l264j340
2960b462L633J174k218j864m02L060J311k354q28n82L948M39l246j611L55Q17
2976h30K213q44k982j23L039J651j489k544q31L798J372q81k095r36K674R25j016
2993A101j962r46K96K179K66l236M78J758J383N08k343j539J821J087J34j969
3009i84k61J989J123m03j528j358O74P87P09q06q17MK050k55n39p70J209o76K181
3028B329k728j397K390J50P7j792M9J305N11n88n81j269J381J208r81j071M45
3045e62N75K70O32j723O29k28L35R87j566q2J25J701j712m94q25J461J387j75
3063G35p27o05P87P97n77j164j72K016k79n49o60k63Q70J318j831m37J10R14Q37
$$ plain form
2944 -2058 -2028 1305 3246 1405 -2792 -2546 492 3300 746 -2276 -2263 1471 4130 2142 -1122 -2462
2960 -2462 1171 2345 127 -1737 -2139 921 2232 -122 -950 -1532 2416 2855 -391 -2002 -1647 -830
2976 -830 1383 539 -2443 -2566 473 2124 635 -1909 -2740 1058 2430 1549 -546 -1482 1192 2117 1101
2993 1101 -861 -1807 -1511 668 934 -2302 -1824 -66 1317 1825 -518 -2057 -236 851 985 -984
3009 -984 -1245 744 1867 1464 -64 -1422 -748 39 748 -58 -875 -871 1179 924 385 -385 824 148 2329
3028 2329 -399 -1796 594 744 821 -971 -922 383 894 306 -275 -1544 -163 1045 64 -1007 -562
3045 -562 13 283 915 -808 -179 -407 -72 915 -651 -733 -608 1093 -619 -1113 -1938 -477 910 735
3063 735 8 -597 190 987 410 -754 -926 1090 811 262 -398 -661 209 1527 -304 -741 -631 283 1120
3082A120o52p05O75j317J024L59p98j62N47K69l50N0j405Q03J042n21k00P78j554
3101i97K359q14p61r70J276M50n56j648J699M02j66r78kK22P44N18K77k109M86
3120e68N35m84P69j019k07J832r16N86j184Q07M53L13j077k80j20O86Q36o13j287
3139i38P51O16N36l00n95k59O24n0O01j043p51J066L34q57j87k4N76R01r53o13
3159e65r4N48K74K68q83j18R96P32j387k69J017o43P92m66j026m64J253K83k88
3178d0R5n94M09J06m0J46m99L82j49m87N15j97L16J336j313P1k81P23m45M15j012
3199e43P37o37R30q93l22N27J780j997r01J468M61j573J444K82k159l46K740j042
3217d4r67J006L40J336j930N9j021L9J733q38L66o85J240j11Q58j465k182L035
$$ plain form
3082 1120 468 -237 438 -879 145 504 -294 -456 91 360 10 60 -1345 -542 500 -21 -221 557 -997
3101 -997 1362 548 -213 -1183 93 543 -13 -1661 38 440 274 -704 -706 -484 260 778 1055 -1054 -568
3120 -568 -33 -517 252 -767 -974 858 -58 528 -656 151 604 917 -160 -440 -560 126 962 349 -938
3139 -938 -187 429 965 665 70 -189 435 385 986 -57 -808 258 592 -265 -452 -476 100 1001 48 -565
3159 -565 -659 -111 163 431 -452 -570 426 1158 -229 -498 519 -124 668 202 -824 -1288 -35 248 -40
3178 -40 55 -539 -130 -24 -64 82 -417 -35 -184 -671 -156 -353 -37 1299 -14 57 -224 499 54 469 -543
3199 -543 194 -443 487 -406 -728 -201 1579 -418 -1319 149 610 -963 481 763 -1396 -1742 998 -44
3217 -44 -1011 -5 335 1671 -259 -200 -1221 -1182 551 -287 79 -606 634 523 1381 -84 -2266 769
3235G69l69R28k587N16k89J844j636j81K89o29J888N43j284P9J165l56j83m76
3253C1k197J750J178J318k841N77P8M48j298L20Ro81K273q83n47N71k42J882q27
3272I19j306O91j217J677R11j849k036J417Q93q28Q82n59m43J094K141j932j501
3289a046J069O76l7o69p10j531K789J487j376j326j9N39J093l12j147L13J596
3306A389j2q51j531J84J398M67q74j94l37O28Q34o51j633j32J291J781j711m81
3324d35j225J537L79j13o68o35J834N39j68j720m42N91J243l81j017j186J118
3341g49J597m50j111m87j18J899k35m10j39r59J739L8r32k66M19J457p28j243
3359f78j52J237n95N76j427o47K172K18K24j211o12L29m25J089J23j177J514j517
$$ plain form
3235 769 400 1328 -1259 -743 -1032 812 -824 -1005 -716 -1345 543 1086 -198 -119 1046 690 507 31
3253 31 -2166 -416 762 2080 -761 -184 -106 342 -956 -636 -627 -1308 965 82 -465 106 -136 1746 919
3272 919 -387 304 -913 764 1675 -174 -2210 -793 100 -728 154 -405 -848 246 2387 455 -1046
3289 -1046 23 699 662 -7 -717 -2248 541 2028 652 -674 -693 -154 939 627 -520 -207 1389
3306 1389 1377 526 -1005 -821 577 1044 170 -24 -361 267 1101 450 -1183 -1315 -24 1757 46 -435
3324 -435 -1660 -123 256 143 -525 -1160 674 1213 1045 -675 -1117 -526 717 336 -681 -1867 -749
3341 -749 848 398 -713 -1200 -1318 581 346 -64 -203 -1162 577 615 -317 -583 -164 1293 565 -678
3359 -678 -830 407 -188 388 -1039 -1686 486 704 928 -283 -895 -566 -991 98 221 -956 558 -959
3377i59K233j975o65J836P6P94j946p06O08J330m64O57j922n14K326j119M99j60
3395g1r45J467J60j841P41M94j05J278j424j214J372Q52j309J143j690J325l17
3412h4J354j981K09L66q3L01K55j582J268k48m51J194p33m38P84Q70n35L55k012
3431a191J240N36P57j285Q45k03o4o19q39P71J049K87j238O06q7O19j022k32J79
3450A09p12K94J351j477J246r06N94k7j113J1M72N35L80j44j201L51M47j203k50
3469a243J560k507M292j461k546J959j17L85L66Q24r3l337K364n10K56m55o47
3486i10J092j63o4q73o38J809J476j651k498pK145N33p46m62O90M74O73J115j701
3505B94j329N04L880k428r11j093J131P81j621J325j639J170J057k172P42n12
$$ plain form
3377 -959 1274 -701 -1366 470 546 1340 -606 -1312 -704 626 162 819 -1103 -1617 709 -410 89 -71
3395 -71 -1016 451 611 -1230 -489 5 -100 1178 -246 -1460 -88 764 -545 598 -1092 233 -84
3412 -84 1270 -711 -502 -136 -219 82 337 -1245 23 -225 -676 518 -215 -653 131 1001 466 821 -1191
3431 -1191 49 585 1342 57 902 699 635 16 -823 -52 997 1284 46 652 565 1184 162 -70 109
3450 109 -603 -309 1042 -435 811 -95 499 472 -641 -630 -158 377 757 613 -588 -237 210 -993 -1243
3469 -1243 317 -2190 2102 641 -1905 54 -63 322 688 1512 1419 -1918 446 -64 192 -263 -910
3486 -910 182 19 -45 -918 -1556 253 1729 78 -2420 -2427 -282 251 -495 -957 -267 207 880 1995 294
3505 294 -1035 -531 3349 921 10 -1083 48 829 -792 533 -1106 64 1121 -1051 -309 -821
3521h21n15J323J09K52k158P65J448J098k488J56M37j96J333k219l7J271R6K673
3539B527j986l221R31K225J109j401l54R42j88q2n66k253K345k57J163j490o9
3556f25L26r7J363j854M33J92m71l47J571j122k51P70P79M02j063j776J115J138
3574D83l80k188J142r2J045Q44l97k103J255P71j66l98j118N96O69K73o17j342
3592a723J363J093n96N52k530J197R48J85p05l38K17M20N26k048n22K494r87N41
3610H7K42n10j21J656K27j703l19n17J665j325L01k78j063J529P09J45q41j194
3628a310P94J227j184K85q47J892o11j97o33k67p7K731j552j378J125m77P83k89
3646A5K60R6q17J134J272k071N69p40OM15L8p61r4J813l66j020L08J7L24J085
$$ plain form
3521 -821 -1336 -13 96 348 -1810 -1045 403 1501 -987 -831 -394 -590 743 -1476 -1513 -242 -146 2527
3539 2527 541 -2680 -1749 476 1585 184 -170 772 584 502 -64 -2317 28 -229 934 -556 -625
3556 -625 -299 -396 967 -887 -454 -262 -733 -1080 491 -631 -882 -112 667 1069 6 -1770 -655 483
3574 483 103 -2085 -943 -1035 10 854 457 -1646 -391 380 214 -184 -1302 -706 -37 236 -381 -1723
3592 -1723 -360 733 137 689 -1841 -644 304 489 -216 -554 -337 83 609 -1439 -1961 533 -454 87
3610 87 329 -181 -302 1354 1581 -122 -441 -958 707 -618 -317 -595 -1658 -129 580 725 -116 -1310
3628 -1310 -516 711 -473 -188 -1035 857 246 49 -584 -851 -928 1803 251 -1127 -2 -479 304 15
3646 15 275 371 -446 688 1960 -111 458 -282 -276 139 177 -584 -678 1135 769 -251 57 74 398 1483
3666A483k426J136n92L88K48n28l53J183k4K90j5j527K51l90K426j450O02q35
3684a33L0j79M55j075J884j547J619k82j513M5R44n62q48Q27O84L15n38L47j887
3703a414J678Q92k294J165N71P20j703L42K87q17L00k16J420q39o53P28P7J841
3721B085j264m83l138L764q69K98j346j27J501Q73j859L04J126o03M68j629k22
3738a121J489m18K05O45q6l42Q21q62n67j71J034j226J86P45L73j913K037j175
3756c46L09n21J496q19M68p13j4O92p07P25j494O16k99L98P22p42l87J364r65
3775b17J327k016J29m97K506j634P54l46L65L93P44j314O9j068J61Q64N09p55
3793b6l4p46J593o75r35k34L38J005R18j411j85J496j324N63q02P45n34J130m89
$$ plain form
3666 1483 -943 193 -399 -11 237 -291 -644 539 515 805 790 -737 -486 -876 1550 100 702 -133
3684 -133 -103 -282 173 -902 982 -565 1054 772 -741 -696 248 -314 -1162 -335 349 664 126 473 -1414
3703 -1414 264 1156 -1138 27 598 1318 -385 -43 244 -573 -273 -489 931 92 -561 167 244 2085
3721 2085 821 338 -2800 964 95 393 -953 -1080 421 1294 -565 -261 865 262 730 -899 -1121
3738 -1121 368 -50 155 800 714 372 1193 331 -236 -407 627 -599 -413 332 705 -1208 829 -346
3756 -346 -37 -558 938 119 587 -126 -140 552 -155 570 -924 -308 -607 -209 513 -229 -616 748 -217
3775 -217 1110 -906 -777 -1274 1232 -402 352 6 371 764 1508 194 263 -805 -644 220 729 -26
3793 -26 -60 -806 787 112 -823 -1057 -719 286 1204 -207 -392 1104 -220 343 -459 286 -248 882 393
3812C93O35j192m76n54R98j62j476J760O52JQ5j734K12J524M43j990J242M23r57
3831a73q16o3k9O22P38r87J184j636J223O24R33j944j94J830j204J459p59j287
3849d79O96M71j14n75m80MJ76m58J085L79r61L86K46o07L52n90J106k68k63L0
3869A36n66O24O90n22Nj597J315n48Q89o66m68N12L7q00M85P29L35k99P9q78j176
3890a684P60P20o29N39p26R12Q0n07M24K57j345P25p27O06P34l60J00L4q6J0k32
3911c95N36k80J81q4k25N33K42n86k84Q53j028P94k00P7m1O75l89p30M08k42%
3932a85J05L36n83Q14j566K159r31j96j2R91j862J976j145k2M16j094J709k28
3950F82k61m88O52P52r95o63p2m94J280j239K09M04K41N59n34p78M85J133R1j113
$$ plain form
3812 393 1028 -164 -640 -1194 -196 -358 -1834 -74 578 579 664 -1070 -858 666 1109 -881 361 784 -173
3831 -173 -989 -1052 -1081 -459 279 -708 476 -1160 63 687 1620 -324 -518 1312 108 1567 808 -479
3849 -479 217 688 574 -1 -481 -477 -301 -759 326 705 -256 130 376 -231 121 -469 637 369 106 136
3869 136 -430 194 884 362 367 -1230 85 -463 426 -240 -708 -196 -159 -959 -474 255 590 291 370 -508 -1684
3890 -1684 -924 -204 -833 -294 -1020 -108 -28 -535 -111 146 -1199 -474 -1201 -595 139 -221 -121 -87 -173 -163 -395
3911 -395 141 -139 42 -42 -267 266 508 -78 -362 491 -537 257 57 134 93 768 379 -351 57 -185 -185
3932 -185 -80 256 -327 487 -1079 1080 149 -47 -59 932 -930 1046 -99 -121 295 -799 910 682
3950 682 421 -67 585 1337 342 -321 -393 -887 393 -846 -637 -233 8 567 33 -745 -260 873 964 -149
3970a49L50n57k81Q38L46m41j173J541j96K56p13j18l44J865k487M54N51m28M27
3989b59n77RJ546N29j9j143J76J15k29P33j141J34J66p44J196Q7p23N2l02L02
4009i2O17j762J418k44O20l08j269O9P97r8j9k82M28J72%K24o4p62P50K38m4l17
4031G2j92m90lO84M50m14p85J037M57j146l7J277m66L98j92l90j17J016j588P23
4051B94j266R68j53j47K04N2P5L74q1j73k55M20L28p27j58k32J266j286R87p26
4071b36M74r29K08L33j22j58L12J076m96o93R35l21L93q29n86Q02L3K15J15r32
4091d06P12O0j2K0p73r06P83M28m28J152m44L75j111R35o21N71r09R16K27m40
4111A29j367P09M89J52j12j016P32P06M2K89p50M75L36j387M27O08j197J469r58
$$ plain form
3970 -149 201 -356 -637 201 547 106 -1067 474 278 534 -179 -297 -641 1224 -1263 -809 -258 -686 -259
3989 -259 -836 -827 719 1248 1229 86 262 377 148 881 -260 -126 40 -704 492 579 -144 -92 -394 -92
4009 -92 525 -1237 181 -63 557 249 -1020 -951 -154 -252 -271 -553 -125 47 47 271 207 -555 195 433 389 72
4031 72 -120 -610 -613 71 521 107 -678 359 816 -330 -367 910 444 842 650 260 143 1159 -429 294
4051 294 -972 -4 -157 -304 -100 -48 27 401 320 147 -108 312 640 -87 -245 -477 789 -497 490 -236
4071 -236 238 -691 -483 -150 -272 -430 -118 958 462 -231 704 383 776 -53 -639 163 196 411 526 -406
4091 -406 306 366 354 374 -399 -1305 -522 -94 -522 630 186 561 -550 385 -236 335 -574 342 569 129
4111 129 -1238 -529 -40 112 0 -1016 -284 422 464 753 3 478 814 -573 -146 462 -735 734 -224
4130b24lk89O30m38P07J20j639J011Q55j000J166j471J10J506j468J134j003n01
4148g97J193n93N21n92J8q82J820k51k1l54o67N06q30P57Q8q0J043q57M94j13
4168D03j59l55N14n04n00O89q37P22r31O99L09J41l09R6k21M06p96R10m77J215
4188A015j001k83Q26j132M12J83O35o41K13k26K11m48Q27q6o83M84k29J64o10
4207c69p8K0M68M58p33j77K85J08K88m91o85J62L58J057n05l2J41k69N39k48k20
4228G7o22O79P4k95k30L57J43K79n4J03o84L13k1l15j2N36k20km30L37M5O22j728
4251a048J079n28J177M10j349L87p1m21l49Q28l47J21j31j93M13M48q43L72j65
4270b10k66J93n96J714p87P86M68L71j896j36L68n08R96j177O10O5J28O45L18
$$ plain form
4130 -224 -227 -516 114 -324 383 503 -1136 -125 730 -270 896 -575 -465 1041 -427 707 -296 -797
4148 -797 396 -197 324 -268 -250 -1132 688 437 416 62 -605 -99 -929 -172 -84 -164 879 22 516 403
4168 403 244 -111 403 -101 -601 88 -749 -27 -958 -259 50 191 -118 -22 -243 163 -633 277 -200 1015
4188 1015 14 -269 557 -575 -163 20 655 14 227 1 212 -236 591 505 -178 306 77 241 -369
4207 -369 -447 -427 41 499 -234 -411 -126 -18 270 -221 -906 -744 -386 671 166 134 275 6 545 297 77
4228 77 -545 134 208 -87 -317 40 183 462 408 511 -173 140 119 -196 -208 328 108 106 -324 13 58 680 -1048
4251 -1048 31 -497 680 1090 -259 128 57 -364 -713 115 -232 -111 -242 -435 -22 426 -417 -45 -210
4270 -210 -476 -283 -879 835 48 834 1302 1673 -223 -359 9 -499 497 -680 -70 -5 123 768 1086
4289A086j392k6L19o64J181m64n6j90m30J298o0j176K99P97K4O4N5J1j568J079
4309A87q14P6J110p53N7n5pj40J032p43k85N67J71L49m72j58k85l87J99K26N0
4330g5k10P82j023j49N66L42K67m08o99J492rj330R32L13o27oK01m10o75K94L67
4351f5Q8k9K50j14k68k73K84k9l02J097j128l03M56M12p64O84k1O34j319O61o78
4372g27J381r94J39P03j26j383L48M35k1O2l56K22l72J152o84k19M85j82K04l37
4392b70R15l93p68P03l0k36R9n29R58L21p26k52l75J025o15N89j482N38m5Q06
4412B33m99o63Q39K41o28M42J326j456O06J70L07r77m17L28O46k25r70K14L28
4431a55kO90n92j57J93m16N07m41O89l28M27l22l21j1J55Qj97M16o79J30J60m3
$$ plain form
4289 1086 -306 -332 -13 -677 504 40 -16 -206 -636 662 602 -574 -275 522 546 610 665 676 -892 187
4309 187 -627 -551 559 -194 -137 -192 -199 -339 693 -50 -335 232 403 752 280 122 -163 -550 -351 -125 -75
4330 -75 -285 497 -526 -675 -109 233 500 92 -607 885 876 -454 478 791 164 158 359 -51 -726 -432 -65
4351 -65 23 -6 244 130 -138 -411 -127 -156 -458 639 -489 -792 -336 76 -688 -4 -25 609 -710 -49 -727
4372 -727 654 -340 -201 502 376 -1007 -659 -224 -245 -183 -539 -317 -689 463 -221 -440 45 -137 67 -270
4392 -270 645 252 -516 187 157 -79 20 -509 449 770 44 -208 -583 442 -173 416 -1066 -528 -573 233
4412 233 -266 -929 -90 151 -477 -35 1291 -165 441 611 918 -59 -476 -148 498 273 -697 -483 -155
4431 -155 -157 533 -59 -216 -23 -439 68 -373 316 -12 415 93 -228 -239 -84 -76 -273 143 -536 -406 -246 -289
4453b89l0K63M4J91l85R57o58m77k79Q72n63N09l79J25N36j52p03k03N2K0P92
4474B43j9o28J00O69l92M05k64j071N99M92j79J76J28j76J51k72J20J68m06Q28
4494F72l38k99M0J96L3k22l4o32O03m90K45O15n36L47L74J45r63k5K81K99n27
4515b16K34q72J054p1K33j196R36j05l39R2N37J5j33j83L16j39n74O30j41J33
4535B11j02L97q45K89j11o46N96Q42p04j26P8J62l18K83M1j26K91k12n10Q79L1
4556D00m25j6N5J07L54j187P64j24j62j55O18K84k07L28p18q5N87j17n36J79L45
4577B89m51L44n4K74p47J09L48n08R12j52m24k61l4P36n04K10J89L27r39K03K04
4598G1j80k59O79j23J92o35R26j014M74l05J154q03j7M13p55q3j23L51l11P01
$$ plain form
4453 -289 -319 -56 -12 179 -206 751 93 -384 -663 209 -354 155 -224 -99 437 285 -418 -621 -569 -549 243
4474 243 224 -404 -304 365 -27 378 114 -957 -358 134 -45 131 259 83 234 -38 82 250 -156 672
4494 672 334 35 75 271 304 82 48 -584 19 -471 -226 389 -147 200 574 719 -244 -269 12 311 -216
4515 -216 18 -854 200 129 362 -834 102 -3 -342 -250 287 302 169 -14 302 163 -411 219 78 211
4535 211 109 506 -339 -50 -161 -807 -211 631 -73 -199 -121 41 -277 6 47 -79 212 0 -510 369 400
4556 400 -25 -41 14 121 475 -712 52 -72 -234 -389 229 513 306 634 -84 -169 418 301 -235 -56 289
4577 289 -162 182 128 402 -345 -236 112 -396 516 364 -60 -321 -355 381 -123 87 276 603 -336 -133 71
4598 71 -109 -368 311 188 380 -255 671 -343 131 -174 980 177 160 573 -182 -265 -388 -37 -348 353
4618C53n11k57N34Rl8k69k07J54O29K53r35j36J21R78p93j40N05l02L54l79N0
4639b7P98r03N9M04k73M50o02M45o18p0M86j0J99o91P36l93k7k81J4K03R7k29
4661b33M14j2o35J57O94n01J49P5l27K69L40r39O38l01M88J66k53q84J433q43
4681a05J81R1J62K2l75J54m29J430j489O46L26j596P20J45L08m01L7L5M77Q4q0
4702C43j52rj116J231L28q37j13J45K85j97R0o39M33R00p02K22m70Q18l79j32
4722D9q3j9k1R6R2N92k23q07O19m95n35R73l97O00j068OJ083l26J41m74K6J14
4744e7L04j003J245j250J260P28l98M25p25p16P84K64M20k257L07P1K25L61O35
4763F23j7o78q1o25j01k94J204p02J771k892K076j044J983K76k222O6q05K300
$$ plain form
4618 353 -158 -415 119 128 90 -179 -386 -232 397 650 -285 -421 -300 678 -115 -255 250 -52 302 -77 -27
4639 -27 771 -132 -73 331 58 508 -94 351 -267 -337 149 139 338 -353 383 -10 -37 -318 -304 -101 -4 -233
4661 -233 181 169 -466 -309 385 -116 33 108 -219 50 390 -549 89 -212 276 442 189 -695 738 -105
4681 -105 76 167 329 351 -24 130 -299 1131 -358 288 614 -982 -262 -117 191 -210 -173 -138 339 423 343
4702 343 191 182 -934 297 625 -212 -325 -180 105 -92 -2 -641 -208 692 -10 212 -258 560 181 49
4722 49 -34 -53 -74 22 114 706 483 -324 295 -200 -735 238 -159 441 -627 -621 462 136 277 -197 -171 -57
4744 -57 247 -756 489 -761 499 1227 829 1254 529 -187 597 861 1281 -976 -669 -598 -373 -12 623
4763 623 606 -72 -153 -778 -879 -1173 31 -671 1100 -1792 284 -760 1223 1499 -723 -657 -1462 838
4781H38m15q83Q25o13n45L07q0p39J824n38k7M32r26J74J005m58J6p02O71lR08
4802A071j427N33o74J000j27K77j198N43l80L28r5m12J251L02r66R52j841q1K041
4821A097o62j585J561j097J159m32M39p7J51J007j795J304k29l97j007k60P46
4838g7M87q16J84N57k42J060m86j109l44J409K04r38O59o92J03j84J906j362p33
4857d14J46j547J057J08J036j005P29m53J28N81q63n12P09J95Q02j637Q16j378
4875a502K466o23l87r37R32o94J622j234M50L64j766J423j706K702j170o50J505
4892G95o16m98j67O18L8P2q94O22N0q29Q59j32j059J30Q35K18q25J83J486o91
4912A95j76O30m65k38O54o91K73J22p02r0J419j033J17J00l59R89p04K17n51l85
$$ plain form
4781 838 423 -460 365 -248 -793 -486 -566 -1305 519 -19 -46 386 -540 -366 639 181 197 -505 166 163 1071
4802 1071 -356 177 -497 503 376 653 -545 -2 -382 -54 -149 -561 690 992 26 978 -863 -944 1097
4821 1097 435 -1150 411 -686 473 41 480 403 554 1561 -234 1070 841 444 -563 -823 -77
4838 -77 410 -406 -222 335 93 1153 667 -442 -786 623 827 -111 548 -144 -41 -225 1681 319 -414
4857 -414 -268 -1815 -758 -650 386 -619 110 -343 -215 366 -497 -1009 -300 -105 697 -940 -124 -1502
4875 -1502 964 341 -46 -983 -51 -745 877 -357 93 457 -1309 114 -1592 1110 -60 -710 795
4892 795 179 -319 -486 132 170 242 -652 -30 20 -809 50 -82 -1141 -1011 -176 42 -783 -600 886 195
4912 195 19 649 184 -54 600 -91 182 304 -398 -488 931 -102 15 115 -244 745 41 258 -293 -678
4932f78K3O41J54j073K99P52r04Q22K94L87n35m29j058J314j90J006N2j103J24
4951a02O37n1j286P87j18M41L46j036k80K10M04o22O61o85R51O5k56j84L93l38
4971f3M67k95K31q99Q43J21N4J98j742J611q22L78n83N19L33l57L58k8M91q26
4991a1L53o71n9l12Q33K85n37R6j96P95j70n4q09j07R80p52K35p37O12qO10K92
5013F68q58Pn08J273k83j239M13J718j825J097k25j088R60K20K48r17K80l2l5
5032a26K48n57N1K63M64m85M65r14O30L94k86m7k18k23L3L93k0o50K99K97J33
5053A44l11J65K15m91M09o75M53J57j61Q45q49k20j42j04K24K00k73O02l48j65
5073c25K73K3o35P02K23k56m87P78m16Q26m72m78j87R37J74p80o1j03K54M89k67
$$ plain form
4932 -678 -655 -14 140 -933 -634 118 -786 36 330 717 182 -247 -1305 9 -181 825 877 -226 -102
4951 -102 535 484 -802 -15 -133 308 654 -382 -662 -452 -48 -670 -9 -694 257 322 66 -118 275 -63
4971 -63 404 109 340 -559 284 405 459 657 -1085 526 -296 82 -501 18 351 -6 352 324 815 -11
4991 -11 342 -329 -388 -700 133 418 -119 -23 -219 576 406 352 -457 -564 416 -336 -101 -838 -226 -234 376 668
5013 668 -190 -183 -691 582 299 -940 -527 1191 -634 463 238 -850 110 330 578 -339 -59 -91 -126
5032 -126 122 -435 -384 -121 343 -142 323 -591 39 433 147 100 -118 -341 -308 85 65 -585 -286 11 144
5053 144 -167 -2 213 -278 131 -544 -91 66 -95 750 -99 -319 -461 -565 -341 -141 -414 188 -160 -325
5073 -325 -52 -29 -664 38 261 5 -482 296 -120 706 234 -244 -431 506 680 -100 -161 -264 -10 479 212
5094B12j050Q03L86j17m68N16n58Q45j100P34p85L56L14M1n37N40K69m43O06n55
5114In28P43ol53L75q5k89K54K74l50o7L32J38j07l67L02J73k70K23n45J46j36
5136a34J51k14K86l55K12m11K71Q02j263N33J267n73p3n94N40O25j393m37K87
5155d73J281p35P1L79n53J88J90JL50o44k54P83o07O4N69m32l95o43J367p80O78
5176D05j046R00n62n41J086J132r37j220J158l52K13l85O58m75o0L96N58r32r9
5195a03J038j327K78l8L03l7o82K97Q29k88k62j67P68m58J49j95j36O02o67M04
5215C08j68O67l49j02j82r50J42M23J51J229j947J023K06n93k88k62N17K69p82
5234f88J28l22J014l73L5L97k64P86l94m84Q63p03M73p34J4L48J7L00P0k88o43
$$ plain form
5094 212 -838 -35 351 234 -234 282 -276 569 -531 203 -582 -226 88 129 -408 132 401 -42 564 9
5114 9 -519 224 218 -135 240 155 -134 120 394 44 -23 309 447 340 -27 275 448 178 401 -144 2 -134
5136 -134 17 -197 89 -266 -54 -465 -194 608 -655 -122 1145 572 499 -95 445 1070 -323 -760 -473
5155 -473 808 73 144 523 -30 158 348 349 699 55 -199 584 -23 41 610 178 -217 -860 507 -273 405
5176 405 -641 259 -303 -844 242 1374 437 -783 375 23 236 -149 509 34 -26 370 928 -4 -103
5195 -103 935 -392 -114 -152 151 114 -568 -271 558 270 8 -159 609 151 300 105 -31 571 -96 308
5215 308 140 807 458 356 174 -776 -634 -211 -60 1169 -778 245 451 -142 -430 -692 -175 94 -688
5234 -688 -560 -882 132 -241 -206 191 -73 713 319 -165 698 -5 468 -266 -252 96 113 413 483 195 -448
5255d48N70M79k37K02j060K08M15O91q78k89l97J348J43q93N08n14j22O66K16
5274F08k32j209J573j128K27K72o61M93q6l36K35j39M05L78r72Q98L78n51K97
5293D50k04J2n49J076l42l00n34J305J07r70M32l85j498J377J219j922N78n0J138
5312I40n70j98n46n06J002M07p09M36k011J369R56J7n12m23K33K08r83R81j040
5331i49J063N92m65J57j072J18P71N9p31P63m35m8M0J70L97J06p3m62K12k58k82
5352c27M47r71R60j28O4l61M82K09m46p74O55j52L13j89P2K95L18n84k2M8J0O1
5374b0J11k29P94J83l70o10q93Q31L88L49m43K99j87L1K36o08k84M84L93j73M09
5395F91j457J127o62M48n6J02q80M62n9J96k02r3K53l08K18N8K57j00P03j380
$$ plain form
5255 -448 122 601 364 566 -494 -286 129 820 -58 -347 -744 604 747 -146 362 -152 -274 392 608
5274 608 376 -833 740 -388 -161 111 -550 -57 -143 -479 -244 -383 22 400 -572 326 704 153 450
5293 450 246 258 -291 785 443 143 -391 914 1021 51 483 98 -1400 -23 1196 -726 -148 -198 940
5312 940 370 172 -374 -880 122 529 -180 256 -1755 -386 570 587 75 -348 -115 93 -890 91 -949
5331 -949 114 706 241 398 -674 -556 215 274 -457 306 -129 -177 -137 33 430 536 463 1 213 -45 -327
5352 -327 120 -851 109 -19 45 -316 166 375 -71 -845 -190 -342 -29 -218 -146 149 467 -117 -139 -91 -81 -20
5374 -20 91 -138 656 839 469 -141 -1034 -203 185 534 91 390 203 234 470 -138 -422 62 455 282 691
5395 691 -766 361 -301 147 91 193 -687 -225 -284 -88 -290 -383 -130 -438 -220 -162 95 -5 698 -682
5415f82L11l25R53n97N92m89N69l0k49p00L09RP35L56r19j53k37J038j159J221
5435E53j246J330J26k64j03j062Q03J167j841j9k21J58R16o3j50K83k49M5j31
5454C2j94q6O0L83p45N17p07N75L27k86O48q32L01K32r3j71p94P29n19J10L13
5475b00O08k63n28K41N61j83m52K50N00o28p32M44N59r4Q3k15Q68p25m26L86o65
5496f11O87O11j113J10O61n38k77N03O4L64l13J66K35r47J64n96J495m35O09n66
5516B73m9J03k53N92n33M64p14R29j033O7J74q6N60j263K68J77J27O41m12J52
5536A84q0M1m50L03j51R08r51J334j077l37o91J58N69R58j270n04M68L88L32J39
5556B71n83O47K49l46n1p08J231q82M54r67R89o45J482j205j95k98J698j452J01
$$ plain form
5415 -682 -371 -696 257 -340 252 -237 332 302 53 -647 -338 -329 406 762 -157 -310 -547 491 -668 553
5435 553 -693 637 763 499 396 -666 137 1304 -537 -556 -777 -619 297 234 84 367 118 163 32
5454 32 -162 -248 -188 195 -550 -33 -740 -165 162 -124 524 -308 -7 225 132 -39 -833 -104 -623 -513 -200
5475 -200 408 145 -383 -142 419 236 -216 34 534 -94 -826 -382 177 83 166 -49 819 94 -332 54 -611
5496 -611 76 687 -426 -316 345 -193 -470 33 97 461 148 314 549 -398 -234 -830 665 230 839 273
5516 273 224 327 74 666 133 597 -117 812 -221 -154 20 -66 494 -769 -501 -324 -197 444 32 184
5536 184 104 145 -305 -2 -153 755 -196 1138 61 -276 -967 -809 -240 718 -552 -1056 -588 -200 132 271
5556 271 -312 335 584 238 187 -521 710 -172 282 -685 304 -341 1141 -64 -259 -557 1141 -311 -210
5575b10R29o45P33o13m59R20o51L26k49M89l77j019J014m54o07J422j8o46J305
5594A190j678P69l98P24j376P77o60O15o01Q09n63O50K48M55L0o31J12o64K87
5613I5L7j283N99p3R74n8J07p65l46J431q02p48KP75J322j122m78O11j40P53q23
5634F8j021O98PJ84M09L19p46j16L81q1L75N35j325R83q8k55j26k73jJ17m41J18
5656b79O69k91o71J039l57j55O04m7j11n53m3L82N99m2o50o0k89M7L47J21m91
5677b31K21N9PN55m92M00Kq91L18N41p17L90o53J84O31l46L16l32k99K60J96p6
5699D3J71l45M14p96P54l86N36q82J103l92M16R5p42O68l38M68p97P4N29j097
5719e04J163j536N81j83N32j87k09j41Q91m26j30J32k66L40j269J988j116m95
$$ plain form
5575 -210 719 74 807 194 -265 655 4 330 81 570 193 -826 188 -266 -873 549 531 -115 1190
5594 1190 -488 281 -117 607 -769 8 -652 -37 -638 171 -392 258 506 961 991 360 472 -192 95
5613 95 132 -1151 -552 -625 349 291 398 -367 -713 718 -84 -832 -830 -55 1267 145 -333 278 138 891 68
5634 68 -953 -255 -248 -64 345 664 -82 -198 183 102 477 1012 -313 670 582 327 201 -72 -73 44 -397 -279
5656 -279 390 99 -572 467 110 -45 559 512 401 -152 -195 187 786 744 94 34 -255 -208 139 260 -231
5677 -231 -10 49 56 611 119 519 521 -370 -52 489 -228 162 -491 -307 324 -22 294 -38 -337 -77 119 43
5699 43 214 -131 283 -513 241 -145 391 -491 612 220 636 731 -11 657 319 787 -10 64 593 -504
5719 -504 659 -877 -296 -479 53 -134 -343 -484 407 -19 -149 -17 -283 57 -1212 776 -340 -835
5737h35N42J198j148N7L02J20l06P80k53m32k08j42r5Q54j00k50n62J141j005
5756c42J033k80L8L82j140l10N43K16n81l45P26q94J108N87p86M36n71l08j054
5775a542J595m38kJ196m57j838J221M05L44J31p45p30O94L74M5l12J81m60L12
5794b6J16n50j21L13P10j156N93J66J7o1N69o78Q1K55o04O20J03j106Q17k90J34
5815i8J35j78J70K87K37o54M29R0k58j70K16m31N2J9P43n28r11Q33J94N08j190
5836e05Q26l92N81r37l7K26N36j12j23L46k70J86m8m97r4j44M96r86Q63o0O17
5857D72r82J452j271M0O54j169O39k12J070j163M7K04Q25m00K15p88k25N10Q07
5876G25Q0r41j99N03j92K24k13n8K19m34N2n0O5J60J45P1k17J50l73K56M57k2
$$ plain form
5737 -835 -293 905 -243 -186 116 236 -70 710 457 25 -183 -325 -420 434 334 84 -478 663 -342
5756 -342 691 411 449 831 -309 -619 -76 140 -441 -786 -60 -954 154 741 -45 391 -180 -488 -1542
5775 -1542 53 -385 -387 809 352 -1486 -265 140 484 615 -130 -860 -166 208 253 -59 122 -338 -26
5794 -26 90 -460 -581 -268 442 -714 -121 45 62 1 570 -108 -27 228 -376 244 347 -759 58 -232 -98
5815 -98 37 -141 29 316 553 -101 328 418 160 -10 206 -225 -173 -154 589 61 -850 -17 177 685 -505
5836 -505 321 -71 510 -427 -464 -238 298 186 63 409 139 325 277 -220 -314 -458 38 -948 -85 -145 472
5857 472 -510 942 -329 -289 365 -804 -165 -377 693 -470 -423 -219 606 206 421 -367 -592 -82 725
5876 725 805 -136 -335 168 -24 200 -13 -71 148 -286 -234 -284 -219 -59 86 157 -60 90 -283 -27 430 408
5898D08n56l68N33K15o55L37R75R5j194L97n69J206o73M11L63o20l87J492k051
5917f41M45l85N35N22j104o02K260l36j155l51J83R59M65l58K76j09n80N77j727
5936a126K008p23r92J720P88j967N55m92M29n37K39P63k378Q48O67J211n62K19
5954F70N07q60j685J478J051j576l92J060l22N57j266j164K138j471K749m55m33
5971E86r85N4P16j092N03L32M54j122P40N2n82O29N12j199K21J999k32k256R33
5990B63L65O60q59o00J456j203j26J08L55p77J008oj748P66J426P9n92n83l87
6009c95N05J37p32l76J134J91j216J349o80m63J123N11k151J981o72j07k42m22
6027e25Q12m02o95N43J169j263q39R70J302q29K03j92r54O25r3Q21n33M9O91j218
$$ plain form
5898 408 -148 -516 17 232 -423 -86 889 984 -210 187 -382 824 151 562 925 305 -82 1410 -641
5917 -641 -196 -581 -46 476 -628 -1230 1030 694 -461 -812 -629 330 795 437 713 604 24 601 -1126
5936 -1126 882 159 -833 887 1675 -292 263 -229 200 -337 -98 665 -1713 -865 -198 1013 451 670
5954 670 1177 317 -1368 110 1161 -415 -807 253 -69 488 -778 -1942 196 -1275 1474 1019 586
5971 586 -399 -345 371 -721 -218 114 568 -554 186 238 -344 285 797 -402 -181 1818 1586 -670 263
5990 263 628 1288 429 -171 1285 82 -44 64 419 -358 650 644 -1104 -338 1088 1167 575 -8 -395
6009 -395 110 247 -485 -861 273 464 -752 597 -83 -546 577 1088 -1063 918 246 139 -103 -525
6027 -525 287 -115 -810 -267 902 -361 -1200 -230 1072 243 446 254 -700 -75 -168 653 120 169 860 -358
6047c58j41J307j50o98k94J03K78m61l23O3J051m98P3n4J48MJ135j161Q4P11p37
6068H2L63p69O98O03j503L30j21l6K35K46L50j460R21k73k0J384o4k133J701j424
6088h90L08M28j34K34O62q13j14J465j495P81m2O39o73K41k07O5r98J304o25Q
6108A44r05O32N1j09R26p74N8n30K513j798Q43j315P90L24j270J22K2J540J13
6127A377m76l37p71l31J057j17o88n61O11M79n26J17K91n59L20k81J200o41N75
6146G39j452J2J220m10j40l97Q03j68k08K37R82q22p10J104o09L22n98K48j45
6165Hl15J015j80j053R21k64J03p7o46Q14J34m67l75R03j011K68j04N67m33m82
6185f74K410l28q79m42j398O27L07K68O74j608J390r42R83n90J407n82j287N66
$$ plain form
6047 -358 -499 808 658 -40 -334 -231 47 -414 -737 -674 377 -121 -48 -102 46 50 1185 24 108 819 82
6068 82 445 -324 374 977 -526 -196 -317 -353 -118 128 478 -982 -61 -334 -354 1030 966 -1167 534 -890
6088 -890 -582 -154 -288 -54 608 -205 -319 1146 -349 432 390 1029 356 597 390 455 -543 761 136 144
6108 144 -761 -129 -78 -187 739 -35 23 -507 2006 208 1051 -264 526 850 -420 -298 -276 1264 1377
6127 1377 901 564 -207 -538 519 402 -286 -847 -236 243 -283 -166 125 -434 -114 -395 805 164 739
6146 739 -713 -701 519 109 -31 -428 375 207 -1 236 1218 396 -314 790 181 503 -95 153 8
6165 8 -307 708 528 -525 396 132 235 158 -488 326 460 -7 -382 521 -490 -222 -326 241 -192 -674
6185 -674 1736 1408 529 87 -1311 -684 -377 -109 565 -1043 347 -595 388 -202 1205 623 -664 -98
6203i8M03ok56j92j97L67n66q7J805j690R21K45j147Op9M53q0MO0P00L71j209
6225b72M79r09R92p33O53L6j29m42N35k09L01m40K99q2k29L24K47q29N25K9l23
6246a77J73K39M19j054M10L50j261Q49o4N95m90K94K10k40p05M15J83k09j25j15
6266c03P34m10j38K27o8K34n30Q2O04j34j7n56K4Q08M44j215N63n94K98l91L25
6287a3L85K6k88r2k49l58N36L5k1j87R65n91K05k74O86j076N44l08j4L48k32N02
6309E29m69j02k23K82m26J73K70L68K36j258K91L94l3l74N47L39m00l6J06M28
6329F42J2p59m53L66N44J23j227O99j67R42p53L38n05L61J035j022n92Q22j151
6348g45J219o84K60l57M10lk03J29l84L56j88n06P16N81j194L56K45M18m13r7
$$ plain form
6203 -98 305 299 43 -149 -346 21 -545 -632 1173 -517 404 649 -498 -492 -571 -118 -198 -194 -134 566 937 -272
6225 -272 207 -702 290 -443 210 246 117 -325 210 1 302 -138 161 79 -150 174 421 -408 117 146 -177
6246 -177 -4 235 654 -400 10 360 -901 -52 -116 479 -11 283 493 253 -452 -37 146 -63 -188 -303
6266 -303 431 21 -117 110 42 276 -254 -172 432 298 281 -275 -251 557 1001 -214 349 -245 53 -338 -13
6287 -13 372 398 110 18 -231 -589 -53 -18 -39 -226 739 148 353 79 765 -311 233 -75 -89 259 27 529
6309 529 60 -42 -265 17 -409 -236 34 402 638 -620 -329 65 32 -342 205 544 144 108 214 642
6329 642 654 -105 -558 -192 352 475 -752 -53 -220 722 -31 307 -198 163 1198 176 -416 406 -745
6348 -745 474 -210 50 -307 103 100 -103 26 -358 -2 -190 -696 20 601 -593 -237 8 426 13 -84
6368h4j94J006o04m82M42J85l92j51K9N19r32Q88J45m25K27P7L00k73m95N97m25
6389d2Q95o79P8J65l20j78m52N36L72m96%K12J75k88q53Q96J80KJj53j07K03q7
6412F0O11o69l41J035n08M1J35ll77K40l71k45N43j7o61N68p19Q54k52O7M25o98
6434b82P46k84L48l68l8p7L98o01K44n9m70K98K78k29k45O10j188O52K36N1m93
6455d73j25P74m2L19k95K88n3o83J31N07o38L96m2l38m06j15N79Q41j153m61m4
6476a033j27K311k213J406j98K26r4O18o02k54m60L96M32m94M58j00J74k80q47
6495f81Q16N2O88o45q50J184L44o55j235P18K67k91K38J13l46R52j644L54K03
6514d18N53l40N89q5j253K36K35J93k88K49L87k98j7k01P9R3k72O35k2m23K50
$$ plain form
6368 -84 -278 728 124 -358 84 269 -123 -274 -245 274 -658 230 375 -50 177 254 554 281 -214 383 -42
6389 -42 853 174 252 417 97 -81 -533 3 375 -121 -121 91 266 -22 -875 21 201 203 204 51 -56 147 60
6412 60 671 2 -339 696 188 229 364 361 -16 224 -147 -392 151 134 -527 41 -678 176 -76 -9 416 -282
6434 -282 464 180 528 160 122 45 443 -158 86 27 -443 -145 133 -96 -341 269 -919 -267 -31 20 -473
6455 -473 -598 176 134 453 158 446 393 -290 -159 348 -290 106 64 -274 -680 -795 -216 625 -528 -989 -1033
6476 -1033 -1160 1151 -1062 344 146 372 278 896 294 40 -420 -24 408 -86 372 272 446 166 -681
6495 -681 135 187 875 230 -620 564 908 253 -982 -264 3 -288 -50 63 -283 669 -975 -621 -418
6514 -418 135 -205 384 299 -954 -718 -483 -290 -578 -329 58 -240 -257 -458 -379 -286 -558 77 55 -368 -118
6535a18M46j369P70L01o59Q45l1k82l64j10O06j76M41J19o69K83r1P08q84L14
6555H0N7K21J33j010m04J097K55n59J215k536J171J317K14J93j297k33P82M86
6573A182q80m21n4k07q65R79l77J39J985p14j454L48L76r36N75j79J69O42o40
6592c32N64n62J095p84j27r1Q01k05m72M27m60j90K51l73O44L27N25l38r76K63
6612a3n03R57m20j92j70O65m37j5J70n29on3J42J091o06K43p41K78l25J39N24
6633A99r98P94N17j775J499J26p70O37k36J90m16N00k67N10l57J6K74N46q22j95
6653b8k72M5R99j342Q35n82J35P3Q19j202M69j160R43J009j79j028J67K30l38
6672d07L16j054J359m65R71j770M25O01N6R18m62K39J06j205N93K44J358j863
$$ plain form
6535 -118 328 -1041 -271 30 -629 216 185 -97 -461 -571 35 -141 300 419 -250 33 -58 650 -234 80
6555 80 137 358 491 -519 -923 174 429 -130 1085 -1451 -280 1037 1251 1444 147 -86 696 1182
6573 1182 302 -119 -173 -380 -1245 -266 -643 -504 1481 767 -687 -339 37 -899 -324 -503 -334 308 -332
6592 -332 232 -330 765 -19 -146 -237 564 359 -113 314 -146 -336 -85 -458 186 513 1038 700 -276 -13
6612 -13 -516 441 21 -171 -341 324 -113 -128 42 -487 -493 -546 -404 687 81 324 -417 -139 -464 -325 199
6633 199 -799 -5 512 -1263 236 362 -408 229 -7 183 -233 267 0 510 153 169 443 989 167 -28
6653 -28 -300 -255 744 -598 237 -345 -210 -137 682 -520 -51 -1211 -268 741 562 -466 -299 -69 -407
6672 -407 -91 -1145 214 -251 720 -1050 -625 -24 32 950 488 727 833 -372 221 465 1823 -40
6690d0n04J535j097K82K89n84P68p80M03m97M37m09j59M88J42k44l91k13O8J062
6710E56n15L73m01N12M42j354J270m15l17m45k32Q88o93m4L19L07j51O39o94Q
6730E3L6n64M15N16o10K12n2j497J943p88N80J38M07n40J32L13Or25n81J212j019
6751f13J046lj371J501J26j73n68J051j158J30J57o44J328r65m04L51M87%K57
6770E35r16K17J80L27q89N88P33j147K53N65k87K51L07j73q35M12N01p32o11R81
6790B60k87J58j69M10j156O17M00j63l10N17j80Q8o00J010m10k58K35L19n95M02
6810B88k00m09L5L22m92N48k54L47Qk28O37m70k85N2J0R5O66m63j97M91q62L07
6832e4M92k50p5l23L03J76l80k65K91L05L06o35J09o85Q74K56j041J420k84p11
$$ plain form
6690 -40 -544 991 -106 176 465 -119 649 -131 272 -225 212 -197 -356 132 274 30 -361 -574 -506 556
6710 556 41 414 13 525 967 -387 883 468 151 -294 -526 362 -331 -375 -56 251 100 739 45 53
6730 53 89 -475 -60 456 -154 58 6 -1491 452 -336 244 382 789 249 381 694 700 -225 -806 406 -613
6751 -613 433 430 -941 560 686 513 -55 996 -162 -32 125 -519 809 -156 -560 -209 278 278 535
6770 535 -381 -164 16 343 -546 42 775 -372 -119 446 159 410 717 544 -291 121 622 -110 -721 260
6790 260 -27 131 -38 372 -784 -167 233 70 -240 277 97 185 -415 595 185 -73 162 481 -114 288
6810 288 88 -321 -286 36 -456 92 -162 185 193 -35 602 132 -153 -101 -91 4 670 207 10 501 -361 -54
6832 -54 438 188 113 -210 93 269 -111 -376 -85 220 526 -109 0 -685 189 445 -596 824 540 -171
6852a71R8L8q99J243m97k76K90RRP63n36P4m05P26o36m40M34Q5J98l25K39k35
6874b14J9Q41k33n91n21N48K25J45J74m54k7m59O73o13Q80n0p61P3j87M26L45
6895B39k84J91jJ31k89m17P22n14m79K49Q76k36m56O11m1k83j67L12j0P0n6K29
6917C97j363J304l99Ol7M57n30l68K97K68l7k87K38j96O91j053Q62n24K54L67
6937C47K66r54J24K25J8j28N89p76K93j86j48L83m13L23J02l43M84Q5K90q63L54
6958G2k55n44R51L54j113L89K12j17N9m92L01j74q0N97Q08j309N97j17j6k99p
6979a83j51N57q1J51k27M02j67n68j44R2o3L56l1j35l25m4N0L68M92p14M43r41
7001h63j07P49J48Q46m9l56j19P03r12k12m99L99Q63q99P01M3P14r11j15j65O15
$$ plain form
6852 -171 -73 -35 -934 309 -188 -464 -174 -165 -156 607 71 145 -260 466 -170 -610 -176 -91 107 -218 21 -214
6874 -214 -195 646 413 -178 -699 -151 74 219 393 -61 -88 -547 126 -487 393 343 -418 -345 -532 -106 239
6895 239 -45 146 145 276 -13 -430 292 -222 -701 -452 424 188 -268 343 302 19 -148 164 154 224 168 397
6917 397 -966 338 -61 -55 -92 365 -165 -533 -236 32 -5 -292 -54 -250 441 -612 250 -274 -20 347
6937 347 613 -341 -217 8 26 -102 487 -289 4 -182 -330 53 -360 -37 65 -278 206 291 581 -282 72
6958 72 -183 -727 224 578 -535 -146 66 -51 8 -484 -183 -357 -437 160 968 -341 256 139 123 -176 -183
6979 -183 -334 223 142 293 66 468 301 -267 -411 -319 -382 -26 -57 -192 -517 -561 -511 -143 349 -365 78 -863
7001 -863 -970 -221 -73 773 724 368 249 952 40 -172 -671 -272 591 -308 393 436 1150 239 124 -41 574
7022E74m11l94l8O01J59r53N97K22k85K89J26p45M93j16Q42q91l48N99o58M45
7042A08j73j66P73r56K43M36m25L88j01j40J37n67M54o30P06o42N21R0l6j36J40
7063B4m01L03L18j73k17j097J663j05j61O5J13J69p14J78n11J203q20J0P08Qm77
7084H6o13O46j98k41k4k3K22J37M30K45j0q12P12K29n9j198R91j36k00J70m58
7105a04N86j753J132O69l18L16p44R74l73p35P50k16m17K6k0J78L30n56M37m55
7125b93P57M58j276P55n97l70J061o82n20R38l28L32L44n94K4K5M6k65m16J044
7145D43k80O72j083K2Q27j346Q85N92j260R91k12R1L0p9k7k94p07J051j03q11
7165e98J196p73N91n43O57n46n04n38R04K35k3r85O66l20J039j167J088k03j00
$$ plain form
7022 574 163 -231 -269 332 491 -462 135 357 72 361 487 -258 235 119 961 70 -278 321 -337 108
7042 108 -65 -231 542 -414 -171 265 -160 228 127 -13 124 -443 11 -619 87 -555 -34 56 20 -116 24
7063 24 -377 -74 244 71 -146 -1243 420 315 154 219 332 501 -213 -35 -546 657 -163 -153 555 563 86
7084 86 -527 119 -79 -320 -344 -367 -145 -8 422 667 657 -155 557 786 727 -471 520 384 184 354 -104
7105 -104 482 -1271 -139 530 212 528 -216 758 385 -350 400 184 -233 -207 -227 -49 281 -275 162 -293
7125 -293 464 922 -354 401 -196 -566 495 -187 -707 231 -97 235 579 -15 9 34 80 -185 -601 443
7145 443 163 835 -248 -226 601 -745 140 732 -528 463 251 342 372 293 266 -28 -735 316 213 -598
7165 -598 598 -175 416 -127 530 -16 -520 -1058 -154 81 58 -927 -261 -581 458 -709 379 176 76
7184G6P3j412J302L65j80j90j70N55r67N20j03Q49j88o40O82q01n6M87j23L55
7204D34l77K84p52J19P27p86M80L13l17m43j70J352o29L84q96K56p9O09n12pM6
7225C6M90p35N7lP01q71K60q0N35k80J3r11R63M8J35n79M88o14J71Mk4L68J99
7248C71R85j556O73r90P87K02n48k85J237j731J4Q31j12m40J411j243m0N96p95
7267f33O02O5q3k71K42L68j94n35R80o51J1J18q35J638n91L27K1q20Q9k42J054
7288F60r1r31L47Q54o65l36J34L73l21L91l42L24r12M55m89K05M32k74l67N85
7308C2q3L79k47K31n02K39j87o34P08R8j20K42N5o10J135m13o1L1j1k25n17J95
7330b65M30n58N92q13M56N7J63L08l08l02K07n88L23P60r72Q40n43K09P5L62o08
$$ plain form
7184 76 149 -1263 39 404 224 34 -136 419 -548 -28 -131 718 530 -110 572 -229 -285 202 79 434
7204 434 57 341 -411 -292 435 -351 129 442 125 -318 -488 864 235 619 -277 -21 -100 509 -3 -10 36
7225 36 526 -209 -152 -155 546 -325 -65 -145 390 110 123 -788 175 223 358 -221 267 -347 -176 -172 -196 172 371
7248 371 1356 -200 473 -517 270 472 -76 -361 876 -855 -841 -10 -122 -562 849 -394 -434 162 -633
7267 -633 -31 34 -49 -320 -78 290 96 -439 541 -110 -99 19 -816 822 231 558 579 -241 -152 -394 660
7288 660 569 -362 -15 839 174 -162 -28 345 24 415 73 397 -515 -60 -549 -344 88 -186 -553 32
7308 32 -51 328 81 312 -190 49 -138 -772 -64 34 -86 156 211 -399 736 323 262 293 282 57 -460 -265
7330 -265 165 -393 199 -614 -158 -101 62 370 62 -240 -33 -621 -298 462 -510 330 -213 -4 71 433 -175
7351a75N8k1J51O93l13j043J45K19O18j26j73K2J17j84Q28j179L33k67L61L51
7371D15Lk161J195K98J85o17Q82K43n2j319R90J249o8j455o65J217k98K18q74
7390f14J437p53q19Q40K40n76j137J249M65l20q7Q3Q67q02j062Q10N65j21l64
7409i9Mp51J091l67J140p20m22k03k75J13J067m93m04Q74o67L0L63j35n01N81
7429B26o05O60r16K25K37o86J077l23n40J172m59J97n35M3R32m28J71j067O60
7448D1J95j72m63m20J102l49l18P81j163J033j239O85j65o26j34J773l51J02j016
7467g04J772j130r8n82L6L62P45M11q52n59Q25p2j54P46j332m9L8L72o5K6K5K6
7489b13M8o8O21r82R30k5r02N24j3J186j840R70N9N11q35M06Q38k759K275j432
$$ plain form
7351 -175 -117 -138 13 706 393 -650 -505 -286 332 206 33 55 172 -12 816 -363 -30 -297 64 415
7371 415 418 -1743 -548 -250 -65 -682 200 443 391 -928 62 1311 1243 -212 -877 340 42 260 -614
7390 -614 823 70 -749 91 331 -245 -1382 -133 332 12 -75 8 875 73 -989 -179 386 265 -99
7409 -99 -95 -846 245 -122 1018 298 -124 -327 -602 -489 578 85 -319 555 -112 -82 281 146 -355 226
7429 226 -379 281 -635 -410 -173 -859 218 -105 -645 527 68 265 -270 -227 705 277 448 -619 41
7448 41 236 64 -399 -819 283 -66 -384 397 -766 267 -972 -287 -452 -1078 -1212 561 210 312 -704
7467 -704 1068 -62 -160 -742 -706 -344 401 812 -40 -599 226 154 0 746 -586 -635 -597 -225 -290 -264 -239 -213
7489 -213 -165 -233 388 -594 336 311 -591 -67 -80 1106 -734 236 295 806 -29 377 1215 -1544 731 -701
7509g01O23N81k18k043J188J68J600q58m74O69j414J125j042R03L39l39o3Q8k91
7528a59q0O28K13m80J85m47j45J976k189K432j891l9J9n48K77k28R62j220J102
7547C68k50k92Q6n54O94Q8j007J430j327K80J743j431k32P54j82l3N4o54M18K76
7567B29J41L47j330M15k18J084p27K45K17K10j441J089j161P16m6J98Q46j166
7585c52O54o18n78J472L93p45j177J148K29l46n10p26N54M31l84K05R43j663J739
7604F69m05K57r85M48q9p33J013k80Q14r23J62L39R9m86o18k09L06R79j086M47
7624b81m04O44N01p59J56j98N31k69k23j54Q1o91J047j63L28J20n69K33r11J502
7644E21l66k01j58J129r99j83O88o61j178Q33R53N43j319j78J07N5J29M78j434
$$ plain form
7509 -701 -78 503 285 -1758 -570 -402 1198 340 -134 535 -879 246 -796 107 446 107 44 132 -159
7528 -159 -239 389 602 122 307 -140 -285 1691 -498 1934 43 4 23 -525 -248 -476 486 -734 368
7547 368 118 -174 -88 -642 52 140 -867 563 -764 -484 1259 -172 -404 350 168 135 189 -465 -47 229
7567 229 370 717 -613 -198 -416 668 -59 186 403 613 -828 261 -900 -184 -230 -32 814 -352
7585 -352 302 -316 -894 578 971 226 -951 197 426 80 -430 -1156 -602 -171 -555 -350 593 -1070 669
7604 669 264 521 -464 -16 -105 -838 175 -105 709 -214 -52 287 386 -100 -718 -927 -621 358 -728 -281
7624 -281 -685 -41 460 -299 -143 -341 190 -79 -302 -456 -375 -1066 -19 -182 146 266 -303 -70 -981 521
7644 521 155 -46 -204 925 -74 -257 431 -230 -1408 -575 378 921 -398 -576 -469 -414 -285 193 -1241
7663a241R26p1J409q06N57m18j329L39J96O47j53L72K79p59L92j115J050j208
7681i33R83k83N3M47j879J529R06n52K82p1R99j773J175q25r32q3J857j7l46r37
7701d00N65j22M26L01m13p93n58J562j425J104j49L73N13o68l24P75m06q32K73
7720a98Q41J20L49j090J012J40J087j881n65n31O08O44q94J517j019p08J032K25
7738F89p98K94M70l61j73N52o74L0m31l31J91O87J54p04L83J92n7n42O13J70k20
7759A34M35p69k90K38L58P53q24m13j30Q23r37R44k60m76k16O60J75K52j782J036
7779b89O65J0K08o78K49L95N06q51J01J54k8l42K46R8j03L08j42l56o55P92J6
7800C04n19L20L48L0k29j77r4q40J035m80K13K1L3L4J36q32O77j5L57M11n62p75
$$ plain form
7663 -1241 -315 -386 1023 217 774 356 -973 -634 -438 209 56 428 707 -52 340 -775 275 -933
7681 -933 50 -233 -180 267 -1612 -83 823 271 553 482 1481 -292 883 58 -874 -957 900 883 537 -400
7701 -400 165 43 469 770 357 -436 -994 568 -857 247 98 471 984 316 -8 767 361 -471 -198
7720 -198 643 763 1112 22 1034 1174 2261 380 -185 -716 -108 536 -358 1159 140 -568 464 689
7738 689 -109 185 655 294 121 673 -1 29 -402 -733 -542 145 299 -405 -22 170 113 -429 184 354 134
7759 134 569 -200 -490 -252 106 859 35 -378 -508 315 -622 322 62 -414 -630 30 205 457 -1325 -289
7779 -289 376 386 594 -84 165 560 1066 215 316 470 442 100 346 444 341 649 507 151 -504 288 304
7800 304 -215 105 453 483 254 77 -17 -857 178 -302 -89 -68 -35 -1 135 -697 -20 -35 322 733 171 -604
7822f04P06l66K17j65N9L55j20l79L30O08j146qN88K54k95n71O72q2K59j23o19
7843d30N85L5k06j05J08k71o71J507j415J345n40Q5k50k30m29J935m31L34q72
7862H4j225J858q04p18J350j400J040j043J40M07M24R51j215N9m89J112j139J347
7880G39p67Q16j565J208n68N35n74j39k74P82k5l17P98j228J051J28q25O39K78
7899F92p6r16o6N03M58l0m06p13M74R79r5j192k34N67O40m92l24Q3N68K01m19
7920B02k58p02R73p84m77J165o10N86r36J873k089n6J401m86N45L85L25P36j263
7939E30L50n04K96J67n30m06k4J250j446J459k73k233K069k83j027M71N49k56
7957A59r50J03K634k030P24n83k29o14J009j069P12q19J236n60P66j0j178Q35
$$ plain form
7822 -604 102 -264 -47 -212 -153 202 82 -297 33 641 -505 -513 75 329 34 -537 135 53 312 189 -430
7843 -430 155 190 -16 -121 -13 -284 -955 552 -863 482 -58 27 -223 -453 -882 1053 622 956 84
7862 84 -1141 717 -87 -805 545 -855 185 -858 -718 -311 113 1064 -151 -92 -581 531 -608 739
7880 739 -28 788 -777 431 -137 398 -176 -315 -589 193 168 -149 649 -579 472 600 -225 414 692
7899 692 616 -300 -366 137 595 565 159 -554 -80 899 804 -388 -622 -55 585 93 -231 -148 420 621 202
7920 202 -56 -758 215 -569 -1046 119 -491 95 -841 1032 -1057 -1113 288 -198 347 732 1057 1793 530
7939 530 880 376 672 839 309 -97 -121 1129 -317 1142 869 -1364 705 422 -605 -134 415 159
7957 159 -791 -688 1946 -84 640 57 -172 -786 223 -846 -134 -953 283 -277 489 479 -699 136
7975A36j175J771j537J013nO98j130m89R76N10j014J5n35n3J016j001N49J27L30
7994B02r39R63o14l3L39r3P46j93r68l11J552l95j003M66P07p23K61m11O76r50
8014g21L76L93p70R9M10L64qk34K4p38Q92J07n12M84m59O21J13J65n49J83p65
8035e25R38j03r96J120j92M84m62j34j331J283j95p30M98M11J99k25L94n63R04
8054G75j6j6j771P0J555m85R9p76J155j218M03j530K131q57O30P18j451J88M98
8073A02K84j107J060m76P68j691K10M83J759j399k4L29l81q94J861j177O7J009
8091G83j041j69l79K39P74k52L97q01J84k39Q78j015M50P62M4l74N77r07L26P9
8111C16j41n04M85J49p62R12p96M63K01m50m00P23j97N17k89l30M3o30Q13l68
$$ plain form
7975 136 -1039 732 -805 208 203 901 -229 -718 258 768 -246 -231 -766 -819 197 -804 -255 -128 202
7994 202 -737 226 -388 -421 -82 -175 571 378 -590 -901 651 256 -747 -281 426 -297 -36 -447 229 -721
8014 -721 -345 48 -722 -623 -213 151 143 -91 -67 -805 87 194 -318 166 -293 328 441 606 57 240 -525
8035 -525 413 310 -686 434 242 726 264 130 -1201 82 -113 -843 -345 66 265 40 434 -129 775
8054 775 759 743 -1028 -958 597 112 211 -565 590 -628 -225 -1755 376 -481 149 867 -584 -396 102
8073 102 386 -721 339 -137 631 -1060 -850 -367 1392 -7 -31 298 -83 -977 884 -293 -226 783
8091 783 -258 -427 -806 -567 207 -45 352 -449 -265 -504 374 -641 -191 571 615 241 818 -89 237 316
8111 316 175 -329 156 305 -457 455 -341 122 323 -127 -527 196 -1 516 227 -103 -60 -690 123 -245
8131b45k8j80Q79m87j241J252K44j545J312n48J037L03J82o72J51r13M06n58J719
8150A068r3p32j10n68P91O1n09k41l09J292q46R82r02J234r24L03l36m6l66K82
8170C1m42N28j02l26J40K70j25M82o96N29n7k77K39q93O37L80k22l78J55J01j74
$$ plain form
8131 -245 -273 -453 426 -61 -1302 -50 194 -1351 -39 -587 450 753 935 263 414 -499 -93 -651 1068
8150 1068 975 243 133 -435 356 417 -92 -333 -642 650 -196 786 -116 1118 194 497 161 115 -251 31
8170 31 -411 117 15 -311 -171 99 -26 456 -240 289 232 -45 194 -699 -62 318 96 -282 -127 -26 -200
8191b00
$$ Imaginary data points
##PAGE= N=2
##DATA TABLE= (X++(I..I)), XYDATA
0@%%%%%%%m0Q0q0Q0q0J20j60J61k01K59l00L61m40N19o00O82p81R05j041J189
27F33j356J532j728J954k195K463k761L083l436L825m251M718n231N799o420P104
43C733p865Q712r658J0723j1937J3328j4935J6820j9070K1809k5236K9666l5643
56a9553M4209n7617Q1760j38904N20952M93811q42692n22267M0330N60080K82606
67D42715j05933l70192j67834P7685K26131P5190l4433m4389J7761r2375j35711
78a11385L0517K91526J89484j99130m23765j39410L05051M05885K7513l72531
88C755l56479O4319L81309K47437j56854l15246q7123K00633J79777m8850j47735
99c5057j3112J03605K2935j15618p5035J08874J58442l4358k23465j34979J41656
$$ plain form
0 0 0 0 0 0 0 0 0 -40 40 -40 40 -40 80 -80 81 -120 139 -161 200 -240 279 -321 361 -420 485 -556 633
27 633 -723 809 -919 1035 -1160 1303 -1458 1625 -1811 2014 -2237 2481 -2750 3049 -3371 3733
43 3733 -4132 4580 -5078 5645 -6292 7036 -7899 8921 -10149 11660 -13576 16090 -19553
56 -19553 24656 -32961 48799 -90105 430847 924658 81966 -440301 -399971 160109 442715
67 442715 336782 -33410 -201244 -123559 102572 177762 143329 98940 116701 24326 -111385
78 -111385 -80868 210658 400142 201012 -222753 -362163 -57112 348773 376286 3755
88 3755 -352724 -288405 92904 340341 183487 -131759 -218882 -18249 161528 112678 -35057
99 -35057 -48169 55436 78371 -37247 -112282 -3408 155034 120676 -102789 -237768 -96112
110i6112K68144O8606k26494k59153K1450K73152J87371j19049k43253m7900J79841
121F603J41209p7064j60184k4404J15495P2752p4844j09911J5371J25553N2419
132H2995j15325j32691N2957J99195Q9327j44112j95911L795J87413J28463q3894
143G2212j78874m7370J24940J15996m7403j36528k5499J15608Q9541n1217j01992
154g0586j292J02120O1409o5672j04140K503J21191P4697q8651j49536q097J44808
166A8754J00455o9385j34572k0130J02481Q4070l2511q9968k3420Q2049Q0653
177I8476l1921j04939k9124Q7924P2425n5755j01757J811R7261M7270p3288j02140
189i3757n870R7760Q3853k7065r7342k9778Q5694Q4494l3562j05091k3108Q8056
$$ plain form
110 -96112 172032 240638 14144 -245009 -223559 49593 236964 117915 -125338 -173238 6603
121 6603 147812 70748 -89436 -113840 1655 74407 -437 -110348 -94977 30576 82995
132 82995 -32330 -165021 -112064 87131 176458 32346 -163565 -159770 27643 156106 72212
143 72212 -106662 -154032 -29092 86904 39501 -97027 -122526 -6918 82623 31406 -70586
154 -70586 -71878 30242 91651 25979 -78161 -75658 45533 120230 31579 -117957 -126054 18754
166 18754 119209 49824 -84748 -104878 -2397 81673 49162 -40806 -64226 17823 98476
177 98476 66555 -38384 -67508 20416 92841 37086 -64671 -62860 34401 81671 8383 -93757
189 -93757 -99627 -1867 81986 54921 -42421 -72199 13495 97989 64427 -40664 -63772 24284
201B4284O8658m8943r8638k2904O8335N4240l3953p7805j1983P9032O7889l1734
213C6478q2945j2303Q7312P5154l5359r9250l3670O9257O6124l2566q8423k4263
225g4454O7755O2764l1715q3546k2077P0275P4715j2580p5756l0839N5590N9599
237E9731k7235q4765k8288O6850P0678k2094q3249l1887N3597O3377j0684o4849
249c8818k6538M8646O3891r501p4305l6665N0577O8883j1295p0858l2553M5934
261b2602N8887j2610o6376l1029M1229O3148m127o6633l9251M0684O7003M952
273C3275n5649l3331L8795N6921k318n4633l8173K8513N4270L782n6470m6097
285g1115K4611N2899O643n0031k7290L6154N6552R450m6470l6622K2673N3694
$$ plain form
201 24284 92942 43999 -54639 -77543 -9208 45032 11079 -66726 -78709 323 68212 36478
213 36478 -46467 -58770 28542 103696 68337 -30913 -64583 4674 70798 38232 -50191 -74454
225 -74454 -6699 56065 24350 -59196 -81273 -10998 63717 51137 -24619 -55458 132 59731
237 59731 32496 -52269 -80557 -13707 56971 34877 -48372 -80259 -26662 36715 26031 -38818
249 -38818 -65356 -16710 47181 37680 -36625 -73290 -22713 46170 34875 -35983 -68536 -22602
261 -22602 36285 23675 -42701 -73730 -32501 30647 26520 -40113 -79364 -38680 28323 33275
273 33275 -22374 -55705 -16910 40011 37693 -16940 -55113 -26600 27670 31452 -25018 -71115
285 -71115 -46504 6395 13038 -36993 -64283 -28129 28423 37873 -8597 -45219 -22546 31148
297C1148J2567m0286m3627J0901M1054Q345m4538l3062K1604N0348J4058l2297
309c785l2490J2922M1196J6823k6218k7246J0943L9499J0054l6956l8445J1106
321b2597L9195J2940k8397l1046R892L5835J3552k4729k5822J2656L4550J2520
333C8549k2409k5087O110L1609J4123j9149k5146O37K2753P011k2548k2156O603
346i100K7317R671j6960k2346K908K5729J0599j0280j4189R573K3320N466k3516
359A8192k4986k324J9444O195j5708j5077Q500J6689O331j3311j3475R826K1718
372B2014R551j0319j3593P52R612k620j5918j2328L315Q797L1j1732r323J0421
386a1340J8299Q058j2267q160O455J5855k337j6671p200R491J2565p238j8999
$$ plain form
297 31148 43715 3429 -40198 -29297 11757 20102 -24436 -57498 -35894 14454 28512 -3785
309 -3785 -36275 -23353 17843 34666 8448 -18798 -7855 31644 41698 4742 -33703 -22597
321 -22597 16598 29538 1141 -29905 -20013 15822 29374 4645 -21177 -8521 26029 38549
333 38549 16140 -8947 -2837 28772 42895 23746 -1400 -763 21990 29001 6453 -15703 -9100
346 -9100 18217 27888 10928 -11418 -8510 17219 27818 17538 3349 12922 36242 41708 18192
359 18192 -6794 -9118 10326 16521 813 -14264 -5764 10925 17256 3945 -9530 296 22014
372 22014 31565 21246 7653 8405 18017 15397 -521 -12849 -9534 -737 -706 -12438 -21761 -11340
386 -11340 6959 15017 2750 -5410 1045 16900 14563 -2108 -9308 183 12748 5510 -13489
399a3489j2880N200J2181J796j1402n779J1928J4613n736j9563n483J6454J9987
412G827l093j7408n212J5373J1015q676j9654p441J4785J4105o109k2713j4745
425d1946J4448J9426q4k0274n030K0837K1775l466k1243n807J8943K0010m379
438A3210k4243j1784J0112J3627o405k4169p378J6708K2609k095k1364j0092J9927
451a1337K5347L860k2650j2161J2481J8399j888k5497j5261J4246K2556K445k0800
464a0260j8376J0258K3465Q955j5111j0859R611K1020J724k3619j7237P042K1758
477H371P269j3771j6060L128J7334O368j6245j5424P595K5583J1306j5932k0977
490a1455K986J8810J0564j1775j6035J609J6444R113j1067j7808k575J6580J1161
$$ plain form
399 -13489 -26369 -21169 -8988 -7192 -18594 -24373 -12445 2168 -3568 -23131 -28614 -12160 7827
412 7827 4734 -12674 -17886 -2513 8502 -174 -19828 -27269 -12484 1621 -4488 -27201 -41946
425 -41946 -27498 -8072 -8156 -28430 -33460 -12623 9152 5686 -15557 -21364 -2421 17589 13210
438 13210 -11033 -22817 -12705 922 -5483 -29652 -37030 -20322 2287 192 -21172 -31264 -11337
451 -11337 14010 17870 -4780 -16941 -4460 13939 12051 -13446 -28707 -14461 8095 10540 -10260
464 -10260 -28636 -18378 5087 14042 -1069 -11928 -2317 18703 20427 -3192 -20429 -13387 8371
477 8371 15640 1869 -14191 -11063 6271 12639 -3606 -19030 -11435 14148 25454 9522 -11455
490 -11455 -8469 10341 20905 9130 -6905 -5296 11148 20261 9194 -8614 -11189 5391 16552
503A6552o913j7361k194J4131J0990m288j0352J715J1173O375r078j3082m154
516f486P898N036k494r737n070M943K798k781m000R47J2965J2043k47o550m459
531D806J982R44l921k244J07r74n318n762j085j710k84j50L041P654N066J743
547C895l636m006M060Q803K042q782p783J751P628j563j0922o675O878J0730L52
562B772j2463r668M312J5358L360j0409q652Q876J5939K124j7278j2968J0605
575h092K1418M814k0092j7754M162J9201N490j9449j7256R717K4561J0360j5791
588A289k1640M634K6261J7517j4124k4662Q88K2602J1358k3593k7405J651K9306
601D082J7272j4772k5949j531K7731K2626j0151k8426l376L0416K3207j8359l7446
$$ plain form
503 16552 9639 -7722 -9916 4215 15205 10917 565 2280 13453 19828 10750 -2332 -6486
516 -6486 1412 6448 3954 -5783 -10853 -5910 -3112 -5893 -9893 -8946 4019 16062 15815 9265 4806
531 4806 6788 7732 3811 1567 1674 700 -4618 -10380 -11465 -13175 -13459 -13609 -10568 -2914 2152 3895
547 3895 259 -3747 313 9116 11158 2376 -5407 -3656 3972 2409 -8513 -15188 -8310 2420 2772
562 2772 -9691 -19359 -15047 311 3671 -6738 -15390 -6514 9425 11549 -5729 -18697 -8092
575 -8092 13326 18140 -1952 -19706 -15544 3657 9147 -10302 -27558 -17841 6720 17080 1289
588 1289 -20351 -15717 10544 28061 13937 -10725 -9837 12765 24123 530 -26875 -25224 4082
601 4082 21354 6582 -19367 -20898 6833 29459 19308 -9118 -12494 17922 41129 22770 -14676
614a4676j0754K8720K5029j1882l3397r745K6833K9115l320l0304j5017K7381
626G983L5488m265l6927k1543K2032L3734j638l6409k1256J8114L2017o58l2622
639e950k2267K1390L8818P591l2572k7338J5857L6975Q850l1232k8008J5940L8197
652C6251Q264l2347l4491P717L6250J4121k7046l1963O516L5804J7492k5713l4196
665b3341N284M0364K3944k1080l5703J330L1853J9590k3749l7655k021K8023K1801
678B8640k0193l5433m855L3073K9099j2909l2738o054L1672K9890j3500l3953
690g261r288K7746K4861j6042l7168j4906K3828K7884n411l1482j3977K4723K8540
703B2047l759l0560j0835K0898K9398q46l1799j8698J7919K6662k422k9927j5208
$$ plain form
614 -14676 -25430 3290 28319 16437 -16960 -26705 128 29243 25923 -4381 -19398 7983
626 7983 43471 39206 2279 -19264 2768 36502 34864 -1545 -22801 -4687 27330 26672 -5950
639 -5950 -28217 -6827 31991 39582 7010 -20328 -4471 32504 41354 10122 -17886 -1946 36251
652 36251 44515 12168 -22323 -14606 21644 35765 8719 -23244 -16728 19076 36568 10855 -23341
665 -23341 -18057 22307 46251 25171 -10532 -9202 22651 42241 18492 -19163 -21184 6839 28640
678 28640 8447 -26986 -31841 1232 30331 17422 -15316 -21370 10302 40192 26692 -7261
690 -7261 -16549 11197 36058 20016 -17152 -32058 -8230 19654 14243 -17239 -31216 -6493 22047
703 22047 18288 -12272 -23107 -2209 27189 26343 -5456 -24154 -6235 20427 18005 -11922 -27130
716b7130J7252K6530n69k7046j8087J6019K8013L725k4801j9098J3643K8821M932
729B2204k6965j8835J2165K6390L293k5504j9965R365K2665L618k0808j7172J1197
742a8352K3985R778j8633j6685J1180K6000P280k1739j8992Q370J9367L982k0972
755e431k1158N359K3170N549j7748k0073O821K9558J1114j3191j9396Q100K4118
768A6792O764j8973k0471K641K1518P169j7605k1447L088K1838Q593j5693j7312
781b3098P360K5836J0801j5810j8803N367J9962J1311j7500k0873P59K1222J2355
794A8889j4694k3010O00K2565J1870j3971k0479J078K2643J4755j2348j9627j413
807a3142J9399J2631r601k1019j616K1236J4299j3978k4184n446K1840J6036j3660
$$ plain form
716 -27130 -9878 16652 16083 -10963 -29050 -13031 14982 18707 -6094 -25192 -11549 17272 22204
729 22204 -4761 -23596 -11431 14959 18252 -7252 -27217 -17852 4813 8431 -12377 -29549 -18352
742 -18352 5633 15411 -3222 -19907 -8727 17273 24553 2814 -16178 -7808 11559 15541 -5431
755 -5431 -26589 -21230 1940 7489 -10259 -30332 -23511 6047 17161 3970 -15426 -7326 16792
768 16792 23556 4583 -15888 -13247 8271 15440 -2165 -23612 -20524 1314 9907 -5786 -23098
781 -23098 -15738 10098 20899 5089 -13714 -8347 11615 22926 5426 -15447 -14688 6534 18889
794 18889 4195 -18815 -18215 4350 16220 2249 -18230 -17152 5491 20246 7898 -11729 -13142
807 -13142 6257 18888 9287 -11732 -13348 7888 22187 8209 -15975 -21421 419 16455 2795
820B795k1445j301K3465J9239j1798k0818m877K0419J9259r836k4784p242J8591
833A667J9165j1174k7245p736K0657J9188o072k1894n056J9405J9249m086k2186
846f118r216J5956K0567o460k6872j2185J6875K2370n764k5317j1229J6447K3159
859A2213m08k0468j0342J5109K2553L50k3655j6038J1704K2674J450k2480j7568
872b4906J0489K0124J947j9511j5272J0155K2949O115j7632j7287Q733K5964O882
885A8750j8351j7161P839K1554L373j8508j9234K819K0297Q382j7089k1581L668
898b5242K2790J2290j2934j8267L805K4959J2615j1457j8877R47J7715J1112j1847
911G609k1185n375J5637J2394r592j9385l546J9776J6330o533j8637j829J7774
$$ plain form
820 2795 -18650 -19951 3514 22753 10955 -9863 -14740 5679 24938 15102 -9682 -16924 1667
833 1667 20832 9658 -17587 -25323 -4666 14522 8450 -13444 -18500 905 20154 16068 -6118
846 -6118 -15334 622 21189 14729 -12143 -24328 -7453 14917 9153 -16164 -27393 -10946 12213
859 12213 11805 -8663 -19005 -3896 18657 19007 -4648 -20686 -8982 13692 15142 -7338 -24906
872 -24906 -14417 5707 7654 -11857 -27129 -16974 5975 12090 -5542 -22829 -14096 11868 18750
885 18750 399 -16762 -8923 12631 16004 -2504 -21738 -18919 1378 9760 -7329 -28910 -25242
898 -25242 -2452 9838 -3096 -21363 -17558 7401 20016 8559 -10318 -9371 8344 19456 7609
911 7609 -13576 -18951 -3314 9080 -512 -19897 -23443 -3667 12663 6130 -12507 -14336 3438
924C438J5706m481j8155o201J2144J4568n772k0980r534J1536J9627O99j7241
937d646j0268J1611J6920J241j4613j0337R329J6486K849j4047j3442L058J7898
950A2039L782j2096j3946M456J6190M148r975j4383L853J6894N858r231j3468
963e879p63J6029R402p993j3998j279J2885R388q322j6622m548J2936J2206m922
977H520j3513m560R895J1506m75j0735m975Q950J3109j641j4460j0725P932Q443
991G271q38j2542p701N734R521L630q977p921P271J3678O512p441j1185J679J0267
1006H958N812j1510j3571j583Q211P014o466j1930k117J0409J0714j505j1468
1019i032p50Q747Q855j631r862j480O550P580j401j2690o173K904R354k67r975
$$ plain form
924 3438 19144 14663 -3492 -9693 2451 17019 11247 -9733 -19267 -7731 11896 12595 -4646
937 -4646 -14914 -3303 13617 14858 245 -10092 -763 15723 18572 4525 -8917 -5859 12039
950 12039 15821 3725 -10221 -5765 10425 14573 4598 -9785 -5932 10962 16820 7589 -5879
963 -5879 -6642 9387 18789 10796 -3202 -4481 8404 17792 9470 -7152 -11700 1236 13442 8520
977 8520 -4993 -9553 342 11848 11373 638 -4337 4613 17722 16081 1621 -9104 -1172 7271
991 7271 6433 -6109 -13810 -8076 1445 5075 -3902 -11823 -4552 9126 15638 8197 -2988 -1309 8958
1006 8958 14770 3260 -10311 -11894 -3683 3331 -3135 -15065 -17182 -6773 3941 2436 -9032
1019 -9032 -9782 -1035 7820 6189 -3673 -5153 1397 8977 7576 -5114 -11287 -8383 971 704 -9271
1034i271o890N032J0868M12r358n853P085J2839L081p114r038L679Q851M077p736
1049F64q911O52Q844J076q849p601J346P615M043k317n754J640P944N647l366
1064B673o702Q02P512L303n517q755n88M621K749l850n596J10O118N538n78n421
1080c581o84N588N205r30n901m39R09J779k034m223R69J147K645r31j598r48L579
1097E52L274p11j75o27K357N89l553k207J518K964J641l865k960J038K847k309
1113C73k326r46L035L935m11k013k316K922L541o01l047O49L491K553k402o541
1129a04j664L813K596l354n195k317M318O201l04o310j590O236Q817j807p382
1144A954l769M171O889j835q973n844L976N757j303n088n444O297Q466K100o083
$$ plain form
1034 -9271 -16161 -11129 -261 151 -9207 -15060 -7975 4864 7945 831 -8207 -4528 4323 8400 664
1049 664 -8247 -7595 1249 2325 -6524 -14125 -12779 -5164 -1121 -3438 -9192 -7552 392 6039 2673
1064 2673 -4029 -3227 4285 7588 2071 -6684 -7272 -2651 98 -3752 -9348 -9238 -3120 2418 1840 -3581
1080 -3581 -4265 1323 6528 5598 -303 -742 167 1946 -88 -4311 -3342 -2195 450 -481 -2079 -3027 552
1097 552 3826 3115 2940 2313 4670 5259 1706 -501 1017 3981 5622 1757 -1203 -165 2682 373
1113 373 -1953 -2899 136 4071 3660 1647 -669 2253 5794 5193 2146 2795 6286 8839 6437 -104
1129 -104 -1768 2045 4641 1287 -3908 -6225 -1907 4294 3990 -2320 -3910 2326 11143 9336 1954
1144 1954 -1815 2356 9245 7410 -1563 -7407 -3431 2326 1023 -4065 -9509 -3212 5254 7354 1271
1159A271m938M004R800q9q427p671K901R220J675j1083r606M100J0585L585q618
1174c291o872J537J2269M284o820q929M72J1441N408q088r600p49Q955N777o081
1189b87r198l60Q770O777m674j0656j867J0547Q160l592j0646k237Q213R536l786
1204D700j0862l570P844Q347k408j2567m915Q322J0582l78j0127n260P749J0216
1218G673R30q501n257N804R698Q91j0053p904J495Q343J918q250o504L369J0330
1233C982L035o860n998K554J2004M707o305q084J471Q089M465p702r518L11Q142
1248D293N077n513q008r76Q117O885k582p221j991P222N988r50p408j878M379
1263E434P144k890p897l824M899O479j676p276l223M712N719n15o632l215M538
$$ plain form
1159 1271 -3667 337 10137 10048 1621 -6050 -3149 6071 7746 -3337 -12943 -8843 1742 5327 -3291
1174 -3291 -10163 -8626 3643 7927 1107 -7822 -7350 4091 9499 1411 -8189 -8938 17 5794 -287
1189 -287 -9485 -9845 -1075 5702 1028 -9628 -11495 -948 7212 3620 -7026 -9263 -1050 8486 4700
1204 4700 -6162 -9732 -1888 6459 4051 -8516 -13431 -5109 5473 5095 -5032 -10292 -2543 7673
1218 7673 8603 102 -5155 649 10347 11238 1185 -6719 -5224 3119 5037 -3213 -9717 -6348 3982
1233 3982 7017 157 -5841 -3287 8717 13424 7119 -965 506 8595 13060 5358 -4160 -3849 4293
1248 4293 9370 3857 -4151 -5127 2990 9875 7293 72 -1919 5303 11291 10341 2933 1055 5434
1263 5434 12578 9688 1791 -2033 2866 9345 7669 393 -2830 1882 7601 7086 454 -2761 1777
1278A777P178K566o611n065K474P429O50o501n733Q88O596Q19n441o302J110O451
1294B285L794l455m524J682O034K529m174m957O87M730N96l838o280j433M849
1309a475L149k532n184N48O274L983k895n036L39N653K601k576n699l484M131
1324b203L127k206o377j118M810M566j529n066R0N035L571j221l925p53L690J465
1340A956j832n485j119L587L771k008n560k166N714L735k243n362K77O054M415
1355C734j097n402j670M737N084j627o117k245M059K826k395o898j995M864N207
1370A065j932o202q16O264N873j401m654p36O611M533k279p305l129M832N421
1385F145k433q333m107N191O312j485o780j832P740N498m99n583l433M527O713
$$ plain form
1278 1777 8955 11521 4910 -155 2319 9748 10398 3897 -1836 -948 5648 6467 1026 -5276 -4166 2285
1294 2285 6079 2624 -1900 -218 5816 8345 4171 -786 -99 4631 5227 1389 -4891 -6324 -1475
1309 -1475 1674 -858 -6042 -5494 780 4763 1868 -3168 -2829 2824 5425 2849 -2850 -6334 -2203
1324 -2203 924 -1282 -7659 -8777 -3967 599 -930 -5996 -5906 -871 2700 1479 -2446 -3199 491 1956
1340 1956 124 -5361 -6480 -2893 878 -1130 -6690 -8856 -3142 593 -1650 -7012 -6735 -681 3734
1355 3734 2637 -2765 -4435 302 5386 3759 -2358 -4603 -544 2282 -113 -7011 -9006 -4142 1065
1370 1065 -867 -7069 -7885 -1621 4252 2851 -1803 -2539 4072 8605 6326 -979 -4108 724 6145
1385 6145 3712 -4621 -8728 -3537 2775 1290 -5490 -7322 418 5916 5417 -166 -3599 928 7641
1400G641J96p751m041N031O283k608q298m410O415P445j556o750k983M061Q007
1415F682Q29q387n179N951Q489R90j0434o167M954Q907J013q641n921L126R357
1430E569J589q616o482M266J0482K483r395p390M304R676K749r379q255L774R645
1445E020K274r713q926L717J1279M649q723q993L532J1704N657j0250q422j286
1459h481J4344N348q937j2572j650J1673O852p879j0787J342J3087O307p134j1497
1473i984J735J1668P993p654j2221j843J2060O702o262j4999k038J2919R630n702
1487B004j3561k236J1497J2225m130j2992m215R923J2509k721j5485m200J0193
1500a189J0226j680j4582p121Q731J2456r57j3308o868R086J2875j032j0873r082
$$ plain form
1400 7641 7837 86 -3955 1076 7359 4751 -3547 -7957 -1542 5903 4347 -2403 -5386 -1325 6682
1415 6682 7511 -876 -6055 -104 8385 9375 -1059 -7226 -2272 6635 7648 -993 -6914 -3788 5569
1430 5569 7158 -1458 -7940 -3674 6808 9291 -104 -7494 -3190 6486 9235 -144 -8399 -4625 5020
1445 5020 7294 -2419 -11345 -7628 3651 8300 -423 -9416 -5884 5820 11477 1227 -7195 -8481
1459 -8481 5863 11211 2274 -10298 -11948 -275 6577 -1302 -12089 -10747 2340 8647 1513 -9984
1473 -9984 -8249 3419 11412 3758 -8463 -10306 1754 8456 2194 -12805 -14843 -1924 7706 2004
1487 2004 -11557 -13793 -2296 9929 5799 -7193 -11408 -1485 11024 8303 -7182 -11382 -1189
1500 -1189 9037 7357 -7225 -14346 -5615 6841 5884 -7424 -14292 -5206 7669 6637 -4236 -13318
1514a3318R378J4038Q67j2848r964P842J3249K232j4656j0578N573J4661K236
1527H712j1533j1141N303J3833M621q118j1334M088J4957M850j0469j2551L033
1540e749J1450N862j0597j1532J819J1828Q523q148j3982p5J5228P443n454j2556
1554e940l1J0870Q433n640j4292k930J2450Q131n347j1603l311R897R880l435
1568G132j2206l315Q999J1288j690j1135n400P205J0844k601r867q314O800J0867
1582H607j038j1412o096N850J1075j156p263o517M976J1816K59p912o608N021
1596c98R009K499r364q551K461P863L395p590p355J802Q203L867n643p397J924
1611e275Q271L132m134m730M20O263K702n473p511Q41N532K389l013o239K11M717
$$ plain form
1514 -13318 -3940 10098 10965 -1883 -11847 -4005 9244 11476 -3180 -13758 -8185 6476 8712
1527 8712 -2821 -13962 -8659 5174 9795 1677 -9657 -5569 9388 14238 3769 -8782 -5749
1540 -5749 5701 11563 966 -10566 -8747 3081 11604 3456 -10526 -10601 4627 12070 6616 -5940
1554 -5940 -5971 4899 13332 7692 -6600 -9530 2920 11051 5704 -5899 -9210 687 10567 7132
1568 7132 -5074 -8389 610 11898 10208 -927 -6327 878 11722 9121 -746 -9060 -2260 8607
1582 8607 7569 -3843 -9939 -4089 6986 5830 -1433 -7950 -2974 8842 9101 1189 -5419 -398
1596 -398 8611 11110 1746 -6805 -4344 3519 6914 -676 -8031 -6229 1974 5841 198 -7199 -5275
1611 -5275 2996 6128 1994 -2736 -2316 3947 6649 1176 -6335 -5494 38 2427 -586 -6825 -6614 -1897
1627a897N399l401m754l6N878N227l010n599k628N629K763k190o356j959N526
1642a408L654l764m202j308N869K439j112l174j034L796L239j071m767j190L862
1657a71L914k483l987j588L384K586k199l555j243M761J927o10k846k300L661
1672g49L977o84l345j412L243K511j918l796n07K384J703j252m239J92L034K528
1688A670J77k875l28M025L364j782n085r43L898L480k719m387k176K303L359n81
1704A400m885j231M035M324j36l356j521K726N796j189m892k784L158L286m45
1719D286n443l499L183M175L29n143l338M448L999J707l883l738K193N196K691
1734G163m936n279J474O000K507n641n596P22N824Q33l609n509J722N104L352
$$ plain form
1627 -1897 3502 101 -4653 -4689 1189 6416 3406 -2193 -4821 808 3571 1381 -4975 -6934 -1408
1642 -1408 2246 -1518 -5720 -7028 -1159 1280 168 -3006 -4040 -244 2995 1924 -2843 -4033 -171
1657 -171 3743 1260 -2727 -4315 -931 1655 -544 -4099 -5342 -581 1346 736 -2110 -4410 -749
1672 -749 3228 2544 -801 -2213 1030 3541 1623 -2173 -2680 -296 1407 155 -4084 -3892 -858 1670
1688 1670 1847 -1028 -1356 2669 6033 4251 -834 -1777 2121 5601 2882 -1505 -3681 -1378 1981 1400
1704 1400 -3485 -4716 -681 3643 3507 151 -1370 1356 7152 5963 1071 -1713 1445 4731 4286
1719 4286 -1157 -4656 -1473 2702 3031 -2112 -5450 -1002 2997 4704 821 -2917 -724 4472 7163
1734 7163 2227 -3052 -1578 4422 6929 1288 -4308 -3586 2238 3071 -538 -6047 -4325 779 4131
1749D131k535n211N62N530M076m138m295n63M798L900m104o872m86O359M085l879
1765A358n724l67M813N210k405n857k338N661O753j903o821m436N167M933k14
1780C830o270m102L910N071J241o060k149K232P125R09o869l535K708N220K260
1795E521o093o391K580O298K299n573l986m41P547L898m460o047k08Q738K765
1810F447k792p117k33O568K448n201m636j057O905J674j303n597j964O432N031
1825E605m943l653j765N768M672j128o738j612N132M496j690p282j821L314N848
1840D203k322n473l797O784N167j525m975j338L899O129q09l921l272J527N499
1855E776n41o113l473J989N290pm117m297L318O269J054m893m485M474M205J679
$$ plain form
1749 4131 1596 -3615 -3053 2477 6553 2415 -1880 -2443 2355 6255 2151 -4721 -5207 1152 5237 1358
1765 1358 -4366 -4733 80 5290 2885 -2972 -5310 351 7104 5201 -1620 -6056 -889 4044 3830
1780 3830 -2440 -6542 -2632 2439 3680 -2380 -4529 -2297 4828 5737 -1132 -4667 -1959 3261 5521
1795 5521 -572 -6963 -4383 1915 4214 -1359 -5345 -5786 1761 5659 1199 -4848 -5056 3682 6447
1810 6447 3655 -3462 -3695 2873 5321 120 -4516 -5573 1332 3006 1703 -3894 -5858 574 5605
1825 5605 662 -2991 -4756 1012 5684 4556 -2182 -3794 1338 5834 4144 -3138 -4959 -1645 4203
1840 4203 1881 -3592 -7389 -605 4562 3037 -1938 -3276 623 6752 5943 2022 -1250 277 5776
1855 5776 5235 -878 -4351 -2362 2928 2921 -1196 -5493 -2175 4094 5148 255 -4230 244 4449 6128
1871F128l934l798J351M954N18m525m580J147N685J352m350l857J518M846J558
1886D013l308k658P10M150K376k697m872Q91M325J890l180m146O21M046K243l568
1902H36m347Q03M569J826k331l898L99M803J696k001m508k1L468K842l009l446
1918b319q51L191K734k602l012j016M147K370o71m170K71L258K134j799l543m69
1934b347K627J293j635l098j188L519L095k503k981J57L126K651r08l395j142
1949b729L100J059M8l343j411K475L860k218m059j582L340K818j595k981p27L636
1965c09K485j121k562j396L561K389j373m247j96K627J938j059l614j065K056
1980a886L179r08k886j261J725M013M70l779r33K435K911k49m239l28J544K318
$$ plain form
1871 6128 2194 -1604 -253 4701 5219 694 -3886 -2739 2946 4298 -52 -3909 -2391 2455 4013
1886 4013 705 -1953 -1243 2907 5283 2586 -2286 -1395 2930 4820 1640 -2506 -1885 2161 4404 836
1902 836 -3511 -2708 1861 3687 1356 -2542 -2143 2660 4356 2355 -2153 -2174 1294 4136 1127 -2319
1918 -2319 -3170 21 2755 153 -2859 -3875 272 2642 1971 -2199 -1928 1330 3464 1665 -1878 -2347
1934 -2347 280 1573 -62 -3160 -4348 -829 2266 -237 -3218 -3061 65 2716 1808 -1587 -2729
1949 -2729 371 1430 1478 -1865 -3276 -801 3059 841 -3218 -4800 -1460 1358 -237 -3218 -3945 -309
1965 -309 2176 1055 -1507 -2903 658 3047 1674 -2573 -2769 -142 1796 737 -2877 -3942 -1886
1980 -1886 1293 385 -2501 -3762 -2037 1976 2446 -1333 -2266 169 3080 2831 -1408 -1736 -192 2126
1996B126n22m223j434K164L783j514k932j191L337M144j345k943j509L097L223
2011D261n81l785j868N50L784J449m118l631L148L129N42l716l597L916K958P93
2027C234l354k838K992L608J186n064l565K491M421K210n361l400J637M959J112
2042D268l121l945P58L245L448l129m552P9N494J183j569n844n03M925L619m600
2058b44m700L07N330L638k787m242n66L911M579k589n982L64M792L337k419n352
2074b623k932N267M010q18p294j837L487O711j008n800l394M623M701K019n688
2089e76m359K733N591J562p018l634K898N122Q08n394m165K828O432J209n337
2104a300m578K461O403K218n464n443K204N841K285m946m875l7P140L329m775
$$ plain form
1996 2126 1604 -2619 -4053 -1889 1894 380 -2552 -3743 -406 3738 2393 -550 -2059 1038 4261
2011 4261 3680 -105 -1973 -1423 2361 3810 -308 -3939 -791 2338 2880 -836 -4433 -517 2441 3234
2027 3234 -120 -2958 34 3642 4828 -236 -3801 -1310 3111 5321 -40 -3440 -1803 3156 4268
2042 4268 1147 -2798 -2040 1205 4653 1524 -3028 -2949 2545 3728 2159 -3685 -4188 737 4356 -244
2058 -244 -4944 -4637 693 4331 1544 -2698 -3264 647 5226 2637 -3345 -2981 1811 5148 2729 -2623
2074 -2623 -5555 -288 3722 2904 -4390 -6227 -2740 3971 2963 -2837 -6231 -1608 3093 5112 -576
2089 -576 -4935 -2202 3389 4951 -2067 -5701 -2803 2319 3127 -2267 -6432 -3604 2828 4037 -1300
2104 -1300 -5878 -3417 2986 5204 -260 -5703 -3499 2342 4627 -319 -5194 -5231 1909 5238 463
2119D63n993R10O281L836m388n264q17O224N569l637p044j072N589M263k632o734
2135d446n38M955M757l515n834r02N125N895j680p465q27N014N575k181p226k332
2151e625N794N700k832o360j895L893O421l25o410k769M396N447m85n997l408
2166d455L965N149l0n730m016L412N333M22o386l766L458O266M84o491k313M466
2182b32M826Q36m534m078K219M261K519n557m483Q74N923L96l322m430K770M565
2198B553P77k908l900J689M790J042k630k212R52K822R05l278m736J981L981J682
2214C510m290l493K871K034K161l693l179R20M845J792l023l243J684M819K43
2229C958l760l487J765M291K86m158l832L118K108K319l220l945K374M972K60
$$ plain form
2119 463 -5530 -4620 1661 5497 1109 -4155 -4972 1252 6821 3184 -3860 -4932 657 4920 2288 -4446
2135 -4446 -4984 -29 4728 1213 -4621 -5523 -398 5497 3817 -3648 -4475 539 6114 3933 -3293 -5625
2151 -5625 169 5869 3037 -3323 -5218 -1325 5096 4771 -1639 -4408 -12 5435 4950 -1047 -4455
2166 -4455 -490 4659 4629 -1101 -5117 -1705 3628 4050 -2336 -6102 -2644 3622 4106 -2385 -4698 -232
2182 -232 4594 5430 896 -3182 -963 3298 5817 260 -4223 -3349 2574 2970 -352 -4782 -2012 2553
2198 2553 3330 422 -3478 -1789 3001 4043 1413 -799 153 2975 3880 602 -4134 -2153 1828 3510
2214 3510 -780 -4273 -1402 632 2793 -900 -4079 -3159 1686 3478 455 -2788 -1104 3715 3958
2229 3958 198 -3289 -1524 2767 3053 -1105 -4937 -1819 289 2608 -612 -4557 -2183 2789 3049
2244C049l627m223M217L880L38m424l178J291N068J020m367l765J834M371J513
2259B997l302l429M57N834J471m086m059J528O360P47m448l838P28M825J353m137
2275i99k898K07M939L009l911m355J163N490K230m182n153J840N244J991l835
2290G80n229L92N463K779l909m051j3N177L326l812l981j39M731L945l882m517
2306b940n67N999K273l528m334o53L273M076j500n404j003N132M597k965n561
2321c105P28M866K351j071n856n05L026L503j638m235k513L159M559l20m956j176
2337c183K810L897q33l718j461J766M818q82l753k927L173M033q57l255l039L087
2353c24K104j09j818m171L487L589Q4m006j879K717K779Q04l454k128J729K303
$$ plain form
2244 3049 -578 -4801 -584 3296 3634 -790 -3968 -2677 2391 3411 -956 -4721 -2887 1484 2997
2259 2997 -305 -3734 -3277 2557 4028 -58 -4117 -2589 3771 4518 70 -3768 -3040 1785 3138 -999
2275 -999 -3897 -3690 1249 4258 347 -4008 -2845 2645 4875 693 -4460 -2620 2624 4615 780
2290 780 -4449 -4057 1406 4185 276 -3775 -3788 1389 4715 903 -3078 -3217 1514 5459 1577 -2940
2306 -2940 -3507 2492 4765 1237 -3097 -3750 -477 3599 2099 -3305 -4308 824 5421 2456 -3105
2321 -3105 -2377 2489 4840 3769 -2087 -2592 434 3937 2299 -1936 -4449 -1290 3269 2949 -2007 -3183
2337 -3183 -373 3524 2691 -1027 -2488 -722 4096 3214 -539 -3466 -293 3740 2883 -372 -3411 -324
2353 -324 1780 1671 -147 -4318 -831 2758 2842 -1164 -3043 -326 2453 3257 -197 -2325 -596 1707
2369A707J141l255j644J556J840P3k225j518J141L323J85k420k280J666J805Q00
2385A895k354r86M4J405J505l416p67O45K689J119j719r81N73O70M03j29j923
2402a327J459l62K332j686q02N10J117j449J132j880p51K593j67j489j57O44J135
2419H52N99j644Q58j179J872o76j238L73m39L309l247q86J422L71k424M75J118
2436d84m91K595k113L90j43J101J082k167o32J000k11O04k30p53j783J434M06
2453c95j59j286K63J125K277k58k544J388P68Q2L0j212r39J898j76J421l200r27
2471a844K381J404k329r7j829K472J521p46j240j547K749J554j493j148o97J764
2487H75J904j632q15k683K439J125M39k750m67J604J966Q40k643k128K780J573
$$ plain form
2369 1707 2848 -407 -2051 -495 1345 1418 -807 -2325 -1184 2139 2324 -96 -2376 -710 1095 1895
2385 1895 -459 -1445 -1401 4 1509 -1907 -2674 -2029 660 1779 60 -921 -348 322 725 596 -1327
2402 -1327 132 -230 2102 416 -386 124 1241 -208 924 -956 -1707 886 719 -770 -927 -283 852
2419 852 1451 -193 665 -514 1358 682 -556 -183 -622 2687 -560 -1446 -24 347 -2077 -1602 -484
2436 -484 -975 1620 -493 -103 -246 855 1937 -230 -862 138 -73 531 301 -452 -2235 -801 -395
2453 -395 -554 -1840 -1577 -452 1825 1567 -977 411 1179 1261 1291 79 -860 1038 862 2283 -917 -1844
2471 -1844 537 1941 -388 -485 -2314 158 1679 933 -307 -1854 895 2449 956 -192 -889 875
2487 875 2779 1147 332 -2351 88 1213 1652 -1098 -1565 39 2005 2845 202 -1926 854 2427
2503B427J76m327n0K266J016O21l239j768R30L862k92j810k570K080K797J291
2519C410k771j614K206J161n10j876k955J36M383K040n324k80J82L123K308m462
2535h43j197J028K217Q46l533j759K338K051J950l695j768J178K320j99o1m107
2551c234L37L671J166k331k004M7M098P74j402l589J256J984J903l122k716K939
2567b23R73Q11k681j406M68L818L75k981k213J233L556N1j618k963Q54L825J658
2584C537l019k400m08M182J147l530k745J099L294J772l273k590K213K157K699
2599D135l956l130J414K438J393k217m097K191K992J547l046k500J031K978J930
2614C103k489m031J721J958L847l285m367Q11N627J338m970l098L362J661J639
$$ plain form
2503 2427 2603 -1724 -1774 492 1508 2129 -1110 -2878 -1948 1914 1622 -188 -2758 -678 2119 3410
2519 3410 639 -975 1231 2392 1882 6 -2949 -2813 1570 3610 -1714 -1994 -1812 1311 3619 -843
2535 -843 -2040 -1012 1205 2051 -1482 -3241 -903 1148 3098 -597 -2365 -1187 1133 934 873 -3234
2551 -3234 -2897 774 1940 -391 -2395 -2348 1750 2524 1122 -2467 -1211 773 2676 -446 -3162 -223
2567 -223 750 1561 -1120 -2526 -2058 1760 2135 -846 -3059 -1826 1730 1781 163 -2800 -1946 1879 3537
2584 3537 518 -1882 -2290 1892 3039 -491 -3236 -2137 1157 2929 -344 -2934 -721 1436 4135
2599 4135 179 -2951 -1537 901 2294 77 -4020 -1829 1163 2710 -336 -2836 -1805 1173 3103
2614 3103 614 -3417 -1696 262 4109 824 -3543 -2732 2895 4233 -737 -3835 -473 1188 2827
2629B827l227k784J670M349p8l041k792K767L550R82l335l880J119L971J488l187
2645C99l982R56N096O49k124m216j0N104L318m974k991n07M856J474j381m746
2661c079J606L124J337j497o019Q1M648K788j315n631p98O611L777l734n989J137
2677b953L485L411j516m541j692M019N021m054n895j281O643N396m469l838l944
2692f208N956M913k649n292j991P349K000r29o730l076P700L224j878l789k379
2707c779J875O284l37q035p97L045N642q19o188k092M781N215j312m638m161L833
2723a483O549j505m649l194K701O295j123n868k983M257L258M22m170l245K262
2738b476N598M18m998l192K422N068J154m925l922K615N253K79m161m382K514
$$ plain form
2629 2827 -400 -3184 -1514 2835 2757 -284 -3076 -309 3241 4223 888 -2992 -1873 2098 3586 399
2645 399 -3583 -2627 2469 3118 994 -3222 -3232 1872 5190 216 -2775 -3282 1574 3048 1667 -3079
2661 -3079 -1473 1651 2988 1491 -4528 -4447 201 2989 1674 -3957 -4755 1856 5633 1899 -4090 -2953
2677 -2953 532 3943 2427 -2114 -3806 213 5234 1180 -4715 -5996 647 6043 1574 -2264 -6208
2692 -6208 -252 4661 2012 -3280 -5271 2078 4078 3149 -3581 -6657 1043 4267 2389 -1400 -3779
2707 -3779 -1904 4380 4043 -3992 -4789 -1744 3898 3079 -3109 -5201 -420 4795 3483 -1155 -5316 -1483
2723 -1483 5066 3561 -1088 -4282 -1581 4714 3591 -2277 -5260 -1003 2255 2677 -1493 -4738 -2476
2738 -2476 3122 3540 -1458 -4650 -2228 2840 3994 -931 -4853 -2238 3015 3294 -867 -5249 -2735
2753b735N243J644l970l309J620M459O20m387l443J273M904J050l643l084K373
2768a385L558J066l752j622l2M668J258m132l239K213L062R53k933k633N53L996
2784A599J684l488l672O29N224P07k065k498M56L143J401k285m110j59N420P68
2800B754j540m961J752M824J194l952m345K580M246R16m016l061J867K812K093
2815C163k805k577j82M026J418k018l939J029L103J035k435k543P65L555J577
2830C172j714l845R81J491L000k652k867Q00L231K174l912l192O3M957J198k090
2846G95m122J70M422K554k931m001P74L544K304k390m338P80L526J144j053m264
2862c086J128K152K082j200l773J043J606L335k218m028m07M029K692k067l796
$$ plain form
2753 -2735 2508 4152 182 -3127 -1507 2952 3572 -815 -4258 -2985 1919 2969 -674 -3758 -1385
2768 -1385 2173 3239 -513 -2135 -2167 2501 3759 -373 -3612 -1399 1663 2616 -317 -2950 -2397 1599
2784 1599 3283 -205 -3877 -3248 1976 2683 618 -1880 -1424 1719 3120 835 -3275 -3434 1986 2754
2800 2754 1214 -3747 -1995 2829 4023 71 -4274 -1694 2552 3468 -548 -3609 -1742 1070 3163
2815 3163 358 -2219 -2401 1625 3043 1025 -2914 -1885 1218 2253 -182 -2725 -1960 1595 3172
2830 3172 1458 -2387 -1406 85 3085 433 -2434 -1634 1597 3771 -141 -3333 -3270 1687 2885 795
2846 795 -3327 -3157 1265 3819 888 -3113 -2339 1205 3509 1119 -3219 -2439 1087 2231 1178 -3086
2862 -3086 -1958 194 2276 1076 -2697 -1654 -48 3287 1069 -2959 -3366 663 3355 1288 -2508
2877b508r75M366L240k528l787m93L094L390k048m438r89L377K864r47l723q68
2893b973L572K869j241m255j409M055K492r87m652m37K654K630m36l605j478L158
2909d3L239q88m146o17K389L514o33m069j969K601L244rl485j846K067K967J468
2926C784n170j856K221L539P24l370k863K217L511q61k476k245K165K619J233
2941C172l140l516J746L783L54l300j750J558K586J289k556k797P74L754Q64k399
2957D22l374J310L529M42k076j603j273L796O58k689j555N53L075M62k587j684
2973b594O87J811K326k146j277J81K113J167k318j933k8L108K20N74m326J133
2989a302K268R20r32k557L5K877O03j403j996M68K189J341k492j83q82K142P58
$$ plain form
2877 -2508 -3483 883 4123 1595 -2192 -2685 409 3799 1751 -2687 -3676 -299 2565 1618 -2105 -2973
2893 -2973 599 3468 2227 -2028 -3437 618 3110 2123 -2529 -2966 -312 2318 1882 -1723 -3201 -43
2909 -43 3196 2308 -1838 -2455 -66 3448 2815 -1254 -3223 -622 2622 2613 -872 -2718 -651 2316 3784
2926 3784 -1386 -3242 -1021 2518 3242 -128 -2991 -774 2737 1876 -600 -2845 -680 1939 3172
2941 3172 32 -3484 -1738 2045 2399 -901 -2651 -1093 1493 2782 226 -2571 -1797 1957 2821 422
2957 422 -2952 -1642 1887 2329 253 -1350 -2623 1173 1831 -858 -2413 -1860 1215 1677 -910 -2594
2973 -2594 -1907 -96 2230 84 -1193 -1012 1101 2268 -50 -1983 -2011 1097 1317 1891 -2435 -1302
2989 -1302 966 1886 954 -1603 -1568 1309 1912 509 -1487 -1019 1170 2511 19 -164 -1046 1096 1854
3006A854j438k465M40J532J865n95j154j541J642J437k530j48M91M34N24J810
3022B158k692j251K223J038j197K62k585K226N35j60j377j662J966L058k509j1
3038B2j034J946J6m5k190N12Q84j0O0n46n84R29J313j92j067j430J254J158j32
3057H64r71m48J218m75r8j374P92M14L57j519Q77O08l06Q13r68o19P96J738j279
3076D20q89J12N45M57j46M9k246J891n85Q95l49j542O97J798l72j433K68P24m5
3095B49M22p36j508J019M05m89m2m65L66J789m43j291M2L45J57P68n12o73N80
3114a7o3P03K90l67k410J772K84k77r20M56R95o26r8j004J086M93L69l94r91K08
3134e11J235p28L68q45K26L23M80r88Oo33J375N19l46r99l4J123P5M9r38l88R30
$$ plain form
3006 1854 416 -2049 -1609 -77 1788 1193 39 -1502 140 1577 -953 -1101 -610 -176 348 2158
3022 2158 -534 -1785 438 1476 279 541 -2044 182 717 557 -820 -2482 -516 2542 33 22
3038 22 -1012 934 950 905 -1285 -773 111 101 161 -385 -969 -40 1273 1081 14 -1416 -162 996 864
3057 864 -107 -555 663 188 90 -1284 -492 -78 279 -1240 -363 245 -61 752 -216 -835 -39 1699 420
3076 420 -469 -357 188 645 499 548 -1698 193 -392 503 154 -1388 -691 1107 735 -698 -430 294 249
3095 249 671 -65 -1573 -554 -149 -638 -680 -1145 -779 1010 567 -724 -682 -337 -180 588 76 -597 -17
3114 -17 -80 623 913 546 -1864 -92 192 -85 -1005 -549 446 -180 -278 -1282 -196 297 666 272 -719 -511
3134 -511 724 -4 364 -481 -255 68 548 -440 -434 -1067 308 827 481 -518 -552 571 646 695 -243 -631 299
3155B99k3J64o23k16K27R94o41o92K4R56M81q62l37R77m66J88K15j020P3Q13M79
3176A010p08j015J95Q03L59m65n98o88J354R9l07j87l12P42L36j132M72l8P3L88
3196C81n94p98J255K43l11J27l15N33j186K074j299l27O66M4l51j599L93p7R89
3215a52R81j218R36Jo31J012l9m69r73O78k55r50J916L87M79k226m71j9J326Q20
3235A133j237j86r41K564j180n40j034K16J548K15M90j940o1J354J094m77j058
3252d0n05K4K411r28j614J54L81J281k37j557j534L022M52j491o80M07Q17n47
3270a84R82k257Q22J086J609M0k138j22N25R92l8j697o08K10Q43l94K14j963J519
3289e59K010Q05k342P10n36J49N21l59j758L45K015o13r02j378K390L42P69j863
$$ plain form
3155 299 276 440 -183 -399 -172 822 181 -511 -487 469 950 88 -249 728 262 450 665 -355 -282 531 1010
3176 1010 302 -713 -518 285 644 179 -419 -1107 247 346 39 -148 -460 282 618 -514 -42 -80 -7 381
3196 381 -213 -1011 244 487 176 303 -12 521 -665 1409 110 -217 449 493 142 -1457 -1064 -1141 -152
3215 -152 829 -389 547 548 -83 929 890 421 -552 126 -129 -1079 837 1224 1703 -523 -994 -1013 313 1133
3235 1133 -104 -290 -1231 1333 153 -387 -1421 -1205 343 558 1048 -892 -953 401 1495 1018 -40
3252 -40 -545 -521 1890 962 -652 -498 -117 1164 927 -630 -2164 858 1310 -181 -861 -454 363 -184
3270 -184 798 -1459 -637 449 2058 2098 -40 -162 363 1355 1317 -380 -988 -778 65 -329 -115 -2078 -559
3289 -559 1451 2256 -86 624 88 237 758 399 -1359 -1014 1001 388 -514 -1892 498 840 1609 -254
3307b54j475J702J007L4j124n13o68J665Q23j568n50j04J840k05k76j620M80J536
3325G30M99l48j082j92J125o13L36j822J068Q53P04r91j483n05J368J650j195
3342A02q33j213J943Q73m12l60n98K40P72j538j35M03K10R97m50j181K68O57R81
3361G26q80n13p73J723J56q48j84M62k35N29j34k219P50J901k25q02J41p30N13
3380f42R16J180k981R22P70L34o16kn34Q44k78j28j084J21J189J94L30j124m53
3399a042Q18J763j070j379N63P07p09K15N76r24M30J40Q46r63j125J57P28N21
3417B52p15m24O78N05N01j86j319L27N46m5j030L25L37L47P92j215O98r19J521
3436I76K48j200m63k03J386N85q46p53L70J444j071j181P30k56J368q8r20p44
$$ plain form
3307 -254 -1729 -27 980 1014 -110 -623 -1291 374 1197 -371 -921 -1025 815 610 334 -1286 -806 730
3325 730 1229 881 -201 -393 732 119 455 -1367 -299 554 1258 267 -1216 -1721 -353 1297 102
3342 102 -731 -1944 -1 872 460 100 -498 -258 514 -1024 -1159 -756 -546 451 1 -1180 -912 -255 726
3361 726 -154 -667 -1440 283 439 -409 -593 -131 -366 163 29 -2190 -1440 461 236 -566 -425 -1155 -642
3380 -642 274 1454 -1527 -605 165 499 -117 -119 -653 191 -87 -215 -1299 -1178 11 205 535 -589 -1042
3399 -1042 -224 1539 469 -910 -347 360 -349 -134 442 -482 -52 88 934 -29 -1154 -997 -269 252
3417 252 -463 -887 -209 296 797 611 -708 -381 165 120 -910 -585 -248 99 891 -324 374 -545 976
3436 976 1224 24 -439 -642 744 1329 483 -270 100 1544 473 -708 22 -234 1134 1046 126 -618
3454f18o5J634m65p31O67M05m68j57P85j456K079k766J468k58r08r64K889j098
3472b7P91n40k420K790J614l407J842q39R94j067Q53K33j905J834o04k39L29L42
3490E74l49J441j522N05p45m09O49J65n42P45Q1L14O45j871p55K033N11n74j844
3509i48k49J642J756R35r52k059j620J048K261j298j098r2J355M0j74m69N67n70
3527G5J421j192n91K286j968J720k253o56L91K03O29J103l449M007r29Nj148m7
3545c93N72j254L041k877J567j451K466k541J43k14J024J520p12k214O47J078
3561D02K39J8j727M64j55J459l37k045J242M94Q35j63j739M71J794j724K15r9
3579c56P62l90p65K405k125M14q76J302J143L00j928j707J100J604J113l973J901
$$ plain form
3454 -618 -683 951 486 -245 422 827 359 202 987 -469 1610 -1156 312 54 -854 -1818 1071 -27
3472 -27 764 224 -2196 594 2208 -1199 643 -196 798 -269 584 817 -1088 746 142 -97 232 574
3490 574 225 1666 144 649 -96 -505 144 309 -233 512 593 907 1552 -319 -1074 959 1470 896 -948
3509 -948 -1197 445 2201 3136 2184 125 -1495 -447 1814 516 -582 -674 681 721 547 78 645 75
3527 75 1496 304 -287 1999 31 1751 -502 -1158 -767 -564 65 1168 -2281 1726 797 802 -346 -393
3545 -393 179 -1075 1966 -911 656 -795 1671 -870 -727 -941 83 1603 891 -1323 -676 402
3561 402 641 659 -1068 -604 -759 700 363 -1682 -440 54 889 726 -1013 -542 1252 -472 -257 -356
3579 -356 406 16 -749 1656 -469 -55 -931 371 1514 1814 -114 -1821 -721 883 1996 -1977 -76
3596g6K26P77p43m96j70K71l66K24j243n55L180k75j653O73j830K706N47M61k351
3615f93N86o92J135Q99j395j97N50P28p02m94m37L87J568n90p6o81k64P14J151
3634A497j035K51j480J384m73r84J4O38J95j54o10J294k011R31J333l99j326J053
3652A18L60J27p13O25k49j598J141L41j541J942J157j184l02q50Q8N34P69p38
3670B7q9J04m43J265j400q7L33l39R55Ln72N2l9J135j254L69k78O61Q78j531L48
3691I8j931J964M56l52Q69j081L77q75J249j686J86J307j310J653j098K69p12
3708f17J763j189l46R56q06o0N99n32Q58j301P46J31p34J511j598K69N60r20J73
3727e37K16J524j87j793q07Q38J218q8j068O69Q94n45R37j471N67m8l51l92Q90
$$ plain form
3596 -76 150 927 184 -312 -482 -211 -577 -353 -1596 -2151 1029 754 -899 -226 -2056 650 1197 1658 -693
3615 -693 -107 -799 336 1235 -160 -357 193 921 219 -275 -712 -325 1243 653 577 -104 -368 346 1497
3634 1497 462 713 -767 617 144 -840 -826 -188 7 -147 -757 537 -1474 -543 790 391 -935 118
3652 118 478 605 -108 517 268 -1330 -189 152 -1389 553 1710 526 224 -626 -538 -4 765 27
3670 27 -62 42 -401 864 -536 -623 -290 -629 326 329 -243 -191 -230 905 -349 20 -258 403 1281 -250 98
3691 98 -1833 131 587 235 1104 23 400 -475 774 -912 -726 581 -729 924 -174 95 -617
3708 -617 1146 -43 -389 567 -239 -299 300 -232 626 -675 71 202 -532 979 -619 -350 210 -710 -537
3727 -537 -321 1203 1016 -777 -1584 -746 472 384 -684 -15 879 334 1271 -200 367 319 -32 -424 466
3746D66j17j668J413N9p57r66J715q32J08n50J142n83K056j994j56j40P84j112
3764a132J943j450m10J054o67R20j24m65o68R7K893j850q06R83Q78j58j736K23
3782d75j59R27K50j09L6Q4o4J267j346k60q53Q33M19l94o07M27l42N00J180k061
3802g47r39K094P54j032j11j79J58L26k09m8p67J573j051P40q32Q2l54J856j100
3821B14J15o18m11O13N14j213l33K013l43p72p57J223j077Q22J384J40l251K237
3839E00q14J488j879m3Q2J489j0o53o19m98Q66P40Q09l064J177O46M7k31r9K53
3859A87P80K01j290n95P27k48P21j24o96M38L45J39o04k29j71N71K57j90n12J69
3879a24J316j341P01j316M91o71J330R8j186p10K300K79p88l94k45L00J498j267
$$ plain form
3746 466 349 -1319 94 153 -604 -1570 145 -687 -579 -1129 13 -570 1486 -508 -664 -804 -20 -1132
3764 -1132 811 -639 -1049 5 -662 258 134 -331 -999 -902 1991 141 -665 318 1196 1038 -698 -475
3782 -475 -634 293 543 434 470 554 490 1757 411 151 -702 131 550 156 -451 -24 -366 134 1314 -747
3802 -747 -1686 408 1162 130 19 -160 -2 324 115 67 -700 873 -178 562 -270 -188 -542 1314 214
3821 214 329 -289 -700 -87 427 -786 -1119 894 551 -221 -978 245 -832 -10 1374 1514 -1737 500
3839 500 -314 1174 -705 -748 -666 823 813 160 -459 -957 -91 649 1458 -1606 -429 217 264 33 -66 187
3859 187 967 1168 -122 -717 10 -238 483 359 -337 101 446 585 -19 -248 -419 152 409 219 -293 -124
3879 -124 1192 -149 552 -764 -273 -944 386 484 -702 -1412 888 1167 379 -15 -260 40 1538 271
3897B71n22j48N14k98l40O66m48m92J109R8n90j020R50O2Q70o37J70j9J23O17
3917I36k36r88n5J88L14o19l6R55J53K80O1j860K91Q60O75j97m75L03r38J19P20
3938D51l77j202J063P89j551R79j59O04l21K59J71j636N0M98N20Q6j68M86n17
3957B5o95O26k61N63M43p07l03r0P64K99l41k32J73l17J46J5n43p44O15R11o4
3978B83j403L43L7R97M18r19P01n08K29m07ll24P44P21r06m69r36J160M9j7k12
3999d22Q83n25j40O47n71M24m19J04j61m58Q21l18L07N90k25m5q96j40O05q1k19
4020b39m69M68N32l07r3L1L0L38r43R99n58P27q50L03m14L57J40O87j20j433M60
4041c54M51k67N1J05O2K22N59o60o53Q7r2L82J53N31j204P10l14j69j2l47J077
$$ plain form
3897 271 -251 -399 115 -183 -523 143 -305 -797 312 410 -180 -1200 -250 -188 682 45 215 196 319 936
3917 936 700 -288 -343 -155 159 -460 -496 459 612 892 953 -907 -616 244 919 722 247 550 -388 -269 451
3938 451 74 -1128 -65 724 -827 152 -7 597 276 535 706 -930 -880 -382 138 224 56 542 25
3957 25 -670 -44 -305 258 701 -6 -309 -399 365 664 323 91 264 -53 93 108 -435 -1179 -564 347 283
3978 283 -1120 -777 -740 257 675 -244 457 -51 178 -229 -232 -556 188 909 3 -466 -1402 -242 -193 -210 -422
3999 -422 461 -64 -204 443 -128 296 -123 -19 -180 -638 183 -135 172 762 537 492 -404 -544 61 -20 -239
4020 -239 -708 -240 292 -15 -108 -77 -47 291 -652 347 -211 516 -334 -31 -445 -88 52 739 619 -814 -354
4041 -354 97 -170 -119 -14 48 270 829 169 -484 -397 -489 -107 46 577 -627 83 -231 -400 -412 -759 318
4062C18k79O85r99j88M76L4k74j9j04K39L11N8n54K7N55j07J05l26L40r71J073
4083D00K47K4q32P63k90N41j193M01n6J18r5n94N11J94P05j076K11o33J813j400
4103b41Q86j198P39n3K31M69J72j489L56Q48j002n11J136k91n31O08M6M7N39j122
4123c61J8K36R23l30l13L33l07k70m36J136l99n21l01R95m29M21n5k1m65M65K13
4144E32r3p88M7K71K10O20r77M26kK87o88l04M25L02m19J752j820r26J692n67
4164b0o46p3J011l02K07K93n41Q03p21r6JO43m80n11M72J79K43q99P10p4o75k10
4186f86Q37k0r0j14J87L4L80o91N74p8j100P95o9O51n35k90k77M11j56N28p71
4207d80K37O72m99q4j047Q79N2P96j045N58N29m53L71m27K7%n19O70m07m27k87
$$ plain form
4062 318 39 724 -275 -463 13 47 -227 -246 -350 -111 200 258 -296 -269 286 179 284 -42 298 -673 400
4083 400 647 671 -161 602 312 853 -340 61 5 123 28 -566 -55 139 844 -232 -21 -654 1159 -241
4103 -241 645 -553 186 133 364 833 1005 -484 -128 720 -282 -793 343 52 -479 129 175 222 761 -361
4123 -361 -343 -107 816 486 173 506 199 -71 -507 629 230 -291 -592 403 -26 395 340 319 -146 319 532
4144 532 439 -349 -302 -31 179 799 -178 248 246 533 -155 -459 -34 268 -151 1601 -219 -1145 547 -20
4164 -20 -666 -739 272 -30 177 470 -71 732 11 -85 -84 559 79 -432 40 219 462 -437 273 199 -476 -686
4186 -686 151 131 41 -73 114 148 528 -163 411 333 -767 28 -41 610 75 -215 -492 -81 -237 291 -480
4207 -480 -243 429 -70 -154 -1201 -322 -270 526 -519 39 568 115 486 59 86 86 -433 237 -170 -597 -884
4228h84O99O2M44l87m70O75j48J7O8l39J53K54k83k40n3N12l77J195k03q22K75
4249A48l04m14Q99j277m84J223J063p66r15K42m39l1P67J425j086n67J346j043
4267b13N71j063J890j587L33o5o83J37J697q14j079J265k78Q22j229J4K9q18K062
4286I91j249j005J791m31L78o94j208J139J368r87q52J033O52j894J285k62J04
4303A59j220o11K392l79j157P89Q05j156l77O09M28j96k90l86O55j094R15m94
4321f08R00n29L87K31m17j7m15J13J54L86M63n88k02K75J7j070K070j324l7L66
4341A55l01L50m81L73j55N35o62J87J26Q41j426j94J399j61n96J83L18L86j094
4360b17L41j11q2M13j079J155j210J405n69m95N19n16O25M6j67M14r05K90m93
$$ plain form
4228 -884 -185 -123 321 -66 -536 139 -9 8 76 -263 -110 144 -139 -379 -432 80 -297 898 695 -127 148
4249 148 -156 -570 329 -948 -1432 -209 854 88 -827 -585 -1024 -1055 -288 1137 51 -516 830 -213
4267 -213 358 -705 1185 -402 -69 -134 -817 -680 1017 203 -876 389 111 933 -296 -282 -253 -1071 991
4286 991 -258 -1263 528 97 475 -219 -1427 -288 1080 93 -759 274 926 -968 317 55 159
4303 159 -1061 -1672 720 341 -816 -27 778 -378 -755 -146 282 86 -204 -590 65 -1029 -114 -608
4321 -608 292 -237 150 381 -36 -53 -468 -355 -201 185 648 60 -142 133 150 -920 1150 -174 -211 155
4341 155 -146 204 -277 96 -59 476 -186 1 127 968 -458 -652 747 586 -10 173 491 877 -217
4360 -217 124 13 -69 344 -735 420 -790 615 46 -449 70 -446 179 225 58 472 -433 -143 -636
4379f36m24J564o51l02j92j38J158j89P7N9p21M28K96n11N93j08q03R4J72l16
4399e50o14L11O32P30m68m99k09l28K95M24l20p86J725J03P6j085P81L60m90r5
4419gK77j1l84j30M72N51r10J004o11n06K75j28O28p35r44O44J25N49J96r02P03
4440A56K69j55n94M35k49m9O94k74J30o04J92k21P08j53k65n9P88l02r52r0P77
4461A82J55p20P89j86M38k82J78l00k17L1j04k87K82r68Q11L15o49O34l0J24l83
4482a87Q8K34o87J08J210m78n38L1O50l33m07K79k00L60L27q55J164n58k35J0
4502a7J15M26K9j94p3q75N9Q77l86k61O10K38p53n31L49R20r30K21l13J61L04
4523b4J48n87o7Q26Q8J78k26m48Q77j44j22k57n78N65p81J67J2j07P2N94p18L81
$$ plain form
4379 -636 -1060 504 -147 -449 -641 -779 379 190 267 326 -395 33 329 -182 411 303 -500 -406 -234 -550
4399 -550 -1164 -853 -221 509 41 -458 -667 -995 -700 -276 -596 -1382 343 446 522 -563 218 578 88 -7
4419 -7 270 259 -125 -255 217 768 -142 862 251 -255 20 -108 520 -215 -1159 -515 -390 159 355 -547 156
4440 156 425 270 -324 111 -138 -187 507 233 363 -241 -49 -270 438 285 20 -39 749 447 -505 -595 182
4461 182 337 -383 406 220 658 376 554 254 37 68 -36 -323 -41 -1009 -198 117 -532 102 72 196 -187
4482 -187 -99 135 -552 -444 766 288 -250 -219 431 98 -309 -30 -230 130 457 -398 766 208 -27 -17
4502 -17 98 524 553 359 286 -589 -530 347 -39 -300 310 548 -205 -736 -387 533 -397 -176 -489 -328 -24
4523 -24 124 -463 -530 296 384 562 336 -112 765 621 499 242 -336 229 -552 -385 -373 -480 -408 186 -532 -151
4545a51k23j4K70O47m00K82j54m00K65n32R19o55P9j04j72L17J4L2O8k63k0k09
4567d04Q72n57M20n85P80m16k43L19J69n46O93o83j47Q65o13K51j90K53o23L59
4587b6J62m82J59L66J7j58m8j66K2j23K95K25L6j72j454J218n06M08n02R43J01
4608C15R3j071J190j352N93J78L41m75M4L15p93O78Q5L10m02n00K92K37q7L82
4628C73o42N0n7P17M10j416N93K48L5M07j130N08K2l73j76N24m6j06k77O47j23
4649A88K99n77N73p98l19J125k87J12m36L13o42J010n86j02n49M24L67j3L68l65
4669A05k38l01Q05j38m97Q44q25l5k50J190n54K13J91j266P35l35j02N87p49J468
4689H48o11j11q6m00N04n41M60l64J51K11m26M5O26L6N8m65M20k91M21j21J91
$$ plain form
4545 -151 -374 -388 -118 529 129 411 257 -143 122 -410 509 -146 -67 -171 -343 -26 -12 20 88 -175 -195 -404
4567 -404 468 -89 331 -254 526 110 -133 186 355 -191 502 -181 -328 537 -76 175 -15 238 -385 -26
4587 -26 136 -346 -187 179 196 38 -10 -176 -154 -277 18 243 279 107 -1347 -129 -635 -227 -729 214 315
4608 315 408 -663 527 -825 -232 -54 287 -188 -144 171 -622 56 141 451 49 -451 -159 78 -9 373
4628 373 -269 -219 -276 441 851 -565 28 276 311 718 -412 96 118 -255 -431 93 47 -59 -336 311 188
4649 188 487 -90 483 -315 -634 491 204 316 -120 193 -449 561 -25 -127 -676 -252 115 102 470 105
4669 105 -133 -434 371 233 -264 580 -245 -280 -530 660 106 319 510 -756 -21 -356 -458 129 -620 848
4689 848 237 126 40 -360 144 -397 63 -301 -150 61 -365 -320 306 342 400 -65 355 64 485 364 555
$$ [...]
8191g
##END NTUPLES=NMR FID
##END=
