##TITLE=1H_SA_28.201.tr
 DMSO-d6, 108 sc, 
 4.6.2020
##JCAMPDX= 6.0         $$ Bruker NMR JCAMP-DX V2.0
##DATA TYPE= NMR FID
##DATA CLASS= NTUPLES
##ORIGIN= UXNMR, Bruker Analytische Messtechnik GmbH
##OWNER= root
$$ XWIN-NMR		Version 3.5
$$ Thu Jun  4 12:21:47 2020 Russian Standard Time (UT+4h)  she@DPX200
##.OBSERVE FREQUENCY= 200.1315
##.OBSERVE NUCLEUS= ^1H
##.DELAY= (6, 6)
##.ACQUISITION MODE= SIMULTANEOUS
##.ACQUISITION SCHEME= undefined
##.AVERAGES= 108
##.DIGITISER RES= 18
##SPECTROMETER/DATA SYSTEM= spect
##.PULSE SEQUENCE= zg30
##.SOLVENT NAME= DMSO
##.SHIFT REFERENCE= (INTERNAL, DMSO, 0, 15.7039)
##AUDIT TRAIL= $$ (NUMBER, WHEN, WHO, WHERE, WHAT)
$$ ##TITLE= Audit trail, XWIN-NMR		Version 3.5
$$ ##JCAMPDX= 5.01
$$ ##ORIGIN= Bruker BioSpin GmbH
$$ ##OWNER= she
$$ F:/spectra/data/she/nmr/H-F/1/audita.txt
$$ ##AUDIT TRAIL=  $$ (NUMBER, WHEN, WHO, WHERE, WHAT)
(   1,<2020-06-04 12:20:25.48 +0400>,<she>,<DPX200>,
      <continue with go, POWCHK disabled, PULCHK disabled
       configuration hash MD5:
       00 E9 B6 7A A2 85 ED C7 34 08 36 98 17 FE 4E 26
       data hash MD5: 16K
       48 20 47 6F BC D7 8F 2B F4 06 3E F5 9B E1 F1 35>)
$$ ##END=
$$ 
$$ hash MD5
$$ F6 3B E8 19 47 A4 5E CD 36 14 D6 2D B2 81 0F E0
##$RELAX= 
##$RELAX= 
##$RELAX= 
##$RELAX= 
##$RELAX= 
##$RELAX= 
$$ Bruker specific parameters
$$ --------------------------
##$DU= <F:/spectra>
##$EXPNO= 1
##$NAME= <H-F>
##$PROCNO= 1
##$TYPE= <nmr>
##$USER= <she>
##$AMP= (0..31)
100 100 100 100 100 100 100 100 100 100 100 100 100 100 100 100 100 100 
100 100 100 100 100 100 100 100 100 100 100 100 100 100 
##$AQSEQ= 0
##$AQ_mod= 1
##$AUNM= <au_zg>
##$AUTOPOS= <>
##$BF1= 200.13
##$BF2= 200.13
##$BF3= 200.13
##$BF4= 200.13
##$BF5= 200.13
##$BF6= 200.13
##$BF7= 200.13
##$BF8= 200.13
##$BYTORDA= 1
##$CFDGTYP= 0
##$CFRGTYP= 5
##$CHEMSTR= <none>
##$CNST= (0..31)
1 1 145 1 1 1 1 1 1 1 1 1 1 1 1 1 1 1 1 1 1 1 1 1 1 1 1 1 1 1 1 1 
##$CPDPRG= <>
##$CPDPRG1= <>
##$CPDPRG2= <>
##$CPDPRG3= <>
##$CPDPRG4= <mlev>
##$CPDPRG5= <mlev>
##$CPDPRG6= <mlev>
##$CPDPRG7= <mlev>
##$CPDPRG8= <mlev>
##$CPDPRGB= <>
##$CPDPRGT= <>
##$D= (0..31)
0 1.2 0 0 0 0 0 0 0 0.06 0 0.03 0 0 0 0 0.0002 0 0 0 0 0 0 0 0 0 0 0 0 
0 0 0 
##$DATE= 1591258494
##$DBL= (0..7)
120 120 120 120 120 120 120 120 
##$DBP= (0..7)
150 150 150 150 150 150 150 150 
##$DBP07= 0
##$DBPNAM0= <>
##$DBPNAM1= <>
##$DBPNAM2= <>
##$DBPNAM3= <>
##$DBPNAM4= <>
##$DBPNAM5= <>
##$DBPNAM6= <>
##$DBPNAM7= <>
##$DBPOAL= (0..7)
0.5 0.5 0.5 0.5 0.5 0.5 0.5 0.5 
##$DBPOFFS= (0..7)
0 0 0 0 0 0 0 0 
##$DE= 6
##$DECBNUC= <off>
##$DECIM= 24
##$DECNUC= <off>
##$DECSTAT= 4
##$DIGMOD= 1
##$DIGTYP= 9
##$DL= (0..7)
0 120 120 120 120 120 120 120 
##$DP= (0..7)
150 150 150 150 150 150 150 150 
##$DP07= 0
##$DPNAME0= <>
##$DPNAME1= <>
##$DPNAME2= <>
##$DPNAME3= <>
##$DPNAME4= <>
##$DPNAME5= <>
##$DPNAME6= <>
##$DPNAME7= <>
##$DPOAL= (0..7)
0.5 0.5 0.5 0.5 0.5 0.5 0.5 0.5 
##$DPOFFS= (0..7)
0 0 0 0 0 0 0 0 
##$DQDMODE= 0
##$DR= 18
##$DS= 0
##$DSLIST= <SSSSSSSSSSSSSSS>
$$ [...]
##$SUBNAM2= <"">
##$SUBNAM3= <"">
##$SUBNAM4= <"">
##$SUBNAM5= <"">
##$SUBNAM6= <"">
##$SUBNAM7= <"">
##$SUBNAM8= <"">
##$SUBNAM9= <"">
##$SW= 24.9337058887773
##$SWIBOX= (0..15)
0 0 2 0 0 0 0 0 0 0 0 0 0 0 0 0 
##$SW_h= 4990.01996007984
##$TD= 16384
##$TD0= 1
##$TE= 0
##$TE2= 300
##$TE3= 300
##$TEG= 300
##$TL= (0..7)
0 120 120 120 120 120 120 120 
##$TP= (0..7)
150 150 150 150 150 150 150 150 
##$TP07= 0
##$TPNAME0= <>
##$TPNAME1= <>
##$TPNAME2= <>
##$TPNAME3= <>
##$TPNAME4= <>
##$TPNAME5= <>
##$TPNAME6= <>
##$TPNAME7= <>
##$TPOAL= (0..7)
0.5 0.5 0.5 0.5 0.5 0.5 0.5 0.5 
##$TPOFFS= (0..7)
0 0 0 0 0 0 0 0 
##$TUNHIN= 0
##$TUNHOUT= 0
##$TUNXOUT= 0
##$USERA1= <user>
##$USERA2= <user>
##$USERA3= <user>
##$USERA4= <user>
##$USERA5= <user>
##$V9= 5
##$VALIST= <valist>
##$VCLIST= <CCCCCCCCCCCCCCC>
##$VD= 0
##$VDLIST= <DDDDDDDDDDDDDDD>
##$VPLIST= <PPPPPPPPPPPPPPP>
##$VTLIST= <TTTTTTTTTTTTTTT>
##$WBST= 1024
##$WBSW= 4
##$XGAIN= (0..3)
0 0 0 0 
##$XL= 0
##$YL= 0
##$YMAX_a= 1501397
##$YMIN_a= -1374875
##$ZGOPTNS= <>
##$ZL1= 120
##$ZL2= 120
##$ZL3= 120
##$ZL4= 120
##$ABSF1= 10
##$ABSF2= 0
##$ABSG= 5
##$ABSL= 3
##$ALPHA= 0
##$AQORDER= 0
##$ASSFAC= 0
##$ASSFACI= 0
##$ASSFACX= 0
##$ASSWID= 0
##$AUNMP= <proc_1d>
##$AZFE= 0.1
##$AZFW= 0.1
##$BCFW= 1
##$BC_mod= 2
##$BYTORDP= 1
##$COROFFS= 0
##$CY= 11.3945322036743
##$DATMOD= 1
##$DC= 2
##$DFILT= <>
##$DTYPP= 0
##$F1P= 16.9975609425685
##$F2P= -3.02152046262296
##$FCOR= 0.5
##$FTSIZE= 0
##$FT_mod= 4
##$GAMMA= 1
##$GB= 0.15
##$INTBC= 1
##$INTSCL= 1
##$ISEN= 128
##$LB= 0.24
##$LEV0= 0
##$LPBIN= 0
##$MAXI= 10000
##$MC2= 0
##$MEAN= 0
##$ME_mod= 0
##$MI= 1.114404
##$NCOEF= 0
##$NC_proc= 0
##$NLEV= 6
##$NOISF1= 3.799351
##$NOISF2= 2.8
##$NSP= 1
##$NTH_PI= 0
##$NZP= 0
##$OFFSET= 15.70392
##$PC= 1
##$PHC0= -9802.569
##$PHC1= 27.60082
##$PH_mod= 1
##$PKNL= yes
##$PPARMOD= 0
##$PSCAL= 0
##$PSIGN= 0
##$REVERSE= no
##$SF= 200.130013532006
##$SI= 16384
##$SIGF1= 3
##$SIGF2= 2
##$SINO= 400
##$SIOLD= 16384
##$SREGLST= <1H.CDCl3>
##$SSB= 0
##$STSI= 0
##$STSR= 0
##$SW_p= 3612.71676300578
##$SYMM= 0
##$S_DEV= 0
##$TDeff= 0
##$TDoff= 0
##$TI= <>
##$TILT= no
##$TM1= 0
##$TM2= 0
##$TOPLEV= 0
##$USERP1= <user>
##$USERP2= <user>
##$USERP3= <user>
##$USERP4= <user>
##$USERP5= <user>
##$WDW= 1
##$XDIM= 8192
##$YMAX_p= 0
##$YMIN_p= 0
$$ End of Bruker specific parameters
$$ ---------------------------------
##NTUPLES= NMR FID
##VAR_NAME=  TIME,          FID/REAL,        FID/IMAG
##SYMBOL=    X,             R,               I
##VAR_TYPE=  INDEPENDENT,   DEPENDENT,       DEPENDENT
##VAR_FORM=  AFFN,          ASDF,            ASDF
##VAR_DIM=   8192,          8192,            8192
##UNITS=     SECONDS,       ARBITRARY UNITS, ARBITRARY UNITS
##FACTOR=    0.0002004,     1,               1
##FIRST=     0,             0,               0
##LAST=      1.6414764,     0,               0
##MIN=       0,             -1374875,        0
##MAX=       1.6414764,     1501397,         0
$$ Real data points
##PAGE= N=1
##DATA TABLE= (X++(R..R)), XYDATA
$$ [...]
3288C745N633p27j1009n647J161P670R803k228r260q152m2R490Q431J01r151q635
3304h817q20R409J1145P44j0835q994k505R077J2067j603o186j3073j87R758J0303
3319I483K335j0785p948l338P793R164L249o822r379k431M167R929M375n106j1249
3334f563m460M419J4073L164m259j2371o239P765J2510K395o212j0841m069O701
3348c987R080N459m365j0134o587M166R838O106m546o824p845K479Q890J0160
3362A1890m749r042p191J724Q841Q329q24j2013p376L076Q805Q027k496r557o405
3377h961K511P138N723J198o483j0193K19P985R761J119q873q823k161R025Q594
3392G779J691q168j0703K4R052Q244K582q588j1421L43O731J0323J177p252q603
$$ y = [3745, 9378, 8651, -2358, -8005, -6844, 826, 10629, 8401, -859, -9011, -9053, 437, 8868, 8969, -182, -8817, -9637, -228, 10917, 11661, 826, -8168, -10673, -1596, 10471, 8868, 2682, -10391, -10578, -820, 9483, 11818, 1033, -6915, -10253, -2460, 6704, 9953, 3131, -6248, -8679, -4512, 5417, 9792, 4686, -6563, -11023, -6604, 7469, 10633, 6374, -5997, -12236, -4471, 8039, 10434, 4222, -6619, -10688, -3987, 5093, 10552, 6187, -3947, -10534, -6368, 3470, 9576, 5030, -1794, -9639, -7160, 1730, 11890, 7141, -1901, -9092, -7368, 1473, 9802, 8978, -3035, -10411, -7335, 1470, 9497, 7001, -2556, -8961, -6450, 688, 6411, 7609, 1126, -9067, -8848, -863, 8898, 10017, 1144, -7679, -9840, -815, 7779, 9470, 1302, -9401, -9377, -325, 7919, 10501, 1913, -9508, -9165, -2434, 7889, 9066, 1814, -6789]
3407f789k329P639O424N725o842j0279k439O206P486M586l453j1361k971L259
3421e138J1260L659n526r645n240O522J0210L379m303q081p432N081R863N548
3435A0157m882r616n478M591P729P745l753q507n561J720Q314O159m35j0385q675
3450a0877L606Q948O459j314r266n362J296P385P740l2r599o607J630O107P719
3465G833J340j0087p457n25R638P543q5p868q008l07P188P062K097o451q571l047
3481i705R070P790J609n829q702k638N466Q881L691p839p982k726P429P158J652
3496G325l226j1126r55M905P296M155l529q677n244M833Q507N655m441j0994k591
3511h107L022R291M627m956q789k814L794P160M929k670q800m737K487P221N978
$$ y = [-6789, -9118, -1479, 4945, 10670, 3828, -6451, -8890, -2684, 4802, 9388, 5935, -5426, -8397, -5138, 6122, 9781, 4255, -5390, -10630, -4108, 6102, 9481, 5178, -2903, -10335, -5254, 4609, 10157, 5275, -4341, -9819, -5228, 2501, 10246, 6493, -2014, -7575, -5855, 2459, 8618, 8183, -2202, -10877, -7271, 1677, 8136, 6822, -2444, -7806, -6510, 875, 8615, 8583, -1016, -7623, -5993, 114, 7833, 9173, -914, -8371, -8896, 742, 8285, 8200, 332, -7676, -7983, -795, 6267, 8364, 1913, -6658, -9705, -635, 7155, 8764, 2935, -5767, -8405, -2939, 5942, 9633, 1794, -6188, -8914, -1485, 5673, 7325, 4099, -7027, -7982, -3077, 4219, 8374, 4845, -3832, -9076, -4243, 4264, 9919, 5478, -5516, -8107, -5085, 4206, 8833, 3877, -4912, -7726, -3932, 3228, 8157, 5487, -3313, -8050, -5563, 1658, 7636]
3526G636j156r163n727J289J1268M761j662p208o975r32P898P161L52r290m490
3541f238j008Q262O003L02p280o740j045P574O288Nn517p010K64N011P031R57
3557F859o420n817k249N631Q188K971p025q477k690P406Q590q18m189q569j77
3572f786L761Q097M205p443p683j611M587O607L191l950o110n381N971N901M961
3587H317l821r454o45K560M970O815m780n978n021L619N415N619j712r996k389
3602f481Q49O666O663l361o364o815K395O822N900J490r673m457K094N219O904
3617G851j237q380o506J845P904N718j702n917n223K24O201O333P39q248p261
3632g659J655M637P134J306o295n020k139O541P419j006m258q375j513O353P021
$$ y = [7636, 6480, -2683, -8410, -7121, 4147, 8908, 7246, 38, -6937, -7869, 29, 7190, 7542, -1748, -6238, -7246, 1016, 7019, 7321, 41, -6699, -7744, -170, 6118, 6123, 606, -6404, -6140, -1129, 5902, 6859, 439, -5378, -7627, -1996, 6192, 9163, 2138, -6339, -9029, -1623, 6967, 6149, 1960, -6609, -6786, -3025, 5072, 9277, 1834, -5849, -7460, -2873, 3734, 6925, 2975, -3135, -8516, -2545, 3356, 8317, 4496, -4958, -5603, -3043, 1927, 8742, 3962, -2016, -7037, -3418, 1997, 7616, 5904, -4092, -6481, -5632, 1034, 7697, 4336, -2028, -8843, -6448, 374, 6274, 7764, -1909, -6366, -4272, 947, 7851, 6614, -1766, -8272, -6427, 1477, 7195, 5493, -424, -5647, -5423, 778, 7111, 7850, -398, -7659, -6004, -1367, 5767, 7073, 778, -4242, -6381, 160, 7579, 6573, 2315, -6060, -7573, -1220, 5801]
3647E801P16m455q288j994P136O665k84k790p061k216N318M821L705m299p845
3662e070k679O415O000L308m148o595m351L415P380L544k928q431m230M804P033
3677C467L330k224p678l409K509O820L768l035m133o173K004N842N151j30p521
3692a412l002k2P118K040J41o389n210J463P885K724j47m795o888N06O196N714
3708E922k006l217n376k426N635O537r74m240l757r35L755O805j25m776n364j064
3724e606N175N503J268o870m881N05K503P189r8l023n128l003N676P179r30m018
3740A441n017k870L410O211K122j719o957q01J311N840J948k932m333m252L039
3755c559O012N027m132p082j069J115N376L282j564m169n139J466O967M332j863
$$ y = [5801, 6517, 2062, -6226, -8220, -1084, 5581, 5297, 2507, -4554, -6770, -1452, 3369, 7074, 2775, -5070, -7749, -1334, 4666, 7974, 3826, -2769, -7120, -3705, 3675, 7219, 4291, -4140, -8370, -3566, 3467, 6797, 4573, -3105, -6514, -4005, 2815, 6583, 3548, -585, -6758, -4754, 1088, 6239, 6109, -1412, -4414, -4436, 2682, 4722, 4863, -1526, -6736, -5273, 2612, 5336, 5189, 394, -6494, -5988, 208, 5922, 3916, 699, -4677, -7103, -1468, 5069, 4095, -145, -3902, -4837, -1082, 5723, 5598, 822, -4542, -5606, -431, 5072, 6340, -530, -5411, -4906, -2403, 4786, 4688, 1665, -3463, -6466, -790, 6389, 5459, 1441, -3576, -6446, -3036, 3175, 5297, 3578, -3379, -4180, -2869, 2971, 4919, 1987, -2346, -6598, -3559, 2453, 7480, 3348, -3734, -4803, -3688, 1688, 4970, 3406, -763, -5902, -4436, 2531, 6863, 5000]
3770E000q115j623Q06N091M082q79n666l452N52O617L503m070j370o352M01N631
3786A56N242P25m834n760r2M260M288J28k104o804J55N092K013K456n161l358
3802c598j369N212N718r65n264m564p42N295O020N40n107m775j992K344O925R68
3818D646l547l098l206R12R012N67n097k929l389M305N929Q5j856l724k065M5
3834c410Q004M40n79o521l911K918M654M937l110m861m383J120N688N529k389
3849D126n353m484K092L690L522K053p607k080j054Q750O00j510m422k672p45
3864e094L879O830j530n103l698j15M152O401m90o005m725J933L701L383q48k483
3880A88m418J571K799L276J470l798m069j751L969M456J405n103l530k790O686
$$ y = [5000, -3115, -4738, -3932, 1159, 5241, 4362, -1304, -4756, -4204, 2413, 5916, 1846, 476, -5876, -5475, 156, 5398, 6123, 1289, -4471, -4563, -303, 3985, 4113, 2009, -4795, -4640, 452, 2465, 4921, -240, -3598, -4967, 245, 5963, 4998, -266, -4830, -5572, -277, 5743, 6283, 1176, -3599, -5591, -3247, 3678, 4646, 1099, -1999, -5205, -4293, 4719, 5286, 189, -2740, -6129, -1824, 4105, 4190, 2334, -1390, -3455, -3410, 4594, 5034, 4455, -2066, -5977, -3059, 1595, 6532, 3422, -1439, -5822, -4702, 986, 6515, 4126, -1227, -5711, -3619, 71, 3593, 5646, -1961, -4041, -5095, 3655, 4255, 2745, -1677, -4349, -5094, -1215, 5615, 4085, -1018, -4716, -4831, -679, 5722, 5232, -773, -5498, -3565, 136, 3519, 2671, 188, -4230, -2659, 140, 3416, 4886, 1088, -2981, -4732, -763, 3693, 5098, -5, -3535, -6325, 361]
3895C61L873M90k178o772o23L707M459J641l121o167k147N444K502N636n629l697
3911b221l419K701O886m54q27m570k505J972O460J363k672m967k250M57O789J977
3927D720k82p529p33K484L889K917l227n169k252J587M019N099q11n626k235j306
3943d455O698K393m99m724l440M7L842M373Q92m943m081K20M204M579j326l972
3959a92m313P75L087L580M33l868l371m62K678N576J624k577o119k074M151M268
3975C196K158m215m242j909M332L529J897l372m223j800K943M101L123l305n100
3990b887p71O46M486L372k194n333k408K608N497K120k859m174j788o18N817K638
4006D152j374n152j942O7N920K445k149l627k979K440L853L426r28n145l436J220
$$ y = [361, 4234, 4724, 2546, -4226, -4849, -1142, 3317, 4958, 1837, -4330, -6477, -1033, 1469, 7105, 1476, -2221, -5640, -2939, 3947, 3493, 2666, -1904, -4409, -2437, 4023, 5386, 2714, -2253, -4503, -4046, 2743, 4720, 4438, -3091, -3824, -1340, 2549, 5466, 2239, -2930, -5182, -3595, 424, 5523, 4712, -914, -3149, -4455, 2243, 4636, 4137, -587, -4027, -3980, -138, 4235, 5127, 184, -3897, -3677, 527, 5106, 3780, -192, -4505, -3730, -643, 2937, 3370, -498, -3869, -4331, -1653, 3923, 5547, 2970, -3149, -5223, -1072, 3196, 5354, 1139, -3103, -5012, -680, 2849, 4746, 1374, -2849, -4649, -1706, 2395, 5518, 2213, -2887, -3658, -3012, 1474, 4846, 2652, -2681, -5089, -2481, 3016, 5136, 2277, -1897, -3685, -4303, 1514, 4152, 2778, -2374, -4316, -4249, 1671, 4116, 1967, -1660, -4639, -2199, 1654, 5080, 4152, -993, -4429, -3209]
4022c209K947M414l26m528l146r7L607M592q00m615k719m56L405M287R85m602
4038b61l101j298N767K900j753k045l678K67K435L254K058l968k638k200L216
4053a045L483J440k967k835l167K913N179R08j984l479j941K301M100K957n034
4068H29m411L3L206M977p86j242l295k427J818M079J476l345j850k952J186L902
4084A198K073n01l982l397J874M293J703j17m873l146K334L431J319J06l026k478
4100c189j05M629K515r54l745l672J535L638K179K86k428m437l91M472L509L57
4116D199k385n821K71M383K729K31k849m205k36K965M044J646m624l840J88L613
4132C09J889J94k233k418r73K086L782P82j643m359o97K534L538J479k891l216
$$ y = [-3209, -262, 4152, 3826, -702, -3848, -3945, -338, 4254, 3454, -1161, -3880, -4336, -931, 3356, 4341, -261, -3362, -4660, 1107, 4007, 2254, 209, -3469, -3202, -767, 2487, 4545, 577, -2061, -4261, -1045, 2438, 3878, 911, -1924, -5091, -2178, 3001, 3909, 1925, -1554, -3495, -1194, 2906, 5863, 829, -3582, -3549, -343, 4634, 3848, 2606, -689, -3116, -1298, 2781, 4257, 912, -938, -3890, -2704, 1198, 3271, 2770, -1212, -4609, -2735, 1558, 3261, 3144, -1729, -4875, -2541, 890, 2209, 2315, -711, -3189, -3294, 1335, 3850, 2896, -849, -4521, -2986, 652, 2831, 3117, 689, -3748, -4139, 333, 3842, 4199, 1814, -4007, -3736, 647, 3376, 3607, 758, -3447, -3683, -718, 3326, 4972, 348, -3492, -3304, 309, 2198, 2392, 159, -2259, -3232, -1146, 2636, 3418, 1775, -2584, -3281, -747, 2791, 4270, 1379, -1837]
4148a837q59O93M296J480j840m402j552K994K709N53m3l688k880K654L630K140
4164D048k738k872k053R97L119L563k682l870j281J783K476K216O41m301l405
4179d359K119K493L205m1m531j821K017J122L397l26m397l111K003L392K603L0
4195C795l976j998m31K819M286j056k810m667J441K799K236J452l733m056j76
4210d075N053J003J060m282k558J068K576K456J401k089l431j392K033L552J205
4225C580j672o139K65K947L119J461k568m134ON86M486J686k112l661o22J644
4241a128K009K889j920k943k050K79N154K476l393j226k881P30L899J208j82m047
4257a126j057K528O91K173K28m035m566K410L709K240j044k375j082k257M522
$$ y = [-1837, -2696, -2003, 2293, 3773, 1933, -2469, -4021, -1027, 1682, 2235, 2192, -1496, -4376, -1722, 1908, 4048, 1310, -1562, -3615, -2618, 501, 4064, 1382, -2488, -3769, -1986, 490, 2706, 3347, -954, -4359, -2240, 253, 3458, 3417, -1114, -2935, -918, 204, 3601, 3275, -1122, -4233, -2230, 1162, 3765, 3795, -181, -2179, -2610, 209, 4495, 3439, 629, -4038, -2597, 202, 2438, 3890, 157, -3899, -4075, 978, 1981, 3041, -1241, -3799, -2731, -155, 2301, 3702, 1613, -1818, -3210, -1177, 2375, 3580, 1908, -4231, -3966, -1019, 2100, 3561, 993, -3141, -3135, -2549, 1937, 3623, 1511, -2150, -2772, -1128, 881, 3770, 1850, -1093, -3143, -2864, 2290, 4766, 1373, 147, -2734, -2004, 1895, 3103, 2921, -1126, -2183, 345, 1036, 3209, 3437, -598, -5164, -2754, 955, 3195, 2151, -224, -1306, -3563, 959]
4272I59J245l42r70m280L56K682M134r54j525m062L66K970L104j489l742k657
4288d205J863L146J022J097k322k835Q34J267K288o76k178j124j133J496K595
4303A135Q18j481k982j568L840K998L90j885l688r14J565N252L64k001l524j52
4319a833O54K771J219j803k714j0j404N797J252j432n101m53R41L791J269L89
4335C333l776k696J248K408L217j537k931j434L14J487L192P24m103q59j116L253
4351G24J750p52j473l458J140J763K544r4m032m26M6J400L944m07k417k915l85
4368c048K578M532j147j248l741k03J386L532J392l231k726o95K952L7K646j636
4384A380m339M81J805M878l284j237M9k477J100K611J538l46l672j003N00K869
$$ y = [959, 2204, 1862, 892, -3388, -3032, -350, 3784, 2830, 1305, -2757, -2391, 579, 3683, 2194, -1548, -4205, -2342, 804, 1826, 2923, 601, -2234, -1400, -133, 2155, 1479, -699, -1823, -2956, -1460, 1135, 1953, 472, -2510, -4078, -238, 2760, 3150, 1265, -2423, -3337, -1772, 3480, 3844, 1843, -1681, -1833, -1179, 1592, 2811, 1008, -1706, -1716, -3120, 2677, 3929, 2497, -2604, -3057, -2116, 1675, 2944, 3333, -443, -3139, -1891, 517, 3734, 2197, -734, -2168, -1854, -367, 2825, 3549, -554, -1413, -2529, 724, 2474, 1722, 249, -3209, -2069, -306, 2238, 2144, -1888, -2314, -2268, -868, 3076, 2669, 252, -2663, -3048, -470, 4062, 2915, 1667, -2074, -2277, -891, 2641, 4033, 802, -1924, -2619, 333, 370, 3016, 1380, -2959, -2478, -673, 4205, 921, -316, -267, -2744, -1644, 967, 2505, 2159, -1513, -2516, -2016, 853]
4400H53K081l011j577q31J21M589R06j449j600l550K213K641Q76q02k090k205
4416b835J526K257J540j424q52k127R20K033J238k32l013q74J60J522L920j189
4432B570l363j948J733m93M787l07l708j521p05K527L710q73j875k687n33K662
4448b4J037P44j932k350j743M022K445l45r28k767L50N48L729o02p89k466pK51
4466h27K101K375l160j487p78R86J296K416k846j119r22J509J589J682j836k796
4482a817j248K065K973Q38o36k995j576J587K152K282l242p99p26o49K781J419
4498B409j925j789K07j308L400K375k140j652l89p21L362J394k653p27j030q72
4514b059K655Q19k30p60l095R95K632K067J18k307k884O80J562J414j07k506l40
$$ y = [853, 2934, -77, -1654, -2485, -2364, 2225, 3131, 1682, 82, -3468, -1255, 1386, 2262, 1460, -630, -2835, -1309, 948, 2488, 1064, 212, -1915, -995, 1038, 2276, 2044, -969, -1843, -1683, -161, 3759, 2570, -793, -2741, -1008, -1501, 3286, 2979, -729, -2250, -2955, -428, 3282, 2409, 534, -2153, -2686, -24, 1013, 1757, -175, -2525, -4268, -246, 2199, 1854, 926, -1841, -1491, -943, 2786, 2184, 1395, -1071, -1078, -827, 1274, 3649, 489, -998, -1776, -790, 506, 2922, 76, -1043, -1965, -456, 1133, 2815, 979, -1817, -3065, -1000, 1973, 2811, 2175, -820, -2396, -809, 1343, 3625, 383, -416, -1142, -1791, 990, 2409, 484, -1305, -1098, -2406, 994, 3369, 1229, -423, -812, -1533, 1829, 3223, 570, -157, -1187, -2059, 596, 1415, 1185, 425, -2670, -1675, 957, 3024, 3142, 835, -2049, -1369, 193, 1607, 1500, -1006, -1346]
4531a346j015K901J828K27k540j427j387J245L158l12j477k028J29J768J581P22
4547B027j063k449j427K357J628k12K67j972l35P71K346m39j160j376j716J604
4563a149J661J950j269j220j135j360M599m14n9j744j719J473O75K214j284k318
4579a099r72R43K451J74m7k518q49O6K682K211j998j505k031J423K194Q34q39
4596A120j132j528l40K077K122l76j488j756O03L49K151r99j038j016j742L632
4612F39P22J13k230k145O83L357J1j30N70k674K30k09L129N68k342j139j701J416
4630a132K905Q97k778k536N38Q97K960J091k690k278L30J133J750n04J361k190
4646b46p10Q2P96K279j805j326j590K199J216R39m29k655r72J554J747J197n62
$$ y = [-1346, -2361, 540, 2368, 2595, 55, -1372, -2759, -1514, 1644, 1332, -145, -2173, -2044, -276, 1305, 2027, 964, -1485, -2912, -555, 1073, 861, 1128, -844, -1179, -408, 1938, 1499, 339, -1037, -2753, -1149, 512, 2462, 1193, -27, -1162, -2522, 2077, 1663, 1604, -140, -1859, -386, 289, 2503, 1219, -1099, -2071, -1128, 1323, 1497, 1450, -1068, -1917, -1851, 831, 3042, 1044, -461, -2492, -1069, 1125, 1959, 1120, -12, -1540, -1880, 197, 2319, 1943, 455, -1301, -698, -349, 1802, 803, -235, -1251, -2993, 639, 1361, 1474, -756, -2901, -2218, 1139, 1150, 1020, 1590, -1084, -854, -1063, 2066, 2634, 292, -847, -2548, -1132, 1773, 2670, -108, -2644, -2106, -1209, 1751, 2842, 152, -2126, -1796, -663, 1087, 583, 1944, -246, -956, -874, -78, 2201, 396, -930, -2520, -321, 895, 1834, 1405, -1250, -2222, -668, 1079, 2276, 1714]
4663A714j651j764n34K655J041o64j418j459L71K604R33n77k115j080N31K125
4679G12R98M15j424k182J69J559J227m2j262k418P43J408K300M78j777l578J424
4696a250J045K103r32m80j280j337J988J618J62r16k356l28J928J910l7j590k283
4713b035L77J204J480M51Ok941j060J615J973J866k103j87k479K208n97K301j490
4730E89j392K32o59K946j194j38M45j491o03J442K829j793k908J30l06L682k45
4747A566j436n95j508J571R41K677j331j895k830J916K77K084P83m196R73k53
4763a256K213J157j889q35l05r32J033J906N73L55k220k159K794P78J324k087
4779D50j857J017J200J069q53j468n64n1J024K447r17k268k93o47J387J534J476
$$ y = [1714, 63, -1701, -2235, 420, 1461, 797, -621, -2080, -1709, 895, 1828, 1251, -864, -1944, -1413, 712, 1710, 2125, 701, -1481, -1312, 247, 1474, 1432, 170, -2248, -1505, -97, 2203, 2681, 904, -2674, -1250, -205, 1898, 966, 486, -794, -2131, -143, 1475, 1637, 721, -1635, -1963, -35, 1875, 1838, 248, -2035, -1658, -454, 1026, 1477, 1483, -1458, -2518, -903, 1070, 2936, 833, 646, -1833, 375, -222, 2079, 589, -803, -571, -1230, 1716, 522, 384, 829, -662, -1265, 177, 3006, 1213, -1695, -1565, -1871, 1811, 1566, 130, -465, -1973, -402, 539, 3216, 1885, -10, -2840, -924, -647, 1437, 2220, -1976, -1003, -1256, 957, 2114, 225, -610, -915, -1847, -814, 1092, 1665, 2020, -200, -2359, 435, 1213, 2537, 450, -1407, -390, 810, 1879, 1026, -442, -1006, -1057, -33, 2414, 1497, -771, -1064, -1711, -324, 1210, 2686]
4796B686l986J005j072o5L205j397J58k103o13J999J451Q30k520j78j731J480
4812h51K108n12l95j830R64j136J192L684k337j838N45jJ571J812k622k23o47
4829e16k74P75L300k921j877J524m19J837J790k616r16j918P25J712J493R56k473
4846A82l22K66q76J563J471k154k381J457Q17Q70J922j643l764J290K499p00j148
4863f51o80q23J058K37J847J068q50k626J340J9L52p36M44j06j382J420J640O86
4881B257j026p37k042J687J944J280k529k840m80J995K896k394N67k149o10J003
4897a178L445j184j112N04q18j69K810l53j069j587j846J285J085J061O06j618
4913a38n47j404L915K00j209l44l171l50M621p53R03l077N54o27J638K954k335
$$ y = [2686, -1300, -295, -1367, -1432, 1773, 376, 534, -1569, -2182, -183, 1268, 2098, -422, -600, -2331, -851, 1257, 745, 350, -1480, -516, -1652, -460, 3224, 887, -951, -406, -407, 1164, 2976, 354, 131, -516, -790, -15, 3285, 364, -1513, 11, -408, 1429, 3219, 603, -313, -2231, -1506, 206, 1699, 2655, 182, -140, 126, -750, 813, 2284, 130, -2251, -794, 23, 893, 2815, 1172, -2592, -1302, 1197, 497, -651, -1331, -2154, -1096, -859, 988, 2056, 1206, -1420, -80, -61, 291, -445, -1, -107, -1489, -69, 1571, 2257, 1231, 494, -1548, 139, 2083, 3363, 834, -2006, -2486, -491, 2405, 11, 578, -1571, -2181, -1178, 2267, 1083, -29, 475, -343, -512, 2298, 1945, 876, -711, -2557, -1272, -187, 874, 1480, -138, -685, -2089, 1826, 2026, 817, 473, -2698, -3048, 1573, 820, 1723, -1354, -800, -1427, 211, 3165, 830]
4930H30o29j683M15R20Q61J144k349k46k834L432K47J341p65k406J27J136L196
4947B737j509R69m695K48K586R74j5k431n7n15K547m99N97j69p1j396J783P50
4965A834N18j293p97q64O37R97K09n8n40k305J935M17m77K174k523l870L611J975
4983A580l81k83k752K50L4K135N92J706k969k35k326K309K714m86j216k478n39
5000b345K150N86N5k531J086N22K251N61j1j395l268M62L074J320p22j281j314
5017h00J811j702J007M76J4k288O1K75N59J602q30k237O89M20K591J361l187l63
5035e41k421L424o63J14j62L46K21J093j410J811q21k648P70N7R41K05o88K37
5053a35K43M4J182P77j575j751J252j336L579Q72l427j274j12J672K203n32j805
$$ y = [830, 201, -1482, -1067, -147, 714, 1858, -491, -737, -3571, -139, 108, 1449, 684, -1722, -1595, -459, 2737, 1228, 2197, -2498, -2250, 336, 1310, 1295, -1136, -1193, -1708, 839, 340, 937, 768, 697, -699, 1084, 1834, 2352, 1059, 262, -602, 35, 1032, 1241, 1183, 643, -1662, 273, 690, 213, 2387, -136, -4006, -395, 1580, 1199, 916, -1836, -1586, -1552, 583, 1175, 2881, -88, -323, -2649, -340, 2374, 1888, 672, -1806, -2345, -195, 391, 446, -2085, -999, -477, 1774, 2335, 2324, 929, -2339, -1877, 1197, 2517, 1795, 514, -800, 1011, -691, 316, 792, 806, -1482, -1421, -1146, -587, 1015, 185, -2052, -1363, -943, 1648, 3009, -178, -541, -2962, 462, -201, -87, -249, 97, 318, 1411, 1, 1812, 991, -1657, -887, -830, 111, 316, -372, -135, 108, 152, 1334, 2111, 536, -1215, 37, -1299, 2280, 3152, -275, -1549, -1661, 11, 2214, 1682, -123]
5070a23j391q73O20K432J201j200J07l091J713R63J883J64k344k30j357K27K421
5087A122J202j387k751J534O61J193N94k855J690j500n81K717k68R0m87j389K074
5104A659J19o96l678J962P75j14Q6k61l08J341k218J168J477j065k1J57j518P35
5122d00J399J427K08m192q39K926L156m815P64j198J208R38k10l57n97p1r19Q70
5140g02L74J466j187n09j593J176Q66J062r91l171J386K213J07J052j744K11k972
5157b956K071K128j045q90j794L168l24P86k92j51Q33k603O58K06K921o46k544
5174d74P54l272L675l75O02l205R7J159R16K668j229j624P94N42l20K0K020k186
5192E62L04k82j017L063j071k926N79k385J753K219n52N84j533j856J751J521
$$ y = [-123, -1514, -2387, -1767, 665, 1866, 666, 773, -2318, -605, 358, 2241, 2405, 61, -169, -1526, -1299, 1122, 2324, 937, -1814, -280, 381, 1574, 2168, -687, 1003, -497, -1078, 1639, 1371, 1461, 974, -415, 1659, 1778, 1082, -2596, -634, 141, 27, 113, -148, -456, 885, -1333, -165, 1312, 247, 226, 383, -1135, -400, 999, 2426, 2634, -1558, -2397, 529, 3685, -1130, -366, -1564, -356, 582, 372, 15, -582, -653, -1572, -702, -328, 1138, -49, -558, -2151, -975, -109, 953, -38, -3209, -1823, 390, 497, 1549, -195, 16, -2956, -885, 1243, 198, -692, -2486, 682, 358, 1144, 852, 701, 1534, -1069, -411, -205, 2716, 2070, -474, 280, -2992, 683, 308, 910, -2295, -2198, -1039, -123, 2545, 1316, -308, 486, 1028, 708, 728, 2748, 562, 866, 584, -433, 2630, 1559, -1367, -788, -3173, -1420, 799, 247, 831, -702, -2558, -807, 714]
5208G14O50k390q76O17K040J725p62j893k029Q04R31m00P93J559k731OR66O37
5226C61K289p15r37r71m56L137M58l338r36k70R98K281j614K48J558k877o70j67
5244a621K415N06j888K10J529j81R13p15j524l536K929J490o47L476l768k230
5260b642K519J7J747l96l242J195j852K591R63j62Q5k816K823L21K033k393n03
5277B88k131m60J181Q60O18R77j152j834oJ342J90J837l244J286O43j721L283
5294A957r11k032M8l45K509K75j644K152j976p40J259M05k707O02o4q5L851j349
5312A205q87N33j795K21OJ374m90Q93j876q62K804J16l46k437J731O41l49m13
5330F9J152j383p49J410o7O41Q05k219J44M95l25R06L7j858j024J306M56J549
$$ y = [714, 1364, -1026, -1902, -1285, 755, 2480, 1718, -175, -2204, -1400, -469, -869, -76, 1483, -1248, -1242, -276, 361, 2650, 1935, 998, 27, -429, 2708, 3166, -172, -1108, -1378, -380, 1901, 287, 535, 2093, -784, -1454, -1621, 794, 1300, -588, -378, 1151, 970, 1883, 1168, -356, -3892, -963, 527, -120, 3356, -412, -2642, -123, -106, 1641, 1245, -1997, -802, -2654, -63, 900, 738, 823, -1993, 830, 1151, 3184, 791, 288, -1843, -2303, -1122, -262, 356, 1333, 181, -1653, -1659, -317, -127, 1710, -1534, -248, 395, -1326, 1957, 1046, -986, -938, -1283, 1226, 1501, -143, 2009, 33, -707, 552, 957, -1750, -1148, -1212, -1297, 2554, 1205, 318, 851, -944, -723, -717, 657, 167, 1060, -816, -1678, 1126, 1242, 896, -1541, 190, 831, 482, 69, 1221, -162, -911, 499, 432, 1073, 1878, -341, -197, 298, -27, 879, 916, -942, -1966, -660, -204, 1345]
5348A345o95j068j670J720J857j430J422K43j677n51O77O09Q42k668N95J310N74
5365A435Q55j954n21J061j743N19L41J792k272l59o09j56K892L65j325j718m76
5382a873M261j935O46r79n12j947J779J630J111j617j876m04J162k87K116k264
5398i89K488j577j689J676j28J542k374Q74j521J245J747K42r81k640K288J29
5414C32N74Q91l102N87k187L087k59J710r21k865J891K117q50k00p29q65l74K266
5432A103m78K92n23j734J28J782Q0pk428L52J518K565j901j347P93j182L74k75
5450h88K438r29N55j789k449J357K081J419j376o26K22N6J526K56k897L60p90
5467a474K22K251k002P56O45j166J500L52m97k33j401q32L94J517J982j241j043
$$ y = [1345, 650, -418, -2088, -368, 1489, 59, 1481, 1724, 47, -504, 173, 782, 1624, -1044, -449, 861, 1435, 2290, 336, -185, 876, -867, -348, -7, 1785, -487, -846, -1455, -1611, 1281, 1646, 321, -1397, -1873, 2388, 453, 1099, 120, -392, -2339, -560, 1070, 2181, 564, -1312, -1716, -554, -841, 1275, -989, 1499, -78, -1767, -91, -219, 1323, -1051, -177, -1698, -453, 1294, 1536, 555, -2085, 203, 332, 906, 1797, -1305, -718, -2905, 182, -77, 1633, 712, -2153, -262, 1855, 1005, 805, 76, -789, -1163, 1103, 625, 917, 394, -1340, -1212, 570, 650, 643, -1785, -1433, 85, 2650, 749, -598, 195, -987, -613, -888, 1550, 621, 1176, -613, -3062, -1705, 376, 1795, 419, -207, 15, 71, 1597, 1853, -1044, -684, -1474, -1252, 999, -1003, -247, 398, -768, 732, 1084, 587, 354, -1047, -1879, -1485, 32, 2014, 773, -270]
5484b70j899J123L64Q01J444k420l81N18p26J607J23K61j826o23K666J049j746
5501F5O06k034P3K304L62M2l40j156M24k14Q78o53j445P9J7n49J896O47J024p93
5521A233k664K024Q77j462J30k642K341R55r69O65n49j082K598r59R48k60j119
5538F5j38o19L70R25J47j00k057M71P40K73K525j938j203j082L882Q9q98j440
5556A2O19k326N59K270R54j410j760J717n65P70L12k82k278J125j164K228j074
5573b93J858k375q7N46O1J147j15r85j659J988J412J66j456j413P06O84l19J026
5591H92j184j534K072N66m78Q50l29r24K84j137P34K545q91j275j200J170M15
5608E76J346j936L95o14J19o11q43L338k156k83N03j02q48J001O99l95j068Q98
$$ y = [-270, -2169, -1046, -682, 119, 1563, -857, -1238, -720, -1446, 161, 284, 545, -1281, -1904, 762, 1811, 65, 671, -1363, -1290, 1014, 1376, 1418, 1078, -78, 346, 132, 1010, 357, -1088, -1009, -992, -1541, 355, 1002, 2026, 1233, -1431, 593, 1470, 8, 138, -2504, -163, 792, -177, 488, -61, -1143, 1455, 496, 1444, 1184, 65, -73, -692, -322, 603, 750, 650, -1407, -936, -196, 77, 2602, 664, -539, -1621, 2261, 2350, 1452, 12, 631, -1695, -1136, 1134, 2088, 678, -1082, 635, 70, 840, 1152, 870, -1408, -283, -1447, 781, -293, 1565, -810, -897, -351, -290, 857, 742, -243, -1902, 86, 1498, 1664, 208, -1205, -499, 185, -134, 892, -292, -1826, 246, 812, 334, 1184, 855, -69, 215, -922, -188, 2357, 1466, 191, -1009, 161, 576, 1922, -14, 381, -233, -114, -725, -1568, 1770, -386, -669, -166, -268, -1116, -115, 584, 189, -879, 19]
5626A9J502J38j764J901j547J960k355L7Q71j131m04J015J031j031P10L36l244
5643a956J275J658O8k61q86j082N64K451L1J191l797l43J804j139k77M70J444
5660A215j583r18O75Q60J855k427k80J560P36l12j520nj462L292k467J671k88
5677F02j225J002m29K303M30j832j520m8M6L93J265q42Q58k833J217J715O13m90
5695A225K64k548J099r24K976J40j646k189J918P91k88j854n4o97Q34M28R16P51
5713A142J231k845l76j89K605j450P56Q70n080J207K517K114j059k318M24l39
5729g90L068j132J012l933J30K384j651K61Q78k030J367n60K222o98O22k192j458
5746b500K332L14q80K664k395L49q59j451L699p90n05j73J198m82M81l23l32k18
$$ y = [19, 1521, 1659, -105, 1796, 249, 2209, -146, -109, 762, -369, -773, 242, 1273, 242, 952, 1288, -1956, -681, 977, 1045, 784, -102, -1184, -620, 1831, 1862, 3053, -744, -1087, 717, -422, -699, -229, 1215, -368, -1286, -611, 249, 2104, -323, -603, 957, 1693, 1381, -139, -144, -1606, 1686, -781, 890, 602, -623, 379, -50, 2253, 2683, 851, -669, -717, -671, -278, 987, 145, 1003, -1830, -613, 1102, 1715, 1225, 1489, -1059, 40, -884, 2092, 2232, 586, -1603, 315, 1106, 818, -1036, -1090, -1787, -953, -525, 391, 1142, 2373, -472, -848, -1037, 1568, 118, 874, 1744, -3336, -2129, 388, 2502, 1443, -875, -451, -790, 2278, 1146, 2158, -1775, -1645, 739, -912, -651, 227, -1803, -436, -996, 1226, 528, 1150, -1042, -2500, -168, 146, -734, 1930, -465, -116, -975, -2426, 1273, 483, -22, -195, 1003, 521, 1002, 679, 347, 129]
5764A29r84N09M31j591Rl23J476k76J320J021O24j534j049o6K153j017J804l868
5782a232o58M44K243N27j167l54J43O33J08R29j51j291j344J339R89N44o79j815
5800g92J319j462n33K866k13l682O58L417p11J062k201k018K621N61N35O8p20
5817G75K23j611L31K25J429j237j92n19k87k71M18n37M99k078L751j288L31m2
5835h0j707J515p69J186l64K596j308k196l3K313l09k282J037J440j880Q27J749
5852A735n72k184o73j26J593K605k977O19j905J775J159j81r09J807k071j569
5868a874J865J452r53rr76o5p5J512j62J40j260J015J569k796L05N07o87J471
5886I79p56K89j891J250K0k45R68J794o91j199j309p4J559l061L454J220k374
$$ y = [129, -855, -346, 85, -1506, -1497, -1820, -344, -620, 700, 1721, 2345, 811, -238, -304, 1849, 832, 2636, -1232, -1890, -1446, 797, 1324, 157, -197, -54, 579, 687, 1616, 1465, 174, -1170, 169, 1158, 1702, 1023, -792, 527, -935, -1468, 1398, 1185, -2497, -1839, 1578, 867, 1929, -272, -2290, 331, 892, 1427, 1495, 775, 998, -613, -282, -57, 1372, 135, -57, -576, -863, -1134, -716, -1253, -754, -2832, 919, -369, -38, -80, -1787, -272, -1041, 145, -219, 2377, 1069, -1127, -1160, 1153, 844, -1438, -401, 1039, -841, -14, 1735, 1163, -1021, -1694, -1820, -227, 2378, -599, 20, -1885, -110, 1049, 868, -41, 1766, -305, -1874, -9, 1443, 490, 481, -495, -560, -635, 877, 715, 855, -405, 610, 2179, -617, -312, 195, -492, 979, 223, 512, -1379, -129, -109, -354, 614, 2408, 1717, 518, -791, -865, 694, -2367, 1087, 2307, -67]
5903f7O12k46j570K27J632R11j831j600M913k385K29l91j384L390l089O76J231
5920A258m15q55K48R97J1k287M1J031M06r89R47j87k436R04Q08P6j42J563q46
5939A33j337J051J28m2J678j18j856j05k92J454Q54j315j664M37j040K174Q93
5956A033j69j199Q05P28J90K95p05k297j988L655J628k236P01n16m03Q88j863
5973a453J899p69O65l17o21J700j314J732j778L96j909L489k355L88o68j461R52
5990a424K415q39j560J930j866J535j52N32q44K58l37k58J276J817j813k014J130
6007b14p80Q36K364l000J241j606J227O49q76J252j088M7j076K359j835P73j441
6024a168J244o83J00J573j264l47j521K7J490J765l84R41k892P09K431k892l65
$$ y = [-67, 545, 299, -1271, -1044, 588, 1499, -332, -1932, 2981, 596, 825, 434, -950, 2440, -649, 27, 1258, 843, -12, 236, 1233, 1244, -1043, -1002, 29, 435, -554, 393, 206, -2230, -1326, -518, -442, -584, 979, 133, -1204, -153, -25, -67, 1611, 1493, -363, -468, -760, 694, 1548, 233, -1431, -994, -2034, 140, 1033, 864, -335, 470, 1198, 1388, 1683, 978, -1319, -3307, 348, 1976, -260, 441, -75, -478, 410, -1453, 446, -323, 342, 25, -596, 1104, -210, 1522, -256, 140, -1769, 1720, -635, -247, -915, -2376, -1424, 991, 152, -1408, 522, -1344, 191, 39, 571, -273, -15, -352, -610, 666, 2483, 670, -1344, -214, -994, -158, 2206, -794, 447, -1159, 68, 717, -159, 1093, 5, 52, -1024, 1335, -500, 273, -1168, 76, -607, -507, 1066, -198, -545, -2066, -2039, -549, 1216, 832, 1773, -1119, -410, 2021, -871, -1236]
6041a236K00O53O05j66m49J67J858k778o90Q82Q4R65J164l140K023L29n83K843
6059B731K60m301J430k22L80K92j262J127j207J108l94M70p86j231J663M64j250
6076g28k61L056k120O00o42p36J334o02r82N67O17q01R49J620j042K68J0k11K70
6095A166M92p56j203k04l39K697l334Q77P14L43k30O06n4j470J183n83j088J857
6113F74j05J10n27o13L99m86Q70k64j148P38M11j155J568J21k038O25k62r84P21
6132a345K409p56J027j290N49n07J882j355m53O57q12M19R76k798J271P43k239
6149a622J401j36L72p71M15O11P49j599k38j111J478Q93k63m78j266J446P39L63
6167I83N57k289L4J3K376k242M16J399k52k515P62K25m8R46o77P91j509O79Q90
$$ y = [-1236, -1036, -383, 222, 56, -393, -226, 1632, -1146, -1836, -954, -870, 95, 1259, -1881, 142, 471, -112, 2731, 2991, -1310, 120, -102, 278, 570, -692, 435, -772, 336, -58, 412, -374, -1605, 58, 522, -728, -989, 2067, -53, 547, -95, -831, 503, -99, -1081, -514, 103, -698, 251, 1871, 829, 1097, 1107, 896, 1166, 1658, 902, -301, -505, -844, 1853, -1481, -604, 110, 453, 223, 829, 775, -695, 488, -95, -1183, 674, 569, 679, 152, -461, -62, -548, 322, 58, -1090, -352, 59, -1096, 472, 593, -1445, -820, -1082, -2066, -1345, 1064, 308, 1335, 45, 594, 87, 1969, 614, 161, 818, 6, 425, 1401, -1397, -126, 617, -1622, -221, -357, 15, -756, -341, 270, 1019, -580, -818, -1929, -451, 442, 179, -299, -1565, -119, 620, 983, 1540, -749, -715, -702, 1674, -568, -152, 1247, 995, -1520, -758, -533, -581, 365, -312, 479, -1030, -351, 539]
6186E39J330n44J54r97K01n54m18K92J165k668L400p95J958j450n12j650J801
6203A252L01k152J946j529M09Q07J466j273o56M52j622J322L58J474r40j571j635
6220a591J165Q83n31J340k277J522k423K125P32m47r73p90M80L71J084q37J244
6237A077r68m11j381J893j80R78k470K403j59P78q10k24k1k028L330j898O42l06
6255B45j07j514J82p16L430j880j629j66K385K187k526j80m62n43O38J637j083
6272a02p57K81j123L220J71j986J711j942M20N12M86K21j72j130O5k78J605q35
6290C67j134J741j953J110n82K673J1k544j489J010J321Q08j161j537p00K971
6306I12k87L44J62k220J384m29M19j005J162L69j371m19k92L165j873N29j161
$$ y = [539, 1869, 1325, 1479, 482, 683, 129, -289, 3, 1168, -1500, 1900, 1105, 3063, 1613, 1101, -549, 1252, 1553, -599, 1347, -182, 227, 1034, 2500, 1227, 571, 1023, -599, 723, 1081, 2555, 1615, 44, -1591, -426, 457, -74, 1266, -1011, 511, -1912, 213, 945, 498, -475, -1265, -785, -414, 670, -167, 1077, 109, -302, -1683, 210, 30, 1008, -1462, 941, 782, 1560, 750, 526, 505, -1523, 1807, -91, 551, 245, 138, -1376, -1194, -1910, 1520, -360, -1989, -2155, 230, 2417, -109, -289, -751, -1294, -656, 981, -102, -859, -578, -1701, 1519, 1690, -296, 1415, -527, -107, 405, 891, 1112, 940, -190, -125, -403, 1202, 367, -767, 974, -979, 131, -451, 2222, 2233, -311, -1800, -790, 531, 1339, 178, -1359, -2059, 912, 625, 969, 1131, -1089, 295, -134, 285, -720, 442, 811, -560, -979, -1271, 1894, 21, 550, -611]
6323f11J011j356K185k54j840j561P77K574P88j050N16j113j034K438p41n64o8
6340I7l76j501J742R41J00j170K65j63N00P44k51n08j973N47L23J192j00r76P47
6359A80j050P08J359j684J145j042N07O98O34n84j606J608n21p63J23j835K642
6376E19k508K068L20o52R51j613J58Q97o83J392j671r03K060j600R66J092Q86
6393A679j931p06m28J741P09J81j102m87j36O40j030J365m42j828J930r34R36
6410A57m11K11K85j320J663R62j437M63m91M5m87O59J833j589j30j331M97j022
6428a443J863n17R6J27j434K96K248k164K447j958J04M46p09J690k77o21j888
6445a694J697Q9N0J443m210J537N64j570J897l71l20n67K779j225J783j363o11
$$ y = [-611, 400, -956, 1229, 975, -865, -2426, -1649, 925, 1713, 663, 1179, 66, -968, 1470, 729, 165, 97, -279, -1780, -38, 903, 1003, -167, 98, -65, 435, 1179, 928, 420, -1553, -1006, -683, 509, 409, -567, 180, -870, -162, 1197, -487, 658, -384, 123, 821, 1455, 871, -735, 873, 352, -411, -288, -2123, 519, -1989, 79, 399, -253, 698, -915, -757, 140, -543, 849, -822, -1725, 335, -1265, -299, 793, 1679, -252, -958, -1386, 355, 1064, 1245, 143, -344, -480, 160, -870, 495, 53, -1775, 155, -779, 157, -254, -43, 242, -1078, 585, 1547, 110, 573, 82, 127, -360, 299, 2132, 543, 413, -918, -421, -1443, 420, -97, -1, 126, -1308, -1012, 1236, -928, 1519, -439, -335, 111, -598, 1092, 815, 194, -1694, 3, 92, 142, 1585, -2625, -1088, -524, -2094, -197, -568, -888, -1455, 1324, 99, 1882, 519, -92]
6462i2J077j260K118o07l84L25j711L23l50R31m69j012R29k13P63M61j120K236
6480A945j588l20Q71j154J859j749L56n9j72Q57j4r00p36O81n41N1J696k281m90
6499a688K362k647M251j925Q39k306J00K815j870J225q77j092J148o15K835j441
6515A114j76l074J255R97j46l80J34J137j482J120l15P90r67R67k781J980N71
6532G44J170r47j110q1J547j001J61Q99o37k149J725n08J495k57k050K20j09K448
6550A560k336J590j138K641k691J502M56p36k334J24J192q59N38M27k88M94P96
6567I38r8l91K08j256j030O34J832M62n14J124k670L47Q64l56L09j349J235j893
6585a604R81M47m35J003k2j55j093N14M86k36o63k08J925j221K06O58p73o14k06
$$ y = [-92, 985, -275, 1843, 1236, 852, 1177, -534, -211, -561, 370, -99, -1111, -182, -395, 368, 829, -291, 1945, 357, 37, 908, -246, 1613, -136, 220, 161, -11, 846, 832, -68, -804, -123, -664, -613, 1083, -1198, -1688, 674, -1973, 2278, 353, 1192, -1114, -1014, 1801, -69, 1156, 279, -813, 335, -280, 2555, 1114, 938, -2136, -881, 116, -30, -410, -276, 861, -621, 499, 184, 974, 7, 974, -1807, 173, 744, 1914, 967, -143, -224, 1323, 322, 483, 1382, 745, -1404, 321, -187, 1308, 1051, -999, -779, -888, 1560, -776, 814, -324, 2317, -374, 1128, 1584, 848, -1486, -1362, -170, -1029, -491, -64, -352, 142, 938, 840, 449, 657, -599, -1629, -995, 837, 1299, 785, 1909, -761, -414, 450, 94, 403, -946, 289, -1604, -623, -176, -611, 392, 370, 215, -878, -364, 122, -114, -777, -985, 940, -281, -75, 583, -190, -804, -1010]
6604a010K211j071k8n2M69j294O95K138j894m26j60J974j891J76l41N08L87M38
6622H29n33o71k89J152j737J034J54K7j55R79o2q13P49j021K284l754J758q1J101
6641I51N77j20k039j197J747j19l8q44J689j149J924j324l02O43j970l25K50K284
6659F38o69J033m01k46j63k359K679K16m58L16j170M54J659n52j210n89N50O15
6677C43k54M30p50J37J055q42K3l46l69K068k959K20K369k079M29Q55L11j737
6695a096M09R46n03j077L97J920j062R91p69p40r8n44K213l4j200l74l79J491
6713D91q57J375N08l94j188J035m68M51pk331Q01K08K96L148k362l37j431J801
6731G39j079J450j583N51p36O78K88j42Q43r47J144j387q6J001K08j45j299j281
$$ y = [-1010, 1201, 130, 102, 50, 519, -775, -80, 2058, 164, -262, -422, 1552, -339, -163, -504, 4, 391, 829, 296, -375, -664, 488, -1249, -215, -61, -34, -189, 790, 728, -85, 664, -357, 1927, -1827, -69, -150, 951, 1528, 1408, -631, -1828, -81, -200, -238, -1082, 607, -542, 1382, 58, -244, 399, -1571, -1896, -1646, 638, -31, 1002, 601, 355, 192, -2167, 512, 728, 270, 586, -584, -130, 1529, 977, -233, -822, -272, 343, 89, 519, -231, -94, 961, 119, 142, -204, -573, 1495, -1464, -1244, 1125, -954, -525, 330, 641, -1096, -687, 259, -244, -1321, -924, 996, -66, 925, 156, -584, -682, -1226, 987, 953, -247, -621, -1000, 491, -366, 1009, 1517, 1123, -65, 970, 502, 953, 946, -1385, -584, -376, -80, 3068, 706, 369, -1062, 739, -340, 1110, -473, 78, -658, 20, 308, 166, 1009, 62, 1206, -181, -267, 734, 942, 797, -502, -1783]
6749a783L209j92j483m56Q95p73N7R09R38j363pj198Q18R76O32k048M86N79o0
6768A36o22N1J601j914o2P70J332N0k095K443k318R1k27J626l90M29j056q98K170
6787A117j564K337l063M49Q80j507J625J181j714P68j341J120N13k80j390Q08
6803f1p4O25O73M84k485Q27J26J609j629O16r09L42P63p61p2J387r07n82K78j697
6823a447J985j60j92k00j27J95K167j892N01j14J157q54o61O53j140j069J431
6840B33p42O21j298J335j134N27J028k52J47n38n87j09J79K83M58j91k83J517
6858A194m35n43O94J265k080j29R9J401j029k8q08R87k36P21q6j01J631m624K060
6877d7O50P65o78j010k15m85M20J799p20q58j50O29J464P55k254o98K07K02J131
$$ y = [-1783, 1426, 1234, -249, -705, 190, -583, -526, 383, 1321, -42, -49, -1247, -429, 547, 1179, -869, -383, 196, 136, -486, -435, 1166, -748, -810, -40, 1292, 1342, -753, 1690, -628, -537, -764, 862, 472, 901, -155, -1053, 1117, -447, 1890, -1173, -724, 156, -1351, 274, 1455, -259, 509, -832, 288, 801, 521, -869, -61, -135, 490, 1163, 1647, -838, -11, 115, 1724, 95, 711, -198, 144, 907, 146, 74, 1461, 554, -28, 250, -1447, 538, 378, 186, -14, -141, 54, 2221, 329, 830, 716, 1873, 1019, 358, 1011, -129, -1198, 233, -509, 112, -1186, 149, -985, -458, 570, 318, 465, -73, -660, -769, -590, -307, 151, -40, -323, 1194, 759, 216, 910, 2175, 95, -34, 65, 1466, 437, 409, -399, 588, 352, 1073, 987, 886, 2517, -2107, -47, 603, 1368, 690, -320, -535, -1020, -600, 1199, 479, -379, -529, 100, 1564, 2319, 65, -633, -426, -224, 907]
6896I07O21j979k08o76N61N25J272m69r90K416j698J87N69r12J466j020k708R95
6914a141L440k172j642K180k33j601K84K008k428P69M96o30Q58l88J97N26j822
6931a299J247l04N98K83j78j898Q51Q50K033k448j496K055o67n62R78R44j718
6948g31K28K7O3O70m23m8N8J1Q34M4n7j134m67J326j057O44O90n65p36m22J743
6969F98m33j226M98j23p9O48J139N12r64j279R76k17J020o38k40Q04j654P06j29
6988A9O17j210J747j638O51J108r53K54n99m24J90P81n30k92k64M64N17M66j03
7007H01l93m26j555O30J364m38k17m42M09K25N59J45L58k64j281J512p0O07l51
7026A173j212J430j067j11m33L3k20j669J615P60L88k96j76k50o08K26N74q3j39
$$ y = [907, 1528, -451, -659, -1335, -774, -249, 1023, 554, -436, 1980, 282, 469, 1038, 126, 1592, 572, -2136, -1141, 2299, 127, -1515, 665, 432, -1169, -885, 1123, -1305, -536, -40, -670, 188, -200, -3, 523, -1299, -52, -356, 242, 525, 347, -1551, -700, 150, 2183, -265, -1761, 294, -373, -935, 43, 987, -731, -503, -476, -413, 257, -166, -214, -156, -145, 689, 733, 676, -458, -925, 401, -656, -12, 678, 113, -623, -1045, 698, 265, -961, -463, -586, -665, -17, 1122, 1634, 670, -609, 367, 150, 1170, 532, 292, 1096, -558, 148, 19, 636, -574, 1173, -465, 186, 1294, 341, 595, -4, -428, -238, 543, 13, -279, -543, -79, 438, 904, 801, 408, -18, -1573, -943, 421, -17, -234, -676, -267, -42, 517, 662, 1020, 756, -525, 987, 917, 1524, 1173, -39, 1391, 324, 213, -220, -187, -407, -2076, -461, 299, 687, 391, 215, -35, -643, -417, 157, 74, -65]
7045f5R58j985K711j109K18N87j895n43K184o31m93r34J038K52l57L81K01K72
7063G90k243J410o84Q87j6O53n83N42p32J525l0j740j65K77P29p49J423j107j22
7082F5r08J941K41j438L92j060O49R29j699R97m00k22k92l02O18p9K69n26K139
7101A314o81p62O91l01k83J660p02j952J026O76P77k834M65K333m14q90J03K9
7119B55j420J126O90r75r46R18N80Q71n22l6L41j022p44P15J514j024m99K32j232
7138a178O5J736m94k28j212l01O19j61O24j565P95R50J952o52k505J464k41J126
7156G94o46M50P10o38j106J250j062J193n81k18o3m46j135J426K5j132J965j634
7174h48O04O34K18o18O13j69k185J952M15q38r46J595K38R0o72J461N2k570M19
$$ y = [-65, 893, -1092, 1619, 510, 728, 1315, -580, -1123, 1061, 430, -63, -997, 41, 293, -64, 317, 518, 790, -1453, -43, -727, 160, 144, 797, 214, 756, 24, 1549, 1519, -221, -386, -109, 620, -129, 1294, 187, 65, -843, 1098, 1339, -99, 293, -767, -118, 811, -888, 109, -291, -513, -805, -1107, -489, -568, -299, -825, 1314, 633, -129, 562, 261, -22, 1638, 936, -1016, 10, 686, 1463, -1371, -906, 1427, 1013, 123, 226, 255, -1165, -39, 651, -324, -1270, -352, 228, 1099, 577, 541, 882, -140, -884, -169, 1345, 321, -178, 54, -1178, -1113, 623, 129, -99, -1311, -1612, -993, -1154, -530, -2095, -1300, -350, 1602, 950, -1555, -91, -332, 794, 148, 598, 1308, 670, -436, 814, -248, 945, 364, 146, 83, -363, -1498, -72, -47, -1179, 786, -848, -244, 390, 608, -10, 603, 434, -1751, 201, 616, -222, -1168, 427, 665, 755, 83, 1544, 1596, -974, -555]
7193e55M86J533j947R9K06M12K21l55m55L82N51j441K535j170K11j930L275l026
7211i68J98M89o33K124o97J62r83j34J686j372J240R12j899K38Q35q27j156n25
7229a310M82N5O12K06j483j145J571P53K76J095n21q28r42n69N87J794o74q10
7247h51P96jR42k79l97J0J92k61l12L31K38j087L28M00j955J129J219r31Q60p53
7267c82P49l98q47K02k60K553j248L25K6k109L752j127r03M16l97J71R89k816
7285a304J381J372j726k62J408m53J199j585J078k578K257j128r74N77J560r73
7301a51J472n17K01Rp22J34k036K888p77l73k1L23k24r41J933j665L57n25P8N67
7321A0R56j426J075R02k897K375j955J536N72p85m05J88j53J333j204K97k541
$$ y = [-555, -69, 1464, -483, -384, -178, 234, 455, 100, -355, 27, 578, -863, 1672, 502, 713, -1217, 2058, -968, -770, -281, -914, 1210, 513, 675, -308, -442, 1244, -128, 1112, 2024, 125, 363, 1198, 371, -785, -1310, -828, -773, -161, 45, -1438, -2583, -1012, -259, 17, 1112, 591, -237, -1179, -1748, -1161, 633, -41, -851, -55, -56, 886, 607, 210, 220, 412, 151, -161, 170, 408, -679, -351, 49, -1906, -777, 442, -489, 371, -382, 367, -31, -878, -676, -936, 1617, 369, 694, 720, -1389, 2363, 1236, 333, 749, 352, 523, 1512, -1304, 77, 1449, -277, -539, 869, 416, 1615, 30, 1108, -1470, 787, -341, -1315, -738, 822, -151, 1321, 804, 1005, 1014, 292, 426, -1610, 1278, 501, 128, 107, 430, 206, -735, 1198, -467, -110, -635, -557, 10, 966, -460, 615, 1517, -1380, 995, -960, 576, 1148, 363, -42, 146, -7, 1326, 122, 419, -2122]
7338b122K244nj40j999K688j038L40K40R73J45k569K264j366J724n13Q37j766
7355f3l83J20Q68Q31j346R17q95n49K462R0k225Q91j583R1q32M79J964j534J705
7374A008m38O74k29J028j301k073J351o59M23P0m37P77j137J09J090j282M61r8
7392f63k95J6n07N41Q80K26k808L930j444k39R03j364j364L380r29J15O20l687
7410b689k15L880j423J580p99m43P44j082J377o02Q82j049N2J162q09M13j520
7427e41j818K271q99o57K616p68J69P2j930K852j715j258J461k43N48J371O92
7444B223j649J970l503j22J514K86j152j393p40L055l63J97r77J343L21j108K89
7461A91K618l771J135k49L58k91J215q80N55n06j621J381q7J232k313J484m8j934
$$ y = [-2122, 122, 117, -23, -2022, 666, -372, -32, 208, 1181, 1326, -1243, 1021, -345, 1379, 866, 1703, -63, -446, -326, 542, 1373, 27, 944, 49, -500, 1962, 2052, -173, 718, -865, -774, -1606, -1127, 837, -697, 1008, 570, 1244, 1015, 2043, 742, -1331, 20, -639, -216, -146, -583, 194, -943, -834, 256, -1026, -565, -663, -958, -942, -1449, -908, -28, 198, -2610, 1320, -124, -363, 540, -824, -2188, 1192, 263, 378, 998, -2689, -2904, 976, -447, 1133, 334, -109, 635, -447, 930, 328, 1210, 161, 213, 1375, 566, 979, -541, -2359, -88, -987, -1644, 972, 204, 373, 445, -1485, 1367, -348, -1606, -145, -388, 160, 1531, 2223, 574, 2544, -959, -1081, 433, 719, -433, -1826, -2566, 489, 126, 323, -654, 689, 1010, -98, 191, 2809, -962, 173, -76, 282, -9, 1206, 326, 881, 375, -1246, 135, 48, 1280, -1033, 451, 403, -1531]
7479a531K652j306k759J726K734j120J105j432L57j77q01R03K00o32J627m97j920
7496h71J158j080O44j439J955O41o67j256J529k189R2K482j233j477K167P25p08
7513D73j89p4J33j014J023k309J554M60Q60J575r34k128k5J76J124R17k879R10
7531c47l35l84N11N53K016l539j115M210l460R55J533M81k485J514j81m10Q62
7548C79j605q2j79R98K029k394j017P15mJ027r45J451j033K314j480q26J052j69
7566B31p60R82j071J080j273K068j823m49q2M62n52j149J139K606q55j62m50k547
7584b605P75K114j297q7J323j821J123l39M88j326K984l36j446M33J3P17oq96
7602a89l82P33k455J801J295j71M59k804J119Q09o23L28r13K124j793K22l28J444
$$ y = [-1531, 1121, -185, -2944, -1218, 1516, 396, 1501, 69, 426, 249, -552, 351, 551, -81, 1546, 1049, -871, 287, -793, -149, -1588, 367, 1008, 341, -915, 614, -1575, -1483, 999, -234, -1711, 456, 1181, 473, 284, 210, 343, -671, 352, -1957, -403, 57, 917, 2492, 1558, -570, -595, -419, 705, 1622, -1257, -347, -682, -1066, -555, -2, 2014, -1525, -2640, 1570, -1890, -935, 598, 1079, -1406, 108, -73, -483, 379, -1226, -1308, -1487, -489, 1540, -854, -1871, -1156, -1160, -133, -1078, 373, -660, 1654, 174, -652, 400, 231, -529, 453, -618, 462, -811, 1257, -566, -1015, -1097, -635, -1187, -2336, -1197, 1409, 554, 392, -58, -2605, -1830, 284, -1013, -1100, 223, -1598, -475, -814, -326, -1652, 1332, 996, -450, -17, -4, 713, 707, -189, -571, 162, -2293, -492, 803, 632, 1091, -1713, -594, 215, -408, -80, -993, 1131, -662, -440, -768, 676]
7620F76O43k31k447J743j160J243N3r92J26R19l043K590L34K84r53M24P44j267
7638c14j066K16J129q93J617n05O12l40q45K04j02J37O49j325j85j28L29O30r47
7657a127L87J077j148m7J949j483q2k22q08J320K87J000j299n28J709k016J651
7674F20q76J75n63l73K911j96j267K55j212J061j691P09J236K76j090P9L01M69
7692H24J676k758J76n29O90m09k97O46J293j745L56K90K44j120n86J01J213Q32
7710H97n70j85K5j431J424J606k158m83J272j013j22k77L37J00J750k226j324
7727b378J573J523j065R79n00j025L65O93j97p79O69n15m66J212m32m18J712j84
7745G67j436J287q27j184R10l74RJ792k00n74j08j15j40J274n77K47Q72k332k71
$$ y = [676, 1319, 1088, -1359, 384, -776, 467, 520, -472, -346, 573, -2470, 120, 454, 738, -215, 209, 953, -314, -1380, -1164, -35, -928, 689, 184, 796, 456, -389, -185, -287, -150, 499, -826, -1011, -1139, -810, -180, -1127, -740, 337, -811, -858, 1091, -392, -474, -696, -1504, -184, 103, 1103, -196, -724, 985, -1031, 620, -256, -81, -644, -1017, 1894, 1698, 431, 686, -526, 535, -1156, -447, 789, 1065, -25, 54, 355, 824, 2500, -258, -82, -611, 79, -330, -627, 19, 1312, -433, -77, 213, 457, -663, -1249, -1148, 65, 897, 327, 142, 167, -1264, 160, 1766, -392, -875, 397, -616, -738, -1015, -678, -578, 1172, -1054, -2378, -805, 718, -347, 632, 132, -893, -528, 165, -32, -811, -142, -657, -1123, 89, -343, -761, 951, 767, -669, 618, -209, -1393, -483, -857, -848, 944, 744, 170, 62, -53, -193, 1081, 504, 751, 1623, -709, -980]
7764i80J085j499J501o20J90j66K06K075j221j254O08r5J223O47j331r93N09k826
7782b941J410R13o98K543j883J364m06m34R49p94j244J732N55j519P69l09j230
7799a223k67J922m69N35m23M1q70J01J55Q54j242r55J568j015J818m2K29j202
7817d85q63J988m90k69M05m77k92j748K271N69k048O24M40K47J380l16r31k18
7835b13n10p4j63J386k54o40L66Q23k86l76n83K04N05j0o30Q50j427J832J74j515
7855e41Q60N15Qk57p58J010j459J780O76k043p85K48J28N46o88J493k285J767
7873B15J30J70l73j39j683J911j430J531L76q89J60o08L46Q13O01j548L26M10
7891C19j045n95J410K98r33N19jn43J266P65j636M68M0M2J091k366J050q36q18
$$ y = [-980, 105, -1394, 107, -513, -323, -489, -283, 1792, 571, -683, -75, -170, 1053, 1700, 369, -624, -115, -2941, -1531, -618, -1316, 1227, -656, 708, 302, -132, 817, 23, -1221, 511, 1066, -453, 316, 7, -1223, -1490, 432, -37, 498, 75, 116, -754, -653, -498, 356, -886, -1841, -273, -1288, 530, 488, 717, -485, -1348, 640, 150, -119, 286, -191, -483, -2231, 40, 609, -1439, -815, -375, -128, 1252, 936, 5, -213, -723, -797, -960, 426, 172, -468, -102, 721, 435, 59, -524, -320, 185, 175, -455, 395, -1032, 800, 974, -541, 319, 834, 842, 585, -173, 837, -622, 1158, 1834, -209, -994, -746, -618, -72, -760, 733, -1552, 215, 345, 515, 142, 3, -1680, 231, -1199, 332, 708, -181, -21, -629, -283, 530, 1131, -417, -91, 319, -726, -1321, 89, 387, -546, -27, -28, -571, 695, 1460, -176, 292, 332, 374, 1465, -901, 149, -687, -1505]
7910a505M6K770j245k491K111l82Q86P21o66J56j160J171o20p31p40J882J96l9
7928C60k0Q5j589J987r02l01J61K46j55M10K27k93K30j32N41p8L53n20j836J652
7948D26j917P30O97l21J16k99N67j143J062M68j084j20J077k41M35K27P49j186
7966B43r10K42O93n27N0O86Q74j884l93R92P2k29O71j054J214l59p40J548j901
7985g12Q54k51Q85l03Q05j640m78M71P7N73jl54L78l2k30l49J676r51J243k056
8005c95Q29j381J903j729J709j538r76L55J568R3Q91J041k898Q59J038k746J72
8022a205Q69k37j432N72J499j219J202j046J702n87P24j878Q5J153O21k42O16
8039A197N53j473j249L025l080P63n6l36M84M57O82p05K68l81L88m19q08P35M9
$$ y = [-1505, -1459, 1311, 66, -2425, -314, -696, 190, 911, 245, 401, -759, 412, -208, -939, -1679, 203, 399, 360, 340, 425, -1164, 823, -79, -380, -219, 27, -128, 282, 509, 216, 446, 314, 855, 777, 1130, 610, -1226, 426, -1491, -761, -64, -385, -269, -568, -1, -1144, -82, 386, -698, -818, 259, 18, 453, 680, 1429, 243, -667, -425, 268, -259, -209, 477, 1351, -533, -926, 66, 138, -91, 580, -474, 740, 381, -359, 1189, -712, 142, -109, 776, 473, 1278, -362, -840, -369, -292, 281, 280, -74, 304, 272, 42, -307, 1369, 418, 1661, -395, 434, -947, 956, -773, 936, -602, -1578, -1223, 345, 438, 1329, 2370, -528, 331, 1369, -1377, -1205, -336, -573, -2005, -1433, 66, -1153, 49, -997, 705, 118, 842, -1036, -951, 202, 823, 581, 1197, 1750, 277, -972, 2053, -1027, -264, -320, -656, -172, 285, 967, 262, 530, 149, 537, 118, -690, 45, 94]
8058I4j44j45o38j44N6J573N0j240M00r96R68k18P28Q2k100P36O38J08J469j347
8078g0J8J073r28O83j606K568k116J812k362P27O06o61n18O1K13j14K72j227N42
8097a027J401o75Q76j034J287n10M71p66L8n98O34q14M00M66M72j080K0r79J91
8116a227Q93P82r11J348K44k950K334q48o32l68J899k03k597J869l01K28j64J582
8134I78j05j691K158k644K513j371O4j584K103n82J167k276Q94K40o30j23J197
8151C08N34K5q6k488N66n09J504P04j925J869m70n57P01R55J18j273k08n84Q14
8170bj523j14J977N42j343J437l79o25n85K168k092K712j401j05Q23l206L343
8187A627j047r02K61m69
$$ y = [94, -50, -195, -833, -977, -921, 652, 702, -538, -138, -1134, -166, -384, 344, 426, -1674, -938, -300, -192, 1277, -70, -52, 1021, 93, 776, -830, 1738, -378, 1434, -928, -201, 405, -256, -774, -713, -500, -614, -342, -1569, -1027, 374, -301, 575, -459, 828, 318, 789, 23, 61, -537, 97, -717, -317, 149, 621, -459, -439, -1418, -1227, -334, 448, -463, 885, 1129, -1821, 513, -335, -967, -1335, 564, 361, -2236, -367, -668, -440, -604, 978, 873, -818, 1340, -1304, 1209, -162, -98, -1682, 421, -161, 1006, -1270, -376, -136, -766, -889, 308, 842, 867, 781, -1707, -1141, -1650, -146, 558, -1367, 502, 32, -525, 176, 1131, 1249, -24, -232, -816, -2, -1525, -1639, 338, 880, -463, 974, 595, -30, -615, 1553, -539, 2173, 772, 667, 1490, -1716, 1627, 580, -322, -61, -530]
8191e30
$$ Imaginary data points
##PAGE= N=2
##DATA TABLE= (X++(I..I)), XYDATA
0@%%%%%%%%%j04K12k16K16k16L14m21M32n36O43p50Q99j015J185j393J611j841
26i80K101k405K737l081L482l933M398m926N518o147O837p610Q446r367J0384
41E454j1490J2722j4085J5601j7307J9219k1382K3872k6756L0123l4158L9063
53B0876m5176N3097o3776P9057j02938J45858k47256R38490P23165j655511j105117
64a259231Q5300J377878R35516k09495j159192p52091J96408R19085O70389j7334
74G87233o69034p00885k52069M80849Q32779M93074m53184j041012o29343N79574
84e72018J279517O68575p47863j410351n92735Q86785J382313L97906r87375j257464
94i52710k23137R74056J076330J38772p99594q66798j68467N51249P15685L00429
$$ y = [0, 0, 0, 0, 0, 0, 0, 0, 0, 0, -104, 108, -108, 108, -108, 206, -215, 217, -319, 324, -426, 473, -542, 643, -750, 861, -980, 1121, -1284, 1453, -1628, 1854, -2079, 2319, -2607, 2911, -3236, 3601, -4009, 4437, -4930, 5454, -6036, 6686, -7399, 8202, -9105, 10114, -11268, 12604, -14152, 15971, -18187, 20876, -24300, 28797, -34979, 44078, -58860, 86998, -160258, 778232, 1501397, -154114, -1259231, -1173931, 203947, 1139463, 929968, -229224, -981315, -784907, 134178, 804567, 787233, 118199, -582686, -834755, -353906, 478873, 971947, 518763, -522249, -1151592, -572018, 707499, 1376074, 628211, -782140, -1374875, -488090, 894223, 1292129, 304754, -952710, -1175847, -201791, 874539, 1013311, 213717, -653081, -821548, -270299, 445386, 745815]
104G45815l23753p00375n14080J74809Q16886P56597j10938r85245r17545J62071
114h95758J151914R40377l26385j285690q67154M88293J306416P21005n70531
123F62487j175712n43125N50211R75853M20729m33166p74192m15307K27551O25174
133A20503N28356J7439n62374p10736j94557O17012R01587K47028p73378j064622
143h73742k07562R35852J117405J02077j035880j044581N6583J048390Q97747
152I96289j61409r63674p35527J63901P85920O11617o0616n75345n64273j14714
162f17831M09620O21794L11377l44248p74042m89306L64268R45134N75629m58369
172E44026j072635n44522N99998J129329M47680p09235j085859l18315P32917
$$ y = [745815, 422062, -278313, -792393, -617584, 199302, 955899, 844961, -140284, -1057829, -895758, 256156, 1196533, 870148, -415542, -1282696, -794403, 512013, 1233018, 662487, -513225, -1056350, -506139, 469714, 890443, 457277, -316915, -732222, -504671, 120503, 648859, 666298, 103924, -606812, -801369, -184357, 717230, 964258, 190880, -873742, -1081304, -145452, 971953, 1074030, 38150, -1006431, -949848, 98542, 996289, 834880, -128794, -864321, -700420, 85500, 697117, 636501, 61156, -503117, -617831, -208211, 413583, 724960, 380712, -393330, -882636, -518368, 426766, 1002395, 544026, -528609, -1073131, -473133, 656196, 1103876, 394641, -691218, -1009533, -276616]
181b76616R54349K07057o58082p82665j69344N06925O34769K26240l20031n74072
191b51470l77543J39898N97009N58559l8837o93093p07306L8600Q45707Q03804
201I15328j19850r68863q04516K38472J021970P12117l42738r85089n79166L80126
211e32209Q69690M55121l31555p11074m01929J98783N50429M26307k0665m55212
221D7686n32647j37092M54020O86782K49271n20864q28556k75125O32924R16140
231F92539K15294p46879r19572j11797P99442Q45103J3277p82041p23324L8568
241f79390O73523N98687j5211n22123n18433q0957L74737N15829K38585k68539
251C16708n84847l85556K31875O99212M94252k73875q25104n33345L61779R07857
$$ y = [-276616, 677733, 884790, 226708, -555957, -725301, -218376, 416393, 642633, 322602, -251470, -629013, -489115, 107894, 666453, 627616, -65477, -772783, -734183, 111524, 915328, 795478, -173385, -977901, -739429, 282541, 994658, 651920, -333169, -912335, -532209, 337481, 792602, 461047, -250027, -651956, -453173, 97256, 523563, 502898, 47686, -484961, -622053, -168033, 518749, 768020, 247156, -581400, -856525, -223601, 692539, 907833, 160954, -758618, -870415, -70973, 774130, 787407, 5366, -717958, -679390, -5867, 592820, 577609, 55486, -462947, -543904, -169167, 346662, 585247, 316708, -268139, -653695, -421820, 277392, 771644, 497769, -327335, -860680, -498901, 408956]
261D08956M92883m61581r23294l98266N18929Q54713L00710n09139p36565k30120
271f82774M25257O11400K34528k88665n14135l04348J41654M79585M27749k7679
281E02572n22222n66654k5974O13838O67215L267p20461p09403O7685P94389O82407
292G86659j55112q05193n96531K18632P56401M95298k19543o43482m20072J52338
302d30605N19063L95230l6088m15457m46891r6477L64708N38327K05226l79902
312B17134o51493k66943M41138P46056K64877n24614p82567k02155N90890P63264
322E95587J27977o09082o84797o8061N64231N86900M9659m69332n05724r1920
332e04562L48976M59248J84992k42357m80811l06463J79381N49070M10642j72759
$$ y = [408956, 901839, 440258, -483036, -881302, -362373, 492340, 793050, 283911, -452654, -682774, -257517, 353883, 588411, 299746, -214389, -518737, -377083, 102502, 530251, 502572, -19650, -586304, -612278, 1560, 668775, 672042, -48419, -757822, -690137, 104252, 786659, 631547, -173646, -770177, -551545, 204856, 700154, 480611, -162871, -582943, -430605, 88458, 483688, 447600, 32143, -414748, -511225, -146517, 391810, 597036, 217134, -434359, -701302, -260164, 485892, 750769, 226155, -556412, -758567, -167677, 595587, 723564, 114482, -570315, -638376, -74145, 512755, 562414, 93082, -412642, -504562, -155586, 303662, 488654, 246297, -234514, -540977, -361596, 187474, 598116, 425357]
342D25357o38197m66029K17552P23941M74763k91443p55664m27977L47491P38042
352C47836L56352l69575o73956k88604L36118N73077K58526k53149m90365k82043
362d85783J42332M33738L55440l8693m28901m50688k5490M73879N45434M9958
372E71226n43304o03811j8491O06012O10728l5422o44882n72933Q9514O28522
382H7159N04353j14393n70691m38966Q9784M82029M00466k7163l91847l99453
392c78722o5800L30077M50434J64535l06788n25827k32850L30019N99112K55540
402F19730l79931o51846k43585M35630O59365J97367m67795o25557j47565M56402
412a47785N61845J14946l98134m93560j24915L25055M46244J75843k34653m28701
$$ y = [425357, -212840, -678869, -461317, 262624, 737387, 445944, -309720, -737697, -390206, 347836, 704188, 334613, -339343, -627947, -291829, 281248, 539774, 286625, -203740, -485783, -343451, 90287, 445727, 407034, -21867, -472555, -498045, -24166, 521268, 571226, 27922, -575889, -594380, 11632, 622360, 586938, -57944, -630877, -541363, 87159, 591512, 477119, -93572, -532538, -442754, 39275, 439741, 412578, 20731, -378722, -444522, -114445, 335989, 500524, 193736, -332091, -564941, -234922, 364190, 619730, 239799, -412047, -655632, -220002, 439363, 636730, 168935, -456622, -604187, -147785, 414060, 529006, 130872, -362688, -487603, -162548, 283696, 459539, 224886, -203815]
422b03815k56539J67062M54085L33713j34018n14800m00650J39036N74768M28182
432E87024j75289o15851m19036K20788O25136L77151k47511n92487l28155K43976
442c24254N36530K94256j96206m65525k90884J29326M08547L20599n3133l85786
452b6530l84496j6069L93444M47714N5061m27755n05067n7259M73659N32894L4388
463E19984n06183n24725J437N13577M91526k3091m86358m40666K3739M31783M00979
474D02002O403l69023l89056o5199L06579M02539J33274k72725m43426j95452
484d84084K68581M96201K33964k85338n39274k42878L21185N60530K25594l41591
494B12890n53367j94927L47537N20028J69809l24456m76834j65991K72398M30098
$$ y = [-203815, -460354, -293292, 160793, 494506, 360488, -154312, -554962, -415926, 158842, 587024, 411735, -204116, -623152, -402364, 222772, 599923, 352412, -240075, -568230, -324254, 212276, 506532, 310326, -155199, -446083, -316757, 91790, 412389, 359256, -26530, -411026, -427095, -33651, 414063, 469124, 41369, -463698, -520957, -47298, 485596, 519984, 13801, -510924, -509487, 4090, 495616, 472525, -13833, -454499, -430760, 1023, 402002, 408405, 39382, -349674, -414873, -108294, 294245, 427519, 154794, -288632, -484084, -215503, 280698, 514662, 229324, -309950, -552828, -231643, 328887, 554481, 212890, -340477, -535404, -187867, 332161, 501970, 177514, -299320, -465311, -192913, 237185]
504B37185J87182k13393m09531k26859J57758M06258K87659j17072m31531l37874
514d60218J00586M70003L74781j09961m98577l83738J31985N12694L71351j49374
524C59532n09625l44525J50781M73610L16857j30581m32245l08894R5940L90796
534F1646L15671m1350l54849l46038q592L42953L88862M9983l53468m26568p0796
545d42546L75744M51486P1694l94130m68359n6986M03060M51706M2457l98244
555C5882m24343l5912L68760L98417N0599l23743l77344q3257K82849L78227J26102
566C96237k48563l91639j71179K28303M18573K06863k27850m51102k27818K34070
576b34105M71546K30029k52188m74923k16908K56052M61336K06631k41078m37639
$$ y = [237185, 424367, 210974, -198557, -425416, -267658, 138600, 426259, 309187, -122344, -460218, -359632, 110371, 485152, 375191, -123386, -507124, -375139, 137555, 508906, 359532, -150093, -494618, -343837, 129773, 446630, 316049, -116196, -425090, -329150, 61646, 377317, 335967, -18882, -364920, -373512, -30559, 358303, 408286, 54818, -371750, -442546, -66802, 384684, 456378, 62248, -406111, -463097, -60037, 391669, 434126, 35882, -388461, -424373, -55613, 342804, 393403, 69660, -307684, -390941, -108092, 270135, 396237, 147674, -243965, -415144, -186841, 231732, 438595, 210745, -240357, -468175, -234105, 237441, 467470, 215282, -259641, -476549, -220497, 240839, 447470, 206392, -231247]
586b31247j97797K17489M08969K06032j78780l86620k28388J39420L73983K61042
596C84103j05290l79983k95659P9972L91935L25335p6340m08216l41809P5244
606c50708M23932L44209p9107m21184l35024Q4634M05638L23178p2494l79576
616e6502l16407N0570L54177L15035j8901l31555l25767j8571L10354L47587M7540
627C57560l04635l70783p3596L08727L94877Q3381l14356m03002q3993L20168
637h5652M02440Q3652l14546l92147q3236K98256L77539Q9626k75286l68267j04874
648c72495K44090L58137J32965k19428l63415j60073J99434L74922J87264j88576
658A92825l85260k05654J84002L99053K17082j81569m04043k18446J80219L96583
$$ y = [-231247, -429044, -211555, 197414, 403446, 224666, -161954, -390342, -250922, 123061, 384103, 278813, -101170, -396829, -316857, 75078, 400413, 324073, -84143, -425952, -350708, 73224, 417433, 338326, -82858, -417882, -333248, 72390, 395568, 323074, -56502, -372909, -322339, 31838, 346873, 327972, -3583, -329350, -347921, -37567, 310020, 357560, 52925, -317858, -391454, -82727, 312150, 395531, 81175, -321827, -405820, -85652, 316788, 400440, 85894, -306253, -389489, -91233, 286306, 375932, 100646, -267621, -372495, -128405, 229732, 362697, 143269, -220146, -380219, -180785, 194137, 381401, 192825, -192435, -398089, -214087, 184966, 402048, 220479, -183564, -402010, -221791, 174792]
668A74792K20056j77133l85937k18611J56522L69856K23972j34626l55164k36833
678c63106J11843L47315K50421q4828l40547k69499O6565L41037K88685n1120
688B96766l44883l00306L9242L46737L10305l8178l44509l12724K8493L40294
698B1237L06074k0195l24764l07629J0194L07502L06356J3396k88656l11169l4467
709c22121K77500L19821N6913k67662l31337p4731K61991L40977Q6912k61011
719H7252l49509r5355K52429L51414J03644k45681l52155j08598K35878L45540
729B24859J20197k20598l37090j32695K05872L37706J43823j84520l34860j63165
739c40471J69989L36848J76408j59675l39853j92398J47340L42498K00433j39047
$$ y = [174792, 394848, 217715, -168222, -386833, -230311, 139545, 363517, 228891, -126273, -363106, -251263, 96052, 346473, 261645, -78902, -348401, -281836, 59201, 347886, 296766, -48117, -348423, -309181, 37556, 347861, 309683, -34826, -347550, -319057, 21237, 327311, 307116, -17648, -325277, -315083, -7581, 298775, 312171, 23515, -287654, -322121, -44621, 275200, 332113, 64451, -266886, -341617, -79626, 261351, 348263, 87252, -262257, -357612, -105183, 246231, 349875, 104194, -247961, -356559, -120681, 224859, 345056, 124458, -212632, -345327, -139455, 198251, 342074, 157554, -177306, -340471, -170482, 166366, 342774, 183099, -156754, -349152, -201812, 140686, 341119, 202072]
749B02072l42308k08470J30814L41317K12387j17379l32369k20288J06782L24624
759I7182K30564r1879l17314k35673P3217L12462K43818n9325l07000k55661M3175
770b66434L01092K64529l2023k98989k70990K1043K94498K77695r125k87293k80613
781b86610n07K79065K85305J3249k68536k88965k7271K60795K89511L9859k49859
792D6036k96366n3129K38370L00258O6966k32688l01904p9954K23669L07231R0125
803C08614k13837l06607r9558K06299L07813J09059j95502l05517j20303J81698
813a27841L04644J30249j72577l04097j42062J58118L03743J54804j47648l04095
823a46762j64598J38057L05253J75017j26834l03663j79106J15984L00440J90471
$$ y = [202072, -140236, -348706, -217892, 123425, 335812, 218433, -113936, -334224, -227442, 97182, 327746, 235867, -81447, -317120, -243903, 68559, 312377, 253052, -53948, -309609, -266434, 34658, 299187, 267164, -31825, -302815, -281772, 12726, 290421, 281296, -5997, -286610, -287117, -8052, 277253, 290502, 21966, -266999, -294270, -33475, 256036, 295895, 46036, -250330, -303459, -65089, 235169, 302135, 69447, -232457, -312411, -88742, 218489, 308614, 94777, -211830, -311388, -105089, 202724, 311783, 116281, -189236, -309539, -127841, 176803, 307052, 134475, -169622, -311684, -153566, 150177, 304981, 157333, -146762, -311360, -173303, 131950, 306967, 180133, -123530, -302636, -186652, 113788, 304259]
833C04259j08129k96990j97376R7926K87488K03695q3901k86026k09472O7124
843b21402K79891K18784n2954k77264k24451M1116K70471K37641l0135k66572
853b4875k43810K2430K64088K48697j1772k59026k51849J565K51513K52190P638
864B56789k40704k59031k0581K31809K59972L1781k24130k57393m8964K15184
874e5268K67479N9925k05322k72077o9611J99166K75347Q0443j92203k76855q9213
885b78189J85460K76481R5923j80748k76535j02078J66146K74396J12875j57517
895A16214k71466j20665J45015K69326J33656j30871k67112j44525J21433K68100
905A19105J55075j10923k69774j65430J04688K68527J70218r7366k68782j75087
$$ y = [304259, 196130, -100860, -298236, -200310, 87178, 290873, 206972, -79054, -288526, -221402, 58489, 277273, 224319, -52945, -277396, -236280, 34191, 271832, 241697, -24875, -268685, -246255, 17833, 266530, 254758, -4268, -256117, -254552, -3039, 249151, 256789, 16085, -242946, -263527, -31718, 228254, 260035, 35905, -221488, -270452, -55268, 212211, 272136, 66814, -205263, -274874, -75708, 199639, 280082, 87879, -188976, -278189, -92729, 183752, 279675, 98927, -177608, -279686, -113540, 160856, 273731, 116214, -155252, -275917, -130902, 138424, 272080, 141209, -125903, -270428, -148995, 119105, 274180, 163257, -106517, -271947, -167259, 101268, 271486, 174120, -94662, -269749]
915b69749Q5298K64432J81702q0372k57255j84037O9644K52633J91383n7852k44004
926d8177j96906M5901K36506K04783k9487k35366k11815J8448K30141K20005q744
937B25289k28696k24298l586K24398K30309J0056k23474k29045j4784K11742K35475
948B13386K0721k03863k31499l0674J95758K34193M0756j85886k35471n5890J74927
959f3542K37253O9787j68305k43468q2413J63880K47101Q8723j57085k48681r4364
970b51114J52184K48295J02913j44868k46258j07638J37803K44330J12458j27342
980A20763k40020j21352J14621K37226J27491j04405k35096j40059R5578K31832
990H6579J49903q1747k34524j60411P6540K35596J67371o9802k32775j68284N8926
$$ y = [-269749, -184451, 79981, 261683, 181311, -75944, -259981, -190337, 62296, 253679, 195827, -48177, -245083, -199182, 37324, 242107, 212620, -22746, -234561, -216113, 14028, 234033, 225289, -3407, -227705, -231291, -6893, 223416, 233472, 9998, -219047, -233831, -22089, 213386, 234107, 30244, -201255, -231929, -36171, 198022, 238778, 52892, -182579, -238469, -63542, 173711, 243498, 75193, -168275, -250688, -86808, 160293, 249016, 91931, -156750, -251114, -98930, 149365, 252278, 107410, -138848, -246486, -108683, 135647, 248105, 120763, -119257, -240609, -125988, 111238, 238729, 134324, -100772, -240831, -145253, 86579, 236482, 154735, -79789, -240200, -163660, 71936, 239307, 169505, -63270, -231554, -172628]
1001a72628K34356J71949n2637k27648j78915M6620K19613J78960l6864k12831
1011c0025j84403K3018K09362J86026j0200j99872j93868J664J93682K00684R633
1022B05701j89498k05639j9474J89916K11074K7931j90596k12794l1524J82186
1032c2717K13135L7445j76744k13169m5369J66199K15612M8658j55587k13051
1042a55588o1090J47568K16627P0774j37646k14201q3620J29694K18625R2600
1052B23743j22990k22356j01650J20153K22051J07201j13771k25730j11091J09874
1062a14566K21136J13705r9959k16473j21745R3265K12124J27121q1509k07921
1072g4822j34450P3643K04825J42047o3462k02767j50563N2933K02823J55676
$$ y = [-172628, 61728, 233677, 181040, -46608, -225523, -178903, 40710, 219670, 182806, -30025, -214428, -191410, 17952, 203978, 193778, -6094, -199962, -198298, -4616, 196068, 205701, 16203, -189436, -208910, -18994, 192080, 220011, 29415, -183379, -214903, -32717, 180418, 217863, 41119, -172050, -217419, -51220, 164392, 213050, 57463, -155588, -216678, -69110, 147517, 218291, 80645, -133556, -217176, -87482, 131143, 223743, 100753, -121603, -223253, -103100, 118951, 226152, 112381, -113349, -224440, -114566, 106570, 220275, 120316, -96157, -217902, -124637, 87487, 214608, 133099, -74822, -209272, -135629, 69196, 211243, 147781, -54986, -205549, -152616, 50207, 205883]
1082B05883m4901k00535j64400L5615K01614J68262l1155j99164j69049K6878
1092a70952J92056J72932j6733j87858j73422Q505J82819J75288j513j73594j78665
1103a71137r597J66652J82024J9746j62631j86950k9544J53843J94005L9146j50472
1114D5085j99753m2074J48831J98787N2345j48509j96352n4804J42685J93933
1124A40174N9458j32090j93718o9457J24763J92262P5085j17492j92901q3178
1134a97094J07670J91967R3715j00104j92722r9360R0728J95998J09413q5547
1144A14664j96267j14543Q1284J98245J17030p4878j96521j20753O8805J91030
1154F8096J24668o4053j87253j29797N4989J82584J31372m3037j77767j37619
$$ y = [205883, 160982, -39553, -203953, -168338, 33276, 201538, 170383, -28781, -197830, -170952, 21104, 194036, 177303, -10555, -183977, -175472, 7347, 182635, 181122, 7528, -171137, -180734, -14082, 167942, 187688, 25057, -161893, -191437, -37594, 156411, 195557, 45085, -154668, -196742, -47911, 150876, 203221, 54712, -141640, -196444, -53759, 140174, 199632, 67542, -126176, -195633, -70870, 121392, 196477, 78985, -113916, -197094, -89424, 102543, 196258, 96154, -96568, -195928, -105200, 90798, 200211, 114664, -81603, -196146, -114862, 83383, 200413, 125535, -70986, -191739, -122934, 68096, 192764, 128711, -58542, -188339, -133350, 49234, 180606, 137569, -40198, -177817]
1164a77817L3101J77254J43386k3387j72465j51256J9846J67687J58865j3468
1174A61746j67889j61649M020J70506J61447k004j63613j66330l347J60532J63051
1185A56470J0748j51940j65561j5333J43306J63993K9559j35946j69372l5846
1195a69922J29550J71735M5449j23819j76458n4954J21715J78571O0151j17077
1205F4941j80571o6848J15506J81154O8372j12040j77632p4041J06988J75978
1215A01807P7560r7171j72715q0813Q6471J72711Q7204p8585j68787r9342P0131
1226a01529J69409J04371o2445j71831j10791N6620J72165J18580n5478j71321
1236e2250j19320N0087J71866J22952m7521j66575j23738M1343J60572J27318
$$ y = [-177817, -144716, 32538, 175924, 152537, -19928, -171184, -151338, 16349, 175214, 161746, -6143, -167792, -163772, 6734, 168181, 166177, 2564, -163766, -167113, -6581, 156470, 167218, 15278, -150283, -165616, -22310, 141683, 171242, 35296, -134076, -169922, -40372, 131363, 176812, 52993, -123465, -178419, -56704, 121867, 182018, 64941, -115630, -182478, -66972, 114182, 182554, 70514, -107118, -181159, -74171, 101807, 179367, 82196, -90519, -171332, -84861, 87850, 175054, 96469, -72318, -171660, -101529, 67880, 172251, 109806, -62025, -172816, -116196, 55969, 174549, 119071, -52250, -171570, -121483, 50383, 173335, 125814, -40761, -164499, -123156, 37416, 164734]
1246A64734l4580j55832j26344K0090J50467J30433j1298j46627j37260L186J42838
1257a93J42862M987j40980j49295r465J42801J53378J3022j39798j53784j7153
1268a53618J36439J56177J8165j31544j51677k5072J23056J50281L1060j16884
1278C6383j49683l9455J07329J51090M9529j02157j53064n9114R8034J58629O6076
1289A63597r4147j59388p2328R2918J62557P3635q7406j64563p6368Q4921J61477
1300H4905P4863p9016j57442q1185P3146J52543Q3772o1719j49833q9945N4904
1311i5007J45989J00189m7092j45161j07461L9332J47847J15066l7735j48574
1321c2607j18576L1588J51660J17003k6879j50049j18107K3993J44452J19921
$$ y = [164734, 130154, -25678, -152022, -131932, 18535, 148968, 137670, -8957, -146217, -143031, -193, 142669, 147656, 6676, -142619, -152084, -9283, 144095, 157117, 17319, -136465, -153618, -17179, 138998, 157163, 25619, -126058, -151130, -28074, 122207, 153267, 36383, -113300, -152755, -45426, 105664, 155193, 53036, -100028, -159142, -61108, 97521, 163597, 69450, -89938, -162266, -69348, 93209, 166844, 79438, -85125, -161493, -76572, 84905, 159768, 80752, -76690, -157875, -84729, 67814, 151586, 89867, -59966, -149911, -95007, 50982, 151171, 104079, -41082, -148543, -109211, 38636, 153702, 115967, -32607, -151183, -119595, 32065, 149068, 122189, -27860, -145967, -121974, 22478, 142399]
1331A42399k0529j38479j18585J4484J30064J23123n659j25841j23332m135J20327
1342f163J28948J2458j17033j36557k1018J15045J43543K3134j16913j42329k7203
1353a44088J15039J41125L1924j13552j40539l1466J08103J39566L3592r9544
1363D0160j35696m1392R2123J34144M9018q4243j36916n8523Q0615J37699O5670
1374A42659p3954j40680p1916O9599J44153P6782o8181j47080p8369O6931J44056
1385F4000Q2133o1045j45280p9925O0410J35786Q2978n4512j31581q5278M3624
1396h8690J26951R1565l4780j27541r6543K6143J26388J04865k2700j23759j11946
1407a30047J7482J31603J11589j5280j27498j14359J3768J25278J15082j1008
$$ y = [142399, 121870, -16609, -135194, -120710, 9354, 132477, 126818, 977, -122355, -126490, -6163, 122785, 135243, 18210, -118347, -139365, -24320, 119223, 142357, 25444, -116885, -144088, -29049, 112076, 144000, 30448, -110091, -141557, -33454, 106112, 139704, 40160, -95536, -136928, -44805, 89339, 138357, 54114, -82802, -141325, -60710, 76989, 142659, 68705, -71975, -143891, -74292, 69861, 146643, 78462, -68618, -146987, -80056, 64000, 146133, 85088, -60192, -140117, -79707, 56079, 139057, 84545, -47036, -132314, -88690, 38261, 129826, 95046, -32495, -129038, -102895, 23493, 128358, 105658, -18101, -130047, -112565, 19038, 130627, 115347, -12151, -126510, -112742, 12536, 127618, 116610]
1417A16610j22511j14108M584J18283J09965R58j08188j13718j0543J05562J13731
1428A00625J8016r7235j18431k7911R5151J26575L3136r5450j26812l8388R5139
1439c5585J30850L7466r4231j29754m0257R1353J26603M2372q5122j26359m3564
1450a26228P8752J21876M8697o8682j22951n5871O4258J21910O3495n9493j22195
1461e6432o9012N4944J22594P8407n1981j28896p8641M8907J30259Q0182m9317
1472H1014j28224p8915M2846J24250Q2127l9813j18041q2458L4269J12103Q4945
1483A14103k5667j10838q7812J7165J07941R7251j3146j05960j02348N717J07380
1494C786J04819k028j08895j07929O23J08380J08417R64j05695j05953l995J01379
$$ y = [116610, -5901, -120009, -115425, 2858, 112823, 113781, 5593, -108125, -118668, -13106, 100625, 118641, 21406, -97025, -124936, -29785, 96790, 129926, 34476, -92336, -130724, -35585, 95265, 132731, 38500, -91254, -131511, -40158, 86445, 128817, 43695, -82664, -126228, -47476, 74400, 123097, 54415, -68536, -124407, -60149, 61761, 125256, 65763, -56432, -125444, -70500, 52094, 130501, 78520, -50376, -129017, -80110, 50149, 130331, 81014, -47210, -126125, -83279, 40971, 123098, 83285, -34756, -117214, -82945, 29158, 114103, 88436, -22402, -110214, -93049, 14892, 112143, 98997, -6963, -109311, -103594, 3786, 108605, 106577, -2318, -110247, -109624, -1244, 107173, 108137, 2442, -103511, -107506, -6127]
1506f127J04509R904r5238j04081j5458Q9551J05390K0196q2187j09909k8290
1517a11740P8049J12248L4960p7910j14281l9392P5438J18432M1443p4313j18598
1528g5664m2515P2241J18840M4985o8614j16136m7649O7467J09865M8236n7572
1539E3484j10473n3425N2585J07381N9739m6690j08368o4742L8612J09626P2443
1550A10172l7603j10853p4122L4998J12683P7663l3410j11884p7294L1269J06599
1561B8218Q1253k7327j06242q0897K2986R9859Q2785j8579r5306q3999Q860R4971
1573F582Q6830k401r5246q8447j808R1815R5589M240q9155r7518r231Q9279J00634
1586I1163R183q8512r8977j2297Q4734R9559J2919q1165r5859k0292P6725R7649
$$ y = [-6127, 98382, 108286, 13048, -91033, -106491, -16940, 88450, 108646, 26459, -83450, -111740, -33691, 78557, 113517, 35607, -78674, -118066, -42628, 75804, 117247, 42934, -75664, -118179, -45938, 72902, 117887, 49273, -66863, -114512, -47045, 62820, 111056, 53484, -56989, -110414, -57829, 49552, 109291, 62601, -45767, -110509, -71897, 37729, 110172, 72569, -38284, -112406, -77408, 35275, 112938, 79528, -32356, -109650, -78381, 28218, 109471, 82144, -24098, -104995, -82009, 17850, 100635, 82056, -13250, -97249, -88389, 6582, 93412, 91011, -4235, -92682, -94490, -2675, 92914, 97154, 7999, -89519, -98750, -9471, 91163, 100346, 11834, -87143, -99440, -14706, 84853, 97772, 16607, -79252, -99544, -22819, 74830]
1598G4830K3971p2024r6828l0009O5079R9935L6674o4050j01154m0711O1706J03181
1610F0600M4990o0594j03154m7703N6625J06032M8568n6075j03122n1514N3774
1621e1573J00704N2157m8731j01068m8664L9238R8559N7264l5771r6257o3879
1632i8021L3928R4362O4829k6592r5368o9997K3272R5812P2988k0621r6588p5379
1644i7375J8622R5486P7001j7786r1916p5248J2116R1148P6876r194q4085p9857
1656h4212L648Q3026P9851Qp7201q4768o745P5795Q5978J2637p7559q8244j4550
1669i2336P4954Q9272J7882p3017q9504k0069P1231R2459K1085o8515r0349k3580
1681i0487O4893Q9439K7084o1570q8915l0570N6490Q8088L6314n3672q9550l8741
$$ y = [74830, 98801, 26777, -70051, -100060, -34981, 64954, 101628, 37578, -63576, -104287, -42581, 60600, 105590, 44996, -58158, -105861, -49236, 56796, 105364, 49289, -53833, -105347, -51573, 49131, 101288, 52557, -48511, -97175, -57937, 40622, 97886, 62115, -34142, -98021, -64093, 30269, 95098, 68506, -26862, -96859, -73587, 22225, 95213, 74592, -21996, -97375, -78753, 16733, 93734, 75948, -15968, -91216, -79100, 12048, 88924, 79730, -4355, -84212, -80564, 2462, 82313, 82321, 5120, -79648, -86393, -10598, 75380, 88017, 10458, -77786, -92336, -17382, 71890, 89772, 16755, -72749, -92818, -21587, 70872, 91957, 23442, -66907, -90487, -25594, 63845, 90929, 29359, -59556, -90126, -33636, 54452, 90766, 37094, -52456, -91197]
1693i1197M6818R2182M4072m7069r0875m7348M4743R1398M9387l9783r2991n1283
1705i1946L9680R0525N2612l6278r0107n4977L3075Q7448N7249k9442q6509o0522
1717h9192K7151Q3881O3140k0596q4739o4847J7808Q2722O7751j3044q2153p0763
1729h2881J0937Q1496O9813o779p8552p4441M278Q0485P3205k345p7270p2699
1741g4753j806P3446P4500N520p0653p6613q296O7759P6158J5041o3954q1625
1753f5276j5330O1174Q0625K0994n9260q2910k3006N6463Q2872K7420n7354q2981
1765e6569k7046N2492Q4707L0054n2790p9814l4035M8563Q2367L4742m6109p7072
1777d0510m2222M2270P9215M3518l9695p8860m5442L2409Q3905M5229l0524q1958
$$ y = [-91197, -44379, 47803, 91875, 44806, -46069, -93417, -48674, 42724, 92111, 52328, -40663, -91946, -52266, 38259, 90871, 54593, -35514, -90491, -57416, 30032, 87281, 57839, -28670, -89192, -62041, 21840, 84980, 64384, -20355, -85202, -67394, 15328, 83079, 70035, -12118, -82881, -71944, 9552, 79365, 72586, -5966, -80407, -76129, 4356, 77561, 75216, -2054, -74753, -76559, -3113, 71387, 76907, 6254, -70359, -78655, -10896, 65262, 80303, 16349, -65276, -80606, -19432, 61193, 82187, 22927, -59983, -82989, -26526, 56346, 83766, 26412, -56569, -83615, -31123, 53584, 83638, 30848, -48966, -83001, -34438, 47929, 82671, 36562, -40510, -82732, -40462, 38753, 82271, 42576, -36284, -81726, -49317, 34588, 79817, 49293, -32665]
1789c2665n1145L0180Q2629N0024k4689q0858n2183K3474P9964N3797k1785p6575
1801a9832n4721J5716P4916N8142j5166p1099o1777J0258P0731O4233q467o9555
1813f621o4155M288O7190O6053N01o5453o8576k435O7181O9880K052o3326o9028
1826f2449q108O2353P1722P455o1487o9118j2799N7718P0064J6001n3561p1830
1838e4039j9990N1889P3525K2247m9259p2998k5975M6708P4622K9783m5729p5539
1850d4755l1710M3462P5412L3156m1912p5119l4298L9607P4035L4618l4920p3914
1862c6338l9043L3804P2050M0869k8939o9856m5276K6871P1630M5591k3193o9904
1874b1734m8757J8646P1402N0564j7409p1279n4749K0141O8515N2986j3967o6824
$$ y = [-32665, -83810, -53630, 28999, 79023, 54334, -26524, -78707, -55233, 24731, 78528, 56743, -19832, -74553, -58837, 16079, 74221, 59055, -12044, -73821, -63563, 7168, 71401, 62934, -6621, -70776, -66488, 702, 66755, 67256, 1803, -66773, -69208, -2027, 67853, 69905, 6579, -62449, -70557, -8204, 63518, 70973, 9486, -59632, -72431, -14713, 55351, 71352, 17791, -54039, -74029, -22140, 51385, 73632, 24373, -48625, -74600, -27892, 46730, 76513, 30784, -44755, -76465, -33003, 42409, 75565, 33653, -41466, -75764, -36157, 37878, 72496, 37576, -36338, -75381, -41577, 30473, 71342, 42403, -27453, -72729, -45858, 25772, 71363, 48170, -21734, -70491, -51845, 19557, 70121, 52712, -18567, -73316, -53175, 15340, 68326, 54359, -12465]
1886a2465n4593J0569O7940N4560r209o3997n5771L619O2614N8551j857o0857
1898h96n8793k177N8395O1501N958n8107o4014p653N5253O6971R020n4747o5132
1911e4421j2300N4327O6196J1111n1109o3182j6821M9514O4276J7468m3777o4384
1923d3102k2614M1606O8257K2042l8914o7740k7647L8787O7612K9366l8275o6198
1935c6820l2256L5479O6731L3451l3064o5881l4983L0545O6810L6055k7643o4835
1947b6411l7885K4163O4636L9362k2576o4188m1255J9978O1910M4456j6775o1496
1959a6081m7840J3796O3207M8791j2591o1287m8808R642O0943N1166q637n9320
1971g019n1939O388N6777N2430k366n6598n3665L481N2557N2887J794n2463n2864
$$ y = [-12465, -67058, -56489, 11451, 66011, 56802, -7195, -62966, -59347, 3267, 61818, 59961, -896, -59689, -61866, -3471, 58030, 63988, 5881, -58133, -65786, -10533, 56438, 65458, 10711, -54421, -66721, -12394, 53802, 64913, 13804, -49378, -66199, -16685, 47591, 65059, 21282, -43102, -65716, -24110, 44147, 66189, 27275, -40465, -68112, -29325, 38287, 67653, 29378, -36820, -69076, -33597, 33134, 66585, 33521, -32360, -67343, -36798, 30012, 66067, 38424, -26411, -64296, -40133, 24503, 63865, 41289, -22899, -64154, -44176, 17734, 62190, 45415, -16081, -63921, -50125, 13082, 61873, 49282, -12005, -60813, -51171, 9772, 60938, 52301, -7019, -58958, -52570, 4207, 56637, 54271, -2327, -55992, -52511, 46, 52933, 54727, 2264, -50600]
1984e0600p687N0647N8382P667n0833n7434r193M8071N8612J2790m6983n8947
1996d5508j4883M4392O0900J5194m2564o0795j4979L7743O0186J9461l7742o0259
2008c8854k1909L7314N8645K4962l3455o0062k7147L2208N9850L0057l0198o0826
2020b9415l1360K8165O0573L2188k5974n8905l5455K4099N9015L4225j9085n8037
2032a9966l8762J9586N4640M1869j7737n4127m1810J4993N5596M2164j2508n4920
2044a0982m3866R795N4169M5659p548n3922m7466N211N4271M7274l554n2048m6964
2057d9971R73M9406M6362L684m6533n0806m157M5822N0225O338m2800n2579q317
2070e2353M2131N4188Q541m1812n4735j1207M0744N4310J4676m0942n4728j1974
$$ y = [-50600, -58287, -7640, 50742, 58409, 7576, -49858, -59051, -10980, 47632, 60422, 13439, -45508, -60391, -15999, 44901, 60095, 17531, -43264, -58243, -20500, 39686, 59147, 21405, -38854, -60763, -23449, 35196, 60158, 26703, -33359, -60506, -28298, 31552, 61609, 31411, -29415, -60775, -32610, 27963, 60151, 34177, -24728, -60183, -36084, 22931, 57156, 38071, -19966, -58728, -39142, 15498, 57367, 39630, -14497, -56307, -41314, 14282, 56446, 43938, -10982, -54848, -45053, 9116, 54775, 47227, -6695, -54161, -48950, 5321, 52595, 49041, -3007, -49971, -48998, 408, 46770, 50454, 3921, -46885, -51042, -5220, 45005, 51343, 8543, -44036, -52353, -10222, 43966, 52507, 10695, -44040, -55247, -14503, 39807, 54483, 13541, -41187, -53161]
2082e3161L7519N1558J6778l4583n2885j9765L4582N2510K0678l0551n1899k4217
2094e3436K8932N2819K6445k7181n4752k9576K7345N6727K8368k5490n5013l1135
2106e5947K4140N4856L1736k2286n4740l0167K0148N0132L3913j6371n0877l3825
2118d9288J2108M7699L9098j1021m6905m1397P627M7842M5272p393n0198m2861
2130d9417N457M7949M6507p335m7611m2101L633M5245M2462j60m4996m3570j671
2143d5608M3389M1524P192m0846m4298p478L7275M8178R265l7913m8536j1376
2155d9232L6502M9813J3695l5924n0588j5611L6512M9967J4612l6119m7720j3502
2167d7595L1212M8080J5638k8118m9327j6841K5944M6990K1633k3219m5901k7149
$$ y = [-53161, -15642, 35916, 52694, 18111, -34774, -54539, -19957, 32553, 53231, 22680, -29219, -53436, -24504, 28315, 54760, 27579, -27173, -56749, -29404, 27323, 55691, 30201, -24812, -55947, -31807, 23049, 54785, 32499, -22241, -52408, -32260, 17872, 51785, 35414, -15463, -49288, -37180, 10519, 49617, 38596, -8309, -49706, -42079, 5763, 51035, 43642, -6556, -49417, -43960, 3989, 50496, 43161, -4450, -46551, -42918, 2327, 44789, 44629, -367, -43937, -45608, -2219, 39305, 46497, 5651, -38647, -46125, -8850, 39328, 48593, 10680, -37856, -49232, -12730, 37083, 50778, 14854, -35734, -51345, -14833, 35134, 49746, 13627, -34093, -47595, -16383, 31697, 47335, 19217, -30110, -46951, -21007, 25983, 47616, 24397, -21504, -48653]
2179d8653K2722M5816K9689k0093n1337k9256K2151N0514K9100k0444m9608k9689
2191d9088J7599M9750L0689j7720m9309k6241J3625M2325L2207j3320m0489l2535
2203d2507O486M2889L4314k676m0936m0508K903M2795M2277j838m3123m3861j54
2216d3939M5729M2887k953m3226m1842K152M1602L9211r80l8231l8546j558L5550
2229d144L8342O224l2643l7916j1126K9830M2396J3267k8783m4599j6851K9801
2241a6202M6667J7949l1123m9377j6503L2264M8983J5654l3673m4355j4254K7268
2253a6702M3747J5441k4087m1488j8121K0186M0526K0478j6321m0746k4730J3627
2265b8190M3032K8392j3965m3934l1561J4755M6055L1651j5878m5995l1278J6981
$$ y = [-48653, -25931, 19885, 49574, 29481, -21856, -51112, -28961, 21553, 50653, 30209, -19399, -49088, -31489, 18261, 48950, 31230, -18079, -44320, -30695, 11630, 43837, 30517, -9972, -42507, -36021, 6868, 41182, 38506, -2430, -42938, -40035, 2760, 45037, 43199, 76, -43785, -43939, 1790, 44677, 41724, -1502, -43344, -41192, 410, 39621, 38641, 410, -38136, -39694, -4144, 34198, 40422, 7779, -30137, -41263, -11433, 30963, 44230, 15447, -29152, -46003, -16202, 30465, 48414, 17291, -32086, -48589, -16325, 32658, 48312, 14639, -29716, -43970, -16702, 27045, 42486, 18399, -23089, -41210, -21024, 19502, 39980, 23659, -17087, -41817, -28190, 14842, 43234, 29269, -14665, -46226, -31471, 14584, 46235, 30357, -15638, -46916, -29935]
2277b9935M4437L1094j6004m3585k8693J5593L7843K8047r733l7272k7868N452
2289c0624L4114L0830jl3902l8080l46L5876L9603K847l6794m2499l940L8609
2302d307M5172o87l9408l8806j149L9176L7273nl5491l5395o08K9425L3983N399
2316C4572k4860l5097j1045K4536L4103J6136k1565m0414j9776K2604M4117K2302
2328D5613k4488m7535j8968K7766M4838J7930k7590m3544j5799K6170M0611J3189
2340C8193k2194l8077j4985J8729L4235J7731j1502l2962k4093R395L3528K8295
2352C6293o794l6972l1578P702L9386L3739j0170m2552l0750J0960M2906L1417
2364D3587j3879m2948k6086J2639L6355K4965q789l2715k3526M457K5542K7925
$$ y = [-29935, 14502, 45596, 29592, -13993, -42686, -27093, 10750, 38797, 29064, -8208, -36076, -30624, 3490, 34320, 34319, 417, -37663, -38009, -2133, 37470, 40317, 3523, -38976, -42916, -4307, 40865, 40178, 770, -38036, -39185, -9, 37264, 37259, 1768, -33627, -34235, -4810, 29173, 34572, 9712, -25385, -36430, -11894, 22209, 38345, 16780, -23634, -43410, -20806, 23311, 45613, 21125, -26410, -45378, -17612, 27226, 45156, 17566, -25978, -41777, -15607, 25004, 38193, 15999, -22078, -37063, -18334, 15901, 33632, 22130, -10832, -34925, -25530, 7998, 36293, 29499, -7473, -39051, -31349, 8037, 41776, 31606, -10946, -41696, -30736, 12170, 43587, 29708, -13240, -39326, -26687, 9668, 34633, 25844, -6871, -30397, -25940, -398, 27527]
2376B7527L500k7977l0403p015K8026L4791J0016l0156l9795q081L2687M1859
2388C4979N767l6151l8264n560L6244L6753J289l3025l1847j823K8385K9136M626
2401C0509k3046k8839p271J6226L0487J4870j5094l3850k0310J5081L8370K2230
2413C9363j7641m1334k2320K0181M4264K0435k3638m1747j7979K5990L8110J2940
2425C6624k1350l3423j5197J8990K8220J5622j2554k5670j9097N257K8407K3924
2437B9753j214l0879l0857J654L4654L1547j870l8606l2748P861L9196K9396q759
2450B9128l9190k5006Q170L8628K1111j0297k8221k1677M293K4137K2823L512
2462B7411k1903k7938r075K1040L3042J2190k1432l8829j1557K5145L9613J1675
$$ y = [27527, 31027, 3050, -27353, -34368, -6342, 28449, 38465, 8309, -31486, -39567, -6880, 34979, 40746, 4595, -33669, -39229, -2985, 33768, 35057, 2032, -29815, -31638, -3253, 25883, 30509, 7463, -21376, -28647, -12421, 18066, 32936, 17842, -16008, -36318, -21237, 17133, 39363, 21722, -19612, -41932, -21751, 22513, 42948, 19310, -22437, -40416, -14426, 23684, 36624, 15274, -18149, -33346, -14356, 13864, 29486, 16932, -8738, -27835, -22578, 5829, 29753, 28539, -2340, -33197, -31543, 3111, 34658, 32788, -5818, -38566, -30705, 8491, 37887, 29128, -10062, -35068, -26898, 11730, 32841, 22544, -5677, -27354, -23061, 1076, 23899, 27411, 5508, -22430, -31505, -10465, 22577, 34767, 13335, -25494, -37051, -11906, 27707, 39382]
2474C9382l0981l8588o688L1468L4449N345k9674l2638k192K7979K5807L414k1194
2487E889k3677q021J3899K6173J1805j0809k5998k0345J0267L3492K1672j0641
2499B3706l7148k6478J6579M0266K4111j9832l9839j8947J9917L7396J4693j9923
2511A4501l1363j3622J7052K6712J2740j2457k0990j5948M808K1896K0271Q32
2523B4432k2953k8412j178K7375L1232J054l0820l4704K456L5136L1215m239l5873
2536e279k9120R064L2012K4672q538k7351j9991M377K1243J7011L806j6336k2257
2549a6687p791J7778K3670J2158j5991l1689j4583J9700L6224J3289k4616l6442
2561b4980j1060K7426L5241P320k8285l0824m049K5716K7126K433k0910k1077
$$ y = [39382, 8401, -30187, -36875, -5407, 29042, 34387, 4713, -27925, -30117, -2138, 23669, 27083, 5889, -17788, -25809, -11910, 14263, 26068, 15259, -10739, -31084, -20817, 12675, 34347, 23706, -13442, -39920, -23341, 16925, 41036, 21204, -18635, -37582, -17665, 19731, 34424, 14501, -16862, -30484, -13432, 13280, 26020, 13563, -7427, -23375, -18567, 3329, 23600, 24432, 1479, -26933, -28111, -736, 30496, 31550, 730, -33974, -31518, 3618, 34833, 30594, -5279, -34399, -25335, 6677, 31349, 22811, -4540, -24531, -20154, 1089, 18100, 21906, 5570, -16687, -24478, -6700, 16970, 29128, 13137, -18552, -33135, -13435, 22789, 36078, 11462, -24980, -36040, -8614, 26627, 33947, 5662, -25162, -29211, -3495, 23631, 26064, 5154, -15923]
2573a5923o021J3289J9607J2385j0174k1053j8650P055K6655K1680n176l1871
2585h197k5555J0341L4182K5065j3695l6006k0691J3500L7082J7858j8139l0014
2597a4269j4487J4872K6088J1792r775k0273j5608M635J9670J6455K249j9872
2609A477k1624o993K2035K9407M408k4304l1952l662K9647L2540j834l1976k6818
2622b9649K747L0728K6355r416k6284j8602L697K2797J7608j925j5181j6985o540
2635b0650J3354K0269J0630j1720k4369j5595J2565L2108J6145j6879l4425j6102
2647c4669K2392L4960J0185k3609l1826n973K3931K5335K348j7397k0381p583
2659b2287J5361J8835O922q850j6883j2190J970K0587J9177k224k3682k4554N543
$$ y = [-15923, -21944, -8655, 10952, 23337, 13163, -7890, -26540, -19485, 7170, 28850, 23674, -8197, -33752, -23411, 10771, 35836, 22141, -13865, -34556, -21056, 16026, 33884, 15745, -14269, -28756, -13884, 12204, 23996, 14221, -6052, -21660, -17025, 2645, 19100, 21349, 1477, -20147, -27140, -5105, 24302, 28710, 4406, -27546, -31208, -1561, 30979, 29145, -2831, -29649, -26902, 3826, 30181, 20765, -5519, -24121, -20424, 2373, 19981, 18056, 2875, -14110, -20650, -7296, 12973, 23603, 11883, -12486, -28081, -15516, 16592, 32737, 15858, -18567, -34669, -12277, 22683, 32868, 9259, -22567, -28540, -4609, 20726, 23074, 5677, -14704, -22287, -6926, 11909, 18831, 9981, -6902, -19092, -17122, 3465, 22642, 20418, -3264, -27818, -22275]
2672b2275K8517K6132r696l3080k2968J4297L0737K0890j5413k9145j6463J4276
2684a4191K6004J2007j0850k0037j2391M586J7553J3835J615j5588j9884m379
2696b1720J5879K4677Q539k1777k8721p431K6672K9887M033k9273k6552O60K7371
2709B244K4115n363k3126k1394N519K0411J5506j177j5103j4395l417R642J5730
2722I192J1471r083k0585j3467O935K6046J7071j3839k7064j6603J4319L3775
2734A8168J2160j7156l2379r747K3018K5562M966j7435k1822n800J4445J6292
2746A0272O821q607j3282r937J002J6675J5843L44k1377k1582M062K1625K2399
2759B4258k816k6528k3466P736K9091J9443q949k5970j9176J1993K4670J0171
$$ y = [-22275, 6242, 32374, 22678, -10402, -33370, -19073, 11664, 32554, 17141, -12004, -28467, -14191, 11813, 23820, 12970, -7067, -19458, -14872, 2681, 16516, 18131, 2543, -17341, -21720, -5841, 18836, 27375, 5598, -23123, -30554, -3882, 26005, 30038, 765, -25787, -25127, 2244, 26359, 20996, -2130, -23524, -18005, 2406, 17912, 16735, 1632, -12763, -16180, -6538, 9192, 20663, 11580, -9005, -22472, -15537, 10509, 27580, 13741, -13323, -29926, -15607, 18168, 30328, 13172, -19207, -28954, -5936, 19626, 24592, 7157, -14665, -20465, -6020, 10272, 17093, 8486, -4796, -14733, -13731, 2944, 18787, 19131, -2246, -23828, -19766, 1859, 24258, 21442, -5086, -28552, -20816, 8275, 27718, 18769, -7201, -26377, -14384, 10286, 20457]
2771B0457o625k1271j0449O264J4257J3054j552j3065j3115o023J1972K0059O925
2784B0888j3157k3904r315J8600K7524Q352k2069k9915l795K4838K5700j83k3572
2797hj9840N08J9573J6949p17j6805j1143m817J0455J5943N773n273j8737j1160
2811a9299N921J9185J6472o560k4714j3525O867K8114J4255j3365k8128j1778
2823b6555J6776K5407P256j7009k0207n458J3372J9759N245j1535j4457p765L575
2836a1596J4813J1710Q18j5588j8948m32J7993K0786J460k4101k0441J12K7156
2849C742K1527n676k5468j8530P402K3507J5191q895j7193j2536N788J6768P984
2862A3611o29j1959j1295m898J1047J3871O819j1430j8535p240J0512K4175J0050
$$ y = [20457, 13832, -7439, -17888, -11624, 2633, 15687, 14135, 1070, -12045, -18068, -6096, 13963, 20888, 7731, -16173, -25488, -6888, 20636, 28988, 6919, -22996, -26791, -1953, 23747, 23564, -8, -19848, -19340, 233, 17182, 16465, -340, -11483, -16300, -5845, 10098, 15871, 10598, -8139, -19299, -13378, 5807, 22279, 15719, -8995, -22520, -15653, 12461, 26716, 13351, -14777, -26555, -9779, 15628, 22884, 5875, -14332, -19790, -6418, 13341, 18586, 7051, -7406, -15171, -11596, 3217, 14927, 15745, 157, -18791, -19223, -1230, 19556, 21016, -3085, -23526, -23414, 3742, 25269, 19593, -5875, -24405, -17003, 6504, 21695, 12800, -4393, -16929, -11141, 5627, 13611, 12982, 1023, -10272, -15170, -4123, 9748, 16567, 5137, -13398, -20638, -10126, 14049, 24099]
2875B4099j8585k3634o366K0629K3348L530j8323k2383q61J6317J7523J251j5299
2888A246j4078k497R086J5646L516o134j0652j1264M728J5710J1812k430k0986
2901f297j5715N483K5074J6616j1410k3992j4935J2964K4337J1205j2664k1949
2913a1283p233J0939J9697M144q698j4603o823M523J1669J1986j696j3449j2550
2926a3377k834J4764J7196M814j8647k0240k676K0945K1881k856k1299j9711O035
2939a6005K2051J3186n318j9739j0975M510J4737J1158j432j2371j0236j448P697
2952d185J3693O035j0119j3941r022R040K0860O916j1849k0865r210J4942K3058
2965A5353N050j5180j9385n521J7015J5786K304j4042j3990j574J0850J2266L566
$$ y = [24099, 5514, -18120, -24486, -3857, 19491, 23021, 4698, -17685, -18546, -2229, 15294, 16545, 1246, -12832, -15329, -6243, 9403, 12919, 6785, -3867, -15131, -10403, 5307, 17119, 14689, -6297, -22012, -16529, 8545, 25161, 13751, -10241, -25176, -12212, 12125, 23330, 10666, -11283, -18516, -7577, 12120, 16264, 7566, -7037, -13860, -9337, 2332, 14318, 12622, -827, -13377, -16211, -1447, 15749, 20563, 1916, -18324, -21000, -55, 21826, 18970, -2329, -22040, -16005, 6046, 19232, 13914, -5825, -16800, -12290, 2447, 13605, 12173, -198, -10434, -11882, -4185, 9508, 15543, 5424, -8517, -17539, -8499, 12361, 19277, 7428, -13437, -22647, -7705, 15353, 20403, 5223, -14162, -19683, -2668, 13118, 15422, 1380, -12610, -14184, -3334, 8932, 12498]
2978A2498p118j1476p526N607J1814J2986m841j5570j4190M667K0584J0862n193
2991A3104j9080j5924R960K0827R388j0277j7537j0167R841J9203P832r955j4261
3004g046o238M034J2065R535k112r919j2275q30J1115J4629K395j4643j5707k211
3018a7208J6077J5959K684j7460j8239J347K0102J2482M61j8910j3062J227J7502
3031B962J2000l435j1354j0434j433R005J0954L241m944j3621r027Q778J7193
3044I885O659r444j8867o665J0106K0372N467j2055j9446l508J2824J5695M473
3057A5496r617j5152n048R880J2234L358n396j0762p394N682R052J0593l091j1960
3071b125j2406K476J4137J5047m706j7973j1958M566J8805J0556n274j8997p048
$$ y = [12498, 5380, -6096, -13622, -8015, 3799, 16785, 11944, -3626, -17816, -13149, 7435, 18297, 13104, -5976, -21900, -11940, 8887, 18275, 7998, -9539, -19706, -9865, 9338, 17170, 7215, -7046, -13284, -9250, 2815, 12350, 10238, 319, -11956, -12786, -1671, 12958, 15353, 710, -14997, -17208, -1131, 14828, 17512, 52, -18187, -16840, 3262, 15744, 16205, -2705, -15767, -14540, 2962, 14962, 11527, 173, -10261, -11694, -2689, 8265, 11506, 6562, -7059, -16086, -7308, 9885, 16544, 7100, -11767, -18432, -8326, 12046, 17513, 5458, -13988, -17496, -4672, 11023, 15496, 5879, -9273, -14321, -4441, 7793, 11151, 5755, -5007, -12401, -6719, 2333, 12926, 9835, -2125, -14531, -12055, 2082, 17129, 12423, -5550, -17508, -12942, 5863, 16419, 11145, -7852, -14900]
3084a4900N377J4642J0475n787j4326j0026O014J1753P131l82j2976o393j628
3097a1026R167J2502K510j0374j5106l038J2286J4641N051j4770j5767n22J4315
3110a31J5019j863j2683j2806q28J4255J0341J117j0972j2683j8J0333R461J528
3124A0070o808j0761n264Q381J3104N747o210j3598q985O622J4829R716q562j5632
3138g351q561Q067J7435M536q257j5912l156Q587J1335N627m995j2464o696O329
3152e476R811P311l331j2103p610L696R057J1043l213j3742q404J448J5410J1805
3166A5702m750j3199j0065L928J4119P283l670j2332q977N637P784J0225n38j1637
3180d90p976j039R964R712K20q047j3756m223J1851J4638L951j1326j4055l527
$$ y = [-14900, -9523, 5119, 15594, 9807, -4519, -14545, -8531, 3222, 10353, 9971, -3005, -9398, -11026, -1859, 10643, 13153, 2779, -12327, -15365, -3079, 11562, 16613, 1843, -13924, -14446, -131, 14888, 13025, 342, -12464, -13292, 963, 11304, 12421, 1449, -11234, -11252, -919, 8542, 10070, 3262, -7499, -12763, -4382, 8722, 14469, 8259, -5339, -14324, -7702, 7127, 16843, 8281, -7351, -15912, -7845, 9590, 14126, 5869, -10043, -13199, -4612, 6723, 12350, 7355, -5109, -11805, -5476, 4335, 11646, 8315, -3788, -11398, -7702, 1355, 12398, 9185, -4557, -12961, -11513, 3897, 15702, 10952, -2247, -12312, -8384, 5735, 13018, 9348, -2984, -11961, -6324, 1460, 11685, 11147, -490, -8466, -9505, 459, 10171, 10391, 2344, -11412, -15635, -3784, 10854, 14805, 3479, -10576, -14103]
3194a4103J1506J1940L187j1745j2090j556J1089J3892n15j0269j2389K914O744
3207a395O810P368q370j1128m845P686R075P251m306j5612o492O367J3685Q001
3221A4095o423j4962o814P753J3839N086o476j4531l635N463J3864O579p319j0953
3235d434p004N383J0795M059p13j0500p874J613R632J1138j641r395j3269L145
3249i065J1402J0538l128j2451j0028L098J1855J0646n980r680p690K42J1854
3262A613Q504k478r296q422L93J0767P882J702q917r464l456O378J4344L033q977
3277C606j3273k606R867J2421J79n301j3529l152J1474Q580K614q176j0153k417
3291i866O066J0948M819q374j0416m537O911J0403N353m997r984o897L566J1960
$$ y = [-14103, -2597, 9343, 12530, 785, -11305, -12861, -1772, 12120, 11605, 1336, -11053, -8139, -1395, 5415, 12783, 4413, -6715, -11560, -3874, 5201, 12452, 8146, -7466, -13958, -7591, 6094, 14095, 7672, -7290, -14104, -6351, 7488, 12574, 6098, -8433, -12068, -6605, 7259, 13838, 6519, -4434, -11438, -6055, 4740, 8799, 8086, -2414, -10288, -8675, 957, 12095, 10454, 1059, -12210, -9065, 2337, 12875, 9747, -2704, -12732, -9634, 2221, 12867, 6887, -2793, -10483, -10241, 1613, 10117, 7639, -1657, -10079, -9686, 1081, 8963, 10665, 1748, -7716, -11172, -4794, 9550, 12583, 3606, -9667, -12273, -2406, 10015, 10194, 4893, -8636, -11788, -314, 8266, 10880, 2704, -7449, -9866, -3800, 7148, 11967, 3593, -6823, -11360, -4449, 5954, 11307, 6310, -3674, -10571, -7005, 4955]
3305D955O861m061j0810r198M113J3511O483m109j1797p174N608J0297N390l626
3319F443j0947o157M800O611R119j687j0507q014J613J0688O421J93p381r962
3333h767j189R593J0863p30j1610p502P06J0198R011k069p462r685k472J0375
3347g40R113p12r115o469m50P867R068k82o330r960j903Q647R591J433n742j2076
3363h060k619Q622J0814Q54o048r474l804N889J0515J751n259r528l625N118J1101
3378F247K703m507j0506k509N264Q100N033m808p438o007K850J1270M384j318
3392H758j2691o191K660J2078M925p48j2770o917N744P625O352j327r991q183
3406a0676L213R038Q268j387j0141p733L912O933Q692l341p818p133J085R335
$$ y = [4955, 11816, 7755, -3055, -12253, -8140, 5371, 11854, 7745, -4052, -11226, -5618, 4679, 10069, 6443, -4504, -10661, -5861, 750, 9869, 8182, -2325, -10339, -8726, 1962, 8383, 8576, 1195, -8767, -9956, -363, 10500, 9770, -1840, -9342, -8636, 1562, 10573, 8504, 1042, -8643, -11115, -740, 8373, 7661, -1454, -7923, -8373, -506, 8562, 8280, 1950, -8010, -9913, -1266, 8325, 9758, 4016, -8060, -10679, -2057, 8757, 9611, 3563, -5911, -9715, -3826, 6689, 8440, 3181, -6347, -9972, -4854, 6247, 8950, 4443, -6063, -8572, -3308, 4792, 9825, 5017, -2421, -8428, -5578, 5692, 10076, 8758, -3933, -10124, -7464, 4614, 9539, 8791, -3979, -10896, -5152, 2473, 8825, 7498, -2493, -10676, -7463, 1575, 9843, 8456, -1685, -9418, -5506, 1427, 10119, 6778, -1040, -8173, -7088, 2247]
3420B247O255Q15r665p893j321R583R749J09r075r801J759P370Q406n07o955r070
3436g994N00O912P413Q45n896p562j006M501R777K439p884p621k505N402Q935
3451F256K909o116j0466k108N308J0150N475q725p450o378P003Q628K634l754
3465C366r056k975N871Q150L437l856r482m709N552P916M502l924o919o213J582
3480f758J0278M495k058r220m327J338R450N229k453p403p937M935O348N673r3
3495G497r720o249J532O848P962j766o339q117P71P398P743J199q632r125n23
$$ y = [2247, 8502, 9317, -348, -8241, -9562, 21, 9770, 9879, 804, -8997, -7238, 132, 8538, 8031, 1076, -7994, -7494, -582, 6831, 7676, 1780, -5782, -6788, -2287, 7490, 9929, 2045, -5576, -8081, -2679, 6256, 9165, 3049, -7417, -9525, -4217, 5933, 11408, 2683, -4767, -11145, -4142, 4486, 7120, 3366, -5690, -8665, -2794, 5356, 8793, 4937, -4545, -9254, -3702, 4214, 8716, 4792, -2127, -8340, -6758, 3520, 8015, 5957, -3263, -7590, -6252, 3198, 8427, 5974, -1429, -9366, -4431, 1917, 7590, 7497, -2223, -8472, -6940, -92, 7870, 6104, -235, -8352, -7581, -183, 7560, 8759, 127, -8998, -9521]
$$ [...]
8191f92
##END NTUPLES=NMR FID
##END=
