##TITLE=1H_SA_28.188.ether
 CDCl3, 8 sc, 
 24.3.2020
##JCAMPDX= 6.0         $$ Bruker NMR JCAMP-DX V2.0
##DATA TYPE= NMR FID
##DATA CLASS= NTUPLES
##ORIGIN= UXNMR, Bruker Analytische Messtechnik GmbH
##OWNER= root
$$ XWIN-NMR		Version 3.5
$$ Tue Mar 24 14:36:10 2020 Russian Standard Time (UT+4h)  she@DPX200
##.OBSERVE FREQUENCY= 200.1315
##.OBSERVE NUCLEUS= ^1H
##.DELAY= (6, 6)
##.ACQUISITION MODE= SIMULTANEOUS
##.ACQUISITION SCHEME= undefined
##.AVERAGES= 8
##.DIGITISER RES= 18
##SPECTROMETER/DATA SYSTEM= spect
##.PULSE SEQUENCE= zg30
##.SOLVENT NAME= CDCl3
##.SHIFT REFERENCE= (INTERNAL, CDCl3, 0, 15.7039)
##AUDIT TRAIL= $$ (NUMBER, WHEN, WHO, WHERE, WHAT)
$$ ##TITLE= Audit trail, XWIN-NMR		Version 3.5
$$ ##JCAMPDX= 5.01
$$ ##ORIGIN= Bruker BioSpin GmbH
$$ ##OWNER= she
$$ F:/spectra/data/she/nmr/H-F/1/audita.txt
$$ ##AUDIT TRAIL=  $$ (NUMBER, WHEN, WHO, WHERE, WHAT)
(   1,<2020-03-24 14:34:46.42 +0400>,<she>,<DPX200>,
      <created by zg, POWCHK disabled, PULCHK disabled
       configuration hash MD5:
       00 E9 B6 7A A2 85 ED C7 34 08 36 98 17 FE 4E 26
       data hash MD5: 16K
       CE 66 DA 0E 1D 15 A2 89 D7 D6 9B 4E 6D 81 46 03>)
$$ ##END=
$$ 
$$ hash MD5
$$ 14 32 7A 3E 5A DD 26 EB 44 D3 99 90 54 72 0B 45
##$RELAX= 
##$RELAX= 
##$RELAX= 
##$RELAX= 
##$RELAX= 
##$RELAX= 
$$ Bruker specific parameters
$$ --------------------------
##$DU= <F:/spectra>
##$EXPNO= 1
##$NAME= <H-F>
##$PROCNO= 1
##$TYPE= <nmr>
##$USER= <she>
##$AMP= (0..31)
100 100 100 100 100 100 100 100 100 100 100 100 100 100 100 100 100 100 
100 100 100 100 100 100 100 100 100 100 100 100 100 100 
##$AQSEQ= 0
##$AQ_mod= 1
##$AUNM= <au_zg>
##$AUTOPOS= <>
##$BF1= 200.13
##$BF2= 200.13
##$BF3= 200.13
##$BF4= 200.13
##$BF5= 200.13
##$BF6= 200.13
##$BF7= 200.13
##$BF8= 200.13
##$BYTORDA= 1
##$CFDGTYP= 0
##$CFRGTYP= 5
##$CHEMSTR= <none>
##$CNST= (0..31)
1 1 145 1 1 1 1 1 1 1 1 1 1 1 1 1 1 1 1 1 1 1 1 1 1 1 1 1 1 1 1 1 
##$CPDPRG= <>
##$CPDPRG1= <>
##$CPDPRG2= <>
##$CPDPRG3= <>
##$CPDPRG4= <mlev>
##$CPDPRG5= <mlev>
##$CPDPRG6= <mlev>
##$CPDPRG7= <mlev>
##$CPDPRG8= <mlev>
##$CPDPRGB= <>
##$CPDPRGT= <>
##$D= (0..31)
0 1.2 0 0 0 0 0 0 0 0.06 0 0.03 0 0 0 0 0.0002 0 0 0 0 0 0 0 0 0 0 0 0 
0 0 0 
##$DATE= 1585046085
##$DBL= (0..7)
120 120 120 120 120 120 120 120 
##$DBP= (0..7)
150 150 150 150 150 150 150 150 
##$DBP07= 0
##$DBPNAM0= <>
##$DBPNAM1= <>
##$DBPNAM2= <>
##$DBPNAM3= <>
##$DBPNAM4= <>
##$DBPNAM5= <>
##$DBPNAM6= <>
##$DBPNAM7= <>
##$DBPOAL= (0..7)
0.5 0.5 0.5 0.5 0.5 0.5 0.5 0.5 
##$DBPOFFS= (0..7)
0 0 0 0 0 0 0 0 
##$DE= 6
##$DECBNUC= <off>
##$DECIM= 24
##$DECNUC= <off>
##$DECSTAT= 4
##$DIGMOD= 1
##$DIGTYP= 9
##$DL= (0..7)
0 120 120 120 120 120 120 120 
##$DP= (0..7)
150 150 150 150 150 150 150 150 
##$DP07= 0
##$DPNAME0= <>
##$DPNAME1= <>
##$DPNAME2= <>
##$DPNAME3= <>
##$DPNAME4= <>
##$DPNAME5= <>
##$DPNAME6= <>
##$DPNAME7= <>
##$DPOAL= (0..7)
0.5 0.5 0.5 0.5 0.5 0.5 0.5 0.5 
##$DPOFFS= (0..7)
0 0 0 0 0 0 0 0 
##$DQDMODE= 0
##$DR= 18
##$DS= 0
##$DSLIST= <SSSSSSSSSSSSSSS>
$$ [...]
##$SUBNAM2= <"">
##$SUBNAM3= <"">
##$SUBNAM4= <"">
##$SUBNAM5= <"">
##$SUBNAM6= <"">
##$SUBNAM7= <"">
##$SUBNAM8= <"">
##$SUBNAM9= <"">
##$SW= 24.9337058887773
##$SWIBOX= (0..15)
0 0 2 0 0 0 0 0 0 0 0 0 0 0 0 0 
##$SW_h= 4990.01996007984
##$TD= 16384
##$TD0= 1
##$TE= 0
##$TE2= 300
##$TE3= 300
##$TEG= 300
##$TL= (0..7)
0 120 120 120 120 120 120 120 
##$TP= (0..7)
150 150 150 150 150 150 150 150 
##$TP07= 0
##$TPNAME0= <>
##$TPNAME1= <>
##$TPNAME2= <>
##$TPNAME3= <>
##$TPNAME4= <>
##$TPNAME5= <>
##$TPNAME6= <>
##$TPNAME7= <>
##$TPOAL= (0..7)
0.5 0.5 0.5 0.5 0.5 0.5 0.5 0.5 
##$TPOFFS= (0..7)
0 0 0 0 0 0 0 0 
##$TUNHIN= 0
##$TUNHOUT= 0
##$TUNXOUT= 0
##$USERA1= <user>
##$USERA2= <user>
##$USERA3= <user>
##$USERA4= <user>
##$USERA5= <user>
##$V9= 5
##$VALIST= <valist>
##$VCLIST= <CCCCCCCCCCCCCCC>
##$VD= 0
##$VDLIST= <DDDDDDDDDDDDDDD>
##$VPLIST= <PPPPPPPPPPPPPPP>
##$VTLIST= <TTTTTTTTTTTTTTT>
##$WBST= 1024
##$WBSW= 4
##$XGAIN= (0..3)
0 0 0 0 
##$XL= 0
##$YL= 0
##$YMAX_a= 384460
##$YMIN_a= -270075
##$ZGOPTNS= <>
##$ZL1= 120
##$ZL2= 120
##$ZL3= 120
##$ZL4= 120
##$ABSF1= 10
##$ABSF2= 0
##$ABSG= 5
##$ABSL= 3
##$ALPHA= 0
##$AQORDER= 0
##$ASSFAC= 0
##$ASSFACI= 0
##$ASSFACX= 0
##$ASSWID= 0
##$AUNMP= <proc_1d>
##$AZFE= 0.1
##$AZFW= 0.1
##$BCFW= 1
##$BC_mod= 2
##$BYTORDP= 1
##$COROFFS= 0
##$CY= 11.3945322036743
##$DATMOD= 1
##$DC= 2
##$DFILT= <>
##$DTYPP= 0
##$F1P= 16.9975609425685
##$F2P= -3.02152046262296
##$FCOR= 0.5
##$FTSIZE= 0
##$FT_mod= 4
##$GAMMA= 1
##$GB= 0.15
##$INTBC= 1
##$INTSCL= 1
##$ISEN= 128
##$LB= 0.24
##$LEV0= 0
##$LPBIN= 0
##$MAXI= 10000
##$MC2= 0
##$MEAN= 0
##$ME_mod= 0
##$MI= 1.114404
##$NCOEF= 0
##$NC_proc= 0
##$NLEV= 6
##$NOISF1= 3.799351
##$NOISF2= 2.8
##$NSP= 1
##$NTH_PI= 0
##$NZP= 0
##$OFFSET= 15.70392
##$PC= 1
##$PHC0= -9792.383
##$PHC1= 21.40082
##$PH_mod= 1
##$PKNL= yes
##$PPARMOD= 0
##$PSCAL= 0
##$PSIGN= 0
##$REVERSE= no
##$SF= 200.130013532006
##$SI= 16384
##$SIGF1= 3
##$SIGF2= 2
##$SINO= 400
##$SIOLD= 16384
##$SREGLST= <1H.CDCl3>
##$SSB= 0
##$STSI= 0
##$STSR= 0
##$SW_p= 3612.71676300578
##$SYMM= 0
##$S_DEV= 0
##$TDeff= 0
##$TDoff= 0
##$TI= <>
##$TILT= no
##$TM1= 0
##$TM2= 0
##$TOPLEV= 0
##$USERP1= <user>
##$USERP2= <user>
##$USERP3= <user>
##$USERP4= <user>
##$USERP5= <user>
##$WDW= 1
##$XDIM= 8192
##$YMAX_p= 0
##$YMIN_p= 0
$$ End of Bruker specific parameters
$$ ---------------------------------
##NTUPLES= NMR FID
##VAR_NAME=  TIME,          FID/REAL,        FID/IMAG
##SYMBOL=    X,             R,               I
##VAR_TYPE=  INDEPENDENT,   DEPENDENT,       DEPENDENT
##VAR_FORM=  AFFN,          ASDF,            ASDF
##VAR_DIM=   8192,          8192,            8192
##UNITS=     SECONDS,       ARBITRARY UNITS, ARBITRARY UNITS
##FACTOR=    0.0002004,     1,               1
##FIRST=     0,             0,               0
##LAST=      1.6414764,     0,               0
##MIN=       0,             -270075,         0
##MAX=       1.6414764,     384460,          0
$$ Real data points
##PAGE= N=1
##DATA TABLE= (X++(R..R)), XYDATA
0@%%%%%%%Qj6J6j7K5l2L9m8N7p0Q4j00J16j36J61j87K17k52K87l26L73m25M79
30B53n39O09o85P68q59R58j067J187j317J457j614J790j982K197k434K695k989
47a572L324l706M144m657N264n999O908q064R593j1733J4961k0442L2198j01795
61h1576J37145J79528k15316j94704j9235J12740M5913J4255M858K7293K7213
72C8114L2190n3361j36820p6175J43086K06089q217k43789j71192R1786K05313
83B7024O5399q4706p8958K5718P1898K7106l5249l7299J7488P2423M5888p7123
95C9609j60943m7028J65148J91389l0008k11109j20286R7845J65838N1920n0919
106I1456m3757O871J3871k5388n9451m4162M4874J27727N9858j30756k02226l5553
$$ plain form
0 0 0 0 0 0 0 0 0 8 -8 8 -9 16 -16 23 -25 32 -38 46 -54 62 -74 87 -100 117 -135 152 -174 199 -226 253
30 253 -286 323 -362 406 -453 505 -562 625 -692 765 -849 941 -1041 1156 -1278 1417 -1572
47 -1572 1752 -1954 2190 -2467 2797 -3202 3706 -4358 5235 -6498 8463 -11979 20219 -81576
61 -81576 55569 235097 19781 -174923 -194158 -81418 -35505 -21250 -16392 10901 38114
72 38114 70304 16943 -119877 -196052 -52966 153123 144906 -98883 -270075 -178289 27024
83 27024 92423 7717 -71241 -45523 26375 53481 18232 -19067 -1579 70844 116732 39609
95 39609 -121334 -168362 -3214 188175 158167 -52942 -173228 -75383 90455 142375 91456
106 91456 47699 54570 68441 43053 -16398 -60560 -15686 112041 171899 41143 -161083 -196636
118a96636J76424J80180L928j32530q9424K7958O5486L409m6003q709N3845L9954
130G7882n6928j26643q0107O4065J56344Q7603q0924j58806n1584J19757J46573
141I7232l463j13214n4146N0284L4122n0471o1045J7191P6851N1847l6555j10477
153a01844p4585O4651J72292J04980p8366j60683m5273J03528R8732k0426o7835
164d829q921L6865l919o6319n7027L0972J14921J00716j4122j24870j08799L1091
176g4241J52527J05614n6069j30912m1869N8426L1123m9514l9606M4758P4897
187G5134K494q2483q0344J0217J08539J18528R307j27825j33681Q072J22922O5117
199I5997o5139q5093J216M4649p966n8979k0852O7648R9450K8194q2135j15517
$$ plain form
118 -196636 -20212 159968 163896 31366 -58058 -30100 35386 38795 -7208 -15917 37928 77882
130 77882 20954 -105689 -185796 -121731 34613 122216 41292 -117514 -169098 -49341 97232
141 97232 93769 -19445 -73591 -23307 10815 -39656 -100701 -83510 -6659 45188 8633 -101844
153 -101844 -176429 -111778 60514 165494 87128 -73555 -118828 -15300 83432 63006 -4829
164 -4829 -13750 23115 19196 -47123 -104150 -73178 41743 142459 128337 3467 -105332 -74241
176 -74241 78286 183900 127831 -3081 -44950 13476 44599 -4915 -44521 237 75134
187 75134 77628 -4855 -85199 -74982 33557 152085 161392 33567 -100114 -92042 30880 95997
199 95997 30858 -54235 -53019 -8370 -16336 -75315 -96167 -28519 70931 99125 16990 -98527
211i8527k8323J01183J32168J8199j18429j19510j360P6674L5587l5982k3027
222f1347M6047N7912k0959q5322l8017P4775J21494M7675p4569j27519n5393P1871
234d3352J13567K2508q2164p2356J8638N7524L858m2280M298Q1306P0069l3592
246I8024j05683o1713M9324J13308N9003o7437j29702o0187N8520R3972J9537
257F6966m8177l0759L2835L0946l4779n9884J1378R2541P1822l6345j21559r3667
269a18682K3121J06623O9563l9205r6731m5202M3369N8589N96l3229J5414O1739
281D5965J9221p4547r2384m351R1708Q7955j2385j08435r3228J4312R6256O9365
293C9452k2018n8865q874M4932K4461l5537l3645L7423P7488J6536q0318j05691
$$ plain form
211 -98527 -126850 -25667 106501 124700 6271 -113239 -114599 -37925 -2338 -38320 -61347
222 -61347 -15300 42612 21653 -63669 -101686 -26911 94583 142258 67689 -59830 -115223 -43352
234 -43352 70215 92723 10559 -61797 -43159 14365 18223 -24057 -19759 61547 131616 98024
246 98024 -7659 -69372 -20048 93260 152263 84826 -44876 -105063 -46543 47429 66966
257 66966 18789 -11970 20865 51811 17032 -42852 -31474 61067 132889 96544 -25015 -118682
269 -118682 -95561 11062 80625 41420 -55311 -100513 -57144 1445 2041 -31188 -15774 45965
281 45965 65186 -9361 -101745 -106096 -14388 73567 61182 -47253 -140481 -126169 -29913 39452
293 39452 17434 -41431 -50305 -5373 19088 -16449 -50094 -12671 64817 81353 1035 -104656
305a04656k0223R2181J07263J2787q4447p6574J0218P3199N0605j1666k7891J2346
317C3142L0634j7501o9214m1359M5806R3187L4305p4118j12371l2180Q0209J04642
329G5182K8330n3134n7234p74L5299P672k9132j1837L5227L3730l2690q9629o0655
342a19645M2735J09276O0394n1080j01332l8872N4295Q0168K5014l5024l4333
353h404K293J0285k6501m6629m802N7404O1602j2976q9933o9346L3962J09224
365A6179P0317k6018p6395m0844K8509M7225O896k7189q652K5692J2255m1038
377a3063o1143n968P7200R0015M665q4373p4740J7023R0004O4501j7187o5554
389B1380l7962J5107J8173j4068k2585J6472N3310K5701m8532q2975j8782Q2538
$$ plain form
305 -104656 -124879 -32698 74565 87352 2905 -73669 -63451 9748 60353 48687 20796 33142
317 33142 63776 46275 -22939 -64298 -18492 74695 109000 34882 -77489 -109669 -29460 75182
329 75182 103512 50378 -6856 -7630 27669 35341 6209 -5628 29599 63329 30639 -58990 -119645
342 -119645 -76910 32366 92760 41680 -59652 -98524 -44229 35939 60953 25929 -8404
353 -8404 -6111 4174 -22327 -68956 -73758 -16354 45248 32272 -57661 -127007 -93045 16179
365 16179 86496 60478 -15917 -56761 -28252 18973 25869 -1320 -9972 15720 27975 -13063
377 -13063 -74206 -80174 -2974 87041 91706 7333 -67407 -50384 39620 104121 86934 21380
389 21380 -16582 -1475 16698 2630 -19955 -3483 49827 75528 26996 -55979 -74761 7777
401G777J00899J6379p8635q6296j2445N7647M5830j3193m1221j3084J5500k071
413b913l8808l3356L4505Q7670M8139n1722r9951l8722O1413Q9777K2343o3694
425A4681p4633j1467L8369K1926k0298j9459K4172M4603m04o0391m9305L8247
437e3959J00445N6797m8001j02296m9418M6261P9655K2029m7295m8134M111L2595
449g210O079k5863m027N3322O4341p148q4075o9201K7019R8134O4107l6618r5761
462a6901n1404L0625N6585J6437k3996j0262K7234K3993k5453n3449q621O6825
474C1613P5919p413r2432q6040L949Q0969O1405k2040o6691l0064K6894L1923
486G992n958k2305J2141M9227K5544m6400p9589k4937O1554Q1126O967q2608q4979
$$ plain form
401 7777 108676 125055 46420 -39876 -52321 5326 51156 37963 -3258 -16342 -842 -2913
413 -2913 -41721 -75077 -40572 47098 95237 43515 -56436 -95158 -33745 56032 78375 14681
425 14681 -59952 -71419 -33050 -11124 -31422 -50881 -26709 17894 17490 -42901 -92206 -53959
437 -53959 46486 103283 55282 -47014 -96432 -50171 29484 51513 4218 -43916 -39805 -7210
449 -7210 -1131 -26994 -31021 22301 86642 79494 -4581 -73782 -46763 51371 115478 78860 -16901
462 -16901 -68305 -37680 18905 35342 11346 1084 28318 52311 26858 -26591 -35212 31613
474 31613 107532 100119 7687 -78353 -74404 6565 67970 45930 -20761 -50825 -23931 7992
486 7992 2034 -20271 -8130 41097 66641 20241 -59348 -84285 -22731 58395 65362 -17246 -102225
499a02225J010P2348N4304j1273l5378l147K6424Q760l0477k8588K5439O5420
511D2617L0780n3155r4229l7778O2665R3906K1850o5229o4330P789N3636L0502
523B9024j0670j1780K1009K9245j3722n8862m5104K5624P8388M7347m2810r5612
535d7923m2455N6635Q5132K2532m2823l8431Q070K8011k696k7604o165L5115L7063
548F4461j8923p1416n9918J6262Q3972O1928k6950q2453l6670L9649N8035J1072
560C9049k9474j6478J5861Q486l1009m4908m173M9454N4423l172p0403o8784J0355
573i0773Q4593O6788j5052o2524l0859K6693L0924q583k6006O398L4801J0606
585B7006m2141n6378p790N8796P6774J8167o0122p1777j679O8019N8573j0546
$$ plain form
499 -102225 -101215 -28867 25437 14164 -21214 -24361 2063 10823 -19654 -48242 -22803 42617
511 42617 73397 20242 -73987 -111765 -49100 44806 66656 1427 -62903 -55114 -1478 29024
523 29024 18354 6574 27583 56828 43106 -15756 -60860 -35236 43152 90499 47689 -47923
535 -47923 -90378 -33743 51389 73921 31098 -7333 737 28748 26052 -1552 -7717 27398 64461
548 64461 45538 -25878 -85796 -69534 14438 76366 49416 -33037 -69707 -30058 27977 39049
560 39049 9575 -6903 8958 17444 -13565 -58473 -62646 -13192 41231 38059 -32344 -101128 -90773
573 -90773 -6180 60608 45556 -16968 -47827 -21134 9790 1207 -24799 -18401 16400 27006
585 27006 -15135 -71513 -79303 -20507 56267 74434 14312 -57465 -59144 8875 67448 56902
597E6902m8972j7197K3707O309l3354k5206K8335N3860J9178l9787o2567j8538
609e7330N3340Q2180K8284n5137p5440j2572M9106L6111k1670l3115R767K8422
621C1946j3693n0729k7369L5904O8075L6733l1658p4137m1168L4294P6374L0465
633G5037m5648o3496r194L3338N408l2852j1269M2251M4066j2656n8658l9382
645g3055K5644O8531M8653k0154o8991n0099K2894O1303K1012m1648l6422J9855
657b2477L0464j4574m1216L054N5931N3619j0383o2241m6412J4714O0543N0688
669G1710j3226o7042m7880K1738M8591J0191k8032l575M0230J8860m0167n6846
681d5448K162P0402O2412p963o5015o5010j0348M6602N2721J580m3624k7598K1220
$$ plain form
597 56902 7930 -9267 14440 20749 -12605 -37811 -9476 44384 63562 23775 -38792 -57330
609 -57330 -3990 78190 106474 51337 -24103 -36675 12431 48542 26872 -6243 3524 31946
621 31946 18253 -32476 -59845 -23941 44134 80867 49209 -24928 -66096 -31802 44572 75037
633 75037 29389 -34107 -43301 -9963 -4555 -37407 -48676 -6425 37641 24985 -33673 -73055
645 -73055 -47411 21120 69773 49619 -19372 -69471 -46577 14726 35738 -5910 -42332 -22477
657 -22477 7987 -6587 -47803 -44749 11182 64801 54418 -7823 -54235 -39521 21022 71710
669 71710 58484 -8558 -56438 -34700 13891 24082 -3950 -7525 32705 51565 11398 -45448
681 -45448 -43286 27116 89528 81565 16550 -48460 -58808 -12206 40515 42095 -1529 -29127 -7907
694g907K3068j9235l2397K2406O5480K3263n3411p2092j1682M8522N0927P330
706D4272m0676n2015j6138L5052M0888m446l3706K46L5174J4355l9960l6734K8383
719b5305O5478J7939n5175o5785j4422M2528N4661J9524k8828m8077j4635L2606
731a9491L3655n019j5452J9695L7774r904o7180m4213L7699P6437K9364l8209
743C5156o2029l0617J8768M9111L5037o627k6854l851K0246k467l8302j7837M6025
756A5759N6668j1239p2108n2322K0573N7567L4782j2835l9871k4066J1581L2397
768A6886J5703j6987j8586J0999K2125j8393n1907j8298M8135N6672q374o5313
780b7338m7654J8144N7140L9716m533l2182k9202j753J8986Q387j2615k565K8374
$$ plain form
694 -7907 15161 -4074 -36471 -14065 51415 74678 21267 -50825 -62507 -13985 36942 44272
706 44272 3596 -48419 -64557 -29505 11383 6937 -26769 -26523 8651 23006 -16954 -53688 -25305
719 -25305 40173 58112 2937 -62848 -77270 -34742 19919 39443 10615 -37462 -52097 -19491
731 -19491 14164 9145 -6307 13388 51162 41258 -25922 -70135 -32436 44001 73365 35156
743 35156 -26873 -57490 -38722 10389 45426 38799 11945 8094 28340 25873 -12429 -30266 15759
756 15759 72427 61188 -10920 -63242 -42669 14898 49680 36845 -3026 -27092 -15511 16886
768 16886 32589 15602 -2984 8015 30140 11747 -40160 -58458 -10323 46349 37975 -27338
780 -27338 -74992 -56848 292 40008 35475 3293 -25909 -27662 -8676 -289 -12904 -15469 12905
793A2905K0380l8908o7703j5604O2599P3205R302n0254m6762j666L1453L2377
805B1324R925j4178j5084K166M514k0294l1938Q903N6416M1055l1067o8775k4410
818f1443M8285O2592J2342l2965l3302n761J5659J5642k059j6591l572J7607P782
831B4216l2613l9906J2540O7252M5476l3370o9869k4258L6683M7147J1911k1648
843B3561k7223j4416N348M259j1215r513K1084L9278N266n0477n4579J3115P2096
856A6584N0601k2698n9279l0120J3081K8280Q840j0159j0469P556J2191r963k7738
869c3293j2946L5771N6569J2420n1569o0715N948O0391L9935j6247m3869k0760
881b8365J0686J7410J684p483M574K1972J7640j6431m3189j8870M1935O3994J1390
$$ plain form
793 12905 33285 -5623 -73326 -88930 -26331 46874 56176 5922 -40840 -42506 -11053 21324
805 21324 31249 17071 1987 4153 8667 -11627 -43565 -34662 21754 62809 31742 -37033 -61443
818 -61443 -13158 49434 61776 28811 -4491 -10252 5407 21049 18990 2399 -1173 16434 24216
831 24216 -8397 -48303 -35763 31489 76965 43595 -26274 -50532 -13849 33298 45209 23561
843 23561 -3662 -18078 -12730 -8471 -19686 -29199 -8115 31163 36429 -14048 -68627 -55512 16584
856 16584 67185 44487 -14792 -44912 -31831 -3551 5289 -4870 -15339 -7783 4408 -5555 -33293
869 -33293 -46239 -10468 46101 58521 6952 -53763 -47815 12576 52511 36264 -7605 -28365
881 -28365 -17679 -269 1415 -6068 -1494 20478 38118 21687 -21502 -40372 1563 65557 76947
894G6947n7728o0630q84M5044L2567q426k4596p309J0531K874j5684j3131J4525
907e900M2811K6186k5285o2525l2100L4704O1251J4319m4746m8188l239K9494
919a3218J7742r237q804J2296J8800m319k7919k5931R837M7481L3912k4341o3488
932c7189l3587K9571N2548J5663k8070l0031M649J9256K715j0445K112K3062K3953
945C4207n512m3307m0358J0057N4220M2337j5414n5543l3869K0235M1255J6461
957B4769j4169q075J1621Q787j3635k5439m333L1269L7010k44m5218m7992j970
970d7619M7371M3498m042l8787k3735J6219K1446K163j3872K726J7966Q105k2560
983H879l7791j1447L0134M3462Q667m1465m6025o517M4438L9060k428k7838j2530
$$ plain form
894 76947 19219 -41411 -42295 2749 35316 26890 2294 -5015 5516 8390 -7294 -20425 -5900
907 -5900 36911 63097 37812 -24713 -56813 -22109 39142 53461 8715 -39473 -42712 -13218
919 -13218 4524 -4713 -13517 -1221 17579 13260 -14659 -40590 -30753 16728 50640 26299 -37189
932 -37189 -70776 -41205 11343 27006 -1064 -31095 -26446 -7190 -4475 -14920 -12808 10254 34207
945 34207 28695 -14612 -54970 -44913 9307 51644 36230 -19313 -53182 -32947 8308 24769
957 24769 10600 2525 14146 22933 9298 -16141 -20474 10795 47805 47561 2343 -45649 -47619
970 -47619 -248 43250 39208 421 -23314 -7095 14351 16514 2642 5368 23334 31439 8879
983 8879 -28912 -40359 -10225 33237 41904 439 -45586 -52103 -7665 31395 28967 1129 -11401
996a1401R759P591j1470j7705J0691L0044J4202k7650m5941j8469L2219N1853
1008B3723K1086l1257m4883o777K8818K7226k324j5938K148J3435l432k6734k4763
1021c9672J2676M3962K8417j7804m8942k6091K4676N1478K2077k2747l2878n528
1033a0376J6144P048j1490p977J4755K2254j305l7522l4653J1926N0360L7186
1045E6350j1900m8484l1636J7898L8419J4792j7353k1507r33Q896o201k2777o936
1058c1372K7986L7717K302m0894m2552N158M6790L9356q525m0599k7896O952K3361
1071b216M838j1989n559J1656J2348j5451l1474o715L3641M5665J0842m0530m4291
1084c9235l569L8708L1976l322k8295j6523O011J0907l455j4679R192L0086J8750
$$ plain form
996 -11401 -1642 5949 -5521 -23226 -12535 17509 31711 4061 -41880 -60349 -28130 23723
1008 23723 44809 13552 -31331 -38108 -9290 17936 15612 -326 1822 15257 11825 -14909 -39672
1021 -39672 -26996 16966 45383 27579 -21363 -47454 -22778 28700 50777 28030 -4848 -10376
1033 -10376 5768 12816 1326 -6651 8104 30358 29053 -8469 -43122 -31196 19164 56350
1045 56350 44450 -4034 -35670 -17772 20647 35439 18086 -3421 -4354 4542 -1659 -24436 -31372
1058 -31372 -3386 34331 36633 -4261 -46813 -41655 5135 44491 35966 -4633 -32529 -25577 -2216
1071 -2216 2622 -9367 -14926 -3270 9078 -6373 -37847 -44562 -10921 34744 45586 5056 -39235
1084 -39235 -42804 -4096 27880 24558 -3737 -20260 -14249 -3342 -6797 -21476 -12284 17802 36552
1097C6552k0601m2287j5007L4790M7829J3954l4489m2887r612K4626K5327j142
1109A7053j5463m381J3696L714k0011j7731J4120L9764K3149k1094m9145k5123
1121d1452K5416M2736J5458k6095l3719p260J6657J1947p228n659J2995K2033
1133B5829l165l1997k8256J1766M4213K9102k0471m8807k8523J7310L6203J5223
1145A8427j4210j7979j84J2037q31j6382j500K5886K9882k846l8570l7887L805
1158d0352M2543L4165j1011l6851k2747Q605K5298J1413p336k361J1500Q595j4061
1171G400k6884n790K7104L5932L444l7781l9972n16L5081L0828l14k4167j6067
1184a1702N161J4155n07p437M885J8111R570k0238l7642j5171K8632M1811R657
$$ plain form
1097 36552 15951 -26336 -41343 -6553 41276 55230 20741 -22146 -31758 -7132 18195 17053
1109 17053 1590 -2791 10905 14619 -5392 -23123 -9003 30761 53910 32816 -16329 -41452
1121 -41452 -16036 26700 42158 16063 -17656 -24916 -8259 3688 -3540 -9199 3796 25829
1133 25829 22664 -9333 -37589 -25823 18390 47492 27021 -21786 -50309 -32999 3204 18427
1145 18427 4217 -13762 -13946 -1909 -2740 -19122 -20622 5264 35146 32300 -6270 -44157 -40352
1158 -40352 2191 36356 25345 -11506 -34253 -25648 -350 11063 3727 1366 12866 21461 7400
1171 7400 -19484 -25274 1830 37762 41206 3425 -36547 -37063 -1982 28846 28532 4365 -11702
1184 -11702 -6541 7614 7107 -330 4555 22666 32236 11998 -25644 -40815 -12183 29628 39285
1197C9285l2157l7342o061K5326K7292L940j4068q454M120J598j2295j4985P082
1210a6719K9096J9555k0181m4841k0723K5125M2552J7409j9252l0109p675J5522
1222a0241J4841j383p096L415J1755q92k3578k5505O498L9882L1135j4223m3152
1235a8544k3637J9227L8198J7694j3065j9860n094O315K559q007n139J2155K2849
1248B5651K175l0603l4757N069M4312L6528p743l7991k5442Q989K4545J0932o861
1261A4804q231M55K559p853j9698q061K1045L5601Q114l3276l9522j251L8727
1274C413L4162n308l0689j8522N648R752J48o374N23J1281R139j0222k8232j4223
1288c9504K3926M3849J3551l2445m2028m756L2880K5536m847j8000p580J834Q26
$$ plain form
1197 39285 7128 -30214 -36275 -10949 16343 20283 6215 -2239 1881 3479 -8816 -23801 -16719
1210 -16719 12377 31932 11751 -33090 -53813 -28688 13864 31273 12021 -18088 -25763 -10241
1222 -10241 4600 3217 -3879 -464 11291 10399 -13179 -38684 -32186 7696 38831 24608 -18544
1235 -18544 -42181 -22954 15244 32938 19873 13 -5081 1234 3793 -4214 -9353 2802 25651
1248 25651 27826 -2777 -37534 -32465 11847 48375 40632 2641 -22801 -13812 10733 21665 14804
1261 14804 6573 7028 9587 1734 -17964 -26025 -4980 30621 38735 5459 -34063 -35314 3413
1274 3413 37575 32267 1578 -16944 -11296 -1544 -1396 -7770 -7247 4034 13173 2951 -25281 -39504
1288 -39504 -15578 28271 41822 9377 -32651 -37407 -4527 21009 16162 -1838 -9418 -7584 -6758
1301f758o876o505P492K4395J9615j2176l8611k3498K2956M7094J7964k7736l6049
1314a8693m871J8754J0634m134l930P317R083l220j6394j7161N704L0869K8690
1327D2648q310m1395k9345J5456L9558J2397k1753k2464R49J0781J621p055P74
1340f138J2589J4425k899k0375k4715P51L2478L2671o930m3563k9436J2752L1573
1353C183R570j0827q413M077L393j0471j0054K299K1922K0246K261k5494l6226
1366c4534p860L3667L7404j215l2972k0832R748J7105j171q350R103J4868O042
1379B1003j4430k2819q651J7686K9292J3014k1817l7645j0425L1023K8070j888
1391B2413k4290p065J3439O647q616q523R319J8143L290j3090k5814j3054J4744
$$ plain form
1301 -6758 -13634 -20139 -12647 11748 31363 19187 -19424 -42922 -19966 27128 45092 17356 -18693
1314 -18693 -23564 -4810 5824 1690 -2240 5077 14160 10940 -5454 -22615 -16911 13958 42648
1327 42648 34338 -7057 -36402 -20946 18612 31009 9256 -13208 -12259 -1478 143 -6912 -6138
1340 -6138 6451 20876 17977 -2398 -27113 -26362 6116 38787 31857 -11706 -41142 -28390 3183
1353 3183 12753 1926 -6487 -2410 983 -9488 -19542 -17243 4679 24925 27186 1692 -34534
1366 -34534 -42394 -8727 28677 27462 -5510 -26342 -16594 511 -660 -9010 93 14961 21003
1379 21003 6573 -16246 -24897 -7211 22081 35095 13278 -24367 -34792 -3769 24301 22413
1391 22413 -1877 -8942 4497 11144 2528 -5995 3324 21467 24757 11667 -14147 -27201 -12457
1404a2457L2775J7603k2754l4778j1988K4518K4803j417j2415J903P764o695k0611
1417a3749j0360J4141K4815J2880j0148l1252k5733Q554L6202K3995j1667k8028
1429a0350q012J4628P640j1546n232J5616J7588o240k5117k0088M624K4718K3414
1442B1643N85k6886k5402N034L0569J8331j2341k1921L663J4013j720j8319m783
1455a7534K1166K0441o789k5062k0643J917K9303K7420K883k7800k7794L263K6409
1468G180J1846j2555q876J0920Q643j5740k5785l283K6809K8916J519k2007k5399
1481a7812j0822J8528L0738P653k0483j9777M841J3000o531j5617L838K2090J3882
1494B3528j7870k7819p753J9181K8662R017j4954k7609j1800J6718K3640Q04j8081
$$ plain form
1404 -12457 20318 37921 15167 -19611 -31599 -7081 17722 16305 3890 5793 13557 6862 -13749
1417 -13749 -24109 -9968 14847 27727 17579 -13673 -39406 -30852 5350 29345 17678 -10350
1429 -10350 -18362 -3734 3906 -7640 -12872 2744 20332 14092 -11025 -31113 -26489 -1771 21643
1442 21643 22228 -4658 -30060 -25026 5543 23874 11533 -10388 -6725 7288 5568 -12751 -17534
1455 -17534 3632 24073 17284 -7778 -28421 -26504 2799 30219 33102 5302 -22492 -19229 7180
1468 7180 19026 6471 -2405 8515 17158 1418 -24367 -27650 -841 28075 29594 7587 -17812
1481 -17812 -28634 -10106 20632 28285 7802 -11975 -7134 5866 -665 -16282 -12444 9646 23528
1494 23528 5658 -22161 -29914 -10733 17929 26946 11992 -15617 -27417 -10699 12941 13745 -4336
1507d336p254J0598O299j3514j5554R365L0359J4248j8010l1812j0440J7255K8981
1520A6185J4795j1868k7433j3728J1952J4558j045q465O992J6642K16k5304k2484
1533b8987J1990L4614K1067j2129l1782j8086O886K2565J4831o262j6789n092
1545g174P459L045j0555o271J5840K4049J633k9313k5882O392K9158J9957p351
1558B0987k5121j8185L003J7041J0543m154p791K125P930m945j7622p342K1295
1571b236K9217J115k9692k8189j89K4249K0517J041j5515j5365j098R184M678
1584b283l203M24J3932J2464j2633k7350j2709K2474L0214N006k0762k5499m272
1597b4197J4960J6173M457n920o517K034L919m524j1356K725K1442J6243j4315
$$ plain form
1507 -4336 -11590 -992 5307 -8207 -23761 -14396 15963 30211 12201 -19611 -30051 -12796 16185
1520 16185 30980 19112 -8321 -22049 -10097 4461 3416 -5049 1943 18585 18801 -6503 -28987
1533 -28987 -16997 17617 38684 26555 -5227 -23313 -16427 6138 20969 14707 -2082 -7174
1545 -7174 285 3330 -7225 -13496 2344 26393 28026 -1287 -27169 -20777 8381 28338 20987
1558 20987 -4134 -22319 -19316 -2275 8268 4114 -3677 -1552 6378 1433 -16189 -23531 -2236
1571 -2236 26981 28096 -1596 -29785 -29974 -5725 14792 15833 318 -15047 -16145 -6961 -2283
1584 -2283 -5486 -5062 8870 21334 8701 -18649 -31358 -8884 21330 26336 5574 -19925 -24197
1597 -24197 -9237 6936 11393 5473 -1044 990 4909 385 -10971 -8246 13196 29439 15124
1610A5124l1050j4851J7573K9940R948j6180k0081m972R227J1080K204k348o74
1623D940O092R42j5803j7816N314K6986J8183j0695l0781j8580J1589K5455J2809
1636A8635o668j2853m554K625K053l991q95P025J5404n84k0435k4463J671K7361
1650C31K4288m079k5478j7135O271J7045R427l338n364J060K196m904j1414n060
1664a6154J3220K0254O070k1388k6132k227K6444K4433j576j7877j4529J847R135
1677A520L740k269j235P663L961r594j8593q053J5985K7227J0538k0264k7671
1690a7045n342J8629J9517J660j1416p561R84Q75o532o157L935J7455J0872r102
1704A0772k6072j4713J4807K9749J2380j4040k4012p908J0497J1835L02n714K14
$$ plain form
1610 15124 -15926 -30777 -13204 16736 26684 10504 -9577 -14549 -5322 5758 7962 5614 4940
1623 4940 11032 11974 -3829 -21645 -16331 10655 28838 18143 -12638 -31218 -19629 5826 18635
1636 18635 11967 -886 -5440 -2815 -762 -4753 -5648 1377 16781 16197 -4238 -28701 -27030 331
1650 331 24619 20540 -4938 -22073 -15802 1243 10670 7332 1968 3028 5224 320 -11094 -16154
1664 -16154 -2934 17320 23390 2002 -24130 -26357 87 24520 22944 5067 -9462 -7615 1520
1677 1520 5260 2991 1756 9419 13380 3786 -14807 -22860 -6875 20352 30890 10626 -17045
1690 -17045 -22387 -3758 15759 17419 6003 -1558 -574 301 -6231 -12388 -8453 9002 19874 10772
1704 10772 -15300 -30013 -15206 14543 26923 12883 -11129 -19037 -8540 3295 3597 -2117 -1903
1717a903N178j252j3135j1731O481K3191J7713q573k6458j6998J0729K4171J3331
1730B0744r323j6561o895N537L933k411k103Q754J1872j092j7112j7726M361K5182
1744G160K0989m872k4685j8594M667J7799J1127n417q676l16L487k855r880j108
1758a1174J4148J8921J507j9560k3548l64K0660K0952l73j8678j6686J581J0507
1771b107M185k381m99P330L904p475j4573n846J5525K1585M889j7850k4388n819
1785b3520J4675J9610K818j1066r984J760M112l268m327O965J3264P880j0853
1798H066k0862j1208J2970K3427J0235j2669k1583r144J0308J5852K886m504j353
1811B421J747M97q573q839O293J7312J3467q622k4935j5284R045K1714J3700o783
$$ plain form
1717 -1903 3275 2023 -11112 -22843 -16362 6829 24542 15969 -10489 -27487 -16758 7413 20744
1730 20744 11421 -5140 -12035 -6498 -2565 -4976 -7079 1675 13547 12455 -4657 -22383 -18022 7160
1744 7160 28149 23277 -1408 -20002 -15335 2464 13591 8174 -502 -818 2669 -186 -10066 -11174
1758 -11174 2974 21895 23402 3842 -19706 -20070 590 21542 21169 2491 -14195 -12614 -2107
1771 -2107 2078 -303 -802 6528 10432 2957 -11616 -17462 -1937 19648 24537 6687 -17701 -23520
1785 -23520 -8845 10765 13583 2517 -7467 -5707 -1595 -4863 -9190 -2225 11039 18919 8066
1798 8066 -12796 -24004 -11034 12393 22628 9959 -11624 -20768 -10460 5392 8278 3774 2421
1811 2421 4168 4665 -3908 -12747 -6454 10858 24325 15703 -9232 -24516 -15471 6243 19943 13160
1825A3160j7183o964N111P976L94n77L570P646n31j5693j6361K577K0997J6804
1839B0926l620k1280j8478L601J9331J2792l095j0039l436L017j27n275m166R404
1853d45J4151J044j7680j9699j494J9541K0984P99j6042j6262J199J1401Q354
1866E851j134l418J664L656n837j3251n830J3488J8099N925j4679k1613n494J6278
1880f295K0355M214j1702j2125q34O651J722m733Q56R712Q302j0541j7989q867
1894b1274J2825K1914J1094j0572k2444q046J0564J5852M135p801o145J013K698
1907C813o914r580L492J6828J1934q201k0354j2485R349K2926J0773p911j6441
1920b771r645N229Q503J931n451J880P066j73j2907j3374M679K0617J6219o049
$$ plain form
1825 13160 -4023 -10987 -5876 2100 2494 1917 5487 13133 12602 -3091 -19452 -16875 4122 20926
1839 20926 17306 -3974 -22452 -18851 480 13272 10177 138 -3298 -281 -408 -5683 -9849 -445
1853 -445 13706 14750 -2930 -22629 -24123 -4582 16402 17201 1159 -15103 -13904 -2503 5851
1866 5851 4717 1299 2963 6619 782 -12469 -18299 -4811 13288 19213 4534 -17079 -22573 -6295
1880 -6295 14060 18274 6572 -5553 -6387 264 1986 -2747 -1891 7821 16123 5582 -12407 -21274
1894 -21274 -8449 13465 24559 13987 -8457 -16503 -5939 9913 14048 6247 102 1115 3813
1907 3813 -3101 -12681 -9189 7639 19573 11372 -8982 -21467 -12118 10808 21581 13670 -2771
1920 -2771 -12416 -7187 1316 3247 -2204 -324 6742 6569 -6338 -19712 -15033 5584 21803 15754
1934A5754j9275j5239M142J7248J1487l945j2141o116M878Q82m139l016P630J4710
1948A2860M09j4337j6490R87J6910J7531L54j6560j2770k819J1410R938l396m393
1962c66J08L039j659j0412m148J0285J9774K925j5209j9864k019J5178J6133K086
1976A5851j1580j1512k813N644L365R4q07O589P319o286j7496r927J5380K2111
1990A5932M969j3790j9012o753Q069J3873N169l716p696k96J644k072o169J871
2004g977J3803J2885p366k1084j1477J0259K0289O460p893j4204n935L261Q966
2017a3L431j552j382L704L082p938j0629J04J8355J5113o821k2092j3342Q575
2031a1405J5734R680l712q455o444q25M871J845p96M095Q557J792j3390j8737
$$ plain form
1934 15754 -3521 -18760 -14618 2630 14117 10172 -1969 -8085 -3207 -2325 -6464 -9480 -1850 12860
1948 12860 13269 -1068 -17558 -16571 339 17870 18224 1664 -11106 -13925 -2515 7423 4027 -366
1962 -366 -258 2781 1122 -9290 -13438 -3153 16621 19546 4337 -15527 -17546 -2368 13765 15851
1976 15851 4271 -7241 -10054 -4410 -1045 -951 -1758 4831 12150 5864 -11632 -21559 -6179 15932
1990 15932 20901 7111 -11901 -18654 -10585 3288 8457 4741 -2955 -3251 -1607 -3679 -9848 -7977
2004 -7977 5826 18711 11345 -9739 -21216 -10957 9332 15792 7899 -6305 -12240 -8979 -13
2017 -13 3418 1866 484 4188 7270 -668 -11297 -11193 7162 22275 15454 -6638 -19980 -11405
2031 -11405 4329 14009 10297 1842 -4602 -5427 -556 1289 493 4588 13145 14937 1547 -17190
2045a7190j118J9131J9354k176j8375j2040J034R203P170K135j261j888o83l244
2059E2n026m324M633J5833O407j2716k1609m274J6698J6822j56j2035q218J070
2073f843M555L374Q02rJ440J672k670j1292p838Q031K0062Q819j5261k1690m092
2088b0940J5786J5265K183o743n532k533j386r57m3L592P720P332m586j8181j3596
2103b2619P724K3695J3296j0007j8375n251P634O442K63K50J584L64k820o120
2117c940o735j65J1601J4424o86j8290j5740N975K0292J0075q611j2081j913L855
2131a939J073j099N23L393L762j393q436j0517m21J5624J7615J66j9398j7339
2145a8386M398J6158Q072m132m498m05j839n219m793K216R722R821K536r760j7416
$$ plain form
2045 -17190 -18308 823 20177 18001 -374 -12414 -11380 -2177 4993 7128 5867 3979 3296 52
2059 52 -4974 -9298 -4665 11168 17575 4859 -16750 -21024 -4326 12496 12340 305 -7913 -6843
2073 -6843 -2288 1086 1888 1879 3319 4991 2321 -8971 -16809 -8778 11284 20103 4842 -16848 -20940
2088 -20940 -5154 10111 12294 5551 19 -2514 -3900 -4857 -4900 -1308 6412 13744 9158 -9023 -22619
2103 -22619 -14895 8800 22096 12089 -6286 -11537 -3903 2539 2802 3052 4636 5000 2180 -3940
2117 -3940 -10675 -10840 761 15185 14499 -3791 -19531 -13556 6736 16811 8200 -3881 -5794 -1939
2131 -1939 -866 -1965 -1442 1951 5713 4320 -4116 -14633 -15054 570 18185 18351 -1047 -18386
2145 -18386 -13988 2170 10242 6110 1612 1207 -632 -5851 -10644 -8428 1294 11115 13651 3891 -13525
2160a3525n319J4463K0837J769j4213j2296J278O718P61k196K377N400J516o768
2174H02q976k658Q416J3072P290r041j8248o653J1853J5940J986j0035r727K205
2188c774L140k312j359M056Q645K371p525j1041n755O657J6132R800q335j8300
2202g600q930P713J1338L172l945j722K434k295p844m189O616J2600O852m243
2216I957j3430j2318J988J5128J1990l940j3204o295M329N524j166l306N833P456
2230H546j173j1318p952L510J1422R374k71j2923j3651N81J2295J1761j845r334
2244i78m032M496L21m055m94R006Q919k048j3034j1451k68J1469J3771L916j1158
2259D380j4752k605Q867R676p50k688J750L839o396j0829j484R497J2578L573
$$ plain form
2160 -13525 -18844 -4381 16456 18225 4012 -8284 -7006 -288 473 -1723 654 6054 7570 802
2174 802 -8174 -10832 -2416 10656 17946 8905 -9343 -15996 -4143 11797 13783 3748 -5979 -3774
2188 -3774 -634 -2946 -4305 -249 8396 10767 3242 -7799 -13554 -6897 9235 19035 10700 -7600
2202 -7600 -16530 -8817 2521 5693 1748 26 2460 165 -7679 -11868 -5252 7348 14200 9957
2216 9957 -3473 -15791 -13803 1325 13315 9375 -3829 -10124 -5795 -271 -1437 -4743 1090 8546
2230 8546 7373 -3945 -11897 -8387 3035 12409 12138 -785 -14436 -13855 -1560 10201 8356 -978
2244 -978 -5010 -514 -193 -4248 -4742 4264 13183 11135 -1899 -13350 -13618 -2149 11622 15538 4380
2259 4380 -10372 -12977 -4110 5566 4816 2128 3878 7717 1321 -9508 -10992 -1495 11083 14656
2273A4656j1137j3586n727P657J3526O745o601j0213j608N187K541l154k8P305
2287E563M715o443j2773n571Q549J3824N562p441j2723p059O016J2079O054m500
2301E852n909k65J968m091n013K751J1692P427o554j5646q481O290J4653R778
2315A4452l354j1063q156K071P284K426j633J85M360O3r074j0516J890J3947J1771
2330A4653l020j3491j0057J546J0622R689m65p529n264L14J990j878k213M612
2344d91Q463J011j1357j2279P01J3777J2862n88j0788j0556j269P655O964Q98
2358E003l469j815M89k484o053k905Q063J3143L246j1066j4597k321J0389J2772
2372H395L596p231q705l040L048K700J19M29M186L638m564j0914n421Q799J4622
$$ plain form
2273 14656 3519 -10067 -15794 -8137 5389 12134 5533 -4680 -6288 -1101 1440 -1714 -1742 5563
2287 5563 10278 3835 -8938 -14509 -5960 7864 13426 5985 -6738 -13797 -7781 4298 10352 5852
2301 5852 -57 -322 1646 -2445 -7458 -4707 6985 14412 7858 -7788 -16269 -9979 4674 14452
2315 14452 11098 35 -8121 -6050 1234 3660 2027 2212 6572 6635 -2439 -12955 -11065 2882 14653
2330 14653 11633 -1858 -11915 -10369 253 9942 9477 1948 -3316 -3002 -1012 -2890 -5103 -491
2344 -491 7972 8983 -2374 -14653 -13952 -175 12687 12099 1311 -9245 -10514 -2859 4105 5003
2358 5003 1534 -281 208 -2276 -8329 -11234 -3171 9972 13218 2152 -12445 -14766 -4377 8395
2372 8395 11991 4760 -3945 -6985 -3937 -1237 -1118 -689 3497 7135 2571 -8343 -13764 -4965 9657
2387I657O004q514j3320n698O653J0001L270l515m675j791L36j485k195K057Q757
2402E542O865n070j2682q091O450J3956P762o057j1538o059K600O135K951l87
2416B377n21J043m62n396o366K475J1278R626l004j3184j0921K522J1532Q397
2430I396j678p599n081Q0J791P01L14M567N492M21r186r800j2J1493J1903O2j2043
2447H21j0901l67Q052O709R04l110j378j60j636m152o81O822R519J951r658j2954
2463a0219k888R685J2511K634q493r194k081M806L997J094J11K497J267m035q444
2478f752l436O711J1678M809q087j3491n439P309J0818L913m011n524j656J156
2492b002l52j535K293O603M212m795j1179p146N275J3001P710n340j1073n980
$$ plain form
2387 9657 15661 7147 -6173 -11871 -5218 4783 8053 4538 -137 -1928 -1592 -3077 -5272 -3215 5542
2402 5542 12407 7337 -5345 -13436 -6986 6970 14732 8675 -2863 -8922 -6322 -187 2764 2377
2416 2377 1856 2899 2437 -2959 -9325 -6850 4428 14054 11050 -2134 -13055 -10533 999 9396
2430 9396 7718 119 -4962 -4882 -3091 -2390 -2076 2491 7983 8404 -782 -10582 -10594 899 12802 12864 821
2447 821 -10080 -10447 -2395 4314 5218 2108 730 570 -1066 -5218 -5899 923 10442 12393 2735 -10219
2463 -10219 -13107 -3422 9089 11723 3230 -5964 -8045 -3239 758 1852 1963 4460 5727 1692 -6752
2478 -6752 -10188 -3477 8201 13010 4923 -8568 -14007 -6698 4120 8033 4022 -1502 -3158 -2002
2492 -2002 -2354 -3889 -1596 5007 9219 4424 -6755 -13901 -8626 4375 12085 6745 -4328 -10308
2506a0308L256P308L564r32j250R30p54m965n198K603R255P620k738j2282r563
2521a3454K994J1846Q733j638p767n310O85L242J033k87L132L691j004q241p874
2536a0219P17J0298J0808k68j0930j0043M46R009P625n24m031k826J29j455l319
2551d583J28N631P157Q92q574j1098j686J0282J1504K078q275r309j390N284M193
2566B234K55r79J483M45m144o263k311O493J0358M028p472j1665m032O934J0475
2581E839L470n101o005j633J292j85q22K408N007K793m601q693n225N457J2082
2596F083O370m814j1253o217L967Q075K965k134k016k92j275l896l173L841Q070
2611D301O041l227j0546p689K919J0185Q446j872r225n807J501L315R93j20L070
$$ plain form
2506 -10308 -7052 256 3820 2888 1638 2568 1814 -3151 -8349 -5746 3509 11129 8391 -3891 -13454
2521 -13454 -10460 1386 10119 8481 714 -4596 -3911 -669 364 77 3209 6900 5896 -2345 -10219
2536 -10219 -9502 796 11604 11336 406 -9637 -9191 -182 7443 6919 2888 62 191 -1264 -4583
2551 -4583 -4455 1176 8333 9225 651 -10447 -12133 -1851 9653 11731 3456 -5853 -7243 -1959 2234
2566 2234 2489 1510 2993 3438 -706 -6969 -9280 -2787 7571 11599 4127 -7538 -11570 -4636 5839
2581 5839 9309 4208 -1797 -3430 -2138 -2323 -3145 -737 4270 7063 2462 -6231 -11456 -5999 6083
2596 6083 12453 7639 -3614 -9831 -5864 2211 5176 3042 1026 734 -541 -4437 -7610 -3769 4301
2611 4301 10342 7115 -3431 -11120 -8201 1984 10430 8558 -667 -6474 -4973 -1658 -665 -785 2285
2626B285K511j638p031n633K351R160Q351p75r295r484p40Q663P321l70n427l170
2642b921K65J23j974M83N268O291k72q143q088j65Q175R469J809p390j0209k024
2658i303O143N627J007j898nJ003l264n421p77P422Q650J444p519r332l998N258
2674d963J0112M636m769p465k416K705J765r84J764M847L044m908q541l663N993
2689b843Q816M298m592q937o383L247Q245M689l295l355r48J013j374l863K325
2704b957P875M690n746r691m684L411J0135N470j083q395o385q8O690L349l57
2719B234p1K314q89p272n991K824J0092O444k305r601p289K07O843Q314J592n173
2735B273n238j55K080n73j190L150O229O58q245q726P64Q932O761Q86o462o130
$$ plain form
2626 2285 4796 3158 -3873 -9506 -7155 2005 10356 9581 286 -9198 -9938 -1275 6046 5676 249 -2921
2642 -2921 -2656 -2533 -4507 -4024 1244 7535 7263 -880 -8968 -9133 -958 8511 10320 2930 -7279 -9303
2658 -9303 -3160 2467 3474 1576 1571 2574 -690 -6111 -6888 534 9184 10628 3109 -6223 -10221 -4963
2674 -4963 5149 9785 5016 -2449 -4865 -2160 -395 -1379 385 5232 8276 3368 -5173 -8836 -2843
2689 -2843 5973 10271 5679 -3258 -9641 -6394 1851 6540 3245 -110 -1058 -45 -1419 -5282 -2957
2704 -2957 4918 9608 3862 -5829 -10513 -7102 3033 8503 7420 -975 -7360 -7448 -758 2591 2234
2719 2234 2163 4477 3588 -3684 -9675 -6851 3241 9685 7380 -2221 -9510 -9303 -2460 5854 7446 2273
2735 2273 -2965 -3120 -1040 -1613 -2803 347 6576 7234 -1011 -9737 -8973 -41 6720 7606 1144 -4986
2751d986k036M598O374J832m298k244J446j241l804j952N955Q338L5q236q859
2766i078o75P694P527L119m127o826l535J384M496J451k03J928J802l048r337
2781g428l825P043J0815L915o253q957l139K595O214M395K02m569k496m97M28
2796a557j941M01N305O036l492r082n334N449Q728M086l894n012m336N59M584
2811E00L565J91k588q5j390k392l766J642P920O821l538j0761o368M136P508N760
2827G155j81m411m490k293L97K576J678K131K607l71m771q181k61Q088R918j1
2843I580q485p600M37M023M200J435p75k216j801j211j318L30K451N605K582n544
2859A693r026k187Q650Q092J58o525n143j641J961L982J475J304n22p28l154l734
$$ plain form
2751 -4986 -7022 -2424 3950 5782 1484 -760 686 -555 -4359 -6311 -356 7982 8017 -219 -9078
2766 -9078 -9753 -2059 5468 8587 4460 -2366 -5901 -4517 -21 1430 1227 3155 4957 1909 -7428
2781 -7428 -11253 -4210 6605 10520 4267 -4690 -7829 -5234 980 5375 5577 1008 -1488 -1985 -1557
2796 -1557 -3498 -3097 2208 8244 4752 -4330 -9664 -4215 4513 8599 4705 -307 -4643 -4084 500
2811 500 4065 4256 1668 1583 193 -2199 -5965 -4323 3597 10418 6880 -3881 -10249 -6113 1395 7155
2827 7155 6974 2563 -1927 -4220 -3823 -1247 431 2562 5169 4798 27 -8154 -8415 -327 9591 9580
2843 9580 1095 -6505 -6068 -2045 2155 3590 2815 599 -1202 -2413 -3731 -3401 -950 4655 7237 1693
2859 1693 -7333 -9520 -870 7222 7380 855 -4288 -5929 -3968 14 1489 2793 2271 1543 -1611 -5345
2875e345q62M036Q401M220o314j1166l557P207P021K157k580k704k672j099m03
2890c660J596K731K862J803j182p178o265L145R764O470m007r159l645K822L817
2905h6Q86J535p9r62j951j989q08J567M192M518p08q070p109J982R452N823k889
2922E304o581k962R48J576J029K333K336L04k166m685l575M50O557P945M32q936
2938C09q415o6P231N889m69k244j130j269k261j425J656M309L412O96n026o598
2954e401k871N983Q357K327o043o834k59L682K686k99N45J190n23l093l758ML973
2971c34N502J938m013q034l973M930Q895K704m360n260r28Q05J32N60K614L259
2987D437N60m649o145j902L486P339N230k652q552n416K250O797L089r80j477
$$ plain form
2875 -5345 -6207 -2171 6230 10450 4136 -7030 -10587 -3380 3641 5798 3218 514 -2158 -3257 -3660
2890 -3660 -2064 667 3529 5332 4150 -3028 -9293 -6148 3616 10086 6079 -3080 -6725 -3903 -86
2905 -86 800 2335 2256 1294 -657 -2646 -3454 -1887 2305 6823 6115 -1955 -9064 -7082 2370 8193 5304
2922 5304 -1277 -4239 -3291 -1715 -686 1647 3983 4287 2121 -2564 -6139 -5689 868 8813 9245 309
2938 309 -8106 -8172 -941 4948 4479 2235 1105 -164 -2425 -3850 -2194 2115 5527 6223 1197 -5401
2954 -5401 -8272 -2289 6068 8395 2352 -4482 -4741 -1059 1627 1328 1873 3063 2540 -553 -4311 -4307 -334
2971 -334 5168 7106 3093 -4941 -8914 -3984 4911 7615 3255 -2005 -2933 -2128 -1996 -1436 1178 4437
2987 4437 4997 348 -5797 -7699 -4213 3126 8356 5704 -2848 -8264 -6014 783 3872 2892 1415
3002A415p51j007l584j596L184N912L114l127o406n168J615O918O091n99o218
3017b07m479R10L373J110l08Q29K434j268n615k819J851N907M939j852n325n944
3033f464o75O222O063L56m155k622l89j09o13J028L271L991j475n273n456j31
3049f431N810O568J739m944o645j823L156M463J255j557j10K45k812l778M0M792
3065c2N859J349n091o943k103M351O736K327k217n749k393J534J772M65P42K588
3081C195J036l375n210j926M101O742K988l599o448m037K177N245L907j169l028
3096E99j649l50j126r12K177M968K644k825p007l916K757O940M427j440n443m710
3112d866L3L630K381N40M31j06q28l471l414J714N816M786q57o827n633N53N209
$$ plain form
3002 1415 664 -343 -3927 -5523 -2339 3573 6687 3560 -2846 -8014 -6399 519 6610 6011 -207
3017 -207 -4686 -3776 -403 707 399 1228 3662 2394 -3221 -6040 -4189 1718 6657 4805 -520 -6464
3033 -6464 -7139 -917 5146 5502 1347 -1275 -1664 -1773 -2386 -1358 1913 5904 4429 -844 -6300 -6431
3049 -6431 -621 5947 7686 2742 -3903 -5726 -2570 1893 3148 1591 1481 1726 -1086 -4864 -4824 -32
3065 -32 5827 7176 2085 -4858 -6961 -2610 4126 6453 4236 -1513 -3906 -2372 -600 -135 607 3195
3081 3195 4231 856 -4354 -6280 -2179 4563 7551 3952 -2496 -6533 -4356 889 4796 3627 599
3096 599 -1050 -1400 -2526 -3438 -1261 3707 6351 3526 -3481 -7397 -4640 2300 6727 5287 -156 -4866
3112 -4866 -4833 -1203 1178 1718 2149 2043 1215 -2256 -5670 -3956 1860 6646 5789 -1038 -6671 -6118 -909
3129i09N316M86l872l205j022R58L57J349K332K338j014m270n107J51O007N864
3145E759M20n130n757j188L484M132J550r93j745q86j188j963J06L497N151J128
3161F377n570o338j244M345O309K270l192m794k170J482J979J399R35J255Q0k448
3177F75m949j484L996O324K339l682o325l303K599N507L116j105k898j987n56
3192a733m17J84K144L160K089k684o277k800K756O300M272j904n805l663P23M085
3208D30J912l36O03j351j009k477k179K261M750L765j998n631n142J441N198M715
3224D952k73l742l347o16Q73R43J901J519J090o66m169l975Q77M943N475j62m882
3241G41n543m19L524L968J431j441j709j264j634o04N92K802M270J12m816n109
$$ plain form
3129 -909 4407 4893 1021 -2184 -3206 -2248 -1891 -542 1790 4128 3114 -1156 -6263 -6112 -105 5759
3145 5759 6179 1049 -4708 -5896 -2412 1720 3270 2277 532 -354 -1542 -3505 -3399 98 5249 6377
3161 6377 807 -5531 -6775 -2430 3879 6149 2957 -1837 -4007 -2525 -546 853 1788 3043 3123 675
3177 675 -4274 -5758 -1762 4562 6901 3219 -3106 -6409 -3810 1697 4813 3708 810 -1177 -1733
3192 -1733 -2150 -1966 178 3338 5427 2743 -3534 -6334 -3578 2722 6994 5090 -715 -4378 -3655 430
3208 430 2342 2006 2609 1258 249 -2228 -4407 -2146 2604 6369 4371 -1260 -6402 -4961 237 4952
3224 4952 4679 937 -2410 -3026 -2153 -1210 691 2210 3300 2634 -1535 -5510 -4633 310 5785 5623 741
3241 741 -4802 -5221 -1697 2271 3702 2261 552 -712 -2346 -2950 -2358 444 4714 4826 10 -5099
3257e099j457N180N555J314k813n043j920J047K634J880P84O84j556k037k392
3272c239j351L680N308J312l079o705k527L677N346K820k686k924j856K25j55
3287b154J133J987J338J399l090l694k193K215N671L269j485o608k851J832L222
3302iK089O45j282k13k595j442j8K277K773K963m38o759l454J947M785M384k068
3319C585l008l412J630M38N65O96K481L41j880l229k360M61M714M403K35n628
3335C2n413J55M504M446L98k556k227q41n38l64J239L263K165o56l610m432j302
3352e737M417O156J307m215m846j585K581K212J090O27L67j122k612k244L45K808
3368d51L987J381k583n878k365K924N757J756j981l610j233L27J99R95J853J773
$$ plain form
3257 -5099 -6556 -1376 4179 5493 2680 -2363 -4283 -3236 -602 1278 2062 2746 1190 -847 -3239
3272 -3239 -4590 -910 4398 5710 2631 -4074 -6601 -2924 2422 5242 2556 -368 -2224 -1999 -2154
3287 -2154 -1021 966 2304 3703 613 -3081 -5274 -3059 2612 5881 4396 -2212 -5063 -3231 -9
3302 -9 2080 2725 1443 1230 -1365 -2807 -2825 -548 2225 5188 4750 -2009 -5463 -3516 1269 5653 3585
3319 3585 577 -2835 -1205 -767 -202 494 2975 3316 1436 -1793 -4153 -3692 1022 5425 5660 32
3335 32 -5381 -5226 -722 3724 4122 1566 -661 -1502 -2040 -2404 -1165 2098 4263 3607 -3 -4435 -5737
3352 -5737 -1320 4836 6143 1928 -2918 -4503 -1922 290 1380 2007 2374 1252 -1360 -3604 -3259 -451
3368 -451 3536 4917 2334 -3544 -5909 -2985 2772 4528 2547 -1063 -2296 -1969 -1770 -775 1078 2851
3384B851j147r65m848p30K263N010L050k107n646l399J798M594K597r51j236j141
3400gk261j535R92K001L436J510j677m318l460J062M762M612p37m076l785M64
3416c017K044R21N07J520Q52k116l227j384J564L780L117p73l741l652j181M464
3432c22L982P7k828k260nO7n14J219L175J319j394l916k917O56L782M162J130
3449E413l150n444k219L342L672J166n31n27r67k465j955P55L843L788j63l723
3465H35m065j742K209M484L365j557m321k235J217J309N60Q61J540M73k747l783
3481c597m89L587L642J046k161l859k567J031M112L280j169k798j692K26k78l74
3497b060J900L556J119l751m530j337K594M374K445m42l677m084o69K885L277
$$ plain form
3384 2851 1704 739 -4109 -4839 -2576 2434 5484 3377 -2269 -5668 -3870 724 3321 2370 1134 -7
3400 -7 -2268 -3803 -2811 -810 2626 4136 2459 -1859 -5319 -4257 505 5117 4380 304 -3481 -3017
3416 -3017 -973 -52 455 1975 2827 711 -2516 -3900 -2336 1444 4561 3788 47 -3605 -4786 -322
3432 -322 3660 3737 909 -1351 -1356 -1289 -1803 -584 2591 3910 2516 -1400 -4317 -3661 121 4283 5413
3449 5413 2263 -3181 -5400 -2058 1614 2780 2249 1722 755 -1710 -3665 -2910 933 4721 4558 835
3465 835 -3230 -4972 -2763 1721 5086 3529 -792 -3027 -1810 -501 59 920 2460 2933 186 -3597
3481 -3597 -4086 -499 3143 4189 2028 -1831 -4398 -3367 745 4025 2856 58 -1634 -1408 -1686 -2060
3497 -2060 -160 3396 4515 764 -3766 -5103 -2509 1865 4310 3868 191 -3893 -4562 -1677 1600
3512A600P34r48K51r14k947k559J796N121L076k200m160k804J07K462L718J237
3528C570j857l133q72R57Q58J70J077K254m87m169l027J351M519K686m81l188
3544B28l082j016J964L411K233j272k964p18l70m83J10K955L787p35m509m160
3560d621n2L918L939R95j262l247k790j51K486K529N67m28M6j225l939j400L643
3577i92M629J468l418l797j491J416K715K285K87j951k400q78J287N97M33J729
3593A919J093j543l771k428K793N130J262k155l344j845L67J381K801J324r16
3608B068k300j279p33k81J306L408K918j663n649l362K189M067K825o47j339k408
3624h80j902m38K085J877J081J87o26k552k274n56M079M334k71m161k918l02K279
$$ plain form
3512 1600 2334 1386 1637 723 -2224 -4783 -2987 2134 5210 3010 -1150 -3954 -3847 -1385 2333 3570
3528 3570 1713 -1420 -2292 -1335 -477 -307 770 3024 2537 -1632 -4659 -3308 1211 3897 3416 228
3544 228 -2854 -3870 -1906 1505 3738 2466 -498 -1216 -1586 -2069 -1959 996 4783 4048 -461 -4621
3560 -4621 -4673 -755 3184 4179 2917 -330 -3120 -3271 -785 1744 2311 1883 1929 704 -3235 -4635 -992
3577 -992 3637 5105 1687 -2110 -3601 -2185 530 2815 3102 1151 -1249 -2127 -840 -243 190 1919
3593 1919 3012 1469 -2302 -4730 -1937 3193 4455 2300 -1044 -2889 -2522 -1141 1660 2984 2068
3608 2068 -232 -1511 -2244 -2525 -1219 2189 5107 3444 -2205 -5567 -3378 689 3514 2867 1528 -880
3624 -880 -2782 -3220 -1135 742 1823 2010 1384 -1168 -3442 -3998 81 4415 4144 -17 -2935 -3237 -958
3641i58K267P61n78j239j248r81N22L17J977R41Q69k137m240k79L661L880L97
3658C932l691k188j171J117J339K227J502r13k482j422j060q60L173M875n04k108
3674A766m890k146K458M460J759j099j647j493j484M1J390L080L12j312m09k684
3690a898j620L20N160L125j881n381q90O5K216K237k87J556k216k120n0J74J740
3707B50K249O19r54l274k808M84M409K952m77l486k016j31J214Q57J721J390n50
3724B449k497j817r87P67L014K948j8l630l703l56L317K681P40r78k247p53j161
3741b231Q73J148J908J347j278j847l424k02L150L262J035k734l519k57J243J908
3757C82J087N15j24j576j856r01M82K762K151n5k218l278j788K784L546J540j976
$$ plain form
3641 -958 1309 2070 1492 253 -995 -1976 -1454 -1137 840 1781 2650 513 -3727 -4006 -345 3535 3932
3658 3932 241 -1947 -3118 -2001 -662 1565 3067 2154 -328 -1750 -2810 -3670 -497 4378 3874 1766
3674 1766 -3124 -5270 -2812 1648 3407 2308 661 -832 -2316 -2275 -885 2195 2507 1195 786 -1898
3690 -1898 -3518 -3198 1962 5087 3206 -2175 -3065 -3000 -784 1453 1166 2722 506 -1614 -1664 -1490 250
3707 250 2499 3118 2164 -1110 -3918 -3434 975 3927 3450 -36 -2052 -2183 -969 -112 1609 2999 2449
3724 2449 -48 -1865 -2852 -2085 929 3877 3859 229 -3474 -3830 -513 2168 2908 1930 -317 -1070 -2231
3741 -2231 -1358 -210 1698 3045 1767 -80 -3504 -3706 -556 2706 3741 1007 -2512 -2769 -1526 382
3757 382 1469 1984 1860 284 -1572 -2473 -1991 771 2922 2867 649 -2629 -4417 -1633 1913 3453 1477
3774A477k432j394j12J308Q37J915O93p86k038k345j62J640L241J261r21l547
3790a365k251R40L230J872o38o54j293q27j810O05J870K462N91j337k779k619
3806d003J707L216K776j105k613j773L68K08J693Q45M67k15j057k765n73J320
3822a504L078J921o75l166k838j69K908K591J080j556k218j431J10Q18J194J663
3838A806P15p18l079j995Q32K847K765M03k321l455p53J636K065J273J07j068
3854A060j545r76r09R56K391K275k82k448l252r31K491K988J441j251k636j627
3870b255K93J081J364J005L14m63j787k475L08J697L229J142j896l443j570J286
3886b170K462K126J70k140j657j75n71K49K197K435j381o71l159j386K029K847
$$ plain form
3774 1477 -955 -2349 -2461 -1153 -316 1599 2292 1506 -532 -2877 -3039 -1399 1842 3103 2182 -1365
3790 -1365 -3616 -2676 554 2426 1788 1134 -159 -986 -2796 -2191 -321 2141 2732 1395 -1384 -4003
3806 -4003 -2296 920 3696 2591 -22 -1795 -1427 -1219 474 1319 1786 1571 514 -2251 -2824 -1504
3822 -1504 1574 3495 2820 -346 -3184 -3353 -445 2146 3226 1670 -548 -1979 -1869 -1051 143 1806
3838 1806 2521 1803 -1276 -3271 -2439 408 3173 3576 1255 -2200 -2953 -1317 748 2021 2128 1060
3854 1060 -485 -1461 -2370 -1414 977 3252 2970 522 -2730 -3661 -1170 1818 3259 2008 -628 -2255
3870 -2255 -1962 -881 483 1488 1802 1339 -448 -2923 -2615 -918 2311 3453 1557 -1886 -3456 -2170
3886 -2170 292 2418 2588 448 -1209 -1384 -1955 -1706 491 2926 1545 874 -2285 -3671 -1642 1205
3902A205J880m96k832k465L21J599J591P93P3o47k258j257J79J012K824J871j216
3919B177l234k205K58K697K722p0j318k031j376Q69R97J260J258J04r71k427j677
3936b967P76K942K389j36k744k644l86J169K923J113q49j158j168r32k97J491
3952d78J869J372m61k518k464l68K458K829P73j414k401j405L85J890J411K54
3968A732J42j040j510j462j7J892K840M20k064k620j354J519J972K300m05j865
3984D80j585o91N28Q84J121J330M15k013k196j041J305K694J463p03k587j682
4000b278l2J429K334N83q05j110q68r26j38J174K147J228j171l051j391O0K979
4017A64K229n92q81k076q12K62J525J112M40l35j353j190j738Q94K365K887j808
$$ plain form
3902 1205 3085 2589 -243 -2708 -2387 -788 803 1596 1669 1022 -1236 -2493 -2314 -1302 1522 3393 2177
3919 2177 -1057 -3262 -3004 -307 2415 2345 1027 -1004 -2380 -1511 -514 746 2004 2108 1137 -1290 -2967
3936 -2967 -2191 751 3140 3004 260 -2384 -2770 -1601 1322 2435 1586 428 -740 -1672 -1969 -478
3952 -478 1391 2763 2302 -216 -2680 -3048 -590 2239 3012 1598 -803 -2208 -1823 67 1478 1732
3968 1732 1874 834 -676 -2138 -2155 -263 2577 2997 933 -1687 -3041 -1522 450 2750 2345 480
3984 480 -1105 -1796 -1268 -384 737 2067 2482 469 -1727 -2768 -1463 1231 2694 1991 -596 -2278
4000 -2278 -2310 -881 1453 2036 1231 121 -747 -1673 -1811 -637 1510 2738 1567 -1484 -2875 -2815 164
4017 164 2393 1801 920 -1156 -1968 -1706 -181 931 1371 1036 -317 -1507 -3245 -2351 14 2901 1093
4034A093j498j809m06J458K185Q99M58j561k132J41o33J741R02J288m76k349j811
4051b510j8K010K534K53j353j683j125Q9J695J576J62N7j605j501o31L99K407
4068G56J602K83j623l524n64J637L020J361j097k340q32q11P63J518J182J113
4084B444j085j528j459j096J519K926J652j286k681j541J47J518J445Q66k88j160
4100C93j482o72P28J220J731M19j318k054j591J034J940K327l83k307r28r24N30
4117a337R99J739M18o21j902j099o44R57K641J290j66k017l464k41K720L337n88
4134B022l88j616j651r02R04K124J083K96j225j778j940Q42J277L314L8k056j658
4151a314j123P93J682P64J90M15r05j578o86J152J752J064K64k338j198j545Q79
$$ plain form
4034 1093 -405 -2214 -2620 -1162 1023 1922 2380 819 -1313 -1172 -1805 -64 838 2126 1650 -699 -2510
4051 -2510 -2528 -518 2016 2269 916 -767 -1892 -1803 -108 1468 1630 1687 82 -1419 -2050 -1651 756
4068 756 2358 2641 1018 -2506 -3070 -1433 1587 2948 1851 -489 -1321 -2132 -1369 149 1331 2444
4084 2444 1359 -169 -1628 -2724 -1205 1721 3373 2087 -594 -2135 -1988 -470 975 1841 1553 393
4100 393 -1089 -1761 -1033 187 1918 2337 1019 -1035 -2626 -1592 348 2675 2292 -15 -943 -1867 -1337
4117 -1337 -338 1401 1819 1198 -704 -1803 -2447 -1490 1151 2441 2275 258 -3206 -3447 -727 2610 2022
4134 2022 1634 18 -1633 -2535 -1631 493 1576 1872 647 -1131 -3071 -2229 -952 2362 2400 344 -1314
4151 -1314 -2437 -1644 38 802 992 1407 502 -1076 -1762 -610 1142 2206 2470 132 -1066 -2611 -1732
4168a732L368R15k083r93j339LJ128Q38J915L02j096k593q88j18K197J300J249
4185B373l10l007k280K78K958J770qq81q28j193o08L66K013J469k6j626j818j122
4203b480N01K280K060J30k131j951PJ208Q20M69L42J93j604j384m62J667J605
4220A270O87r50j563j619M2J810K372Q91j862j981m61L21M58J385J115K42j619
4237E38k613k67Q32J797J576O82j587k398j403J429K503O83n20l94j005j069r29
4254b145N58K505J156k24k440r60k99O85J784J830r53k158j016L05J186N27N52
4271H93J69o08j290j425L38K477J427k99j753q17j223J84K423J618j31j961j195
4288a173m37K69N30J567J619k59k234k178J41J520J780Q96J04j771k419p67J990
$$ plain form
4168 -1732 1636 2551 468 -525 -1864 -1861 -733 105 2020 2322 1226 -1367 -2255 -2373 -176 1124 2373
4185 2373 2063 -944 -3224 -2946 12 1782 1774 893 65 -1128 -1736 -1370 643 2112 2086 460 -1358 -2480
4203 -2480 -1979 301 2361 2491 360 -1591 -1584 -376 444 913 1255 1448 -156 -1540 -2002 -335 1270
4220 1270 1957 1007 -556 -2175 -2133 -323 2049 2940 1078 -903 -1364 -1043 -585 800 1915 2157 538
4237 538 -2075 -2342 -1510 287 1863 2545 958 -1440 -2843 -1414 1089 1772 1252 858 -147 -1216 -2145
4254 -2145 -1587 918 2074 1850 -590 -1550 -1849 -1164 620 2450 1497 -661 -1677 -1372 -186 341 893
4271 893 1062 454 -836 -2261 -1923 554 1981 1682 -71 -888 -2111 -1927 496 2114 1983 22 -1173
4288 -1173 -1610 -1341 -811 756 2375 2116 -118 -2296 -2155 -635 1145 2041 2145 374 -2045 -2812 -822
4305h22J543P01m34m53o90j117j057J842K075R61j503j967r04L16J202J601N96
4322A890j069j858p77O18J180N48M69L33q29j809r37J353K293R74r14j744j399
4339a678j97P36K221J145o34j738j084R0j81J068J262J269m07k716j592N22J605
4356c09J794Q99j079j411j583J44J005K107K66p53o78r63j070n7J893J914k67
4373A852j503j616n40J063R52R06K30p67j805l95O52Q59J149M78l18j154j645
4390a602m10J319K138Q01j234j685q15k7P80J818J001r57j178j364j2N12Q56J624
4408A565L64j424k042j248J009K354J026L0j245j182q19L11J045J390K38o00p89
4425a7r52p54L60J877J652p44j704j894N06J265R16R82k71j174j123p61R44J112
$$ plain form
4305 -822 721 1422 988 535 -155 -1272 -2329 -487 1588 2549 1046 -921 -1825 -1509 -307 1294 1890
4322 1890 821 -1037 -1814 -1196 -16 532 1001 1334 505 -1304 -2241 -888 1405 2379 1465 -279 -1678
4339 -1678 -1875 -1139 1082 2227 1593 -145 -1229 -1139 -1320 -252 1010 2279 1872 -844 -2436 -1914 -309
4356 -309 1485 2384 1305 -106 -1689 -1545 -540 1567 1833 1080 402 -561 -1631 -1688 205 2119 1852
4373 1852 349 -1267 -1807 -744 208 1114 1344 577 -1228 -1623 -971 -112 1037 1515 1197 43 -1602
4390 -1602 -2012 -693 1445 2246 1012 -673 -1488 -1515 -735 1083 2084 1127 -51 -1415 -1427 -915 -59 1565
4408 1565 1929 505 -1537 -2785 -1776 578 1604 1634 389 -793 -1612 -1301 -256 1134 1372 772 -17
4425 -17 -969 -1723 -1363 514 2166 1422 -282 -2176 -1670 -405 511 1493 1222 48 -1075 -1836 -892 220
4443B20P10K47k31r15k110m17J750K712L84k096j083o01N07K69J680L44m40j146
4461b16j787L91M29J577J936n56j626j514K0N78K135L29j082p41k35j474L97K389
4479I50K33L06m40p56k178O31J641R64J422j313k277j104O97J220J116Q97r92
4496A017j340p75m50J049J251Q81k17p12j558j300J275J412J299J5j628j474k00
4513a455N08R94J200K49j062j257n72o19K094J92J809r17j729j578J400J49J766
4530A172K61l53k856L1J022m30O16J091N31M6j652j297O19Q01J762O28m22l707
4548b137M23j09P74J927J6J26k299M56m98P75J973r57J70q51j741N25K46J655
4566D74J998j560j601j244R59L79N67J928l95j359j455l41O76R40J100P11j093
$$ plain form
4443 220 930 1177 946 31 -2079 -2496 -746 1966 2350 254 -829 -1430 -923 -654 1026 1370 930 -216
4461 -216 -2003 -1612 -1183 394 2330 1774 148 -1366 -1346 -768 1367 1696 614 -127 -362 -1836 -1439 950
4479 950 1183 1489 1049 293 -1885 -1254 387 1351 2773 1460 -817 -1921 -1224 -4 1112 2009 1017
4496 1017 -323 -1098 -1548 -499 752 1633 1416 704 -854 -2154 -879 533 1832 1847 219 -1255 -1455
4513 -1455 -947 47 1247 1496 434 -823 -1395 -2014 80 272 2081 1164 -565 -2143 -743 -594 1172
4530 1172 1433 1080 -1776 -1745 -723 -1153 -537 554 1085 1131 -521 -1818 -1199 -398 1364 1992 1570 -2137
4548 -2137 -1714 -1823 -1049 878 894 1020 -1279 -823 -1321 -546 1427 470 640 -211 -1952 -1427 -1181 474
4566 474 2472 912 -689 -1933 -974 -595 -28 1900 1505 146 -1309 -1650 -974 -34 1066 1777 684
4583F84j391j200R49J687J36J83n93q84j736N84J470J028Q64l53j508r61o53Q68
4601h26J655R85l24j932j009l63J047J433M92k5l81j536l86l28J693J274K20p15
4619I74j635q49J38J449J202K39r65j102o19J21O04J143J45L04q58j046q60J293
4637c22R69m4J467k277j184oL10J658N08J26r23p43n35j32J058J384M13j129j299
4656g01r52n1J605J052L82m26j319j150K29J194O62P19l99m48j474j010J097J363
4674C73O73n5p11j726p37R15J987N16M52j309j331m25R60O05L22M90o59p06j260
4693a626L47Q63J240Q19j02j618p03n72J027R40P47q82l57j030p4L84J078Q53
4711A334j60q07j276p88O7J874R16N36j091j035j134M18Q15J225N20o26p02j563
$$ plain form
4583 684 -707 -1907 -958 729 865 1048 455 -429 -2165 -1581 -111 917 1781 1428 -80 -1041 -1694 -826
4601 -826 829 1814 1490 -442 -1451 -1814 -767 666 1158 1133 752 -784 -1170 -1498 195 1469 1689 974
4619 974 -661 -1510 -1372 77 1279 1518 553 -549 -1168 -1047 -443 700 845 1149 291 -755 -1615 -322
4637 -322 647 603 2070 -207 -1391 -1397 -1087 571 1079 1205 282 -461 -996 -1128 -70 1314 1727 598 -701
4656 -701 -1653 -1704 -99 953 1335 909 -410 -1560 -1331 -137 525 1244 845 397 -1077 -2087 -990 373
4674 373 1046 991 280 -1446 -2183 -1268 719 1235 1687 378 -953 -1378 -418 187 509 999 340 -366 -1626
4693 -1626 -1279 -416 824 1643 1541 -77 -780 -1352 -325 615 1362 480 123 -907 -981 -597 481 1334
4711 1334 1174 367 -909 -1697 -1630 244 1160 1696 605 -430 -1564 -1146 -331 894 1414 788 86 -1477
4729a477K16P61J271N88n2j514q63k06P92J175O14L9j228q00k13K03J176N51K49
4748A282o75j161j048O79J257J030K14r63q57r15j02J365P86M57p13q05r63p6
4766a208L40J600M59Q85k319j069j27N5J541J340m72r60p56O4r6K29J708j142
4784G2J061j690m62o74J451L28J003j079k47j277R6J145K172j303q4j014p14j99
4802a415J83J261J943m23j591j134n40N83J694N17L43k040k67p87K68R25J223
4819G43M19q59o03r68O89m1J160J151j065j073j281M74Q85P27J258o57j119m87
4837f47k96N20J182M03k44l05j337q95M10J256J454k51j198n04q92R83Q2J898
4855A619R5j285j243n24M26M72J222O26l3j541j006m1L66K234K04r67n63o82o95
$$ plain form
4729 -1477 -1261 -500 771 1359 1307 -207 -1070 -1276 -484 691 1305 1344 116 -684 -897 -694 482 1033 1282
4748 1282 607 -554 -1602 -923 334 1364 1578 615 -242 -1157 -1259 106 892 1349 636 -169 -1132 -1208
4766 -1208 -868 732 1191 2076 -243 -1312 -1439 -1384 157 1497 1025 65 -691 -627 -723 -494 1214 72
4784 72 1133 -557 -1019 -1693 -242 86 1089 10 -237 -1514 -1418 -273 1899 596 512 -502 -1216 -1415
4802 -1415 -1232 29 1972 1549 -42 -1176 -1716 -1133 561 1078 1421 -619 -886 -1673 -1405 -480 743
4819 743 1162 303 -300 -1268 -579 -620 540 1691 626 -447 -1728 -1254 -369 358 1616 959 -160 -647
4837 -647 -943 -423 759 1162 918 613 -724 -1619 -1209 47 1501 1250 52 -452 -1344 -361 -279 1619
4855 1619 1714 429 -814 -1338 -912 -440 782 1408 1375 -166 -1172 -1213 -847 1387 1591 624 61 -621 -1316
4874a316O96J080N85mp93m35o34J94r1J000J136p75j709J86L7O60R44N8K1r27
4894h7p50r9L80J377K14o07J12j142j036R82K36J963L67k373j308M65r7J419J038
4913A054J549k406j120Mj41L15J162O35k36j315j400J463Q71N43Q04k046j92m43
4931h99l61R42P38J464j018q19j076l34N31Q60O71J463k146j160J95K17J045N20
4949H33k34K8j90k138L22J996R01l54m92o84j433J018p42J639J121j947l36l88
4967a080R46L20M46J13J070k139k81r34Q86P47J103J43n70j337j330K90J937P55
4985A085Q5n63o21l31j030J027J192N36p14j008l35l1J30J185P72l67j152r13
5003a053K61N25O78K61K07k47j302o09N76J042M39K49q52j007k02J54R80J285
$$ plain form
4874 -1316 -620 460 1045 1041 248 -187 -821 -627 -718 282 1418 643 -1066 -880 -843 -183 761 819 840 -87
4894 -87 -837 -936 -556 821 1035 428 540 -602 -1638 -656 -420 1543 1910 -463 -1771 -1306 -1403 16 1054
4913 1054 2603 197 -923 -919 -1060 -745 417 1052 816 -499 -1899 -436 435 978 1782 -264 -456 -899
4931 -899 -1260 -318 420 1884 866 47 -1029 -1363 -832 28 699 2162 16 -1144 -949 -732 313 833
4949 833 599 627 437 -1701 -1379 617 1518 1164 672 -12 -1445 -427 -1169 470 1591 -356 -692 -1080
4967 -1080 -134 186 632 745 1815 -324 -605 -1539 -653 94 1197 1340 770 -567 -1897 -1607 330 1085
4985 1085 1170 607 -14 -345 -1375 -348 844 1380 666 -342 -677 -708 -578 607 1379 1012 -140 -1053
5003 -1053 -792 -267 411 672 879 632 -670 -1279 -703 339 778 1027 175 -832 -1034 -880 100 1385
5021A385Jq91j156o14N82O25O65N22j21j215j105lJ016R48L04P1q07j430n71J005
5041g89J172N50j86n27k78p39k28R67R94N17j298q34j48j30Q27R14K18j84j518
5060g00p66M95R83M27K07j31n32o97n95J146Q17M56k77j146m43m29J88J071J396
5079A470m99p48j131p0O84L2P06R41n85r76j211J33J070Q23M90m42q13q91o3R00
5099a80R68K68j89p12p39o41N79Q48J43M59j83j18p63L22j25J747K8j271n01j152
5119a212M57J207O22Jm13j034o96J69O55J261J20l30q11o40m63P94J011O48k85
5138A061j160p21j48K34J055M47K2m35j078o70L89J098P55J95m18p62j012M12
5156g36P00Q92l3l89m20j155P7P32J165K01l32q68n48k6L70P52M60k30q94p14
$$ plain form
5021 1385 1386 495 -661 -1275 -693 -68 597 1119 998 -217 -1322 -1325 -309 639 943 1014 207 -1223 -1794 -789
5041 -789 383 933 747 220 -58 -797 -1025 -58 936 1453 155 -679 -827 -957 -130 784 1002 818 -700
5060 -700 -1466 -971 12 439 646 515 -17 -714 -1309 -163 654 1110 833 -313 -756 -1185 -997 74 1470
5079 1470 971 223 -908 -978 -294 -262 444 1385 800 -176 -1387 -1254 -184 639 1129 687 -126 -1017 -1080 -180
5099 -180 788 1056 867 155 -584 -1225 -646 202 345 804 621 503 -260 62 -63 1684 1712 441 -60 -1212
5119 -1212 -755 452 1074 1075 662 -372 -1068 -899 -244 1017 1137 807 -4 -644 -1107 -313 698 1346 1061
5138 1061 -99 -820 -968 -734 321 768 790 355 -723 -1393 -1004 94 849 1044 626 -136 -1148 -736
5156 -736 -36 856 823 434 14 -1141 -1064 -332 833 1034 702 -166 -714 -740 -370 382 842 612 -282 -996
5176i96k13O93N23P33J94p81o23p86L22Q98Q09J60o65p53o57J74N08J269j02J100
5196A807k431l21K14J54J356P2o0q19p16k22L69J150M87l77o69m49n90J81J102
5215B38Q02j00n25q93n87J59P68P64M06l02j180n13J71P89O88P5j23p38q88L6
5235i53R10N29M81k48p57p63k78N66J039R00m43p92m77p23O3J096P77L64p90q69
5255c68o59M80P95M05J21k60q02q28J48P41O59O42k08p98p30l59L90Q59R59l97
5275G90m93q65m60P79N91M43J45n23r54o65K41J072M71L15m21q20k07p36J197
5294a00R25j21l95n45r86L68N46R11K46rq52p30m69Q14Q56M64K40j081o50n55
5314a123M59R49L41L55o05j399j77L94P60P72K10o17p72l43m6O14Q71K12Q8j244
$$ plain form
5176 -996 -1209 -516 7 740 934 153 -470 -1256 -934 -36 773 933 268 -485 -1142 -968 -460 809 707 1807
5196 1807 -624 -945 -731 -577 779 851 791 -28 -744 -966 -597 553 1040 663 -6 -455 -1045 -864 238
5215 238 1040 940 415 -478 -1065 -906 -138 626 1032 730 -450 -963 -792 -3 685 760 637 -101 -989 -953
5235 -953 -43 486 967 719 -38 -801 -1079 -513 526 1426 983 191 -286 -1009 -946 150 927 1291 501 -368
5255 -368 -1027 -547 248 653 774 514 -288 -1116 -968 -227 432 1074 866 68 -662 -1021 -631 228 1187 790
5275 790 297 -568 -1028 -249 342 785 930 407 -547 -1212 -971 101 572 887 466 -354 -561 -1297 -100
5294 -100 825 704 309 -236 -1222 -854 -308 603 849 840 -12 -742 -1211 -397 459 923 1163 82 -568 -1123
5314 -1123 -664 285 626 981 376 -1023 -1200 -806 -46 726 936 319 -453 -796 -842 -228 643 855 943 -301
5334c01n55J7N27O18N21l41m86k87m46m5J184L98j91n5j188l83K71R15L96O13
5354A182r01l80j003K46P07R70L60m43n33o47k48N02P32L50l24o81r77K92L66
5373d30P38L98J18p80n17l58K79O68J108n2j179q03j02K81Q72K69L94k38r97l58
5393f89J82J81J011M08o36n71p96K71N28N74N63r5j220n64j95N26R12L66K74p85
5413B45o54k69N6P80O17k9n13q26k03K4Q44N13K43l29o21p75j70Q36P88K24l00
5434D81q01p18J17N39Q15L47Pq11q19j99L78Q96N90J46p49r80k31N58L89P60J99
5455I14o18o56q22M36N82O03L85j94p49r31L91L59Q77K37m15o68l62L1J50P39
5475B89M91k40m60m94l83O72K57P08K6m39q29l47N3Q26P61k8m73o53n36j28R97
$$ plain form
5334 -301 -856 -839 -312 306 827 486 0 -287 -733 -778 406 804 613 558 -630 -1013 -742 173 569 1182
5354 1182 281 -99 -1102 -856 -149 821 1181 738 205 -442 -690 -188 544 894 570 -111 -1088 -796 -430
5373 -430 308 706 824 44 -473 -831 -552 116 1224 1172 -7 -810 -912 -631 241 510 904 666 -331 -689
5393 -689 -507 -326 685 1093 457 -114 -910 -639 -111 463 1026 931 -289 -853 -1048 -522 390 756 1030 245
5413 245 -409 -678 -622 158 775 746 233 -593 -796 -772 72 585 828 499 -122 -897 -1067 -231 557 781 481
5434 481 -320 -1038 -921 -382 433 780 787 -24 -843 -1042 -664 232 822 968 219 -761 -992 -434 -45 715 914
5455 914 296 -360 -1182 -746 -164 439 824 630 -119 -1050 -659 -300 577 814 399 -269 -631 -600 -450 289
5475 289 780 540 80 -414 -797 -125 132 840 866 427 -402 -749 -696 130 891 863 390 -263 -799 -927 70
5496G0O17KJ84j090k56j1O5J147L41l28p05r37M2M90M88Q01m5o80p10k97M37N59
5518A84M85k49q9o69m64M7P91P30m4l97o27m96j7N55P43O80k07j166m96j93Q87
5539a2L44O91j14j066o76l47N16J105K14Qn06m32o88Q3Q30R14J35r29l81k97l03
5560i11L98Q44N78l51o40m59p7N36K06L48J46q52o99k03Q48Q44O6l39l3n86p66
5581a102M02J126N24n35j80q67Q1J30L96P74N60q62r01p18M82N41N90O72m21o06
5601H6j031N7P28O87J72j19R2j006n30M15R30M62k0j144m15o7Q4N46O39L71n06
5622D31j034l04N37K83M78N41n30n18o95J34R01P37k29m07j21q60M6J49R86L25
5642H50k29n74o42p6J38R27L15M56j044j001m1M32Q18K75J09l03n86p82J09O78
$$ plain form
5496 70 687 689 873 -217 -473 -484 -419 728 1069 741 36 -901 -859 -369 119 920 875 195 -515 -812 -375 184
5518 184 669 420 331 -338 -802 -755 36 766 722 325 -302 -798 -815 -260 483 1163 956 -210 -706 -899 -12
5539 -12 332 1023 909 -157 -833 -1180 -664 441 655 663 157 -275 -963 -880 -50 864 999 70 -311 -608 -911
5560 -911 -513 331 909 558 -82 -541 -618 -82 124 472 618 -234 -933 -1136 -288 556 622 283 250 -336 -1102
5581 -1102 -700 426 950 415 235 -632 -551 -421 -25 749 1309 447 -454 -1172 -690 -149 441 1113 692 86
5601 86 -945 -888 -160 527 699 580 672 -334 -864 -449 481 943 923 -221 -636 -703 -619 -73 566 937 431
5622 431 -603 -907 -370 -87 391 932 402 -116 -811 -677 224 961 732 325 204 -656 -610 -461 525 850
5642 850 621 47 -595 -671 -533 394 709 1165 121 -880 -921 -489 329 604 713 410 -176 -958 -849 -171
5662a71Q49M0m02l76q14J03K99Q59L87j76p02m41J10j34N21O42K3p51l76k80N51
5683b39O77%P9O4j056m17J04R91J13o3r6m28m69J70N25N75K17j2r18m91K04L18
5705a52M22P7J27n33r72K80N69L64M02R1j24r85n55J81O85P60Q4n38m30n16J32
5726f31L52P87L91n49p29o34M33M47J17J064m74p07o54J55M88M81N16l62k36q97
5746f42j87L16Q85N53m07o02k42m9j95M70J019K06q89q76K52k87M34J007J18q9
5766G95r74q33L17P74K99L08j74m59m59k71L49M69N28j54j02n32k38k66N67R79
5786I23L03j133l50j55j21M82P32L9o22k94n96J66O51O85k10j09o09m08l12N85
5806c53R59J72l21n74m45n18K65P67P36l7l70q41J33j56O43O54L3n49m97n77q
$$ plain form
5662 -171 678 718 316 -60 -874 -771 -472 387 774 598 -104 -545 -435 -569 -48 594 617 -134 -510 -790 -239
5683 -239 438 438 517 581 -475 -892 -788 203 316 253 157 -271 -740 -570 -45 530 747 735 -183 -674 -470 -152
5705 -152 270 347 474 -59 -1031 -751 -182 182 584 675 551 -434 -989 -808 -123 637 721 183 -247 -763 -631
5726 -631 -279 508 899 350 -379 -1013 -580 -133 -16 1048 574 -133 -787 -632 -144 337 853 491 255 -642
5746 -642 -829 -513 372 925 518 -84 -326 -375 -570 -100 919 1125 236 -640 -388 -675 -241 766 884 795
5766 795 -179 -1012 -695 79 378 686 512 53 -406 -677 -328 141 669 515 413 -119 -357 -623 -56 923
5786 923 1226 93 -257 -412 -533 -51 681 720 98 -196 -792 -626 25 710 500 391 -218 -626 -938 -353
5806 -353 606 778 457 -117 -562 -1080 -815 -48 688 651 281 -560 -427 -583 60 714 747 198 -299 -876 -884
5827h84O91O17L4L45r12n88m5M26N51N47k4q61n03k62L98Q16N10k21n07r93J21
5848g44K26Q83M12r7k31p13m03K72M25O67N3k59r16l48j04P56Q90l45k99k68l31
5869d74l3J77R20L01k79n02q41p3K17P50L05R8k79q97k74N01L24P49q6k27l77
5890@o32n0O33P85j21l64p66k71K36L22Q60L28n13p38k10k36N38O74J43J25o39
5911A04p96J0R2O70P57j26p31o61L08k33R86K00j07j8j066J2K7N45O94J34m52
5932C49l93o20o0N20M82N52j38r69l37J6l7R05O92k76m50q47j14K93L96O23N2
5953F39m79p48j37J84L59R51k26n13k34m19J01M72N30J79o16l57k20O05n31J051
5973E91K28l66Po97n01L01J28O39L71p3j207K98j55O01N88j81l78j15o04o50P00
$$ plain form
5827 -884 -193 424 458 803 -109 -697 -742 -316 235 782 758 -103 -606 -868 -470 346 856 635 128 -865 -744
5848 -744 -518 365 777 680 449 -264 -667 -395 30 697 750 491 -425 -773 -877 -121 769 424 125 -143 -474
5869 -474 -507 -330 590 891 612 110 -731 -804 -587 163 468 566 287 -610 -884 -383 -59 690 604 377 0
5890 0 -632 -682 -49 736 615 251 -515 -786 -550 -228 632 960 447 -291 -501 -737 -199 475 618 743 104
5911 104 -692 -682 -590 80 837 711 -20 -681 -373 -606 380 580 473 455 -611 -599 -572 -27 667 801 349
5932 349 -44 -664 -724 -204 278 830 692 -277 -614 -598 -635 270 962 686 236 -611 -725 -432 -36 587 639
5953 639 160 -588 -725 -541 -182 769 543 30 -204 -623 -522 -50 480 659 43 -314 -534 71 -460 591
5973 591 819 453 460 -237 -738 -437 -309 330 701 628 -579 -281 -436 165 753 572 194 79 -525 -1175 -475
5994d75R83r2q5o98O76j464Q58J029m72N54r52q14k04J519N85n15L01r19J41j640
6014a684J295P19Q56n74p60j32j41j23Q05R18j5o89p22p25L68k09J490J70j17
6033G30r26p15N78O15L16K50p25r6q4j216J453P40j150R81l85N34j925J847o06
6052B16O87j89j41K02j233J412p87P89j035J367p14j134L82l9J672q02p50K74
6070A77p11m41N05R08N66n43J68j743LJ181j19L66L11j27o3j124j26M47J993k548
6090i20J364k35p33J98L10P93J71n49n82l91j45Q46J46O6K40m98o72p2M52K44
6110C3K29L78m53m54m05Q8M73P84R0m24p35k56L25L79O54K23q32j06o97L68K48
6131i0M86N3K02n98k69n18M91R29j92Q03j371l7p95J039k09M74R42q30o98n78
$$ plain form
5994 -475 508 416 331 -367 309 -1155 -297 732 260 814 -138 -952 -1156 363 948 433 734 -185 -44 -1684
6014 -1684 -389 330 1186 612 -148 -280 -421 -544 261 1179 1164 475 -247 -972 -604 -813 677 847 730
6033 730 -196 -911 -333 282 598 848 123 27 -57 -1273 180 920 -230 751 366 900 -1025 822 216
6052 216 903 714 573 775 -458 954 167 956 -79 1288 574 -560 -178 -217 1455 653 -97 177
6070 177 -534 -975 -470 438 1004 461 629 -1114 -1111 70 -49 317 628 501 438 -686 -812 -365 1628 -920
6090 -920 444 209 -524 -326 -16 777 948 399 -183 -574 -719 127 273 339 579 81 -591 -663 -211 33
6110 33 262 640 187 -267 -672 -584 -111 673 763 339 -396 -652 -327 52 706 929 97 -9 -706 -338 -90
6131 -90 396 449 651 53 -216 -734 -243 686 494 1297 -74 -111 -906 133 -76 398 1340 510 -188 -766
6151g66K65J29L80M27q97K9k07L29J04K98J220j091r15M20q95J303J062j043N67
6170G19n59m6j592Q37J103P2j89k58k69m54O15L47N30n63k83m16j0R7o5N60M21
6191E97j109k44L16L60j117J694K82m87j19j032L61J41R94j21j15m65k07k27L75
6210a23M97K66l33p04p6j08L22M02Q96o83J56j587M31P9N12N29l8j49k87n70l24
6231h92O63N76K71m33l66l76k05M38Q14J06k44k31p94K05J57N46K58j4k87m25
6251b33m88K68P82R0k0m55k69k35K12K48Q98j25p26j31l73J44K83N51p5K33n82
6272cn64M6K56N10M93m56k0p92j78O52L56J76j17N2l78k75l68O48P49L5p41M8
6294A29o80J40M41K51P9L72q53k16o4K18L49K69Q9l94n20k33L71N25J85l42k86
$$ plain form
6151 -766 -501 -372 8 435 -462 -433 -640 -311 -207 91 1311 220 -695 -275 -1170 133 1195 152 719
6170 719 160 114 -1478 -641 462 534 345 87 -182 -636 -21 326 856 293 10 -406 -416 -319 -384 176 597
6191 597 -512 -756 -440 -80 -1197 497 779 292 173 -859 -498 -357 637 516 401 -64 -271 -498 -123
6210 -123 374 640 307 -397 -473 -581 -259 143 1039 356 512 -1075 -644 -565 -53 476 438 289 2 -568 -892
6231 -892 -229 347 618 185 -181 -557 -762 -324 490 596 352 121 -673 -468 -311 235 493 479 192 -233
6251 -233 -721 -453 329 419 399 -56 -325 -560 -348 -100 798 673 -53 -184 -557 -413 -130 421 346 579 -3
6272 -3 -567 -521 -265 245 738 282 262 -530 -708 -56 300 476 359 411 33 -242 -610 38 787 822 81 129
6294 129 -551 -411 30 281 360 732 -121 -337 -401 -183 166 435 524 130 -390 -623 -252 273 458 116 -170
6315a70j56l16M29L73P24k04r61M5l14M8N42N00j65k7n61n92M83K68N31p9K79
6336F77o42p44j9K03Q93K97j99n19l03m69O8R00L12Nm92j59k62j6N43K27L21n71
6358E1m05l26N53J59K40J7K24p47k23l99R23M51N0l47l64j17m67O36L98J77j4
6379D70o58j31J2m6L92M04J49j34q48l12K21N26L77J68m96k44k08j30L51L81K93
6400E37j56k26k91k62K31M20K21o7l57l82No6J95P29n2m39m28j40N19R0J49K01
6422D31o7m78m88NN91M72n8j53l95o23K78M99M06J91l48n14j69k52M94M01N86
6443H09R3j080n66J15N15O49n17J57j06l21l11j0J036p7L00l0q65n61L90M35M22
6464D77L08k74q34J23R20l42Q32j051M67l30j509J102q7N09k19l28K03L44j605
$$ plain form
6315 -170 -326 -642 -213 160 884 680 -281 -236 -550 -502 40 540 375 348 -213 -805 -322 -54 477 398 677
6336 677 35 -709 -728 -525 368 665 466 -53 -356 -825 -757 143 455 460 -32 -191 -453 -469 74 301 622 51
6358 51 -354 -680 -127 32 272 289 513 -234 -457 -856 67 518 568 221 -143 -260 -727 -91 307 484 470
6379 470 -188 -319 -307 -353 39 443 592 458 -390 -702 -481 45 422 590 94 -150 -358 -488 -137 244 537
6400 537 381 155 -136 -398 -167 253 474 407 50 -332 -327 -393 -198 531 479 40 -388 -528 -9 81 230 431
6422 431 364 -114 -602 -597 -6 466 408 255 -140 -763 -485 14 420 611 263 -251 -420 -672 -178 223 809
6443 809 902 -178 -744 -629 -114 535 18 175 69 -252 -563 -573 463 386 686 656 -209 -770 -380 55 477
6464 477 785 511 -323 -200 720 378 1210 159 626 296 -1213 -111 -198 311 92 -236 -33 311 -1294
6483a294Q75Q93M59q02l41m85N90o22J54P83J078j171j4j115J268q6K56L89m14
6502D01K87r81j62J0K00R46n15RM3m40K19N02l62K25q4m84l42K14M84L16L24o7
6524G43q67l03k4L19O2L22K54J66n82o47P58r8R49j183Q9p1K09o7K26K36L64o34
6546B21m88m73P77l00K70N0K05j003J72k86P44j29P03K53o18mM5M3L06p17L21
6567I2n41j03l60R33P62K6o7j610k4K61R00J51R65j122n90L10L1k19p8J301K1
6588A039p00k95m18o0j06L25L06K1j14q76Q31p4L17L49k10m95K06l33l6K46L78
6609C01K5l95k89j04K04M81J98j01m63j37j75J83K28M08l5Q1o50o97Q44j8L14
6630B03L12k85m58k68p8Q82O6K37j3p22l65l62N35O66K76k55l09m02k43L40K64
$$ plain form
6483 -1294 -419 474 933 131 -210 -695 -105 -727 -573 210 1288 117 103 -1012 256 170 426 815 401
6502 401 688 -293 -455 -445 -245 701 186 195 238 -202 17 519 157 382 298 -186 -528 -314 170 486 810 743
6524 743 -124 -427 -451 -132 -70 252 506 672 90 -557 201 103 1052 -131 -42 -113 96 29 255 491 855 221
6546 221 -267 -740 37 -263 7 57 262 -741 -569 -855 -111 -240 463 716 98 94 139 182 488 -229 92
6567 92 -449 -552 -912 21 783 809 742 -868 -892 -631 269 420 1385 263 -327 -17 14 -205 -283 1018 1039
6588 1039 339 44 -374 -434 -540 -215 91 112 -2 -878 -47 -121 196 545 335 -160 46 -287 -323 -77 301
6609 301 326 -69 -358 -462 -258 223 421 320 -143 -280 -455 -272 -44 364 329 410 -240 -937 -93 -111 203
6630 203 515 230 -228 -496 -574 308 374 611 598 -124 -489 -851 -316 350 626 371 62 -340 -583 -243 21
6651B1M36r2m89k90k0M6K33N90K38k62m33o8n41J034j44L34m80l57k41k46N72
6672a59N39J77p48J6j089R83M93j92m7P64n65K85j249J026q6L3q1L98l88o12j7
6693e19P71P6J12J57j108O9J18R5M23M52k29k39q00R6J6O03J56J26l55k61n98
6714h39N61L89M35l36k43n36j34J31J253n80R94n35j686O70n03N71L02MK90K2
6734B30k05j73k99M87L76l99k18M9j39q5O40R7L4j19m82l92K25O54Q7j515R47
6755b00J97m57L10k49J450p54J97m74n02j54L93K48N95l20m18j97J14Q9M17j15
6775A70mj55J28n26K55K32M99o4l99m85k3J39Q79K43j34m95lj079J232r63L42
6796b11N51n46J01m29n00M24J049k70K43k33Ro52J126j189Q74p10j15m53K66N74
$$ plain form
6651 21 457 365 -124 -414 -434 -388 -155 435 673 411 -22 -90 -631 403 259 593 113 -244 -485 -731 -159
6672 -159 380 557 -191 -175 -1264 -281 212 20 -27 737 172 457 -792 234 148 181 100 498 110 -502 -519
6693 -519 252 328 440 597 -511 -442 -324 -229 194 646 417 178 -622 -526 -510 93 249 375 20 -241 -839
6714 -839 -278 111 546 210 -33 -569 -703 -572 681 101 1095 560 -1126 -456 -959 -388 -86 -82 208 230
6734 230 25 -148 -447 40 416 17 -201 -152 -291 -376 264 361 395 276 -206 -598 -373 281 368 -1147 -200
6755 -200 -3 -460 -150 -399 1051 297 494 20 -482 -636 -243 5 600 280 -138 -335 -221 -132 285 170
6775 170 166 11 139 -387 -132 100 599 535 136 -349 -372 -233 646 889 755 260 257 -822 410 -553 -211
6796 -211 340 -206 -105 -534 -1034 -610 439 169 412 179 188 -464 662 -527 347 -363 -478 -931 -665 -91
6816i1N1O23l91k92l11n20P63R54n97O26k62p56n29L16K54M28J96k93l1k94l49
6837e05N62J0N00l47l32q9j95M2O41K27p2l22l11k16K05L12J78Oj11j08j45l18
6859c88K17O22Q4m16j88k24j81L91M45K43p2n27n25J82J9L79m6L19n08J2m57N24
6881i5M39Qk45m04k48j70M57k7J82O59j009M19j30n17M3J828n94j040j80j51K04
6902e71M01K63K85j63k1p05J43k4J005k00o7k76l25K24l17K73N36J11k49l36l35
6923c48L29m5K05M65J6o71o31M63n4N95m2k19J28l62j54L43L79J15n95O2k11k21
6945d53M44M1M89j70m55m73J89j4L18N01P1k18m48m46P1N83K35j03n9j77j33m24
6967f31L11O96K79n14l93J05k02o5M64L19J54p94L26r9k8J03L03L15j41l84j249
$$ plain form
6816 -91 -40 583 192 -100 -411 -931 -168 786 189 815 553 -203 -732 -416 -162 266 462 169 138 -156 -505
6837 -505 57 67 567 220 -112 -201 -396 -354 287 514 442 120 -191 -407 -202 110 288 294 183 75 -70 -388
6859 -388 -171 451 535 119 -69 -293 -474 -83 362 605 533 6 -519 -337 -318 61 15 334 -174 -162 -619 -95
6881 -95 344 352 107 -297 -545 -715 -258 -285 -103 556 -453 -34 -164 -681 -638 1190 596 -444 -624 -775 -571
6902 -571 -170 93 378 215 194 -511 -368 -392 613 413 346 70 -255 -31 -348 -75 461 572 323 -13 -348
6923 -348 -19 -64 141 606 622 -49 -680 -217 -271 324 282 63 191 -171 -325 18 397 512 -83 -21 -232 -453
6945 -453 -9 32 521 351 -104 -577 -388 -402 -84 417 488 270 -178 -624 -553 30 265 162 103 -74 -207 -631
6967 -631 -320 376 655 141 -252 -147 -349 -414 50 369 523 -271 55 -44 -72 31 334 649 508 124 -1125
6988a125P22P95n92Q86j245L87K1n94R86M98n57R3m60k70L6J15O48J99j87m58
7008a02k03j78P1N59K07R1k88l26j48j17L87M43j11k68j26k88P7j57O59J93l97
7029b2J2j22k00L02K04J67j04j85k94r7J37K64J81K28l11l19Rj26N46K72n03J50
7051A89l51n13L29M67L60j03j7N13j305M01M49k54M21k93l43k87P8M47j5K74J12
7072E59m24o73m8M81L52o4J52k05k43q6j03L10L73Pm43Q7m87L26J86k7N25m32
7094A23K0m05L3N68j65K14k66p0m53K45K04J42J69j87k76k08O2j05P00P9k14l0
7116A80o16J79N9J14K42L31l52l81j34R0L55J44K66Km05n93j37O07J87K15p1l40
7138e8o5l09K67J69M45n6q44O08l56j18N23K3K85k77j311L46O58M56k67l52K00
$$ plain form
6988 -1125 -403 392 -200 686 -559 -172 -151 -745 241 739 182 275 -185 -455 -419 -304 344 543 356 -102
7008 -102 -305 -483 -412 147 354 445 157 -169 -317 -434 -47 396 285 17 -109 -397 -320 -477 182 375 -22
7029 -22 -10 -132 -332 -30 174 341 237 52 -242 -339 -202 62 243 471 160 -159 -150 -276 270 542 39 189
7051 189 -162 -675 -346 121 481 378 361 874 -431 -30 419 165 586 293 -50 -337 -259 188 173 447 559
7072 559 135 -538 -586 -105 247 183 335 130 -113 -199 -302 8 381 388 -55 32 -455 -129 57 30 555 123
7094 123 143 -262 -229 339 174 388 122 52 -401 -156 48 190 359 172 -104 -312 -250 -355 345 424 210 180
7116 180 -436 -257 -198 -84 158 489 137 -244 -378 -288 67 211 477 479 74 -519 -656 -49 138 353 282 -58
7138 -58 -123 -432 -165 4 449 393 -451 157 -199 -317 206 229 514 237 -1074 -728 -70 386 119 -233 -33
7159c3l3j53k03P41O88q56J80l80Ro10M50L96O67o2m42r78L74J178j152k91O98
7180A88m13k7l64J11N27N81n47p71j65N0J428m92n84J85L83L60q41p41Q29K00
7200a03Q62q95k62N27m91j96P73K0R12j591j55J9J231m55J15N09j792L27O6J020
7220D41n12P63j027L08l44j93P14m25J81o3P60n50n23R36l65O5K89P43j391J43
7240e0n67L12N94K45k6j222K58j447K434p41J493P0j269o36L2k31J384J73p97
7259Ik35K82k21O10J197n55m42m15r66J045o14m46J714m32l06p76J06R60k06O49
7279I58q59J111j913M80q01o27J539J091O67j684m83k54L76O19Q18j043J012j421
7297d14m13J399o20J37M50l20J58j557P00K23k22J186K96k037O7L99k41O61j19
$$ plain form
7159 -33 -66 -219 -422 319 1007 151 331 -49 -40 -650 -200 196 863 801 359 -619 -245 933 -219 -510 188
7180 188 -225 -252 -616 -505 22 603 56 -715 -880 -830 598 106 -478 -293 90 450 -391 -1132 -303 -103
7200 -103 759 -136 -398 129 -362 -558 215 235 1147 -444 -599 -580 651 196 311 820 -972 -645 -579 441
7220 441 -71 692 -335 -27 -371 -564 150 -275 -94 -157 603 53 -470 466 101 166 455 1198 -193 -50
7240 -50 -617 -305 289 534 508 -714 -456 -1903 531 -210 1283 1353 84 -552 -520 -751 633 806 9
7259 9 -226 56 -165 445 1642 1087 645 230 -736 309 -305 -751 963 531 225 -551 -445 515 309 958
7279 958 99 1210 -703 -223 -1024 -1651 -112 979 1646 -38 -521 -775 -399 220 1038 -5 1007 -414
7297 -414 -827 572 -48 89 539 219 377 -1180 -480 -257 -479 707 1003 -1034 -967 -568 -809 -148 -267
7316b67M03K7p53J06L78L28M33J77p39J1j3n35N96pj94L27m26l11m9L87j1J181
7338A049o65m03j244Q48J129n4j275N38K43N38p70L40K42k02j04k33N91r49n8
7357d39J68P43L0l04l45m54O09M12l68l0Q87j488J51L8L26q7J008k88m75o01j98
7378g05O20l30O6J148n57k70l57J71M80j85k72k16L54k28K71k09L30J44K95j04
7398D46n70m30P63m96L17M97q17J9N8R24o96O40n76O3q84l32P71O86M14j312N92
7419G7l4k53k96Q23K40l80n6k44J5J05M3O2K40k21N5l05K05k72K62oJ28j91j43
7442a46m4k9K67n4L59r1l63K9l89L87M52k07j2po17J0J056j001N30j44K9k49p60
7465i94Q14K76M48L00p49J69n16L07j61K03J78k20o51J87j6M14J09K14k67k52
$$ plain form
7316 -267 136 163 -590 -484 -106 222 655 832 93 104 91 -444 152 145 -49 278 -148 -459 -508 -121 -132 1049
7338 1049 384 -19 -1263 -415 714 660 -615 -77 166 704 -66 274 516 314 210 -23 568 -381 -439
7357 -439 -271 472 502 198 -147 -601 8 420 52 22 909 -579 -428 -390 -64 -151 857 569 94 -507 -705
7378 -705 -85 -415 -349 799 242 -28 -385 -214 266 81 -191 -407 -53 -281 -10 -219 111 255 550 446
7398 446 -124 -554 209 -287 30 527 -290 -271 -213 711 15 655 79 142 -742 -1074 -303 383 797 -515 77
7419 77 43 -210 -506 317 557 177 121 -123 -108 -3 40 102 342 121 176 -129 76 -196 66 60 188 -3 -146
7442 -146 -190 -219 48 -6 353 262 -101 -72 -461 -74 378 171 159 152 -465 -455 601 -400 130 -14 15 -234 -994
7465 -994 -180 96 544 844 95 264 -252 55 -106 97 275 55 -596 -409 -425 -11 98 312 45 -207
7485b07J12k06N20J1J39o9m24k53J32K69L93m80K76j12m57J81k13O79j60J45K5
7506C01o03L88k00N0J20M08m17k50q8J70J2L49K13n52K01k44l45O18L5p9P2l98
7528b39j02r8L17N72q9j61k55j34k08K20K28J30j34o1j80n1n2K34N57j37j74k45
7550f2l55K49M47J87n13K12j80r9j47M54QM7P8j29m67O7K20N1L48q4l52k31L26
7573G5l00K95M44m20N6m01l4j33P98K4l01O7l06j59L0M77q9J42K2m82m0J57o5
7596a43L68n5O1m69J28l18L11J62L47n08R8l99J4K78L71j69M8L7l15j01m3M75
7618A78K5J60m79q1j10L33j47N62p7m48j89%L5K03J66L18m31P3n98L67J16J20
7640I6j2r9l4P3k33n93Q11j46l58K26K8J64k21K61KM40o90k1k13J5N92Q0K97L5
$$ plain form
7485 -207 -95 -301 219 230 369 300 -124 -377 -245 24 417 -63 213 101 -356 -175 -388 291 131 276 301
7506 301 -302 86 -114 -64 56 464 47 -203 -291 -121 -109 240 453 -99 102 -142 -487 131 166 87 159 -239
7528 -239 -341 -439 -122 450 361 200 -55 -189 -397 -177 51 181 47 -14 -194 -245 -297 -63 494 357 183 -62
7550 -62 -417 -168 279 466 -47 165 -15 -114 -261 193 201 248 326 197 -270 -203 17 68 416 332 -20 -251 75
7573 75 -225 70 514 94 150 -251 -285 -418 380 404 103 170 -136 -295 -265 212 123 265 287 -195 -235 -78 -143
7596 -143 225 170 231 -238 -110 -428 -117 45 392 -116 -18 -417 -403 -125 246 77 125 162 -153 -254 -297 178
7618 178 203 363 -116 -197 -307 26 -121 441 364 -84 -273 -273 -238 -35 131 449 18 91 -507 -140 -24 96
7640 96 84 -15 -49 24 -209 -802 9 -137 -495 -269 -241 -77 -298 -37 -35 405 -285 -306 -519 -504 88 168 465 500
7664E00l90m77r3M51N38J33j11o97k63R2P0N55J91j90n16k91P27L41l33l67O14
7685D84o80N16q27R01j81K15q09r1n03J550r62O41m89J73R91j78Q5j131M65n73
7705d03J18N37m70qk17L55K46K3p9K75k10m18K50L0R2J06K0j93m08Q7J37L35J65
7728C70m33j29l21J97L52O2M18l01m40j12L0j14L55L16r6j50p06L52K45J17J00
7749A12Q9K2m43k22p4M25O7K67k68k2l35P3L73N5j32Q6J27k53J05K0J05l62J60
7772b5k11r9J20k28O76L11p70N97q92O4O58K17L28n12o9l23p0m40O95k14O57m95
7794b5k7J5l22O45k12N31n40N2n91J230m15r27pJ187n02m56M64L18p27J025r39
7815b23k52N28k43N2K18L43n85N82j017J99O02K63m20L93o91Ol29l94J145m92
$$ plain form
7664 500 110 -367 -460 -9 529 662 551 -146 -409 -317 -247 308 499 309 -207 -498 229 570 237 -130 484
7685 484 -196 320 -507 394 213 428 -381 -472 -975 575 -387 254 -235 -62 929 751 836 -295 170 -403
7705 -403 -285 252 -218 -226 -443 -88 158 181 102 377 167 -251 -1 29 121 227 247 54 -354 -267 -130 205 370
7728 370 -63 -192 -513 -316 36 98 516 215 -225 -337 -307 -421 -66 250 154 4 -702 -350 -105 12 112
7749 112 201 223 -220 -442 -516 -91 -24 243 -25 -47 -382 -309 64 119 -13 73 200 -53 52 72 177 -185 -25
7772 -25 -236 -335 -215 -443 233 544 -226 371 -521 -457 201 418 746 234 165 -158 -228 -668 27 -187 470 -25
7794 -25 -52 -37 -359 286 74 605 65 117 -474 756 341 -586 -593 594 92 -364 100 418 -309 716 -223
7815 -223 -475 53 -190 -138 80 423 -162 420 -597 -398 204 467 47 440 -251 -245 -574 -968 177 -315
7835c15L22n80j27q76J014O80L10p12Q83j191Q27n40Q1l77J326p31J10k80o10
7854g86J02Q01M25j3j55j372J010n54L21N44K1R66j681k43j273J029R10O52k29
7873D75j143O69j183N11P89l46O52P10n46q42l13K86Q97p35n8p43L92M25j26k20
7893d49L64Q77L21j173m70L07K78K92q3q89J79Q09j31O37j08p73j30J45l86J52
7913b31j60Q79k22j19j42l32k21K23J602l32j506R93r55O55j89k45P83q54J47
7932b26P63r22j34N36M36K96j493N76o65O07L78N19k24J39l18J1k48M74l51l50
7952a96K55M83p28k36L37k0L96n38K28j77J15KQ03k37n28k10r2J53J85L1M78n70
7974f6k53o20M65L14J458n98n90k47L34o21n65P11M95N52o81M02j2o00k14M45
$$ plain form
7835 -315 7 -573 -700 -1576 -562 118 428 -284 599 -592 235 -305 -224 -601 725 -6 104 -176 -786
7854 -786 -684 117 542 529 374 -998 12 -542 -221 323 344 1310 -371 -614 -1887 -858 52 704 475
7873 475 -668 1 -1182 -671 118 -228 424 1134 588 -254 -567 -281 616 -119 -177 -920 -528 -103 -229 -449
7893 -449 -85 792 1113 -60 -530 -223 55 347 264 -625 -446 363 232 869 761 -12 -142 3 -383 -231
7913 -231 -391 488 266 147 5 -327 -548 -325 1277 945 -561 432 -523 132 -57 -302 481 -373 -226
7932 -226 537 -385 -519 17 453 749 -744 -168 -833 -226 152 671 447 586 268 279 31 505 154 -196
7952 -196 59 542 -186 -422 -85 -105 291 -247 -19 -196 -81 -79 724 487 -41 -251 -343 -190 -5 26 504 -66
7974 -66 -319 -939 -474 -160 1298 700 110 -137 197 -424 -989 -278 217 769 88 490 478 -122 -336 109
7994A09O21j057l00K46L74r9j07N6K84p0K97m28J85M12k06k43m08k50j51L36L27
8015g2J01K15k32O88o53l12p5Q75k61K62r54j52m46J234O48j52l19p64J702k187
8035h54M91L07L53m53R10j127L40l52M95j90K29J83l03l63k1O46o8L78J96o21
8055A76m44K15L7K06m1l00K47k38j31O22j91M34o08j50m39P27K43k42K94J5l34
8076I8m3n77M2N32L59J23l19k67qK07K87l18L7m3q7k92L2K29n8J58k75j06L73
8099H4q07J281j52NJ11p81k87J071q04N7r5N27l01Q04n01n40J52M51r5k59P8m24
8121d25N97l38L92N10q81j63j61P30l1K62p33O53j046L86K66J40k98K46j07j58
8141a59M7n67j58J342o86J57J60N65o82Q5j92q55J265j55K08r67J283j697J108
$$ plain form
7994 109 730 -327 -627 -381 -7 -106 -213 -157 127 57 354 -74 111 523 317 74 -334 -584 -735 -399 -72
8015 -72 29 244 12 700 47 -265 -340 535 274 536 -418 -570 -1016 218 866 714 395 -369 1333 -854
8035 -854 -363 -56 297 -156 754 -373 -33 -385 110 -80 149 332 29 -334 -355 291 223 601 797 176
8055 176 -268 -53 -16 190 149 -151 96 -142 -273 349 158 592 -16 -166 -605 122 365 123 417 432 98
8076 98 55 -522 -480 52 411 534 215 -52 -60 147 434 116 153 110 23 -269 -237 -8 -66 92 -183 -289 84
8099 84 -723 558 406 411 522 -259 -546 525 -279 -222 -317 210 -91 713 212 -328 -176 275 180 -79 -1 -425
8121 -425 172 -166 226 736 -145 -308 -469 261 230 492 -241 412 -634 -248 18 158 -140 106 -1 -159
8141 -159 -112 -679 -837 505 -181 -24 136 701 19 104 -88 -943 322 167 375 -592 691 -1006 102
8160A02m8N34j14j601J159N25Nj58p16k45N02J54J77m05J75j15K12K65l8n70K20
8181B0J88j37K03o36M22p52L15Q31l56R0
$$ plain form
8160 102 54 588 474 -1127 32 557 562 404 -312 -557 -55 99 276 -129 46 -69 143 408 370 -200 20
8181 20 208 71 274 -362 60 -692 -377 454 98 188
8191A88
$$ Imaginary data points
##PAGE= N=2
##DATA TABLE= (X++(I..I)), XYDATA
0@%%%%OoQj6J6k3L1l8M6n5P0q5J02j22J43j68K00k33K67l09L56m08M67n32O03
29C20o80P68q65R69j084J210j349J503j671J853k057K279k520K792l093L423l795
46a997M216m692N238n871O613p499Q581r935J1686j4055J7457k2788L2414n5253
60c5885K05328K15017l55789k00922L3966J67107K3803k9571k7833J6312J726
71A3259R624m4251o4489R653J71185J44098r3824k64153j03980J60962J91885
82A29969k1853j62196r7427M5331P7663J4719m0040j4529M3559O9712J6694p9866
94a8264j04119K3186J72029J14766j26208k37410o3106J62024J63824n738j05653
105b4669m8854L3670L9992k34j7444J2293O9781Q6353j1853j61502j53368M6861
$$ plain form
0 0 0 0 0 0 6 0 8 -8 8 -15 16 -22 24 -31 39 -46 56 -66 77 -91 109 -124 143 -166 190 -218 249 -283 320
29 320 -360 408 -457 512 -572 638 -711 792 -879 974 -1083 1196 -1324 1468 -1625 1798 -1997
46 -1997 2219 -2473 2765 -3106 3507 -3992 4589 -5346 6340 -7715 9742 -13046 19368 -35885
60 -35885 169443 384460 28671 -172251 -138285 28822 52625 23054 -4779 11533 13259
71 13259 22883 -21368 -85857 -76204 94981 239079 145255 -118898 -222878 -61916 129969
82 129969 108116 -54080 -151507 -106176 -28513 -13794 -53834 -68363 -24804 44908 61602 -18264
94 -18264 -122383 -99197 72832 187598 61390 -176020 -239126 -77102 86722 80984 -24669
105 -24669 -73523 -39853 139 -95 -17539 -5246 64535 150888 139035 -22467 -175835 -128974
117a28974K04556J19212r5692j75796n6550Q5785R9949J4181l5065P409N6027
128I5042J6162p2925r8586j6649J00665J18588m869j49716j48214Q037J56412
139C947J18988n3813j28975k5825Q9115N3975m2986m4403L4068O1121k765q5323
151b2876j04651k8695R6033J33155J7601j37799j43446K4563J56688J00723m5130
162D6166q1439k33M4201p571o0381k9563N1144Q7914K4889q6401j29427m6602
174a87303J02193J64753O0045r7349j21304P840J02928M6660m8672l6574M0862
185C4079M4018l9813r6452m7061N8029J13777O6458n1004j30048o8245Q7051J54138
197A24927M5414r4746q8054J8133N1288j5677o0863j1372O1186N4897l2033j04701
$$ plain form
117 -128974 75582 194794 99102 -76694 -133244 -47459 52490 66671 31606 39015 95042
128 95042 111204 38279 -60307 -76956 23709 142297 137428 -12288 -160502 -152465 3947
139 3947 122935 69122 -59853 -85678 3437 57412 14426 -29977 4091 65212 62447 -22876
151 -22876 -127527 -156222 -60189 72966 90567 -47232 -190678 -166115 -9427 91296 46166
162 46166 -35273 -35506 8695 1124 -59257 -88820 -37676 50238 75127 -11274 -140701 -187303
174 -187303 -85110 79643 139688 42339 -78965 -71125 31803 78463 29791 -6783 34079
185 34079 78097 38284 -58168 -105229 -47200 66577 133035 82031 -48017 -116262 -29211 124927
197 124927 170341 75595 -12459 5674 56962 41285 -19578 -30950 30236 85133 53100 -51601
209e1601p3247M4673J36871J02879l9334j38085q1668N5820J02375J9334o3933
220A4084m4071K2408K1431m9903p9508j962R7753R6287r377j03030r0862K0022
232a06728J20070R9950k5839j13842o7439L6321N7520j0900n0622K322O4522L2860
244C8195n9915q4864J059J04422J11603J3111r9135j07083j72R9056Q2858k1587
256G7548q3944m1293K9657K6347l0169l3063M2492R5530L6822o6167j02436k6544
268g5220Q7648J13105K3362q9589j06376k2111O3572N2276j9718m4839Q639M7495
280C8244M59o8877m7785N1808J10372N1362o3420j20472n6266N7457R7774K3297
292G3953o8943p8888n207N1275K2011k9614j6277M9152O1587j2389q7320o6319
$$ plain form
209 -51601 -124848 -80175 56696 159575 120241 -17844 -99512 -43692 58683 78017 14084
220 14084 -29987 -7579 13852 -36051 -115559 -117521 -19768 76519 67142 -35888 -126750 -106728
232 -106728 13342 113292 87453 -26389 -93828 -57507 13 -10887 -61509 -59187 5335 38195
244 38195 -21720 -106584 -105525 -1103 110500 123611 24476 -82607 -82779 16277 99135 77548
256 77548 -6396 -47689 -18032 8315 -21854 -54917 -12425 83105 119927 53760 -48676 -75220
268 -75220 12428 125533 148895 59306 -47070 -69181 -5609 46667 26949 -17890 -9251 38244
280 38244 38703 -30174 -77959 -26151 84221 135583 72163 -48309 -104575 -47118 50656 73953
292 73953 5010 -73878 -79085 -27810 -5799 -35413 -51690 -2538 59049 46660 -40660 -106979
304a06979L5427J08669O5770n3566j18256o2304M4829Q3793L1547l4683l4268
315d0021J5801L4305q243m1142J324P1016P2561j5211j04013r1278J7327J04388
327A6814P6548k6785q7721m9573K9347N9256K0889j6457K449L8738K0438m3292
339D0651p1237j6040O9788Q5318j709j01582j00874J318Q7838P5523l613n3848
351A1533l0302J9239K5877j1372k3074J4702N0577K3063n5326r7113m0655O4591
363d8260R6705J9322p3491q5199q617O4545O0005K417l1111p003K1287J149m2957
376c1208m2096J5478P2633M4574m9351j00227m4825O1982J02309L9499m8443o7272
388d6947j0130M4961L5121q995j7853J3509K9794q397o5499o1458K2165R6326
$$ plain form
304 -106979 -71552 37117 102887 49321 -68935 -131239 -86410 -2617 28930 -5753 -40021
315 -40021 -24220 10085 1842 -39300 -37976 33040 105601 90390 -13623 -104901 -87574 16814
327 16814 93362 66577 -21144 -70717 -41370 17886 38775 22318 24767 63505 83943 40651
339 40651 -30586 -46626 23162 108480 106771 5189 -95685 -94367 -6529 68994 65381 11533
351 11533 -18769 470 26347 14975 -8099 6603 57180 80243 24917 -72196 -112851 -48260
363 -48260 48445 67767 -5724 -90923 -99540 -34995 25010 27427 -3684 -10687 10600 11749 -31208
376 -31208 -73304 -57826 14807 59381 10030 -90197 -135022 -73040 29269 68768 20325 -46947
388 -46947 -57077 -12116 23005 14010 -3843 9666 39460 31063 -34436 -95894 -73729 22597
400B2597P3865l1823r4501n3422M4069Q9176M5320l0318m9866q855J7379l017
412B0604l2514j6747L8556O0388O99q1387q0308J4823R9264Q2832j3112q0855
424A2243n6094K2571N7597J7165l3820k9252J1232J9038k4375o0671k2692O0930
436b6128Q7333J3213p9909q4692L675Q7934P7501r913p3023m9292J4992L3408
448d901k813k9963l961M1182L2569l4999p6171k2842P4619J03506K7356p2852
460C0730r1752j4044O4945O0282o498m4619k0872J8305J2263k7299l3737K2453
472b9843P7073N1038l7526r0048l9550N6822R5205L3306o1051p8995j7700L9788
484a481L0551j5001k3982J2208L9306O046m9253m9355K1763Q4509O0273l4604
$$ plain form
400 22597 96462 64639 -29862 -83284 -39215 49961 95281 64963 15097 6242 23621 20604
412 20604 -11910 -28657 9899 70287 70986 -10401 -90709 -75886 23378 106210 93098 12243
424 12243 -43851 -21280 36317 53482 19662 -9590 1642 20680 -3695 -64366 -87058 -26128
436 -26128 61205 74418 -5491 -90183 -86508 1426 78927 69014 -4009 -53301 -38309 -4901
448 -4901 -7714 -37677 -41638 -456 32113 -2886 -79057 -101899 -27280 76226 103582 30730
460 30730 -61022 -75066 -10121 50161 43663 -956 -21828 -3523 8740 -18559 -52296 -29843
472 -29843 47230 98268 60742 -29306 -68856 -12034 83171 116477 55426 -23569 -41269 -1481
484 -1481 29070 14069 -9913 2295 41601 47647 -1606 -50961 -29198 55311 115584 80980
496H0980r7981n9899L7317Q0610K5842m8836n6024n672K6729O968k2441q372M0385
509c94N4642J598o7492o9124R418Q5363O9088k8929r7705n8929L0696O2277J8340
522H849k6765j7109J8557K2418j5653l9270o407N3907P1122P433p4656q5865n624
535h9063Q0582P0416j6401p1432l6574K6936L9999N683j5532J0067L7394K2140
547F4215l3353o0220k1345M8062P6973J8766o9150q6857r763O5711N7801p496
559D3344l9868j1572K3247J4217k0989k2943J8317N0262K3924m0710p9111m2675
571h4557M1307Q3869L1538n4296p2663j0759M9130M0070q194k3607R801K8201
583B9840n225m8740l8793J7050O0736M0880k9510q1758n1327L5186Q3045M2539
$$ plain form
496 80980 -17001 -76900 -39583 41027 66869 18033 -37991 -43663 -16934 -9966 -32407 -40779 -394
509 -394 54248 55846 -11646 -80770 -71352 14011 83099 54170 -43535 -102464 -71768 -9491 8849
522 8849 -17916 -35025 -16468 5950 -9703 -48973 -55380 -1473 69649 77082 2426 -83439 -89063
535 -89063 -8481 61935 45534 -25898 -62472 -35536 4463 10146 -5386 4681 42075 64215
547 64215 30862 -29358 -50703 -2641 74332 93098 23948 -62909 -72672 -6961 50840 43344
559 43344 3476 -8096 15151 29368 8379 -14564 3753 54015 77939 37229 -41882 -84557
571 -84557 -43250 40619 72157 17861 -54802 -65561 -16431 23639 15445 -8162 1639 29840
583 29840 24615 -24125 -62918 -45868 14868 55748 26238 -55520 -106847 -71661 11384 53923
595E3923l3089n4637m598L8349J4165k6439j3529L2206L6370j3185o0077m8644
607g9185J4159O9853N9901j0774p2807n3628K7289P5882L6735k9820l5335J1017
619A3287K2958k0275m4898p737M6666M9517k874o0282o0767Q59O8256P3763M954
632H3427o3913n2252J5143M8725Q555l3407j1742L2547J7418l8939o1974j4597
644g1009N0280O5686J3843m6351o2922j3624N3125O3961K242n6190l6319K1000
656a6278K7237k3357l7856R976N3274K3762m1104o1811j4477N0051O9518K4792
668F3727l9768o7142k1549M6061N3441m861m2828j0909K6082P059m2811l5089
680f8587L2275P6779L8440l7672p1006l1088L3208O5488L8996k4990n7369k4455
$$ plain form
595 53923 20834 -33803 -38401 -52 14113 -12326 -25855 6351 42721 29536 -30541 -79185
607 -79185 -65026 4827 64728 53954 -18853 -72481 -45192 30690 67425 37605 2270 13287
619 13287 36245 15970 -28928 -36665 10001 59518 56644 -3638 -64405 -63546 4710 78473 83427
632 83427 19514 -32738 -17595 31130 39685 6278 -5464 27083 44501 5562 -56412 -71009
644 -71009 -20729 44957 58800 12449 -50473 -64097 -10972 52989 55231 -959 -37278 -16278
656 -16278 10959 -12398 -50254 -40278 12996 36758 -4346 -66157 -80634 -30583 38935 63727
668 63727 23959 -43183 -64732 -18671 34770 29909 -12919 -23828 2254 9313 -33498 -68587
680 -68587 -36312 40467 78907 41235 -29771 -60859 -27651 37837 76833 51843 -5526 -29981
692b9981K5878K2068j8509k3289K6153N1484R28o2026m7828K8082P2279M0681
704H5920k1807n5393l9677P445M4174K6910k4564m2024k217K9632P096l7226j9376
717d1107M2651N6666n318o5037m7674K3652N8731L8534j6730n3673m8678J654
729e6329M0900K9764j4451k2009J1996K6432j6457n1386j0823O3370O7862o394
741F2475o7534n8829k399M2894M6850J1250k9651l6331n55K3436M862k0413K907
754b1038N1026M0562l2176p3008k4953M9522N9430P583m1659m7344j0173K6810
766a5418L6307Q218k1399j4225J5788K1850j4180l5435L476N3104L5448l8410
778C5124p2481k8316M2982N7488J4925l4687m1919j5584J8343L2328J3373r316
$$ plain form
692 -29981 -4103 17965 -544 -23833 2320 53804 54732 -7294 -55122 -27040 45239 85920
704 85920 64113 8720 -30957 -23512 20662 47572 23008 -19016 -21233 8399 15495 -21731 -41107
717 -41107 1544 58210 52892 -12145 -59819 -36167 22564 61098 44368 -9305 -57983 -56329
729 -56329 -15429 14335 -116 -22125 -10129 16303 -154 -51540 -62363 1007 68869 62475
741 62475 -5059 -63888 -66287 -23393 23457 34707 5056 -31275 -31830 -8394 -3532 -23945 -21038
754 -21038 29988 70550 38374 -34634 -59587 -10065 49365 56948 15289 -32055 -42228 -15418
766 -15418 20889 29107 7708 -6517 9271 31121 16941 -18494 -15018 38086 73534 35124
778 35124 -37357 -65673 -22691 34797 49722 15035 -26884 -42468 -24125 8203 21576 12260
790A2260m280J7715M136m3687n0085J2430O9617M5765l3948p4222l5809K4494
802e5614M8825K6739l467k0552j4037O903R420j0724j5529J8448M4232R890n4934
815a0400o3370J734O5054N1976j4418m8948k5171J7804L2021J8369l816j5112
827E723j924J3858J00k8533k4783K4819N7407J3006n5561o3543N225O3924M8790
840E8508o093l5670k2344O3J6184J0326p286o048J3399J7545j5644n4493l1719
853f3272L9659P2671K2598m9998o1035n068M0091L6649J820k0058j4495J264K147
866B973j3239k3453L56L5837L5296j4521o0691l6161L5386O9696K4495l9012m7347
879c0385p712K6389J9573m218j2835r94J1820J165k3232k9344N838N1890M9419
$$ plain form
790 12260 7980 25695 29831 -13856 -63941 -51511 18106 63871 29923 -44299 -80108 -55614
802 -55614 -6789 19950 16483 -4069 -18106 -11203 -1783 -12507 -28036 -9588 34644 44534 -10400
815 -10400 -73770 -72036 -6982 44994 30576 -18372 -43543 -25739 6282 24651 20835 5723
827 5723 3799 17657 17757 -10776 -35559 -10740 46667 59673 4112 -59431 -54206 9718 58508
840 58508 52415 16745 -5599 -5536 10648 20974 13688 7640 21039 38584 22940 -31553 -63272
853 -63272 -23613 49058 71656 21658 -39377 -44445 -4354 32295 34115 14057 -438 826 2973
866 2973 -10266 -33719 -33363 2474 37770 23249 -37442 -73603 -38217 31479 55974 16962 -30385
879 -30385 -38097 -11708 7865 3647 -9188 -10182 1638 2803 -20429 -49773 -43935 7955 57374
892E7374j5455o5819l8266L2504O1243K2163k8527l4888p001J2272K937j2558
904a4021m754K0680L1759N864l6877m6233J697N9078N4528r037o0103l9202J6498
917b0123L9364J0531k0720j6100P263J1274j0837k3216o172K6956M4178J1932
929E4330m0916n4153m010N0198M5470r310m9588l1066J0365K4017J680j2484K286
942a3181J9742J1085j6798l5794j4048L4247N5053J7421m3493n8725j4696L7744
954b1443M0722J152k9106j5022J1104Q206r858j1087J1838L6253K4856k0208m8696
967b1289k6290K4793N1741K5508l1429m7557j4473K6768K5765m41j3094L017J8084
980B1103J758k1453k1240Q571L8752L0718j9301n2237l2232J6041M8473K6222
$$ plain form
892 57374 41919 -23900 -62166 -29662 31581 53744 25217 -9671 -16672 -4400 -1463 -14021
904 -14021 -18775 1905 33664 39528 2651 -43582 -41885 17193 71721 62684 2581 -36621 -20123
917 -20123 19241 29772 9052 -7048 215 11489 652 -22564 -28736 -1780 42398 54330
929 54330 13414 -40739 -44749 5449 50919 41609 -7979 -39045 -28680 -4663 -2983 -15467 -13181
942 -13181 6561 17646 848 -34946 -48994 -14747 40306 57727 14234 -44491 -59187 -21443
954 -21443 19279 20431 -8675 -23697 -12593 -4387 -14245 -25332 -13494 22759 47615 27407 -21289
967 -21289 -47579 -22786 28955 54463 23034 -24523 -38996 -12228 13537 13096 2 3019 21103
980 21103 22861 1408 -19832 -11261 27491 58209 38908 -13329 -45561 -29520 18953 45175
992D5175k2218l6749p582J7645J3720p449o850J5966K2953p52l6505l6094K201
$$ plain form
992 45175 22957 -13792 -21374 -3729 9991 2542 -4308 11658 34611 33859 -2646 -38740 -36539
$$ [...]
8191g39
##END NTUPLES=NMR FID
##END=
