##TITLE=1H_SA_28.188.etoAc
 DMSO, 8 sc, 
 24.3.2020
##JCAMPDX= 6.0         $$ Bruker NMR JCAMP-DX V2.0
##DATA TYPE= NMR FID
##DATA CLASS= NTUPLES
##ORIGIN= UXNMR, Bruker Analytische Messtechnik GmbH
##OWNER= root
$$ XWIN-NMR		Version 3.5
$$ Tue Mar 24 14:30:38 2020 Russian Standard Time (UT+4h)  she@DPX200
##.OBSERVE FREQUENCY= 200.1315
##.OBSERVE NUCLEUS= ^1H
##.DELAY= (6, 6)
##.ACQUISITION MODE= SIMULTANEOUS
##.ACQUISITION SCHEME= undefined
##.AVERAGES= 8
##.DIGITISER RES= 18
##SPECTROMETER/DATA SYSTEM= spect
##.PULSE SEQUENCE= zg30
##.SOLVENT NAME= CD3CN
##.SHIFT REFERENCE= (INTERNAL, CD3CN, 0, 15.7039)
##AUDIT TRAIL= $$ (NUMBER, WHEN, WHO, WHERE, WHAT)
$$ ##TITLE= Audit trail, XWIN-NMR		Version 3.5
$$ ##JCAMPDX= 5.01
$$ ##ORIGIN= Bruker BioSpin GmbH
$$ ##OWNER= she
$$ F:/spectra/data/she/nmr/H-F/1/audita.txt
$$ ##AUDIT TRAIL=  $$ (NUMBER, WHEN, WHO, WHERE, WHAT)
(   1,<2020-03-24 14:29:17.45 +0400>,<she>,<DPX200>,
      <created by zg, POWCHK disabled, PULCHK disabled
       configuration hash MD5:
       00 E9 B6 7A A2 85 ED C7 34 08 36 98 17 FE 4E 26
       data hash MD5: 16K
       16 B9 33 DA 94 B4 8B 4E A3 4F B3 7A 61 B3 CC 16>)
$$ ##END=
$$ 
$$ hash MD5
$$ 2C 5B 1A 15 E6 F5 B8 A3 63 C5 38 E4 D5 C2 E0 71
##$RELAX= 
##$RELAX= 
##$RELAX= 
##$RELAX= 
##$RELAX= 
##$RELAX= 
$$ Bruker specific parameters
$$ --------------------------
##$DU= <F:/spectra>
##$EXPNO= 1
##$NAME= <H-F>
##$PROCNO= 1
##$TYPE= <nmr>
##$USER= <she>
##$AMP= (0..31)
100 100 100 100 100 100 100 100 100 100 100 100 100 100 100 100 100 100 
100 100 100 100 100 100 100 100 100 100 100 100 100 100 
##$AQSEQ= 0
##$AQ_mod= 1
##$AUNM= <au_zg>
##$AUTOPOS= <>
##$BF1= 200.13
##$BF2= 200.13
##$BF3= 200.13
##$BF4= 200.13
##$BF5= 200.13
##$BF6= 200.13
##$BF7= 200.13
##$BF8= 200.13
##$BYTORDA= 1
##$CFDGTYP= 0
##$CFRGTYP= 5
##$CHEMSTR= <none>
##$CNST= (0..31)
1 1 145 1 1 1 1 1 1 1 1 1 1 1 1 1 1 1 1 1 1 1 1 1 1 1 1 1 1 1 1 1 
##$CPDPRG= <>
##$CPDPRG1= <>
##$CPDPRG2= <>
##$CPDPRG3= <>
##$CPDPRG4= <mlev>
##$CPDPRG5= <mlev>
##$CPDPRG6= <mlev>
##$CPDPRG7= <mlev>
##$CPDPRG8= <mlev>
##$CPDPRGB= <>
##$CPDPRGT= <>
##$D= (0..31)
0 1.2 0 0 0 0 0 0 0 0.06 0 0.03 0 0 0 0 0.0002 0 0 0 0 0 0 0 0 0 0 0 0 
0 0 0 
##$DATE= 1585045756
##$DBL= (0..7)
120 120 120 120 120 120 120 120 
##$DBP= (0..7)
150 150 150 150 150 150 150 150 
##$DBP07= 0
##$DBPNAM0= <>
##$DBPNAM1= <>
##$DBPNAM2= <>
##$DBPNAM3= <>
##$DBPNAM4= <>
##$DBPNAM5= <>
##$DBPNAM6= <>
##$DBPNAM7= <>
##$DBPOAL= (0..7)
0.5 0.5 0.5 0.5 0.5 0.5 0.5 0.5 
##$DBPOFFS= (0..7)
0 0 0 0 0 0 0 0 
##$DE= 6
##$DECBNUC= <off>
##$DECIM= 24
##$DECNUC= <off>
##$DECSTAT= 4
##$DIGMOD= 1
##$DIGTYP= 9
##$DL= (0..7)
0 120 120 120 120 120 120 120 
##$DP= (0..7)
150 150 150 150 150 150 150 150 
##$DP07= 0
##$DPNAME0= <>
##$DPNAME1= <>
##$DPNAME2= <>
##$DPNAME3= <>
##$DPNAME4= <>
##$DPNAME5= <>
##$DPNAME6= <>
##$DPNAME7= <>
##$DPOAL= (0..7)
0.5 0.5 0.5 0.5 0.5 0.5 0.5 0.5 
##$DPOFFS= (0..7)
0 0 0 0 0 0 0 0 
##$DQDMODE= 0
##$DR= 18
##$DS= 0
##$DSLIST= <SSSSSSSSSSSSSSS>
$$ [...]
##$SUBNAM2= <"">
##$SUBNAM3= <"">
##$SUBNAM4= <"">
##$SUBNAM5= <"">
##$SUBNAM6= <"">
##$SUBNAM7= <"">
##$SUBNAM8= <"">
##$SUBNAM9= <"">
##$SW= 24.9337058887773
##$SWIBOX= (0..15)
0 0 2 0 0 0 0 0 0 0 0 0 0 0 0 0 
##$SW_h= 4990.01996007984
##$TD= 16384
##$TD0= 1
##$TE= 0
##$TE2= 300
##$TE3= 300
##$TEG= 300
##$TL= (0..7)
0 120 120 120 120 120 120 120 
##$TP= (0..7)
150 150 150 150 150 150 150 150 
##$TP07= 0
##$TPNAME0= <>
##$TPNAME1= <>
##$TPNAME2= <>
##$TPNAME3= <>
##$TPNAME4= <>
##$TPNAME5= <>
##$TPNAME6= <>
##$TPNAME7= <>
##$TPOAL= (0..7)
0.5 0.5 0.5 0.5 0.5 0.5 0.5 0.5 
##$TPOFFS= (0..7)
0 0 0 0 0 0 0 0 
##$TUNHIN= 0
##$TUNHOUT= 0
##$TUNXOUT= 0
##$USERA1= <user>
##$USERA2= <user>
##$USERA3= <user>
##$USERA4= <user>
##$USERA5= <user>
##$V9= 5
##$VALIST= <valist>
##$VCLIST= <CCCCCCCCCCCCCCC>
##$VD= 0
##$VDLIST= <DDDDDDDDDDDDDDD>
##$VPLIST= <PPPPPPPPPPPPPPP>
##$VTLIST= <TTTTTTTTTTTTTTT>
##$WBST= 1024
##$WBSW= 4
##$XGAIN= (0..3)
0 0 0 0 
##$XL= 0
##$YL= 0
##$YMAX_a= 172852
##$YMIN_a= -119140
##$ZGOPTNS= <>
##$ZL1= 120
##$ZL2= 120
##$ZL3= 120
##$ZL4= 120
##$ABSF1= 10
##$ABSF2= 0
##$ABSG= 5
##$ABSL= 3
##$ALPHA= 0
##$AQORDER= 0
##$ASSFAC= 0
##$ASSFACI= 0
##$ASSFACX= 0
##$ASSWID= 0
##$AUNMP= <proc_1d>
##$AZFE= 0.1
##$AZFW= 0.1
##$BCFW= 1
##$BC_mod= 2
##$BYTORDP= 1
##$COROFFS= 0
##$CY= 11.3945322036743
##$DATMOD= 1
##$DC= 2
##$DFILT= <>
##$DTYPP= 0
##$F1P= 16.9975609425685
##$F2P= -3.02152046262296
##$FCOR= 0.5
##$FTSIZE= 0
##$FT_mod= 4
##$GAMMA= 1
##$GB= 0.15
##$INTBC= 1
##$INTSCL= 1
##$ISEN= 128
##$LB= 0.24
##$LEV0= 0
##$LPBIN= 0
##$MAXI= 10000
##$MC2= 0
##$MEAN= 0
##$ME_mod= 0
##$MI= 1.114404
##$NCOEF= 0
##$NC_proc= 0
##$NLEV= 6
##$NOISF1= 3.799351
##$NOISF2= 2.8
##$NSP= 1
##$NTH_PI= 0
##$NZP= 0
##$OFFSET= 15.70392
##$PC= 1
##$PHC0= -9787.999
##$PHC1= 10.20082
##$PH_mod= 1
##$PKNL= yes
##$PPARMOD= 0
##$PSCAL= 0
##$PSIGN= 0
##$REVERSE= no
##$SF= 200.130013532006
##$SI= 16384
##$SIGF1= 3
##$SIGF2= 2
##$SINO= 400
##$SIOLD= 16384
##$SREGLST= <1H.CDCl3>
##$SSB= 0
##$STSI= 0
##$STSR= 0
##$SW_p= 3612.71676300578
##$SYMM= 0
##$S_DEV= 0
##$TDeff= 0
##$TDoff= 0
##$TI= <>
##$TILT= no
##$TM1= 0
##$TM2= 0
##$TOPLEV= 0
##$USERP1= <user>
##$USERP2= <user>
##$USERP3= <user>
##$USERP4= <user>
##$USERP5= <user>
##$WDW= 1
##$XDIM= 8192
##$YMAX_p= 0
##$YMIN_p= 0
$$ End of Bruker specific parameters
$$ ---------------------------------
##NTUPLES= NMR FID
##VAR_NAME=  TIME,          FID/REAL,        FID/IMAG
##SYMBOL=    X,             R,               I
##VAR_TYPE=  INDEPENDENT,   DEPENDENT,       DEPENDENT
##VAR_FORM=  AFFN,          ASDF,            ASDF
##VAR_DIM=   8192,          8192,            8192
##UNITS=     SECONDS,       ARBITRARY UNITS, ARBITRARY UNITS
##FACTOR=    0.0002004,     1,               1
##FIRST=     0,             0,               0
##LAST=      1.6414764,     0,               0
##MIN=       0,             -119140,         0
##MAX=       1.6414764,     172852,          0
$$ Real data points
##PAGE= N=1
##DATA TABLE= (X++(R..R)), XYDATA
0@%%%%%%%%%%qJ6j6J6j8K6l2L5m3N0n8P2q3R3j08J24j41J61j84K09k36K66k99
33a58L34l74M18m65N19n76O38p07P83q67R60j065J179j308J456j623J815k039
51a080K306k629L026l531M203n140O555q972J4189m7420O4612Q5778r3156j11181
65i2440k6700Q3629P3661L541n1021j9314K9394M0558o460l5321j8497J5206J339
78b425k3727j3095L6860M0780k3819q2486m5258N8184J11359M4510o7915j02417
90f9449j7717Q3647Q2933j6944q8778m7954M5944P0167P28o7007n1393J6098N1154
103h571K5920q549j1770J766n457k3202j2130L2740N8930J7877n6514p6816r306
116g5082O7749O1641k1839p5673l3066N1823P0780L122o9641n9468J9886P5002
$$ plain form
0 0 0 0 0 0 0 0 0 0 0 0 -8 8 -8 8 -10 16 -16 19 -24 26 -32 40 -43 50 -58 66 -75 86 -98 111 -125 141 -158
33 -158 176 -198 220 -245 274 -302 336 -371 412 -455 505 -560 619 -689 767 -856 959 -1080
51 -1080 1226 -1403 1623 -1908 2295 -2845 3710 -5262 8927 -38493 26119 111897 18741 -92440
65 -92440 -119140 -35511 38150 41691 -9330 -28644 750 41308 34848 -473 -18970 -3764 -2425
78 -2425 -26152 -39247 -2387 38393 14574 -67912 -113170 -54986 56373 100883 32968 -69449
90 -69449 -87166 -3519 79414 62470 -26308 -74262 -28318 41849 42577 -24430 -75823 -59725 -8571
103 -8571 17349 8800 -2970 -1204 -6661 -29863 -41993 -9253 49677 67554 11040 -65776 -75082
116 -75082 -7333 54308 32469 -43204 -76270 -24447 46333 49455 -20186 -79654 -59768 15234
128A5234M6858k5914n9031k7799J8826K4963N914l67J1861O159k1914l3464l743
141d2417L7516L3552j3329m5728j8820L7106M8851l669o1570m5774K8471P5799
153B9988M0241l5165p0103k8874L2703M6790J2689k2595k4612l349P429n14n353
166b0725K852J1629L776r390k362J5943J8465q690l4424k0408K6983N2003J8167
179E3819m1636o1381k0068L7936M8291R364l2886l0867L425K7315J7427q324j5416
192a3001J29J4639J4762J228r233j6098j5886q995O671K1580K0641k767k9277
205a5607l2282k67L6075L9741N407k7567k7149L197K4714J4109j4999k6563o913
218b8104J8119K3048N84k5277k7248n029K1476K9813J5876m748j8473j7754k509
$$ plain form
128 15234 62092 36178 -22853 -50652 -31826 -6863 -949 -1316 10545 16704 -5210 -38674 -42417
141 -42417 -4901 28651 15322 -30406 -49226 -12120 36731 33062 -28508 -74282 -45811 29988
153 29988 70229 35064 -35039 -63913 -31210 15580 28269 5674 -18938 -22287 -14858 -15372 -20725
166 -20725 -17873 -6244 -2468 -11858 -14220 1723 20188 11498 -22926 -43334 -16351 35652 53819
179 53819 12183 -49198 -69266 -31330 16961 26325 -6561 -37428 -34003 -6688 10739 2415 -13001
192 -13001 -12872 1767 16529 17757 8524 -7574 -23460 -32455 -25784 -4204 16437 13670 -15607
205 -15607 -47889 -48156 -12081 27660 33067 5500 -21649 -18452 6262 20371 5372 -21191 -28104
218 -28104 -9985 13063 13647 -11630 -38878 -43907 -22431 7382 23258 18510 37 -17717 -20226
231b0226J2597J7760R317q069j7497j3403q8J0257N610q260j3580m05K0135K4428
245A8576J649k5221k6976K54L3032L3015L258k9312l1725p551J7245J8248K784
258G276j1910r028K669P126J092n928l562J431P580P142N640L625o691j5543j6171
273b5252J680K5496K5460k50l2087l2426P18L0865K6850p938k3871r517J7152
286c120K0038l177k4712j2953J2073K4530J0765j2104j7741q979J328Q32L853
299i367R847J3438J487k0885k3148n34K7466K5266l314k7055j2033J7459K5028
312B3655k619k9654k2796J7072L8170J4406k7366l7293q254K1511K1001P95r483
325h55Q4P924k167j3851o492J4739K1959K486k0770j7736P031J9957N2k6262k0093
$$ plain form
231 -20226 -7629 10131 19448 11379 -6118 -19521 -19609 -9352 -3742 -12002 -25582 -25987 -5852 18576
245 18576 20225 -4996 -31972 -31718 1314 34329 37587 8275 -23450 -31001 -13756 4492 7276
258 7276 -4634 -13662 -10993 -3867 -2775 -8703 -12265 -10834 -3254 3888 9528 13153 6462 -9081 -25252
273 -25252 -23572 1924 27384 27134 -4953 -37379 -36661 -5796 21054 13116 -10755 -20272 -3120
286 -3120 16918 13741 -10971 -23924 -11851 12679 23444 11340 -6401 -15380 -14052 -13220 -9367
299 -9367 480 13918 15405 -5480 -28628 -29162 -1696 23570 20256 -6799 -18832 -1373 23655
312 23655 21036 -8618 -31414 -14342 23828 38234 10868 -26425 -34679 -13168 7833 8628 -855
325 -855 -771 7153 4986 -8865 -15357 -618 21341 23827 3057 -14679 -7648 12309 12361 -13901 -33994
340c3994J5875L8633J6541k7620m1074o357L3944L6875R6k7460j6737J1750J6362
353A6834n764k0759n371J7834J5761r765k3306n803J5938J0086j0899j3631J0597
366h248L2069J4827k3885l9659n785L3963L6341l755l7110k4936J1597K4008L522
379A2949k1967j4784J3803K8268O221j9857k0096N740J9948P455r332p657J1359
392A2050J0346j3049k9710j0498K4982L3122R89l2841k6242J1315L1957J1330
404B3751k1956j9624J1003L1393J2190k3102l0143l512K4056K0433n505j8425
416E59o456P266J888j2048r028J3171K4896P360k0805k3353L252K5907J4547j4499
430A2657k2661K188K5531J4146k1263l4075o838K8145K9613j934k6224j6950Q842
$$ plain form
340 -33994 -18119 20514 37055 9435 -31639 -37996 -4052 32823 32919 5459 -11278 472 16834
353 16834 11070 -9689 -15060 2774 18535 8770 -14536 -20339 -4401 5685 -5214 -18845 -8248
366 -8248 23821 38648 14763 -24896 -30681 3282 39623 35868 -1242 -26178 -14581 9427 12949
379 12949 -9018 -23802 -9999 18269 24490 4633 -15463 -9723 10225 17680 8348 691 12050
392 12050 22396 9347 -20363 -30861 -5879 27243 28232 -4609 -30851 -19536 12421 23751
404 23751 1795 -17829 -6826 24567 36757 13655 -16488 -20000 4056 24489 18984 559
416 559 -5897 1369 3257 -8791 -17819 -4648 20248 27608 6803 -16550 -13298 12609 27156 12657
430 12657 -10004 -7816 17715 31861 10598 -23477 -30315 -2170 27443 25509 -715 -17665 -8823
443h823J7002J936j0129k49J4261J1059j0499j9467n127J4190J3946o246j5922
456d068l349J4481J0847j2858k5444n446K3906L0572J425k4762k3150N308K3416
469A0878J1954r529j4765L683J3551o36j5795j3109M139J6558P064r494q054L732
483A77Q867l077j2925k948J7721K0945Q00k3771k2140L356K0755J2890r229j7140
497e719l281J2052Q664q330j5367j850J6637J6314Qj1910r286L027N756j979l578
512A158M428R022J062j4617j7562l77J6666J5309k892j3769n043R665J0530l028
526A0552j3545m442J2716J6918J429j6167j7149k810J0501R853o13n366j535J751
540B093j121o432k172Q351J2277L965q219q208O98O912M27q305o228O598J2685
$$ plain form
443 -8823 8179 10115 -14 -263 13998 25057 14558 -4909 -10036 4154 18100 11854 -4068
456 -4068 -7417 7064 17911 5053 -20391 -25837 -1931 28641 30066 5304 -17846 -12538 10878
469 10878 22832 13303 -1462 2221 15772 15136 -659 -13768 -9629 6929 13993 4499 -3555 177
483 177 9044 5967 -6958 -9906 7815 28760 29560 5789 -16351 -12995 7760 20650 11421 -5719
497 -5719 -9000 3052 11716 3386 -11981 -13831 2806 19120 19128 7218 -2068 959 6715 4736 1158
512 1158 5586 14608 15670 1053 -16509 -16886 -220 15089 12197 -1572 -6615 3050 13580 10552
526 10552 -2993 -7435 5281 22199 23628 7461 -9688 -12498 -1997 7856 7243 1877 342 2093
540 2093 972 -5460 -7632 719 12996 16961 8742 534 1232 8144 8571 266 -5962 636 13321
555A3321K988j2970j7829k581J3731J5622K783q915p985O59M971J048l794j458
569d09N786N870p24q280q271M41M502K821j246P24N729K722o177j0858l395J1048
585B83J5739M195j0717j3110k823Q308N871m068p388L6P212M285n966j0148m111
600a2402P372J0785M426k492l724p96j59k410l486L892R113N065p242j3460o333
615a1851O136J0251M88o636l683O059Q570k066j1428p919P676J5675O634q072
629I834j2481m667M445L457j159j707K836M211j558p077o570L067J0274O726k520
644G111o499K07O559J595r136r505L064J3646Q033p754j6761q081P941J2527K952
659E899o860l415N405O060l107r025k286Q825R578o52q683n848J924K421l319
$$ plain form
555 13321 16309 3339 -14490 -17071 -3340 12282 15065 6150 -1835 -1176 3795 4843 1049 -409
569 -409 5377 11247 10523 2243 -6028 -5587 -1085 1736 490 1214 6943 9665 3488 -7370 -10765 283
585 283 16022 20217 9500 -3610 -6433 1875 7746 3678 -3710 -3674 3538 7823 1857 -8291 -12402
600 -12402 -5030 5755 10181 7689 3965 3169 3010 600 -2886 1006 10119 15184 7942 -5518 -11851
615 -11851 -5715 4536 5024 -1612 -5295 764 9334 7268 -4160 -12079 -4403 11272 17906 9834
629 9834 -2647 -7314 -2869 588 -571 -2278 558 4769 3211 -3866 -10436 -7369 2905 9631 7111
644 7111 612 819 7378 8973 -163 -9668 -6604 7042 15075 7321 -9440 -17521 -9580 2947 5899
659 5899 -961 -4376 1029 7089 3982 -5043 -7329 1496 11074 10422 1739 -4109 -2185 236 -3083
674c083n896J059J0054Q434m408j4423q023Q766J5743N461p632r628J409P725
688E558J107r223q581M049J1475M801q704j1663j488P937N853k489k576N400P977
703I433j111j1050q578N459J3389N745q114j1338k683P669M061o304q414J818
717a0018J2082Q338n498j3337m713Q583J0833K544n925m109K649L100m699q849
731i019j371R738Q346l667j2107n409P099Q710o12p298j107J0323R069m113j4334
746e752p632P419J3135L712r183r584n40O532P31n365l953O100R494J835q093
761a144q041J963R365M463m432n382K209P516r39j1811r734M118J4110O896p607
776A550j2578k322R056P282k236o328J736R318M713o301j1157k123P467P375j351
$$ plain form
674 -3083 -8979 -7920 2134 10568 6160 -8263 -16286 -7520 8223 13684 6052 -3576 -2167 5558
688 5558 6665 -2558 -11139 -7090 4385 9186 482 -11181 -12669 -4732 1121 -1368 -3944 1456 9433
703 9433 8322 -2728 -11306 -5847 7542 13287 5173 -6165 -8848 -1179 2882 -3422 -11836 -10018
717 -10018 2064 10402 4904 -8433 -13146 -4563 6270 8814 2889 -1220 1429 4529 -170 -9019
731 -9019 -10390 -652 7694 4027 -8080 -13489 -6390 2320 1708 -5590 -6697 3626 12695 8582 -5752
746 -5752 -13384 -5965 7170 10882 1699 -7885 -8425 -1893 -1162 -6527 -10480 -4380 5114 6949 -1144
761 -1144 -9185 -7222 2143 6606 2174 -3208 -999 6517 5578 -6233 -15967 -11849 2261 9157 1550
776 1550 -11028 -13350 -4294 2988 752 -5576 -3840 5478 10191 3890 -7267 -9390 -1923 5452 4101
791D101p520l210K914K590m156o301J186J0568Q372l495j0715n644O088J0179
805D957J186p056m818M596O328j778j0726p254N774J1129L773p041p253J083N745
820a355K058l604j585N609O928p43r800p918K103R162L717n419o701L85N812J945
836E94o119o566L158J1398P501m158j0860m032O144P275n66n497j521M143K517
851C411n635p620j406P860P322j915o129l192M642N279k295o128OQ194O675k988
867F081r753p283M209P640K741m231n860J945M762K56m857m559N735P748L105
882G679m932p445J112L282J655k866k509K608M789r40q177o531K966R369N318
897E378m114o175p72N175L223k218n278J396O818L952l795q512m271L922O122
$$ plain form
791 4101 -3419 -6629 -3715 -1125 -5281 -11582 -10396 172 8544 5049 -5666 -11310 -5222 4957
805 4957 6143 -913 -5731 -1135 5193 3415 -7311 -14565 -8791 2338 6111 -930 -8183 -7100 -1355
820 -1355 703 -2901 -4486 1123 8051 7308 -2492 -10410 -8307 855 4572 -847 -7548 -7163 -1351 594
836 594 -5525 -12091 -8933 2465 9966 5808 -5052 -9084 -2940 4335 3769 -1728 -3249 894 3411
851 3411 -2224 -9844 -11250 -3390 3932 2017 -4112 -7304 -2662 2617 322 -5806 -5800 2394 9069 6081
867 6081 -3672 -10955 -6746 894 3635 -596 -6456 -4511 251 507 -4350 -8909 -3174 4574 7679
882 7679 2747 -4698 -3586 -304 1351 -1515 -4024 -1416 3373 2433 -5744 -12275 -9309 60 5378
897 5378 1264 -4911 -5683 -508 2715 497 -4781 -3385 3433 7385 3590 -4922 -9193 -5271 851
912H51P21m387j633L005L035l148n594l8P648P013j453p630m387L229M934r08
928A258n216k104N050N634k007q330m818L877Q573L542l680m306N88L466P73l711
944a411k316K969N447J013o712o654K62N669L121k780l998J575N732J610m939
959a412o412K296Q556N397l398q080k450M492L152k346m496N28N246K931m030
974b6n978j345N152N617J79l952j311K688K377k279n372q64N739N838j572q287
990c396n140K418O952K030m136l454L262N763k46o114l970L834P627K230n481
1005B179n499K50L962M42m527k557L867N460O11n508n747J706P233M158k341m738
1021a049k7M176K069m362n543j41O441M888k796p598l584L873N249K60l636l62
$$ plain form
912 851 1572 -2815 -4448 -1443 1592 -1556 -7150 -7188 460 7473 6020 -1610 -5997 -2768 2166 1258
928 1258 -3958 -6062 -1012 4622 2615 -5715 -10533 -6656 1917 5459 1779 -2527 -1939 1527 2300 -1411
944 -1411 -3727 -758 4689 5702 -1010 -7664 -7402 -1733 1388 -1392 -5390 -3815 1917 3527 -1412
959 -1412 -7824 -5528 3028 8425 5027 -3053 -5503 -1011 2141 -205 -4701 -4173 1073 4004 -26
974 -26 -6004 -7349 -2197 3420 3599 -353 -1664 1024 3401 1122 -4250 -5114 625 6463 4891 -3396
990 -3396 -8536 -6118 834 2864 -1272 -4726 -1464 4299 4053 -2061 -6031 -2197 5430 7660 2179
1005 2179 -3320 -3070 892 1334 -3193 -5750 -1883 3577 4188 -1320 -7067 -5361 1872 6030 3689 -1049
1021 -1049 -1076 3100 5169 807 -4736 -4877 1564 6452 3656 -3942 -7526 -3653 1596 1856 -1780 -2142
1037b142M551L645k645o521j271N864N975j248o674l305K956L053j029n342r60
1052e093M653N954k35o586m742K765O638L032k854m171K90M077L99m556m578J776
1068c231N755K800m337o072j19N349L162k942l490K375O245J823n278o742P35
1083c967O808M781k785o293k193L225L006k477m245q7N728L995j567n630l062
1098d763L735N286Q33l695j993K114K588j683n241k353M133N684M01n771m567
1113e292K400N115J772l608k500L370N035Q02n751n044J348N494K695l323m576
1128b063n44K908Q41k472k971K208N348K587l145m736m07M686L594j342m009l76
1144A07L015K085l457n521j143N256N060j493n334k548L067M048R7l488n02L820
$$ plain form
1037 -2142 2409 6054 3409 -3112 -4383 1481 7456 6208 -466 -3771 -815 2238 1209 -4133 -5093
1052 -5093 -440 5514 5279 -1307 -6049 -3284 3354 6386 3532 -639 -349 3728 4127 -429 -5007 -3231
1068 -3231 2524 5324 987 -5085 -5204 145 3307 365 -3125 -750 5495 7318 2040 -4702 -3967
1083 -3967 2841 7622 4837 -1456 -3649 -424 2582 105 -4140 -4227 1501 5496 3929 -1701 -4763
1098 -4763 -1028 4258 5091 1396 -597 1517 4105 2422 -2819 -5172 -1039 4645 5046 -725 -5292
1113 -5292 -2892 2223 3995 387 -2113 1257 6292 7094 1343 -3701 -2353 3141 5836 2513 -2063
1128 -2063 -2607 301 1142 -1330 -4301 -2093 3255 5842 2697 -2039 -2446 2240 5834 4492 483 107
1144 107 3122 5207 1750 -3771 -4914 342 5402 3909 -1425 -3973 -906 3142 3239 -249 -751 3069
1160C069L186j456n504k800L192M309N38m174k554J477L098m79l569j917L282
1175c02N941R19m455m442J108M521K074k864l527Q33L728K06m511m171J789N208
1191B055K664k794m082K29L627K021k155k369J277M182J693l607m878n27L732
1206A068K818j068l593j381K410K416j271l641o70M028M642j000m634k494K437
1221F7L411K8l252j457K169K962j972m065k121K927M892M02l477k684K008L407
1237C245J77l232j820K559L773M55m002m323L74L916K353k395k873k31L104J607
1253B687k607k922J261M885K589k755m293p21L630K214j762l838J04L597J751
1268C820k689m572o39M199L881n53l983j156K469K274n07k695j163K291L281p49
$$ plain form
1160 3069 6255 4799 -705 -3505 -313 3996 4534 360 -2194 -717 2381 1902 -1667 -3584 -302
1175 -302 5639 6558 2103 -2339 -1231 3290 5364 2500 -1027 -194 3534 3740 -771 -4942 -3153 2055
1191 2055 4719 1925 -2157 -1928 1699 3720 1565 -804 473 4655 6348 2741 -2137 -2664 1068
1206 1068 3886 2818 -775 -2156 254 2670 1399 -2242 -2912 1116 5758 4758 124 -2370 67
1221 67 3478 3506 254 -1203 966 3928 1956 -2109 -4230 -1303 3589 3991 514 -2170 -162 3245
1237 3245 3422 190 -1630 929 4702 5157 1155 -3168 -2794 1122 3475 1080 -1793 -2024 1080 2687
1253 2687 80 -2842 -1581 3304 5893 3138 -1155 -1876 1754 3968 2206 -1632 -1528 2069 3820
1268 3820 1131 -3441 -4080 119 4000 3447 -536 -1692 777 3051 2544 -151 -1314 977 4258 3509
1284C509m240k702J389L362Q36k211k149J759L149j48l017k750K786M798R83l671
1300A683m143O07L549J512k678l460J314L488J004l381l342Q96L990K498j381
1315B156k730p71K768J740j715k238n07K888K351j724m516j550K564L270l70k798
1331a182j540K723L085q41m288j139L014M059K42m166k495J298K651J43k613j638
1347b687J811L213J63l608k052J299L993J403j853l098N51K438R73k409k632M12
1363b083L715J305k383m245p37L669K898p82l580j20L198K371j572l788k97L378
1379I47L077j669l481j513K311K147r57k981p48K556K539r58l520j451K024L840
1395B163L15k409k081J261K433L20l154k107J403L320J067k999l438N97L970J864
$$ plain form
1284 3509 -731 -3433 -2044 1318 2154 -57 -2206 -447 2702 2554 -463 -3213 -427 4371 5354 1683
1300 1683 -2460 -1853 1696 3208 530 -2930 -1616 1872 2876 -505 -3847 -2951 1039 3537 2156
1315 2156 -574 -1345 1423 3163 1448 -790 -1297 1591 3942 2218 -2298 -3848 -1284 1986 1616 -1182
1331 -1182 -2722 1 3086 2245 -2043 -3182 -168 3891 4133 -33 -2528 -1230 1421 1564 -1049 -2687
1347 -2687 -876 2337 2500 -1108 -3160 -1861 2132 3535 1682 -1416 -865 1573 2546 137 -2495 -2083
1363 -2083 1632 2937 554 -3691 -4428 -759 2139 1357 -2223 -2343 855 3226 1654 -2134 -2431 947
1379 947 4024 2355 -1126 -2639 -328 1819 862 -2119 -2867 -311 2228 1270 -2250 -3701 -1677 2163
1395 2163 2478 69 -2012 -751 1682 2002 -1152 -3259 -1856 1464 2531 -468 -3906 -3309 661 2525
1411B525k038k834J158L169J189k942l228Q55L749J472k447l495m07K810J604
1426A140j859k505l4L250K281j203l387p53K842K675j42k719j175J211K353j028
1442I47l111j406K729L035o15l775j978K194L455J10k797j322K422K999q15l584
1458a512j848J910L514M23k937k797Q32K641J222k814j973J389L432Q63k560k601
1474b816Q32L079J597k159k552K42K382J382k328l346L87L436K178k165l410j85
1490c446K994K315j205k614%K654K342j606l533o93K743K429j069k851j515J855
1506a200J760p51k063o90K110K604R8l236j951J962L260N94l131k433J672K791
1522A396Ol100k333J964K948R39k450k293J266K175J175j807k309J591K744P63
$$ plain form
1411 2525 487 -2347 -1189 1980 3169 227 -3001 -2146 1603 3075 628 -2867 -3274 -464 1140
1426 1140 -719 -3224 -3258 -8 2273 1070 -2317 -3070 -228 2447 2305 -414 -1589 -378 1975 947
1442 947 -2164 -3570 -841 2194 1579 -2196 -4174 -1980 1475 1585 -1212 -2534 -112 2887 2072 -1512
1458 -1512 -3360 -1450 2064 2487 -450 -3247 -2415 226 1448 -1366 -3339 -1950 1482 2345 -215 -2816
1474 -2816 -1984 1095 2692 533 -2019 -1777 605 1987 -341 -3687 -3300 136 2314 149 -3261 -3446
1490 -3446 -452 1863 658 -1956 -1956 698 3040 1434 -2099 -2792 -49 2380 1311 -1540 -3055 -1200
1506 -1200 560 -191 -2254 -2944 -834 1770 1868 -1368 -3319 -1357 1903 2497 -634 -3067 -1395 1396
1522 1396 1402 -1698 -4031 -2067 881 1820 -630 -2923 -1657 518 1693 -114 -2423 -832 1912 2675
1538B675k741k881P76K435J328j580k524j27K125J481j325k064l37L078K391j469
1554A241l197p46K540K699j144k641j011K030J833j280k909q86K885K222k66l009
1570a639j274K056K390j30k507j110J701K317q2k548j419P33K084J026j923k271
1586b596J88L267R71k263k101J014K633J068k116k411L67K717J123k173j353P48
1602i17J759Q92j485k308q9K423J281n40k658k40K066J109m36j758n88K408N63
1619A482J06k629k114K572J799P5k515j434K297J141O93k510q70J649J920N17
1635B179k599j857J129K686p7k111j358J040K299R4k027j582Q96K461O19j311
1651D81j810L35J807M50q94j493J40J545J009j368k031n48K445J545j010k022
$$ plain form
1538 2675 -66 -2947 -2171 264 1592 12 -2512 -2639 -514 967 -358 -2422 -2759 319 2710 1241
1554 1241 -1956 -2702 -162 2537 1393 -1248 -2259 -229 1604 324 -2585 -3471 -586 1636 1370 -1639
1570 -1639 -2913 -857 1533 1403 -1104 -2214 -513 1804 1722 -826 -2245 -1512 572 1598 -325 -2596
1586 -2596 -2408 859 1830 -433 -2534 -1520 1113 2181 65 -2346 -1979 738 1861 -312 -1665 -917
1602 -917 842 1734 249 -2059 -2148 275 1556 1016 -1642 -1882 184 1293 857 -901 -1489 919 1482
1619 1482 1588 -1041 -3155 -583 1216 1291 -1224 -2658 -361 780 1473 -1037 -1907 -258 1662 2179
1635 2179 -420 -2277 -1148 1538 1461 -650 -2008 -968 1331 1425 -602 -2184 -1288 1173 1792 481
1651 481 -1329 -994 813 1263 369 -1124 -984 561 1570 202 -1829 -2377 68 1613 603 -1419
1667a419n33J867J664o63k109l24K000J827r03k199q48J366J703k89j971j091
1683a922J597J404l02j659j001J529J719Pj827j151J226J471J11j620r87R65J614
1700A174O19j827k128N62K351O05j112j448K53J980R11j377j739K92K054J112
1716B282j555k471N34J460J193j174j665L63J424J023j155j475O8J713J105m67
1732A203j504q15J604Q96k27j644r84J207J520k33j692q91Q81J919O8j514q00
1749a006O44J938m4j986j069J326J821n4j577j488P64J770M31j730j085P64J546
1766I65Q22j814j035M86J683Q69j312j135n43J819Q22j176j335l64J930M34p78
1783C38j578r4J319J578o04j439m72J520J414q65j047q60J098J402r23j511l55
$$ plain form
1667 -1419 -1952 -85 1579 916 -1193 -1517 483 2310 1407 -792 -1640 -274 1429 1140 -831 -1922
1683 -1922 -325 1079 777 -882 -1883 -354 1365 1372 -455 -1606 -380 1091 1202 -418 -1405 -440 1174
1700 1174 1793 -34 -2162 -1600 751 1356 244 -1204 -951 1029 1940 563 -1176 -884 1170 2282
1716 2282 727 -1744 -1210 250 1443 269 -1396 -1033 391 1414 259 -1216 -1148 565 1670 1203
1732 1203 -301 -1116 488 1384 1157 -487 -1471 -264 1256 1023 -669 -1560 -679 1240 1308 -206 -1006
1749 -1006 -362 1576 1532 -454 -1523 -197 1624 1570 -7 -1495 -731 1039 1470 -260 -1345 -581 965
1766 965 1787 -27 -1062 -576 1107 1976 664 -471 -1014 805 1627 451 -884 -1248 682 1116 338
1783 338 -1240 -1334 -15 1563 959 -480 -952 568 1982 1117 70 -790 308 1710 787 -724 -1079
1800a079J192R70k26j361n59Q20J202J72j520j034Q81J469N26j302j369R51R51
1817F84M32j327j190O79J600J67r47j258M20J602P59r08j285M33R65N19q93j023
1835e71p6J195P95r91j302j46J203P57q42n70o12J366J174m51j467l75J141R32
1853A160P4j173q48J193P75l07j176j096J181J313k42j175p35N74J005L82j000
1870i5o68N74J100K68j213k73M01O47K48n09j233K61J021L47o01q96o5J623M08
1889A345j046j015J42J006J067j030q33l61J028N53m34j163k41J086Q75o78j000
1906f99n9J030N80k06n04k27L84Q51n77r85k79N96N98J95p85r13O08N66L22m62
1926C4r16M69R48M41r64p68L45J192K0q11p38K90P78N43p85o22K89J100j5p01
$$ plain form
1800 -1079 113 1083 857 -504 -1063 -243 959 1131 -389 -1423 -542 927 1453 151 -1218 -267 684
1817 684 1116 -211 -1401 -722 878 1045 98 -1160 -740 862 1621 713 -572 -139 826 1345 452 -571
1835 -571 -647 548 1343 352 -950 -1096 107 864 22 -548 -1160 206 1380 929 -538 -913 228 1160
1853 1160 1234 61 -787 406 1181 874 -302 -1398 -217 1096 854 -321 -1056 -482 523 905 -95
1870 -95 -763 -189 911 1179 -34 -307 94 741 989 480 -753 -492 529 876 275 -621 -686 937 1345
1889 1345 299 -716 -574 432 1499 469 -364 -725 303 856 422 -741 -982 104 979 301 -699
1906 -699 -758 272 852 646 142 -85 299 1150 573 -412 -691 -95 503 698 -87 -1000 -392 174 496 34
1926 34 -882 -413 535 976 12 -756 -411 781 801 -10 -748 -458 320 863 78 -544 -255 845 830 129
1946A29o08L01R61k52j04r23R5P63O2l18p42k53Q26N04l18n72k23N91P03n5j130
1967e63j29O41J002j44j129j60M44Q16o7j126k31O61P90k98r52l35Q26N70l83
1986B33n58m54O16O84l60k55n55N97M88J20n32j66k58JJ167j001n0o01J822J32
2006A070r87j044N88N35L41K95j611J88O34J02q2j33o49Q77J83l35j043K01J111
2025B41O23l42j072J93J51R07o19l29K90M23K86P5j359l51L66L55R56j359n79
2044a144J011K54l19l19k43j52P68P19l29j331P40l9O99l21j81p7J016p81j04
2063a33J47J3L71m59P90j036J70K16L89j84m54l03K1M19L98r7l11j183J128K22
2083A24l72j88r5L94J444j454m11M68O95L10p25n10k29P88j77J74q55n5P38N47
$$ plain form
1946 129 -479 -178 783 531 427 -496 -401 362 424 106 -636 -889 -63 441 123 -449 -672 -81 622 567 -563
1967 -563 -692 -51 951 807 -322 -482 -38 778 711 -415 -646 15 805 507 -445 -780 46 616 233
1986 233 -325 -779 -163 521 161 -94 -649 -52 436 556 24 -142 -400 -399 768 -233 -283 -884 938 1070
2006 1070 83 -961 -373 162 503 798 -813 -625 9 111 29 -104 -753 124 307 -28 -1071 -870 241
2025 241 864 522 -550 -357 -206 701 82 -247 43 466 752 827 -532 -883 -517 -162 794 -565 -1144
2044 -1144 -133 121 -198 -517 -760 -912 -144 575 246 -1085 -345 -384 315 -6 -187 -264 752 -29 -133
2063 -133 14 27 398 -61 729 -307 -137 79 468 284 -170 -473 -452 -33 365 268 -43 -1226 -98 124
2083 124 -248 -436 -531 -137 1307 -147 -558 -90 605 915 190 -320 -549 239 62 236 -619 -674 64 611
2103F11o10q46M44L61L88K9m48n02M51O95q4r76q2M85O74j20j126m7P17P32j37
2124F09q16o82Q50Q73l18p99p7L46L22m7o97l78P08L43K29o72l76K94O69L36j127
2145d10J73l31J135K07l79r46k2J114J49m28p83J78N79L54p63n45O7P57P37q24
2165A9p91N36M58J43j9j258K32J044M54q72r90N37k7M62J101j665L82L16L51Q03
2185A216j935J96K03Q06q9q58j071J988o5N53j619Q3J81N37o8m84m37R73P48l02
2205E56j010l9M67Q93n93p34j13L79J006k59q19n48P32N47P5n26o75K75Q54o6
2225D02m51n11M37M52K04r53k17M01J022k9o89l31L25L56K1n26o81N86P49n7o91
2246a81r34J124L94r5p60p0M90K33L77r67j76K37R97j36k33r98K88N81N20o0j309
$$ plain form
2103 611 1 -845 -401 -40 348 377 -71 -573 -122 573 489 -487 -569 -84 590 470 -656 -703 14 746 609
2124 609 -207 -889 -39 834 516 -283 -360 -14 308 261 -436 -814 -106 237 466 -206 -582 -288 381 717 -410
2145 -410 -237 -568 567 774 395 -551 -573 541 690 262 -521 -343 236 590 -173 -718 -651 106 843 19
2165 19 -772 -236 222 365 346 -912 -680 364 818 -54 -1044 -507 -534 -72 1029 -636 -254 62 413 1216
2185 1216 -719 -523 -320 486 397 -461 -1532 456 391 944 -675 -592 -411 126 58 -426 -863 110 858 556
2205 556 -454 -493 -26 867 274 -460 -573 -194 812 553 -266 -814 -82 465 540 14 -661 -386 468 402
2225 402 -49 -560 -123 329 533 -420 -637 -236 786 757 68 -263 62 418 439 -87 -768 -182 567 510 -181
2246 -181 -1115 9 403 308 -452 -522 -32 201 578 -389 -565 -328 669 533 300 -698 -410 171 691 631 -678
2267f78N38M77J59j57p04J58Q31K81o59r25P6J039K41m07j195L92P38M15m85n00
2287c65k40Q88L28m71m45l3P59L2l94l14J39K01L90k14p48J46M13P5Q3m80k98
2308e48N02M45j70n44k79O00O82m84o30n7N36P55k32r97j25M43O02o3o03l43O14
2329A04K87l54n39j2N61K15K46n04l51J84r1L94j11k01K03L8J03n56J58Q7J65
2350B6n0m4k6j58R49k72m04l85L50J58p9l52M3L97m8R5n20m5N16O9j17m87Q7J20
2374a77L75n74K14O4N07k37l15k44N05L58k81l53M2J0K64j68K45m88m2K97J72
2395A74p0k71j2K81L3j51n14N35J93O5o06J24l5O22lo40k37L31Q44r1m80o21N62
2418C3L75j20k90p16O09M96j52n48j56L56O94k78n50j04K7P77j81m86n78L02P14
$$ plain form
2267 -678 -140 337 496 339 -365 -207 624 905 246 -679 -603 436 677 270 -925 -533 205 620 135 -365
2287 -365 -605 283 611 140 -305 -338 421 453 59 -255 -116 85 475 261 -487 -341 72 147 230 -250 -548
2308 -548 -46 399 229 -315 -594 6 688 204 -426 -483 53 808 576 -421 -546 -103 499 436 -167 -510 104
2329 104 391 37 -502 -514 47 262 508 4 -347 -163 -254 140 29 -172 31 69 172 -384 -226 -139 26
2350 26 -24 -68 -94 -252 697 425 21 -364 -14 144 65 -287 -244 153 105 200 -320 -365 151 220 103 -384 -297 -177
2374 -177 198 -376 -162 -98 409 172 -143 -387 118 476 195 -158 -116 -106 158 -10 235 -253 -295 2 174
2395 174 104 -167 -179 102 135 -16 -530 5 198 263 -343 -219 -254 368 365 -275 -512 -181 663 572 92 -529 33
2418 33 408 288 -2 -718 -109 387 235 -313 -469 -113 581 303 -247 -351 -324 453 272 -214 -792 -490 224
2439B24K21m19l66p0Q16jm97n07L93M55M13n72p42R6J013K10n39m81j03Q61P1
2460D76n72n00L71M47M1m09o69M07R96k25m14m13K66N70Q3m19n37M71N32O3n12
2481E3p49M00M46L34o48o00L12O98O61r88o55K59Q27L10n15j098M39R74M6r34
2501d28j41J86O83K18l75r20L99J011j20m66k16k16O06J35l51p61J31Q43O6L1
2521C15r43k76R56N95l35j021l4J090J71j33q19j14P28O62n65o94n44J522M95
2540A056j038j084%J290M92o35o49k16J219K18o55m83m05R30P65m72q96J21O11
2559A69M71m04m09n42Q92O42n31q14k17N68J015k98j067k47O58J044p84q17m42
2578a113Q73Q68k9j158l30O66R36l50r73l09Q82J110p59p12l92O75P18P4j085
$$ plain form
2439 224 445 26 -340 -410 406 405 -92 -599 -206 249 662 90 -652 -556 457 667 128 -353 -456 405 476
2460 476 -96 -596 -225 222 263 -146 -815 -408 588 363 -51 -464 -198 372 455 36 -501 -30 502 565 53
2481 53 -696 -296 150 484 -164 -764 -452 246 907 -81 -736 -477 350 660 145 -953 -514 460 506 -428
2501 -428 -569 -383 300 518 143 -777 -378 633 513 47 -169 -385 221 356 5 -756 -625 218 284 315
2521 315 -628 -904 52 647 312 -709 -743 347 518 385 -434 -548 180 842 277 -417 -961 561 1056
2540 1056 18 -1066 -1066 224 716 81 -568 -784 435 653 -2 -485 -890 40 805 333 -563 -442 169
2559 169 640 236 -173 -715 177 819 288 -526 -743 -175 840 542 -525 -772 -114 930 146 -671 -1113
2578 -1113 -240 628 599 -559 -889 -223 713 363 -610 -919 -37 1073 314 -398 -790 -115 603 677 -408
2597d08r5K09Q58j60o98l39L13Q19m5r15m28O94M19O54j363q1L22P15J20q00q09
2618a018O77R77k91k09j044M55J172p5p62q15P29R62o2p91o10O64N13j96n87m67
2638g78M84P00J51r77k33M12Q75J39o96n19OO89L16o02l52p9R82L60q62o86L81
2659b89Q20j01n25o46J50P62K54n31p85N34N17J12m96m76M34O50J97o01l34M0
2679c14Q30j9m55p27J83O32J89l86n96J46P88K05m69m73j79Q16K95m45n08Q8P07
2700C08Q5o37j82l0P52K73q44Qk12J062P4q40m2j35Q20J7m63m81J35O59J8n31
2722a86k38J0O71L03m57o74N7Q92Jk64n18n9Q08K65n24o18J85P87Pk81p34Q6O06
2745A25N00n26r09M32O08M61o32n55r7J014j28l17m88J44L89K32l80l13L59K09
$$ plain form
2597 -408 -503 -294 564 404 -294 -633 -320 499 454 -461 -889 -195 224 878 -485 -566 -244 471 591 -209 -1018
2618 -1018 -341 636 345 136 -908 -453 719 644 -118 -933 -204 758 696 -95 -705 -41 472 276 -311 -778
2638 -778 -294 406 557 -420 -653 -241 634 773 77 -442 -436 253 569 -33 -385 -464 518 878 16 -670 -289
2659 -289 531 430 -95 -741 -591 171 425 -106 -891 -357 160 272 -224 -700 -266 384 581 -20 -354 -314
2679 -314 516 497 42 -685 -502 130 319 -67 -663 -517 271 476 7 -466 -645 171 466 21 -487 -399 308
2700 308 393 -244 -426 -456 296 569 -275 -267 -479 583 657 -183 -225 -360 460 477 14 -467 -332 327 345 -186
2722 -186 -424 -414 257 560 103 -571 -514 378 379 115 -403 -462 346 611 87 -531 -346 441 448 167 -567 -481 125
2745 125 625 99 -810 -378 230 691 59 -496 -593 421 293 -24 -512 -368 21 253 -127 -440 -81 128
2765A28J27J12q64L12M68K86m05o7n41N63N96o64m95N2M01M32l16n76k05Q04L59
2786E07k39o49n5N74M89k16n10j99O51J57p84m00O43M46J90o90k48J73M02J99
2806D41l83o06J31N45N25m26q51M78M96K4n56o5M4J44M52l19l31J3K87Q35o46
2827B32r15J95J176j33j64o04o2O24M05k56j055%Q91K52m75r77P57M28M12p76
2847d5n33J48L46O67n63m36m4O06M62k43m26l30N06M52p30l92L4N93Q31m87q04
2868c88Q9L83P58n68p12J12N25N39n77n73k95Q74J94j06m22k45P08L09k90q00
2888d85L38K12O80l65n45J23jK68Q8n04j41L20J88n8p7o95O90K17J45m82o17Q10
2910A09P18M6j081j60M48N39m98l39j46J35Q35k28p80m22P91M89j88l37j49L05
$$ plain form
2765 128 255 367 -497 -185 283 569 164 97 -444 119 715 51 -444 -392 9 441 125 -451 -656 148 507
2786 507 268 -381 -436 138 627 411 -99 -298 353 510 -274 -674 -31 415 605 -85 -333 -160 242 441
2806 441 58 -548 -417 128 653 227 -624 -146 350 374 -182 -247 -203 -59 393 74 -257 -244 43 878 232
2827 232 -683 -488 688 555 391 -213 -275 349 754 498 -557 -557 334 586 111 -866 -109 319 731 -45
2847 -45 -578 -430 -84 583 20 -416 -460 146 608 365 -61 -391 115 567 -163 -555 -521 72 903 416 -388
2868 -388 -299 84 842 274 -438 -326 199 738 161 -412 -707 167 361 255 -167 -412 296 605 315 -485
2888 -485 -147 65 745 380 -165 -42 -43 225 313 -191 -332 -12 176 118 41 -654 36 253 398 -84 -701 109
2910 109 827 873 -208 -368 80 619 121 -218 -364 -229 606 378 -402 -824 -33 456 268 -69 -218 87
2930H7O15l95n36j20K73O60k92l45m27K62N50j3k08l19m7Q06N7m99m37L59N35
2951E66Q4o00j39o4M07j38k32m76K69O67K47q18k75O28O6K11m76k15K91J10J74
2972B87m12k77M77O62m79j45n82L74L30J38l58m29M36M5M83n83k14M45O9K27o79
2993a85k48J81M15P9l11m10K90O74k07k09o16L86N12K52m84m47L92K93k07j78
3013b8j94J80O08l68k35l46m1N79L58j71o43J50p5L71J37l38j13K67K10j75n37
3034d04K39O4L37j00k64O2j2M61k36l23k60N97J8l88K96k72N30l77J80m28j79
3055d59N67q2J13l75J92J41k2O8k19l33Q58n5M3m18j53N32J7n05l58P1J31K46
3077@J18l55j69P5N58k63j38M6J48J64k11p5J19j78M17k30q3l16K84L35k78n5
$$ plain form
2930 87 702 307 -229 -349 -76 584 292 -53 -480 -218 332 319 111 -208 -255 551 608 109 -328 31 566
2951 566 650 50 -89 -153 254 116 -116 -592 -323 344 591 -227 -502 126 192 403 -73 -288 3 113 287
2972 287 -125 -402 75 737 258 113 -469 -95 235 373 15 -414 22 67 550 -33 -247 198 267 494 -185
2993 -185 -433 -252 163 242 -69 -479 -189 485 278 69 -547 -161 351 603 119 -328 64 357 150 -28
3013 -28 -222 -42 566 198 -37 -383 -424 155 513 342 -301 -151 -226 145 282 -56 -169 98 308 133 -404
3034 -404 -165 -101 236 136 -128 -66 -78 383 147 -176 -436 161 179 -209 87 -185 345 -32 148 -280 -459
3055 -459 108 26 139 -236 -44 97 75 143 -76 -409 449 394 437 19 -134 398 415 -90 -448 -377 -246 0
3077 0 118 -237 -406 -331 227 -36 -174 -128 20 184 -27 -102 17 -161 256 26 -57 -373 -89 246 -32 -87
3099h7L23k39K45k14o4K83k8L01p62n9K75J31k0l2m25O3L99k08J40k84l24P83
3121A97o2j56J00K85J62l86l3K49n08M31k80L8j60j76O22j69k38k25K58K15Lk87
3143a20r5J90j7J06j26l62j43R10p0rp98L99J65J202j194M58p37O45k20j071O63
3164b24O11l17k75Q6q9O42r3O3l56j73K03q7K84o31j26L22L77k03P1k05L34k92
3186g8J94L70r98L70J35r2K61j16n45N69N9J8l04O19j70q80J070l09p35J682j556
3207d36R34q25k94J292j38l25j445P43j95L76j7K15k2P7j39J26M71r62R59M01
3227G96j604N23J99M73q39j9O7O6m41J033J11N25r64j87J47N69p8o71M48L22l7
3248D39m13q7J97N15p85j07j53L15N2pj92J85K25m14j88O6J93L48o67M70k86M95
$$ plain form
3099 -87 236 -3 242 28 -36 247 219 520 -242 -301 -26 105 85 53 -372 -309 90 -118 22 -262 -586 197
3121 197 135 -21 79 364 526 140 107 356 -152 279 -1 37 -123 -299 323 154 -84 -309 -51 164 167 -120
3143 -120 -215 -25 -42 64 -62 -424 -567 343 273 264 -534 -135 30 1232 38 496 -241 404 184 -887 -224
3164 -224 387 70 -205 -119 -208 434 341 404 48 -125 78 -9 275 -356 -482 -160 217 14 85 -120 214 -78
3186 -78 116 486 -512 -142 -7 -99 162 46 -499 70 129 147 -157 462 292 -588 482 173 -562 1120 -436
3207 -436 498 -327 -621 671 533 208 -1237 -494 -689 -313 -330 -115 -137 -60 -199 -73 398 -564 395 796
3227 796 -808 -285 -86 387 -452 -471 -404 -338 -779 254 365 890 -74 -261 -114 455 377 -294 154 476 439
3248 439 26 -61 136 651 -134 -241 -394 -79 -27 -34 -226 -41 184 -230 -418 -352 -159 189 -478 -8 -294 201
3270B01J49l9l96L33k7n27l75O63K36K72j19r81r8O39J21m52K63J64J81o59M30
3291b1L14O0o91J71J24K81kk51N7R4L38l02k53l5K5K21k28K69K4k65L89m6n53
3314b80j7Q9o4L28P8l65K24J6M58o14j10J45L24M5l62j66K08Q8mk62J34J51Kj61
3338a15j68L00rj7J05P0j58j62K17J62o91M19k32K13j38R1m1P8k63O02k20l8k2
3361a7J14N6J39k08k29J19p9K32mk05K26k86L80l26j72J94L70j84k05oJ25M6J61
3384B41j92NJ97j91k24J56p0L54j29k14K07j21oK4J06j72j17K87j5M5J2m07L22
3407I8J74k44j45K2J05K16l03R6l3K67l44pL08k04p3L6K64l30K03k73L52k98K01
3430H8P3k53K31k26J00j12j1J02j8m7O0j12N9J93j17J39m9J43m7k35L36m22O2
$$ plain form
3270 201 350 311 -85 248 221 -306 -681 -18 218 490 371 -610 -708 -69 52 -400 -137 27 208 -451 -21
3291 -21 293 353 -338 -167 -43 238 236 -15 42 136 474 172 -81 -116 -91 130 -98 171 195 -70 319 273 -280
3314 -280 -297 -208 -272 56 134 -231 -7 9 467 -147 -257 -112 212 257 -105 -271 -63 25 21 -241 -107 44 46 -115
3338 -115 -283 17 8 -9 96 166 8 -154 63 225 -466 -47 -279 -66 -204 -113 -154 -76 -339 263 43 5 -17
3361 -17 97 153 292 84 -145 -26 -105 127 123 -82 144 -142 238 -88 -260 -66 304 120 -85 -91 34 80 241
3384 241 49 54 251 60 -164 -8 -78 276 147 -67 140 19 13 37 143 -29 -146 141 126 171 183 -224 98
3407 98 272 28 -117 -95 10 226 -77 19 -14 253 -91 -98 210 6 -67 -31 233 -97 106 -167 185 -113 88
3430 88 161 -92 139 -87 13 -99 -110 -8 -26 -73 -13 -125 -66 127 10 149 100 243 196 -39 297 -125 -63
3453f3O5P8r6M66o04K18o24O74M49j389J162m76m1J92L4j06K92j48j84l0m3J98
3475B4n9J10j85K58j11J06j8R4K0j28P9p0J91j52K6k99L2L4J23j68m2J94J77j51
3499H5p0P1J20r5l22J15J98Q8l49J00J81q9J74N5p3m27K72K25q1k02n3J85p3M5
3523H0j09M9R8n6j31J36k89J99m8o1K02j94K47J08l0k70J7J78j1L10m26LR8K43
3547C43j69k44M21n60K37k93L97k25L35l36K17j35q6K38Mn3l11K66j71L45l92
3568a72L09Q3k67jK34j59M32m86k1J47j55K27k28J29L9q6J18k95n1P91o41r4k38
3591c85L37J90k47kJ10k60M13j61K22k10KK62k00k61L35k84K54J58l01rO9O7l19
3614b20K81k29K77J39k63n0J71j69k7K26k91q3J38O6Rp4j6K42m3M1k25L52k80
$$ plain form
3453 -63 2 80 -16 450 -154 64 -560 114 563 -826 336 -140 -181 11 45 -61 231 83 -101 -131 -174 24
3475 24 -35 75 -110 148 37 143 125 219 239 111 190 120 311 159 185 -114 -82 -48 75 -93 -135 59 236 85
3499 85 15 86 206 111 -211 -96 102 190 -159 -59 122 33 207 262 189 -238 34 259 178 -24 -77 108 35 80
3523 80 -29 20 118 62 -69 67 -222 -23 -71 -132 70 -124 123 231 201 -69 -52 126 115 425 -1 2 100 343
3547 343 174 -70 351 -209 28 -265 132 -93 242 -94 123 -12 -98 140 144 91 -220 46 -125 220 -172
3568 -172 137 220 -47 -48 186 27 459 -27 -48 99 -56 171 -57 72 111 25 143 -152 -203 588 -53 -147 -385
3591 -385 -48 142 -105 -107 3 -257 156 -5 217 7 9 271 71 -190 145 -139 115 273 -28 -37 32 99 -220
3614 -220 61 -168 109 248 -15 -65 106 -63 -90 136 -155 -238 -100 -34 -25 -99 -115 127 84 125 -100 252 -28
3637b8J56j47p7L93n22J72k38M28j39K59k90J68l61j4L19m3Q1L2j38k7j54J23
3659d7N0K04l58J75K81l68R7J28k70n9K34j80J95k36K7K10N0k66L5L6N7J06l62
3682b61K11P8oK82k25m3J17k47K43o8m9L21k05l70L48M7O5k72NK4M3k72L67j65
3706c2j15m9M2K84K9K63k63O2l56K86m46L64j7j11K23k07J16J0j48K5j8Q5n8n0
3730h1M2j25K65Q7k12L2Q8K4j85J40J15j64k78J92R2r2K88k17j39j98K32N7j73
3753b10L91l15K57J24K1j80m0j88J87K6j05J20m65M37l28J24O2L7l1N12n15K92
3775B13k17L8M7j43k55O27k25l15k03O77K99k30n47l00M60j58M67j72n31M33M12
3796C77p36O02o10K04p27n8N67P98n66j88K54j99N60k4L47p23n99J151l62m27
$$ plain form
3637 -28 128 -19 -96 297 -225 -53 -291 137 -2 257 -33 135 -226 -240 79 36 117 149 11 -16 -170 -47
3659 -47 3 207 -151 24 305 -63 34 162 -108 -167 67 -113 82 -154 -127 83 133 -133 -98 -62 -5 101 -261
3682 -261 -50 28 22 304 79 36 153 -94 149 81 32 353 148 -222 126 173 238 -34 -29 -5 38 -234 133 -32
3706 -32 -147 -196 -154 130 159 422 159 221 -135 151 -295 69 52 -59 164 -43 73 83 -65 -40 -58 27 -31 -81
3730 -81 -39 -164 101 188 -24 8 96 120 -65 75 190 26 -252 -60 32 -60 228 11 -128 -326 -94 -37 -210
3753 -210 181 -134 123 247 268 88 48 -140 47 73 -32 88 -377 60 -268 -144 -82 -45 -76 436 -79 213
3775 213 -4 34 81 -62 -317 310 85 -230 -433 244 543 313 -234 -534 -74 -232 235 63 -468 -35 377
3796 377 -359 243 -367 -163 -890 -948 -381 417 -149 -337 -83 -282 278 254 601 -122 -721 430 68 -359
3816c59Q2j78k72N47L97l46q15J123p91O38m07r44Q94o41J124n65J07p9M39q4
3836a30M6K41q5j5M0J6J07r9j04j55M8J05J13l03L9O7K73k06J86jk65J45K9n7
3860C5j11j01J46j60J04P4N0k58K66j61L47l30K0J8n6k57L68j81M69l35K1l1k45
3883c08K59j73J75K7J23R3k73m0J90K6J5k32RL15k5l07K82m58L64k63K17k5l8
3906d7j69J87O3k05j0Nj9N92m65M1n3k40O13j43j73n7K18j42P6n4k0k61L86J73
3930B96l79J44M9j97j46N96p07K17R1J02o4qk5K16k05r0M61m07J82j24M0K47l68
3953g9J48oj1J01j93P9P3J60k47j5j82RK12k13l4N0j00N12j90l9K08l84J37P9
3977G5lP1j52l6j55J06k8J11j38Q2m6J6RQ1j35N7J09m8N5j00J9K70Q5l16L2K41
$$ plain form
3816 -359 -277 -455 -727 -180 217 -129 -944 179 -612 26 -381 -1325 -431 -1072 52 -513 -406 -485 -46 -130
3836 -130 -84 157 72 57 97 113 220 121 17 -138 -90 15 128 -175 -136 -69 204 -2 184 183 -82 63 92 35
3860 35 -76 -177 -31 -191 -87 -13 37 -221 45 -116 231 -99 -79 -61 -117 -374 -6 -187 282 -53 -32 -63 -308
3883 -308 -49 -222 -47 -20 103 196 -77 -117 73 99 114 -118 -109 206 181 -126 156 -302 62 -201 16 -9 -47
3906 -47 -216 -29 34 -171 -181 -176 -195 397 -68 -27 -80 -320 293 150 -23 -80 138 -4 72 18 -2 -263 123 296
3930 296 -83 61 110 -87 -233 363 -344 -127 -36 66 2 -6 -31 185 -20 -110 351 -56 126 2 42 289 -79
3953 -79 69 63 52 153 -40 39 112 272 25 10 -172 -163 49 -164 -198 -148 -248 264 74 35 243 -141 -4 75
3977 75 72 143 -9 -45 -200 -94 -122 -11 -149 -67 -113 -97 -88 -7 -142 -85 24 -24 31 -69 -50 220 305 -11 21 262
4003B62l47M4j35j1K01k76M12k87n2K48J41J12m08N1p1QJ30k35L69n6k56P6L30
4026B50m12k01L72l4k7r8P4j94L30q4O2J35m53J30K49r2J73k48L84n07P1P0q9
4049a39K47o0m9m2l3m4J10J78k02p5R1L3j84L39l20J32Q6m4q7j06o1J37J23K3
4073E3nJ36L16j80j92p8j17k09L21j9J06j66J36R7j36n22m5k50Q22L02m17k06
4095b53L07n4m30L10J03L99l71K22j606J689Mo53K23N2K04K19n58RL57l45J20
4116e2n3L70o53O08J39k64N97j306O40L85r22L03N3l63r2J25N73m31L7N35p3l52
4138a96q8k8K96L8N37p26N6l19J69L3j7J78p82K28j127J176Q65m91p36L527k732
4159a39r70l88O27J289r44J503j599O19M40l16M58j010m1J213q03J250n02j129
$$ plain form
4003 262 -85 -41 -176 -187 14 -262 150 -137 -189 59 200 312 -96 -45 -116 -108 22 -213 156 100 -156 -80 250
4026 250 -162 -363 9 -25 -52 -150 -76 -270 60 -24 38 173 -280 -150 99 7 180 -68 316 -191 -120 -50 -139
4049 -139 108 48 -1 -43 -76 -120 -10 168 -34 -109 -18 15 -169 170 -150 -18 68 24 -63 -169 -230 -93 30 53
4073 53 48 184 500 320 128 50 -67 -276 45 26 132 -34 102 199 63 -459 -504 -754 68 370 -47 -253
4095 -253 54 0 -430 -120 -17 382 11 233 -1373 316 320 -333 -110 -58 146 365 -193 -184 173 -172 -52
4116 -52 -105 265 -388 220 359 95 692 -614 26 411 -511 -208 -155 -518 -610 -485 88 -343 -306 229 156 -196
4138 -196 -284 -312 -16 22 559 -167 -111 -430 -261 -228 -245 -67 -849 -621 -1748 -572 293 -198 -934 2593 -139
4159 -139 -1109 -1497 -870 419 -525 978 -621 -2 438 122 580 -430 -471 742 -61 1189 687 -442
4177d42o86Q44J000j218L64O0J83j25j064K043q93l3L12L31N21o54k50r91M26
4196b72L0m3Q49m00J72m34r3q0L40P6r5K18L12N6p03J90K6N1M20q72L0J02K15
4219I5l43N08n63K70p0K11k6k29J83J18j28L8R7n2K22m53Kj93J92J52O3p7l10
4242b93L45j64J027r98M77j023J005j342O0R08o09j95L65J7R09m7o48l21j9J031
4262D85j057J011Q0j35n80L12R38q90J93J17J20k00l87l30J13O65o12O3J26m75
4282d43L09J33q3n63M37M06l49K13P6K65l33M10P3m49J06o50R51j92m72J00m45
4303e00O91j220N16R88N08j170J42O08j898J176l11N12J8K4j07k82k32L21J81
4322c5Lk10O4j88J36R7K64r31P32k93K16K28j35M26l18p63N79O10J0m89J19K1
$$ plain form
4177 -442 -1128 -284 716 -502 -138 -78 105 -20 -1084 959 66 33 345 676 1197 543 293 -698 -272
4196 -272 -242 -285 564 164 336 -98 -191 -271 69 145 50 268 580 636 -67 123 149 200 620 -252 -222 -120 95
4219 95 -248 260 -303 -33 -103 108 82 -147 36 154 26 64 161 109 331 -122 -120 -313 -121 31 94 17 -293
4242 -293 52 -112 915 -83 394 -629 376 -966 -906 2 -607 -802 -437 -420 489 442 -206 -527 -546 485
4262 485 -572 439 519 384 -196 116 1054 164 357 474 594 394 7 -323 -210 455 -157 -94 32 -443
4282 -443 -134 -1 -84 -647 -210 196 -153 60 136 401 68 478 551 102 208 -442 509 317 -155 -55 -500
4303 -500 191 -1029 -513 475 983 -187 -45 563 -1335 -159 -470 42 60 84 -23 -305 -537 -216 -35
4322 -35 -32 -242 -178 -366 -230 -133 131 -800 -68 -361 -145 83 -52 374 56 -707 -128 482 492 3 122 143
4344A43j4L29o50r9N25j9l25l3M95k66k01J26R3p3j71L42R4N62j196M95n82K68
4366a57k17P91m00M25j5l39j24P1J46k13j25l41K68N49m15K66k9k04j12L85j61
4387D9j49O6l3J2k06K21K28k45q9R3r2o9j20L63R2j60o4J86k39K38j18r6k93q9
4411e14K62j12L35l9k12N96n74O25n78J3M82j180Q60j33L30O8P70j052m69M42
4431h0M08r97P67M8k58k3l10j39K52K34J43j33k73O02j54J01l86K41l26L94K50
4452C61m69l2J00j63L88m96O0K52l0n5j14M5J99J76l97J04J30J7k8k3j06q3L53
4475A89j41J07p6j26n8J75l52J91K93l68L21j81J2jJ63j74k4R3k08J90JN9k26
4498a41J49L09m75L07O6k67Q3J79l46K02kj44K2k0n0J30k22Q48K98j403Q31O07
$$ plain form
4344 143 129 458 -192 -291 234 215 -110 -143 352 86 -115 11 104 31 -140 202 296 858 -338 157 -425 -157
4366 -157 -374 417 17 442 427 88 -36 35 181 -32 -157 -498 -230 319 -96 170 141 -63 -175 210 49
4387 49 -100 -34 -67 -55 -261 -40 188 -57 -146 -53 -145 -214 -334 29 121 -39 -103 83 -156 82 -36 -132 -425 -514
4411 -514 -252 -364 -29 -68 -280 316 -258 367 -211 -198 284 -896 -36 -169 161 229 999 -53 -522 -80
4431 -80 328 -669 98 146 -112 -135 -445 -584 -332 -98 45 -88 -361 241 87 188 -198 43 -283 111 361
4452 361 -108 -140 -40 -203 185 -311 -251 1 -29 -84 -198 -153 46 222 -175 -71 59 76 48 25 -81 -164 189
4475 189 48 155 79 -47 -105 70 -282 -91 202 -166 155 -26 -14 -15 148 -26 -50 43 -165 25 26 85 -141
4498 -141 8 317 -158 149 215 -52 31 210 -136 66 64 -80 -58 -78 -128 2 -220 628 926 -477 354 961
4520I61j040K02k36N15l03J40k46n19R89p11L32l9l77J74J99j27JL7K32l49L54
4541A89j19k7K91k04k22j06M47J62m16j56N51k28J14r9m13P82m16p21j3M47jQ64
4563G06n99l47r3p65J308k28K7L27k36L24j095J105k07J61L14k69m62o80P54K83
4583C28j008N89o55K98K13J79p32J040r2m61N17j44N2RP0m44L11M34q07P33o0
4604C70n60P2j52P9M43o00K48J27O4j75J65J39j37n2J3L7j28j45J71K7L7j56K08
4627I5k47O6n3J90J3j44o0j55r7L89O0K8J0k06J8M81l35K15m43J48J35j90k14
4650b96M22jk47K73j33L34k64Q7pk39L5k40K02r9L06r9k3j86L07J29j86k7k38
4673a90M27m2j55MR1j81j22J84m46K53J92k9M2m3J51k09p1L36Jk45k27N99Nl98
$$ plain form
4520 961 -79 123 -113 402 99 239 -7 -526 463 -248 84 45 -332 -158 41 -86 -85 -48 184 -165 189
4541 189 70 43 334 130 -92 -198 249 411 -5 -161 390 162 276 177 -236 546 130 -591 -604 -157 -158 706
4563 706 107 -240 -333 -1098 210 -18 9 336 100 424 -671 434 227 388 702 433 -29 -709 45 328
4583 328 -680 -91 -746 -448 -235 -56 -788 252 160 -301 216 72 124 133 203 -241 70 504 -303 430 370
4604 370 -190 -118 -270 -191 252 -348 -100 27 91 -84 81 220 83 31 44 81 -47 -192 -21 6 43 -113 95
4627 95 -152 -86 -139 51 64 -80 -140 -295 -392 -3 57 85 95 -111 -93 388 53 268 -175 -27 108 -82 -296
4650 -296 126 125 -122 151 18 352 88 175 168 -71 -36 -276 -74 -173 133 34 11 -175 132 261 75 48 -190
4673 -190 237 195 40 44 135 -46 -168 16 -430 -177 15 -14 28 -15 136 -73 -144 192 193 -52 -279 320 325 -73
4697g3J66r7KQ5L5K3J7k82J16j64L84n7J3m4k93J33n1J91l18L88j50J3k11L8K10
4722G4J44m24P9L87j14Q8n03L50q6L9M6P8k16M7j61M59l55J04k27J50J26o9J22
4745A38Q2q4o5q3J30n2l5J27k01K9r8L20k49P4m5j36M18k17j29J4J27j52K3O4
4769@j74M57j75j33j31L27j7j09L7l5j30J09O4j21j17J65N2l5j05J70Kj93p8J91
4793B1P7J21m53L53k24M7RM8j16L28l51L51j88L15m75j34L83l05K43L8j41L06
4815B53k18j49M8r5J26l41M64q3M7O7o13N30j60Q5J11n3j41n7J49Q5m6q4J92j87
4839g0K04j02j7J41j70P7J11n1l03J20l50N09K95Q3m50P86j044O90j60M5O5L83
4861G92n68l70N95m50j58O92l76m2j99M10k58k19q0Q9J75l9K4J73j83m00N66L5
$$ plain form
4697 -73 93 -4 -2 83 118 141 158 -124 -8 -172 212 155 168 124 -169 -36 -87 104 -214 174 24 37 -174 -136 74
4722 74 218 -206 -127 260 146 234 -269 81 -5 34 80 158 -58 -11 -172 287 -68 36 -191 -41 85 16 138
4745 138 220 136 71 -12 118 66 31 158 -43 -14 -112 208 -41 33 -12 -148 270 53 -76 -62 65 -87 -64 0
4769 0 -174 283 108 -25 -156 171 154 45 82 47 -83 26 90 -31 -148 17 69 34 -71 99 101 -92 -170 21
4793 21 98 219 -234 119 -105 -58 -49 -1 -117 211 -140 211 23 338 -137 -271 112 -193 50 88 -53 253
4815 253 35 -114 -66 -161 -35 -376 88 5 52 119 -494 36 -124 -39 72 19 -122 -179 -30 55 9 -75 117 -70
4839 -70 134 32 15 156 -14 63 174 123 -180 -60 -410 99 394 477 27 813 -231 459 299 344 409 792
4861 792 224 -146 449 -1 -159 533 157 115 -84 326 68 -151 -231 -142 33 -6 18 191 8 -392 174 209
4883B09l13K14j72J04K0J67j42n6l0L7j96mJ67m7K1N6m8O0r0Q1K6J86K37j32n23
4908a68J96M6j47J53J50p48R60o59M28jj06M87p95q7Q0M79M4k37n18j69N02K11
4930A01l26j76J033j157J129p91P26K39p13m14J82n03M70J07j2j54M59J29k33
4949I6K24j111N75M82l32k7N34K20r39Q3L41o57R29q39l82J344j188M2Q46n46
4969c05n21J065l44J9J055l50m2o89J442j244r02K4R25j48J286j535O71o02M17
4988B22j008O58j34l1j56O12j49k00K9J73l83K31k49M69j07Q8K51o07M38J53k98
5009Bk79M16j21q2j00j35L25J79j70O0mo8J79J27m40q8K25Q3k76J74K12l79J59
5032aMm7J30J1K22o34M38j53M31l63l7j88j88KK48M9j17o0K93Ln7k89L50K32M4
$$ plain form
4883 209 -104 110 -62 42 62 229 87 31 1 38 -158 -162 5 -42 -21 35 -13 47 -43 38 64 250 487 355 -168
4908 -168 28 74 -73 80 230 -518 442 -217 211 210 104 591 -204 -291 -211 268 312 75 -443 -612 -110 101
4930 101 -225 -401 632 -525 604 -187 539 778 65 -349 -167 -670 -200 -93 -105 -259 200 329 96
4949 96 320 -791 -216 266 -66 -93 441 661 -278 -195 146 -511 418 -421 -803 541 -647 -605 241 -305
4969 -305 -826 239 -105 -86 969 619 577 -112 1330 86 -816 -792 133 -15 1271 -264 407 -195 222
4988 222 -786 -128 -262 -293 -449 163 14 -186 -157 16 -367 -136 -385 84 -23 65 316 -291 147 300 2
5009 2 -277 139 18 -64 -164 -299 26 205 35 95 91 23 202 329 -111 -199 26 109 -167 7 219 -160 -1
5032 -1 3 -44 86 97 319 -315 123 -30 401 38 1 -187 -375 -373 -125 -76 -193 -253 40 43 -14 -303 47 279 323
5057C23L45N20j503M26r42P44Q89q17m82P88L02j277P79j34O11m90l87M29O6P89
5077I79j177j44M97k48J06q2J31k30M90k41K15q48M36k25N14n69L66n3r4M26j06
5098A43K64q33L00J87J25L7k00J19k26L68m7o07l03N64n6k89M34k58R80q93n67
5119g58L51M19K51J59l39o49P19n00r36J412M72l07k25l6R6n8N38r72J99Lj00
5140b61L64N9mQ2l59K07j99M5j46K86N1mk3j41J24j25j14M68j81M1J0p6j6j7J88
5165B59n57M64j54N3r9J04N1Mo4k21nJ41O7q6J61o3J55K32n41K76l09J91K09n08
5189b40P9J77O5o0N0k39L47r1K94l07r8K3k71L27J5j77k6J25J3j75j03J27J04
5212d1j12J5K53j17O2K10n61J10R6N52l50k96j94N50k31n55O73l75N21q5p8k35
$$ plain form
5057 323 668 1188 -315 111 -831 -87 802 -15 -497 291 593 -684 95 -39 572 82 -305 124 190 979
5077 979 -198 -342 155 -93 13 -69 62 -168 322 81 296 -552 -116 -341 173 -396 -30 -83 -177 249 143
5098 143 407 -426 -126 61 186 223 23 142 -84 284 237 -370 -673 -109 -165 -454 -20 -278 702 -191 -758
5119 -758 -407 12 263 422 83 -566 153 -347 -1283 129 601 294 69 33 129 71 609 -363 -164 -161 -261
5140 -261 103 162 158 240 -119 88 -111 -66 -212 74 125 121 98 -43 81 -44 -158 310 129 170 180 104 88 71 259
5165 259 -298 166 12 65 -34 70 121 125 61 -160 -165 -24 43 -43 118 55 210 442 -99 177 -132 59 268 -240
5189 -240 -161 16 81 21 71 -168 179 88 382 75 -23 0 -271 56 71 -106 -132 -7 6 -169 -272 -145 -41
5212 -41 -153 -138 115 -2 60 270 -291 -181 -85 467 117 -179 -373 177 -54 -609 64 -311 210 125 47 -188
5234a88K25k00N98l34k10J55k7k95N10k17K1J19m88K52j77J75O2o66J91L18L5
5255a41j09l95K93L40K47l48J67K30J40l18K93n48m6J58L8J51n52j44L25L79k91
5276a31n8K58M21n79J50K39k98J07mJ5k56M00l91K24k19K61K5j26J26k04J52q8
5298B4K38m95J31q5N67j60k66j69M5J76O0k01K29l7K10j62P9k39M4j8J04k29R7
5321e7J04KJ3k95J55Q6q8J42m16M7Q2m20P06K59j91J85M02j284O49J14M54j415
5343g66J72N34O24m07o05J20q5M78k55M08m87n8O63n28L69j81j23L29N8k54o84
5364f78L08k37m9N16p6L19l1n04Q56r14J31J56L78J08o67m10P37l05M79Q7L48
5385E52j100Q35M06k10k10j59l71j08K49J04M07n67j5n21L07j83O00K39m99M46
$$ plain form
5234 -188 37 -163 435 101 -109 46 19 -276 234 17 38 157 -331 -79 -256 -81 -19 -685 -494 -176 -141
5255 -141 -250 -645 -352 -12 235 -113 54 284 424 106 399 -149 -195 -37 1 152 -400 -544 -219 160 -131
5276 -131 -189 69 490 -89 61 300 2 109 105 120 -136 264 -127 97 -122 139 164 38 164 -40 112 24
5298 24 262 -233 -102 -187 380 220 -46 -215 -170 6 66 -135 94 57 267 105 184 -55 -11 -29 75 -154 -57
5321 -57 47 49 62 -233 -78 8 -80 62 -354 -307 -225 -645 61 320 129 314 716 -568 81 195 649 -766
5343 -766 -594 -60 564 157 -448 -328 -413 65 -190 218 -269 -327 336 -192 177 -4 -127 202 260 6 -678
5364 -678 -370 -607 -656 -140 -216 103 72 -432 424 -490 -359 -203 175 283 -384 -794 -57 -362 117 204 552
5385 552 -548 287 693 483 273 114 -257 -365 -116 -12 395 -172 -187 -708 -401 -584 16 255 -244 202
5405B02M14n14k81M97o82k02N17k07N97j08m41M56l11k39M91kL3L48k78m01K5
5426h6l99J43L81n58J450o09M9P4l02M74n72R5K65o00j08P03p09K62P16o05l81
5447c17K51O89m14N37q75k42N42n78P25j18L59m50N61l47q66k08J406r31M00l17
5467a93j2L37J6L96j151Q69p87K22o42P11J97O16q60J07K13l8p60R46j291J361
5487B57k39Q9P94n45p38K30J120j281J93Rk65M61L67j64L29l13p47J44M52j00
5507E3p00O94N32o42K79l34P%M7q6J11K5K21n14M52p08O2L19N46l8l00j02N78
5530E02n61O18m53l39J90p96L39R38P2m27Po36O08p97P04k61o6L19j59R1k68k6
5552d01L9k39J304m99J33K64Ml13k07l0P37m72l89L01l43J99m15M74oj64j05L21
$$ plain form
5405 202 616 102 -179 318 -364 -566 -49 -256 341 233 -208 248 -63 -302 189 187 220 568 290 -111 -86
5426 -86 -485 -342 39 -519 931 322 371 445 143 617 45 140 405 -195 -303 400 -309 -47 669 64 -317
5447 -317 -66 623 209 746 -129 -371 171 -407 318 200 559 109 670 323 -543 -751 655 -276 124 -193
5467 -193 -205 132 148 544 -607 262 -525 -303 -945 -234 -37 579 -281 -174 39 1 -759 187 -1104 257
5487 257 18 107 901 356 -382 -152 968 -313 -120 -111 -376 85 452 288 617 304 -443 -299 153 53
5507 53 -647 47 579 -63 216 -118 -111 -111 -64 -150 -39 -14 207 -307 145 -563 -501 -182 364 326 26 -76 502
5530 502 -59 559 106 -233 -43 -839 -500 438 510 83 90 -546 62 -735 -31 -292 -358 -39 -198 -107 -375 -401
5552 -401 -362 -601 703 204 337 601 605 292 85 55 792 320 -69 232 -111 88 -327 147 141 -23 -128 193
5574A93L3n0r29K75M65o7O7p4j75K0j8J26K43R9L3l36J78J15l60K31K22k68J56
5597A79K03q8k26J16j24J04K21l34m9k73L60j43n5L67p33O16k02J56j17j22M1
5618a03J81R9k52p9J60L83n06K60kj19j22r4J8j75N81j26q9n6j22N0K20j04j6
5641a3m6M32m14J68M9j11r5J49J2k32K5k3q5R3L44o82K85J2l5K59j93L78j26j86
5665c5l9j08R5M28r9l28K3j54J74L94l64l70M58J1l70K81j69M2M5o34J126o14
5687b07J03J60M4k29p9Rn55m11J108p36N80J269j262J2K15L02q1K5n81P7K09k07
5709b35j43l4P62k25m70O93n49J44L02J01p18L13n37K08L87q6K41K55K23j38l40
5730A54j22j285J747n09L04r8r9K78l01M4m61L14l8l12Q61o19n75K43L18K84J22
$$ plain form
5574 193 226 176 -753 -478 -13 -80 -13 -87 -262 -242 -260 -134 109 208 241 -95 83 198 -162 69 291 23 179
5597 179 382 294 68 184 60 164 385 51 2 -271 89 -54 -109 258 -475 141 -61 95 -22 -144 -103
5618 -103 78 177 -75 -154 6 389 -117 143 141 22 -100 -194 -176 -351 230 104 15 -41 -163 -113 107 3 -13
5641 -13 -59 373 -41 127 176 65 -30 119 131 -101 -76 -99 -184 -91 253 -429 -144 -132 -167 92 -101 277 151 -35
5665 -35 -74 -182 -87 341 242 -86 -63 -217 -43 351 -13 -383 75 86 -284 -3 -172 -130 -85 -719 407 -207
5687 -207 -104 56 100 -129 -208 -199 -754 -1165 -57 -793 -213 1056 -206 -194 21 323 242 267 -314 -237 -28 -235
5709 -235 -378 -412 350 125 -345 348 -201 -57 245 346 -372 -59 -596 -388 -1 -87 154 409 632 494 154
5730 154 32 -1253 494 -15 289 191 92 370 69 113 -348 -34 -72 -384 477 -142 -717 -474 -156 128 250
5751B50n42J90j14k61l3N08K01l33o7K31K67k08L42J53m76n52L51k4P27q13P42
5772E39k83L3pj11n50O16P01j348M04m20Q27l83o9j2n3l5R6J91j39K42l15k7L
5795a00k39K29J81k43j34K17J85j46J6Q6q3l07N66J05k88j51l9Q4L08j67k40o8
5817b28M38n2m39K53L39l50K03j65J72p4Jm2N8o8J17k33j12K33j41n7J39J83k83
5840a08J59k06J25J15l5r2k51K34K07R4o7j42l0J4k0Q9M4p4m2O9k94P0J71J0k07
5865a67m8L87j41O1M0k5p3K8j10J61K8j54oj15L02r1k89L71j01O5j13J2j90nJ93
5890B0K11k99L4k43l9M94Qm57J20j68M8K5J94j88L34P5j55n90J329j213K89q26
5912i97R04M30l28K97j38j72J69M1m77J78K24j27r6J26p4j99K41J9j7r8j43L23
$$ plain form
5751 250 -292 -102 -216 -477 -510 -2 199 -134 -201 30 297 89 431 584 108 -444 -93 -117 610 -203 539
5772 539 256 289 282 171 -379 237 938 -410 -6 -426 401 18 -51 -63 -116 -151 -55 136 -3 239 -76 -103 -100
5795 -100 -339 -110 71 -172 -306 -89 96 -50 -34 52 -31 -338 228 333 45 -106 -145 -61 247 80 -160 -228
5817 -228 210 158 -281 -28 311 -39 164 -1 171 97 98 56 114 46 163 -70 -182 51 -90 -147 -8 175 -108
5840 -108 51 -155 -30 85 50 -42 -293 -59 148 242 175 33 3 17 -3 86 130 56 14 83 -211 -141 30 40 -167
5865 -167 -215 172 31 92 132 107 34 62 -48 113 141 -13 -19 -134 168 77 -212 159 58 123 10 22 -168 -173 20
5890 20 231 -68 -34 -277 -316 178 186 -271 -151 -319 -271 -246 -52 -240 94 169 14 -576 753 -460 -171 -997
5912 -997 -93 337 9 306 168 -4 165 206 -271 -93 131 4 -92 34 -40 -239 2 21 4 -94 -237 86
5934H6o9K04l15J76k40J21K9j60p0M48j52K85j37l91J33J69j75J90q86p5R85M63
5956F19l49j7k59P53r51J74j04O00l53k56L93k47o8J42O6j11j5j02J50k62L34
5977A37l02p4L56k8j83R1j92J17j63M38l47p8K70J26l14O4K3O8l05P0M11m57K01
6000g1j30N46j34l01L78l80N7J9L2J75J33l21q9J22J40K19j72k03r5J04J94l34
6022a11L41j50r9j45j06J82J41J28l29o4L82m68L18J45j93j03OJ36J5K81l56M9
6044@K5J64k70j2P5q7K44q8o4J54k00rK33k66K99l08M11m01K37k79l84O05n35
6067d56L45N4M8J49l8K71o25K52k28J66P0k7Q9p4p6L02l02l0M3J14N4j91P4O6
6091E0k09J63j33k01J93L0K23j4Pr2R0k93Q5J43q8J66j99j79L04Q3p0J15l33K05
$$ plain form
5934 86 17 221 -94 82 -158 -37 -8 -168 -238 210 58 343 206 -185 -52 117 -58 132 -754 -829 156 619
5956 619 270 253 -6 747 -204 -30 -134 466 113 -143 250 3 -65 77 143 32 17 -85 65 -197 137
5977 137 -165 -239 117 89 -94 -3 -195 -78 -241 197 -150 -228 42 168 -146 -82 -59 9 -296 -226 185 -272 -71
6000 -71 -201 345 211 -90 288 -92 -35 -16 16 191 324 3 -86 36 176 395 223 20 -75 29 223 -111
6022 -111 230 80 -19 -164 -270 -88 53 181 -148 -212 170 -298 20 165 -28 -131 -125 11 26 307 -49 0
6044 0 25 189 -81 -93 -18 -105 139 51 -13 141 -59 -68 165 -101 198 -110 301 -100 137 -142 -526 79 -456
6067 -456 -111 -57 -9 140 102 373 -252 0 -228 -62 8 -19 70 -4 -80 222 -80 -110 -67 47 101 -90 -16 50
6091 50 -159 4 -129 -330 -137 -107 116 102 109 17 107 -186 -101 42 -46 120 -79 -258 46 129 59 174 -159 46
6115D6j71K32k6k44K71k87K7k2L82k13k52L93j51K85m7k06J24j47J52m22p6L66
6137A4P0J13j00j24L08j01l87K36M7O2k41P1K47k31J5jQ3j96K49J4k09Om9N4J65
6162A15o0j36o3N7J29K8N0j65L6mJ81j11j74k2r2J49Q9m6K18j31R2M7l74K29j85
6187a43M07l13m4K59l23m7L52k20o3m9O9P6J47j59J58Q8l41rK79j42K11l18k13
6210c38K04j5K22j07oJ05j09n7K13J01k94J4p3K48j82O7j11M88l23o1Q5k57K57
6233G1j13m6M9k80Q1K14P2k2J0J16k18K38R0n66p5M22Pj79R8K04k77K94j73R6
6257A13k28J42q5P0k9J94jo3l8k9r8N8N8j13M27l84P4j44M13l41m9l45L32J03
6281C7j20m6K37p5j53L21R1k78l50L59k70K09J92k57K5K11k11j22O71m37j52M3
$$ plain form
6115 46 -125 107 81 -163 108 -179 -152 -174 208 -5 -257 136 -15 270 223 17 141 -6 146 -276 -352 14
6137 14 84 197 97 -27 281 180 -207 29 76 138 -103 -32 215 -16 -1 -2 81 -115 134 148 -61 -55 -104 -50 115
6162 115 55 -81 -144 -87 42 70 120 -45 -9 -13 168 57 -117 -139 -231 -82 7 -39 179 48 140 187 -187 42 -143
6187 -143 264 -49 -93 166 -157 -204 148 -72 -135 -184 -115 -39 108 -51 107 195 -146 -155 124 -18 193 -125 -338
6210 -338 -134 -149 73 -34 -40 65 -44 -101 112 213 -81 -67 -140 108 -74 -7 -118 370 47 -14 71 -186 71
6233 71 -42 -88 -39 -319 -238 -24 48 26 36 152 -66 172 262 -304 -379 43 50 -129 -31 173 -104 190 17 113
6257 113 -115 27 -58 12 -17 177 176 113 75 46 -52 6 64 -49 378 -6 68 -76 337 -4 -53 -398 -66 37
6281 37 -83 -129 108 33 -120 201 292 14 -336 23 -247 -38 154 -103 -78 133 -78 -200 471 34 -118 -75
6303g5L3R8K45k87J28J60k57Mm41M95m0L7j20J40k29L72k56r4J11J82j57l95L06
6326d0j7K5Q7j14J24m75L22%j59K43j29L47k17j04K8K83k50j08K48j14K03n8k64
6349a39K07j29J35M0k19L22k32j83j1J68j17j69N10l99K32O7j92J95J02r2L1r0
6371C7r4J87l0ql3K44p0k38J38k18K20p6J83l61K38k9n37M15j98K29J25Q5l74
6394a65j56L41J3P5l32K9j7M03j26j00K02j16j49J91p5j09J55j10K58Lj02l30
6416b17J48M8j15P7N8m1J20j78p7K99j81j45O2k20J45O1L77l61K29K18o92M66
6438H1j5l22K08n62J066l89l34Q4k03L61o23N16m52J61Q65j29m36j99L53l8Q9
6459H2k84M08k64L74j61n82M50J9j95J64j49m4k9M84j55k17j89M31l99K80J52
$$ plain form
6303 -75 -42 56 301 14 142 302 45 49 -392 103 63 100 -20 120 -109 263 7 -87 24 206 49 -346 -40
6326 -40 -57 -32 55 -59 65 -410 -88 -88 -247 -4 -133 214 -3 -107 -79 204 -46 -154 94 -20 183 125 -139
6349 -139 68 -61 74 114 -105 217 -15 -198 -209 -41 -158 -327 183 -216 16 83 -109 86 188 96 127 37
6371 37 -57 130 100 92 59 303 233 -5 133 -85 135 59 242 -119 119 90 -447 -32 -230 -1 124 209 -165
6394 -165 -321 20 33 108 -224 -195 -212 191 65 -35 167 51 -98 93 18 -91 64 -46 212 215 113 -217
6416 -217 -69 -21 -136 -59 -1 -42 78 -100 -177 122 -59 -204 -142 -362 -217 -156 221 -140 89 307 -385 81
6438 81 66 -256 -48 -610 456 67 -267 -183 -386 -25 -648 -132 -584 -423 442 313 -123 -322 31 -7 82
6459 82 -202 206 -58 316 155 -427 23 42 -153 11 -138 -182 -211 273 118 -99 -288 143 -256 24 176
6480A76k36J25j45Ko9R4J3p7J28j69M5m5L72J48k35M7k91o1M0Q3p9l54L97P5L17
6505C01j63m1j72j07N4J84j10L2L26k65j57P3K17j13K8o2j48q7L2M20k18J41j78
6528a3k74K91j9j79K35J04j49j14J83p6N0J8k61N6J48j79L77m71K88OPk73M88
6551B43m44J66K00m79L79l54M83j55J63m00k57M27j76p1J147j138N72K76j001
6570d19P74n35l81Q59p2n1n62K25p0O20m07m38K90M63j99j11k59M26j99L52l98
6591i2j13K54J25n14J76P3l25N69K07m81M67%j43q5j17Qk12L04J56jl17J25j52
6614h8M7L93k73M32o89J04L26j96J33l04Q8K05l72L27Q8n2n27M80J54l81J43J62
6636B00l36N10M9j179R05k83K06k76N28l44P1j93J91l58K59J64k05j74L58P6j59
$$ plain form
6480 176 -60 65 -80 -78 -147 -53 -40 -117 11 -158 -113 -158 214 362 127 174 -117 -178 -138 -55 -134 -488 -91 -16 301
6505 301 138 97 -75 -182 -128 56 -54 -22 304 39 -118 -45 172 59 87 25 -123 -210 -178 242 24 165 -13
6528 -13 -287 4 -15 -194 41 145 -4 -118 65 -11 39 57 -204 -148 0 -179 198 -273 15 21 28 -245 243
6551 243 -201 -35 165 -314 65 -289 194 39 202 -198 -455 -28 -204 -275 872 -266 306 582 -419
6570 -419 355 -180 -561 298 226 175 -387 -162 -232 388 -19 -457 -167 296 97 -14 -273 153 -46 306 -92
6591 -92 -205 49 174 -340 -164 -91 -416 153 360 -121 346 346 203 118 1 9 -203 101 257 256 -61 64 -88
6614 -88 -41 352 79 511 -178 -74 252 56 189 -115 -27 178 -194 133 221 169 -358 122 276 -105 38 200
6636 200 -136 374 423 -756 149 -134 72 -204 324 -20 51 -142 49 -309 -50 114 -91 -265 93 169 10
6657A0L0l7j19J22R1P9j63r5PQ1l0l12L88j33J31j52p8M3k4K15K8j21l1J95j90
6682f5k8J45q0n7K63m21K87j79M04l75K37j55J48j63R7M9P2k30J97l40K74k06
6704a26K65Q8j70j05K17k09N2O9j02M15k04m80O11j24m96K87mJ62l04K18k16J63
6726GoM5P3k55K77k87K24O5j64N3k99L81k29K19k58L78l11O0J74J58m65N0Q1K9
6750@J69k51mJ51J42k0j30O2j42j84L32J61k07r4K07m71M15m34J52M18j98J38
6772B12j47Q8l65J30j12M67j56k20k52L05J99k27K7p0J35J1r2J96k40J7N9J18
6794H3K42k30J19l27K19p2j31K28k4Lj09J9j27R8j42K80k03m9j62J37J43m4L03
6817B54k16m84Q73m89l26P84j49j11j20j62K72Ok32J85j87J17J27l03L82j23p
$$ plain form
6657 10 40 3 -116 6 97 176 13 -82 -75 6 -24 -336 52 -81 50 -102 -180 -137 -161 54 82 -39 -70 125 -65
6682 -65 -93 52 -28 -85 178 -243 44 -135 269 -106 131 -24 124 -39 58 107 179 -51 146 -194 80 -126
6704 -126 139 227 57 -48 169 -40 12 81 -21 394 190 -290 321 197 -299 -12 -16 146 -158 60 -156 7
6726 7 1 46 119 -136 141 -146 78 143 -21 32 -267 114 -115 104 -154 224 -87 -27 147 305 -160 -110 -29 0
6750 0 169 -82 -86 65 207 187 57 119 -23 -207 125 286 79 -15 192 -279 136 -298 -146 272 74 212
6772 212 65 153 -212 -82 -194 273 117 -103 -355 -50 149 -78 -51 -121 14 25 -67 129 -111 -94 -35 83
6794 83 325 95 214 -113 106 34 -97 131 107 110 1 20 -107 -9 -151 129 -74 -123 -285 -148 -5 -49 254
6817 254 38 -446 427 -62 -388 396 247 136 16 -146 126 132 -100 85 -102 15 142 -161 221 98 91
6838I1K45n00J70O2j53P5l5j92O01l19k7o3O0K10n17M21p4J41Lk56P1K25j42l8
6862E9k79l1L98n7j45K27lk01o4J15r9r9J27J78k01N2K81k68k2K9J36k03L6J28
6886I4Q0l12J56j50k1J60m5M23k94M0n7l9J28m35N01j0k70M33m18L12n24L94L65
6909E11k36k89J3K1j80P3J30l6K7k33L79j86k30L2K67k46J78J0m0j00K6M13m17
6932a13k93K30L38j86m4K27k63o6pL64l58J15OK69O8l19k5k15M52k29K38j04j03
6955a8j97O0l55L74J3K35Q7j73k3K9P8J39k57J05l30J16J22O7K0J32m71o8L25
6978A0o0r3J92k72K59n3j52K54M2j46K26k17Nl2j66k0M76k40J3Kk94K68k2p9J18
7003A9j29K77k96n4J37n3lp1J18M4o8j51L36j26P1j19J14p8J61o10L55N1L05m05
$$ plain form
6838 91 336 -164 6 68 -85 -10 -45 -237 364 45 18 -45 15 225 -292 129 55 196 199 -57 14 239 97 59
6862 59 -220 -251 147 90 -55 172 169 -32 -96 19 -80 -179 -52 126 -75 -23 258 -10 -32 -3 133 -70 -34 94
6886 94 174 -138 18 -132 -153 7 -38 385 91 131 74 35 163 -272 229 219 -51 382 -36 276 -248 146 511
6909 511 275 -14 -1 20 -160 -87 43 7 34 -199 180 -6 -236 -204 63 -183 -5 5 -35 -135 -109 304 -113
6932 -113 -406 -176 162 -24 -68 159 -104 -170 -177 187 -171 -56 -50 219 287 -32 -57 -272 180 -49 189 85 -18
6955 -18 -215 -155 -510 -136 -123 112 199 26 3 32 110 249 -8 97 -233 -117 5 72 92 224 -247 -315 10
6978 10 -50 -143 49 -223 36 -17 -169 85 127 -19 207 -10 -5 -37 -203 -223 253 13 26 28 -266 2 -20 -99 19
7003 19 -110 167 -129 -183 -46 -99 -102 -173 -55 -11 -79 -230 106 -20 51 -68 46 -32 129 -481 -126 -75 230 -175
7027a75J3k7L28j40r9L2K35m41N73l81n98k54J445K50r68M53o83K68O78M0o1L32
7049H20l97L30j2j174O89J95j17M2J45q48M29j71K58p25J67J039q72m0r91O11
7069f22K82N19k80L10j42o64P80j37R7o13R20l98j10K80k2n56J92L09q38O28K81
7090B16Q5N13r52L24J39p7o28O47q57L11N26j705J191M80k14j26l97o59P54M92
7110F3K90l38K18J32K8j80L65j027M43M96r23M41j84M57J92j45J09l26P8J56j059
7131g14R21k39l25M99j14j67K02J55k92k04J08O9j19J026q28J79N12o79P03j237
7151e44K57M43P6O02m95o33k03J069k41K0K16k65k56K11m62J00J86l03J80n15
7171e57M01K34j66K0l86L59J86J95K97k7j455J200j609P17J705j437Q95n38L71
$$ plain form
7027 -175 -162 -189 139 -1 -100 -68 167 -274 299 -82 -680 -934 511 761 -207 246 -437 -169 509 549 488 820
7049 820 423 753 741 -433 256 451 334 376 521 -327 102 -69 189 -536 -369 670 -202 -242 -1233 -622
7069 -622 -340 179 -101 209 67 -597 183 46 143 -470 450 52 -58 222 200 -356 -164 145 -693 -65 216
7090 216 301 814 -138 186 325 248 -380 267 -590 -279 247 -1458 -267 213 -1 -127 -524 -1183 -429 63
7110 63 353 15 233 365 393 213 578 -449 -6 490 -433 8 -176 281 473 328 437 111 189 345 -714
7131 -714 207 -32 -357 142 28 -139 63 218 -74 -278 -170 -101 -220 806 -22 157 669 -10 693 -544
7151 -544 -287 156 232 834 339 -294 -497 572 331 351 567 302 46 257 -205 -105 81 -222 -42 -557
7171 -557 -156 78 -88 -68 -454 -95 91 286 583 556 -899 301 -1308 -591 1114 -323 572 34 405
7190D05p6m56O99l92J7k38n51R79n2o53J09L87J98k75j10q0l08L14j7J26J73j86
7212A3j63J27kq3m4Q0%o5L37l04J98m62P83J10m61L22m92J43r1K01J84k06k91
7235a66J55M3K62o34M91k68K14j76j68K70j6Oj5L77k50j21p7J55K89k38j68o0
7257i5R1j69J41K5r9Pj54M89m05j07K65Q8p1j8q5J70P7K8o1o8j78K00j77K05j07
7282hK2L1M7l07M6M12m97L95r0m5L92m35j11L87j25O78n80L05l54k6k67O57J54
7305F81j188l19N6L63Q99O83p58q65L3O30j35l83N03J46m09l8j16q2J34P27p82
7326b20L88k44O83m55j00J0K49k53%K42j41n46J297o61K34j146P67j19K4r0J47
7347F6k22J79k9j23j35L33k86JJ96N3J68l25r7M2L06k74J20k3k28M63k23p1J16
$$ plain form
7190 405 329 -127 572 180 197 -41 -592 387 335 -318 -209 178 376 101 -9 -89 -397 -83 -100 26 199 13
7212 13 -150 -23 -25 -108 -152 -72 -72 -137 200 -104 94 -368 415 525 64 386 -106 37 -54 147 331 125 -166
7235 -166 -11 32 294 -340 151 -117 97 -79 -247 23 7 13 -2 375 125 4 -73 82 371 133 -35 -95
7257 -95 -4 -173 -32 -7 -106 -99 -253 236 -169 -276 -11 77 6 -12 -97 73 150 178 117 49 -129 71 -106 99 -8
7282 -8 14 45 92 -215 -169 243 -254 141 51 6 398 -37 -148 239 114 792 212 517 163 137 -130 527 681
7305 681 -507 -826 -770 -407 492 1175 417 -448 -415 215 80 -303 200 346 -63 -101 -217 -299 -165 562 -220
7326 -220 168 -76 607 152 52 62 311 58 58 300 159 -387 910 249 483 -663 104 -15 9 -81 66
7347 66 -156 23 -6 -129 -264 69 -217 -216 -20 33 201 -124 -221 -179 127 -147 -27 -50 -278 185 -38 -109 7
7370Gj97L48r2k13J59J17l11K15k14M21k19K12k06k71l8Q79m84R0j80j85M74k54
7392E8l0O8k24L20M0Nn44M31m65L56L22m76L6k4j02J18q2K58o3j06R6J40n1j95
7416a14L63k63J15k65J75n4J69j14k54K47N0q2J63j22J06l01J00J6J04P1k84J
7438a73L30o6R1N6j48l01J38m9N6qmJ65k27RK08O0j71l2n5J20O5j23K0J40k90
7463a89K83j58RJ74J10n7J0k49M5Q6J51j96n1N5q3L26k85Q0o0k13j53oK82L00
7487B11o22Q26o40N11m29j64N53o9l04k34L67n17NR49r5p07N00o05L72M85l51
7508D2q9J84J9n36O29O33j134N73j40l18j34J13M74l67m7J92k19J83k75J58J25
7529F6j10q1J18l7R3q6l26L72l11K97K4n5L7l6j16L34l49K30j96J71k69N13k70
$$ plain form
7370 7 -190 158 66 -147 12 129 -182 33 -181 240 21 233 27 -244 -282 597 113 203 23 -162 312 58
7392 58 28 96 -128 192 232 237 -307 124 -341 15 337 -139 -103 -127 -229 -111 -193 65 2 -104 -8 132 81 -114
7416 -114 249 -14 101 -164 11 -43 126 12 -242 5 55 -27 136 14 120 -181 -81 -65 39 110 -174 -173
7438 -173 157 91 182 238 90 -211 -73 -122 -66 -74 -78 87 -140 -131 77 137 -34 -66 -121 -1 64 -59 -39 101 -189
7463 -189 94 -64 -55 119 229 172 182 -67 -22 64 215 19 -32 23 -60 266 -19 61 1 -212 -365 -371 -89 211
7487 211 -411 415 -225 286 -143 -307 246 177 -127 -361 6 -511 -506 443 348 -359 141 -464 -92 393 42
7508 42 -47 137 156 -380 249 882 -252 321 181 -137 -271 -158 316 -51 -98 94 -125 58 -217 -59 66
7529 66 -44 -125 -7 -44 49 -37 -363 9 -302 -5 19 -36 1 -35 -151 183 -166 64 -132 39 -230 283 13
7552A3J94j40RO2j07n0K36n88L91M8K15l43j36J96j92K16o5R0j33L78j80k4R3
7575A83k33J61o2j67j39N85l31k14J15n4K46j50k39N07n98M71j13P6j05j24L69
7596A84q54J423p52m89K71o6j16M04k51R49p70j29K1J43O93q93j11O88k35J2Q13
7617I35j315R2j20K91q43P32M80m57O3M39m28k89P28n03L41k99L38p1j04k1O6
7638E5j0J59m28L91l73P0o7N16l19q3kP7l62L34o6K14Q2k94K70n1j26L39k56j19
7662d9L29j64j83J60l7j09R7m7K51l07o8J21p0j46Q0J87L8l5K0J73j05m92M03
7685D7J42l76J76j35O3J07j36J26J83N5k13m6Q3n9j50K43k30J16j10K69k59J27
7707B3j0J85l71K97k90J62m6K6l24M37J63l79J7J36q0J75j19j15K08l96O9K47
$$ plain form
7552 13 207 67 76 138 31 -19 217 -371 20 68 283 -60 -196 0 -192 24 -41 49 -84 294 114 90 183
7575 183 -50 111 49 -118 -257 328 -3 -217 -102 -156 90 -60 -299 208 -390 81 -32 44 -61 -185 184
7596 184 -670 753 1 -488 -217 -283 -399 5 -246 703 -67 -196 -175 -32 661 -232 -343 345 110 122 935
7617 935 -380 -288 -408 -117 -960 -228 252 -205 -142 297 -131 -420 308 -195 146 -153 185 114 10 -11 55
7638 55 45 204 -224 167 -206 -136 -203 313 -6 -89 -91 -14 -376 -42 -108 106 188 -106 164 113 -13 326 70 -49
7662 -49 280 116 -67 93 56 -53 44 -3 248 -59 -127 -6 -76 -222 -142 45 83 48 68 241 136 -356 47
7685 47 189 -187 -11 -146 -83 24 -112 14 197 252 39 -7 76 17 -133 110 -120 -4 -114 155 -104 23
7707 23 13 198 -173 124 -166 -4 -50 -24 -348 89 252 -127 -110 26 -54 121 2 -113 95 -301 -232 15
7729A5J44j0j37J44r1k77L20J52j5l46K39j96n0J53r3K61m05L0J52r8k46L28j34
7752a60K19Lm1l46M24j84J27M4l59J19J95k07j38N19m25kJ5R0P3P3j27j8K67l07
7776a46K81l71L83j7j18j29nK81Ol95J40j6J92j63J27j3Q1j67L50j02k10K48m60
7799b23L95j89oJ14l3j90L6k44N81l17J82k13J99M1M0l75N26j55k63m15J008k51
7821B48l84j68K28k72L36l35R9j55K73N79n84M7K75R7M77r59k12K040k595R62
7841cl7m75J340l77j128J346j305J643j588j21J040r04N01L57k0O36n17j320m77
7860a409R45N61n17J401j164N76K40r79N93k24o67L98k69Q33o79N53k93J11o1
7879e1N44k89j40j26m65N34k85O63p34JN02K88j42j74p1J45J6K11j94l63j09k64
$$ plain form
7729 15 159 149 12 156 65 -212 108 260 245 -101 138 -58 -108 45 -48 213 -192 -162 -10 -108 -354 -26 -160
7752 -160 59 62 21 -325 99 -85 42 86 -273 -154 41 -166 -304 215 -210 -212 -197 -107 -34 39 -88 -106 161 -146
7776 -146 135 -236 147 130 12 -117 -122 159 165 -230 -90 -106 86 -77 50 37 118 -49 301 199 -11 237 -223
7799 -223 172 -17 -23 91 58 -132 -96 -340 241 -76 106 -107 92 133 173 -202 324 169 -94 -509 499 248
7821 248 -136 -304 -76 -348 -12 -347 -248 -403 -130 449 -135 -88 187 284 761 -198 -410 1630 -965 -3
7841 -3 -40 -515 825 448 -680 666 -639 1004 -584 -705 335 -569 -68 289 269 905 388 -932 -1409
7860 -1409 -464 97 -420 981 -183 393 633 -346 247 23 -644 -246 -515 318 -361 192 -101 10 -51
7879 -51 493 204 64 -62 -527 7 -278 385 -349 -348 154 442 300 126 55 200 216 427 233 -130 -239 -503
7901e03P19m20O87o22M59j86r97M08P47k49J138p37j083O77k17l41N53K00K69
7920E02K01j254R61q51Q77l95P5l70J06K99k32M6o69J171j19j80k28M79m06j93
7940a80M78j22p1m2K2q9O0l70L60J80m16R1K16L0p7O5j92K3Nn57P83j54n40M15
7964h2J87k70N31j33l43K63m0M22m41n5M0k44J84L26n52K82r1R1p2J00l40K30
7986gJ31j15L6p3k23O12k81k1q3L2k11L04O2l69K95j15K56k44r0j37L93j47K62
8009B67k23n42Q22o30Q55j274R93N65p16M97r45Q22j102P66o31J229R68k927K23
8028i83O61N31K79k79R4n36m38J252l39j88m0m84M38Q9L06n73P44l07j52k92K48
8049C1k67J81j85J05K87j57k55%k34N91K30J07l11l02M72p11J110l34n88k46L02
$$ plain form
7901 -503 216 -204 483 -139 320 134 -863 -455 292 43 1181 444 -639 38 -179 -520 33 233 502
7920 502 703 -551 410 -441 436 41 116 -254 -148 151 -81 -35 -704 467 348 168 -60 419 13 -180
7940 -180 298 176 105 63 85 -4 56 -314 46 226 -190 -99 117 147 70 135 -57 -34 -29 -586 197 43 -497 -82
7964 -82 105 -165 366 233 -110 153 113 535 94 39 79 -165 19 345 -207 75 -16 75 3 103 -237 -7
7986 -7 124 9 45 -28 -251 361 80 59 -24 8 -203 101 163 -206 89 -26 230 -14 -104 -241 152 5 267
8009 267 44 -498 324 -306 549 -725 268 833 117 614 -331 491 -611 155 -476 753 1721 -1206 -983
8028 -983 -322 209 488 209 303 -233 -671 581 242 54 14 -470 -32 57 363 -210 534 227 75 -217 31
8049 31 -236 -55 -240 -135 152 -5 -260 -260 -494 97 327 434 123 -179 293 -418 692 358 -230 -476 -174
8070a74O33q58j14N59k84P80q41N02O58j010O94j002P03J99j073N2J422l65o94
8089b13N1L24n15J104o24J47j1R48j344m20K39J86Q2l82J250q03N81q94J026j070
8109c38N63j210J71M73J04O15l75J56q4K12p32K71N30O61q18p22K26J25L96m42
8129b18M92m32O5o1L28j45J68j72l3p2k93M37J38k76r1P4K31L3o7j67J88Jj77
8152d9K99n18O8N44o66O16L3j86n1l06Q41j272M75l33O16j86L78l57M1K00l09
8173a22kl17k55O79K20k77J95j95j87J16K23p54N95l2O9O6j40J81
$$ plain form
8070 -174 459 -399 -513 46 -238 542 -299 203 861 -149 545 -457 246 445 -628 -576 846 481 -213
8089 -213 -162 162 -353 751 127 274 263 1211 -133 -553 -314 -128 -46 -428 822 19 600 -294 732 -338
8109 -338 225 -985 -814 -341 -237 378 3 159 75 287 -445 -174 356 1017 199 -523 -297 -172 224 -218
8129 -218 274 -158 -93 -154 174 29 197 25 -8 -80 -373 64 202 -74 -165 -91 140 173 106 -61 127 128 -49
8152 -49 250 -268 -200 344 -322 294 327 141 90 -216 625 -647 -172 -505 111 -75 303 -54 -13 187 -122
8173 -122 -124 -441 -696 -17 203 -74 121 -74 -261 -145 78 -676 -81 -113 -44 22 -118 63
8191F3
$$ Imaginary data points
##PAGE= N=2
##DATA TABLE= (X++(I..I)), XYDATA
0@%%%%%%%oJ4j6J6j6K2l0L2m0M9n7P1q4R6j12J32j51J73j97K24k56K91l30L72
31A97m19M71n27N88o56P31q12R01j000J109j227J357j504J667j846K051k285K549
49A345k856L217l647M170m824N671o812Q446j1003J5598k6457R9129R0875j63650
63I202j03138P182J06831M4741l6585p2327p858M2361M2932j3375k8563l056L3057
76B1404J4341j3730q401K8103J4828m3600p3814j0415P6483Q4550j2083j00832
88b3166q1606L1887J07974O3393m6850q8466j5821P2883O2998k4929p8238l4274
100e4215M0117N3578N166l5643k7664k247M04p548O317L9483M1433r000o3077
113a2896m9728K8186Q1027L8618m9657p6713j0050O5094N2401k8940p7506l3180
$$ plain form
0 0 0 0 0 0 0 0 0 -6 8 -8 8 -8 14 -16 16 -24 25 -32 39 -45 51 -61 71 -80 93 -104 120 -136 155 -175 197
31 197 -222 249 -278 310 -346 385 -427 474 -526 583 -644 713 -791 876 -970 1081 -1204 1345
49 1345 -1511 1706 -1941 2229 -2595 3076 -3736 4710 -6293 9305 -17152 81977 172852 9202
63 9202 -93936 -86754 20077 64818 28233 -44094 -51952 -9591 33341 19966 -8597 -11653 21404
76 21404 35745 22015 13614 41717 56545 12945 -60869 -71284 5199 89749 77666 -23166
88 -23166 -104772 -72885 35089 98482 51632 -36834 -52655 20228 83226 58297 -19941 -54215
100 -54215 -14098 39480 44646 9003 -18661 -20908 -20504 -28052 -21735 17748 59181 50181 -12896
113 -12896 -62624 -34438 46589 85207 35550 -41163 -51213 13881 66282 37342 -40164 -73344
125g3344N0895P6492J7617n5347o1838n123M1823L3763r77j2322M02j329k1128
138a0416j9182J2755M1381K0495k7855m2648l398M2188L2807k6175o0697k0948
150f1693N1019O7792N561o2305o2790M673N9372M7876m755l7273k3007N801J4981
163E252R27o264M45N415k379j1746l965J0625R182j3368k4914Q28L9983M2291
177E2312n382n3028m4511J2707N5845L7187j7725m8163k9258J3329K8771P225
189I309j8231j5209O703K0466J2618l608j0361r685j006N953J5296J5201K234
202B9680k1597l4576k0296J4659L8237K2625j5813l6416j7660K0394L2845R180
214B1262j6962j8578O404K4933J4952j3595l2713k0340Q758K6319J8782m660k1678
$$ plain form
125 -73344 -22449 54043 71660 16313 -45525 -50648 -8825 24938 23961 11639 12041 10712 -10416
138 -10416 -29598 -16843 24538 45033 17178 -25470 -28868 13320 46127 19952 -40745 -61693
150 -61693 -10674 57118 62679 374 -62416 -57743 1629 49505 44750 7477 -15530 -9729 5252
163 5252 6179 -85 360 5775 3396 -8350 -12315 -1690 7492 -5876 -30790 -29962 10021 52312
177 52312 46930 -6098 -50609 -37902 17943 55130 37405 -10758 -40016 -26687 2084 9309
189 9309 -8922 -24131 -17428 3038 15656 12048 1687 -7998 -9004 -3051 12245 27446 29680
202 29680 8083 -26493 -46789 -32130 6107 28732 12919 -23497 -41157 -20763 12082 21262
214 21262 4300 -14278 -7874 17059 32011 18416 -14297 -34637 -25879 440 19222 14562 -7116
227g116k2187o673J2209K3110J7672L127j2542j5012l853Q806J1566N61j2591
240b923j2841K669J5353R154j3941k7899j4080J9038L7399K1851j4214l3871j9940
253c4245J1932K8566J7433p474j8572j0628M209O142k342p621m205N507O803N480
267I85Ll990p223q771k770J4779K4527J3719j6683l5367j8546J6558L4597J3959
281B5777k0854k9238k370J9186J5744j0105k2271l789K2557K2899J149k0497j6486
294a8298k03J0648P510L322M306L648j1088k0727j3185J1702K7796J4530j6538
307C423k9053n325K3191K1700r992k7799o934K8496L3203j355l6420l0327P961
320b9231L1588J7534j0485j8736m776N199k905r978J042J8507J7189m629k1441
$$ plain form
227 -7116 -29303 -35976 -23767 -657 17015 20142 7600 -7412 -11265 -2459 9107 9668 -2923
240 -2923 -15764 -13095 2258 11412 -2529 -30428 -44508 -25470 11929 33780 19566 -14305 -34245
253 -34245 -22313 6253 23686 16212 -2360 -12988 -8779 -2637 -4979 -12600 -16805 -11298 -4495 985
267 985 988 -3002 -10225 -18996 -21766 -6987 17540 31259 14576 -20791 -39337 -22779 11818 25777
281 25777 4923 -24315 -26685 -7499 8245 -1860 -24131 -27920 -5363 17536 18685 -1812 -18298
294 -18298 -18501 -7853 -343 2979 7285 10933 -155 -20882 -34067 -22365 5431 19961 3423
307 3423 -25630 -30955 -7764 13936 3944 -23855 -30789 -2293 30910 29555 -6865 -37192 -29231
320 -29231 2357 19891 9406 -9330 -14106 -8907 -11812 -21790 -20748 -2241 14948 10319 -11122
333a1122r744J5555J9257l808k4308j0615K2374K8519m056l9678l4238J1191M2850
346B177K6128j6109l3849q735K0657K0222o560j5305K225K1052J0944j6935k3107
359a7195j631J5867Q290j4564j3254J0678K1768J374l0178k6700J3241M4373K7200
372C9269j8068l9703j3139K4381K6717m784k5623j2122J7439J9778p416k7533
384b0804j4828J6550K3139O153j2237n506J0540P429j2229j9533L926K9929K2151
397C4680j6553l9281j7309K1340L0386l2k7088j6514J7300K7238J778k8256k1076
410c3387J3224L2093J4880j3938k1514l203J0945K462r661n268J3182J5618n713
423I720k6079j7312J3808K8296Q680j9257j7730J0097K5876N563k5651k4890P994
$$ plain form
333 -11122 -20866 -5311 13946 10138 -14170 -24785 -2411 26108 22052 -17626 -51864 -40673 2177
346 2177 28305 12196 -21653 -30388 -9731 10491 3931 -11374 -9149 11903 22847 5912 -17195
359 -17195 -18826 -2959 5331 -9233 -22487 -11809 9959 11333 -18845 -45545 -32304 12069 39269
372 39269 21201 -18502 -31641 -7260 19457 14673 -10950 -23072 -5633 14145 6729 -20804
384 -20804 -35632 -19082 4057 10210 -2027 -7533 3007 10436 -1793 -21326 -17400 12529 34680
397 34680 18127 -21154 -38463 -17123 13263 13231 -13857 -30371 -13071 14167 15945 -12311 -33387
410 -33387 -20163 11930 26810 12872 -8642 -11845 -900 1562 -8099 -13367 -185 15433 9720
423 9720 -16359 -33671 -19863 8433 17113 -2144 -19874 -9777 16099 21662 -3989 -28879 -20885
436b0885L4030J9791j7546l2876j1539J6664J8264j924j2931n85J2840N271j2159
449c585j4733L231K1326J2253r515j5302K66J4516N200j5891k0379L658K6751
462G796J8808j4483l1334j5087J7800K7360N873j4453j2247P521J3995k012j4633
475e096o334R670J6299l8j4891j0543L439O258l184r910K731J7279J3951r209
489A0422k3933j0607J5972K5797P398j5537j6879P66J3507M293j2568j3551K539
502a2381J7107R041q601j6663m731R112R886J754j747M510O411k920j4988j0110
516a4320P631J8424O951j1924j7502l007J1020Q277n751j0945J665J5708J3019
529A9246n224j8334j0175Q121J5944P924o010r833l553Q33k114m757Q9Q821Q406
$$ plain form
436 -20885 13145 32936 15390 -17486 -29025 -12361 5903 3979 -8952 -9537 3303 8574 -3585
449 -3585 -18318 -15087 6239 18492 8977 -6325 -6059 8457 13657 -2234 -22613 -18955 7796
462 7796 26604 12121 -19213 -34300 -16500 10860 16733 2280 -9967 -2446 11549 9537 -5096
475 -5096 -11430 -1760 14539 14501 -390 -10933 -7494 -1236 -4420 -14330 -11599 5680 19631 10422
489 10422 -13511 -24118 -8146 17651 25049 9512 -7367 -6601 6906 11199 -1369 -14920 -12381
502 -12381 4726 13767 5166 -11497 -16228 -7116 2770 4524 2777 7287 13698 10778 -4210 -14320
516 -14320 -6689 11735 18686 6762 -10740 -13747 -2727 5550 -201 -11146 -9481 6227 19246
529 19246 14022 -4312 -14487 -6366 9578 17502 11492 1659 -1894 -1061 -3175 -7932 -7843 978 9384
544I384k686j0246o529N818R749J689n810j957Q617R579l427j6259j2785M904
558i959J7414R881o398j4819p176M013P351J975k198P35N949M437l956p996l756
573d503M377O952J640k923k153J384j501p219p892K875J3351J1177k706j4635
587a776r408N233J2664O293n089o227K174O556P15r457r730P77R499P255j506
602G973p680n479J619J565R51R95N721P692l6r146j0279k85J1241Q906l195r752
618H11m055N807M892n285j0880r67J1648J3256J084j2385j1049J521R874N926
632A0198j548k814N29J195m316q100l597N249R323K378o743o410J980P084J242
647E650n786l459Q121J3379K383j2846j5457j167J2543J0790l069j1170m575M533
$$ plain form
544 9384 6698 -3548 -10077 -4259 5490 7179 1369 -588 8029 17608 14181 -2078 -14863 -9959
558 -9959 7455 17336 10938 -3881 -11057 -7044 307 2282 84 819 6768 11205 7249 -747 -4503
573 -4503 -126 6826 8466 5543 3390 4774 3273 -3946 -11838 -8963 4388 15565 12859 -1776
587 -1776 -11184 -5951 6713 13006 7917 1690 3864 10420 11135 1678 -8052 -7275 2224 9479 7973
602 7973 293 -5186 -3567 -2002 -1051 -56 5665 13357 13321 4175 -6104 -6389 4852 13758 10563 811
618 811 -3244 2563 7455 2170 -8710 -9677 1971 15227 16311 3926 -7123 -5602 4272 10198
632 10198 8650 5836 6365 7560 3244 -4856 -8453 -3204 6119 8497 1754 -4656 -2676 4408 5650
647 5650 -136 -3595 4526 17905 20288 7442 -8015 -9182 3361 14151 11082 -88 -4663 -130
661a30L988m305p240K036J1012P867m000r390k551N488M628k262m079K375P767
676A1204J520j0265j3937j999J2918J3365n91j2030p805N329R979N90p056l766
690b544P537J0487p35j2153j0973K032R750L477n250m335L179M936l754r300k425
705a0071J1178J3151J121j0778r539K438R831K979p138p152L570R857K009j1564
719a08j2248j39J2600R888j499q142l377M675M190l015m378K803R842M396q333
734G155j2891k893Q945O988l895q559L30R141M854p605j1402o23J3254J2885j131
749A4553j1872p737L539P747L03o529k846N376O142l515j0244n596N477J0011
763D809L328o017m369M507O594k310r530l961Q575J2714J108j3742j2401J289
$$ plain form
661 -130 3858 -447 -7687 -5651 5361 13228 9228 -162 -2713 2775 7403 5141 1062 3437 11204
676 11204 12724 2459 -11478 -13477 -559 12806 12215 185 -7620 -2291 7688 8278 1222 -2544
690 -2544 4993 15480 14745 2592 -8381 -6349 3401 6878 1628 -2707 472 5408 1654 -7646 -10071
705 -10071 1107 14258 15379 4601 -4938 -2500 7331 10310 3172 -3980 -410 9447 11456 -108
719 -108 -12356 -12495 105 9993 8494 352 -3025 1650 5840 2825 -1553 1250 11092 15488 7155
734 7155 -5736 -8629 316 7304 3409 -5150 -4820 4321 9175 1570 -9832 -10455 2799 15684 14553
749 14553 2681 -5056 -1517 6230 6533 4 -2842 2534 8676 5161 -5083 -10679 -5202 4809
763 4809 8137 2120 -2249 2258 8852 6542 -2988 -6949 1626 14340 15448 1706 -10695 -9406
777i406J0586N115n321o616K408Q036J881p864p154L614J1062O666m343p953k073
792a362M428J325m415n051K922Q514K491q664j0908j304J0406R209q66p725l267
807d267O474O336l872r027k160Q558R335k088j0772p764K736O675P22l815r51
822c880N882M721l729q421k479P438J0032J566q030o562K064N207q37o839m665
837h532M911R603J458r046r771L34J0241P781j660o088m01N485J264n664n057
852e142K185P926L617n498q792j669N225M239l129m671J889P946L951n979r227
867g129j474Q949Q137k84p522n641K491L741r44n478k073N138O936n75p427m523
883g678K992P326J560l082j730L328L813l716p400l702O457P766O14p715p773
$$ plain form
777 -9406 1180 6295 974 -5642 -3234 4802 6683 -1181 -8335 -4721 6341 13007 8664 711 -1362
792 -1362 3066 4391 -24 -5075 -2153 6361 8852 188 -10720 -12024 -1618 7591 6725 -1000 -4267
807 -4267 2207 8543 4671 -4356 -6516 2042 11377 9289 -1483 -9247 -6511 164 886 -2929 -3880
822 -3880 2002 6723 2994 -5427 -7906 -468 9564 11130 3100 -3462 -1398 3809 2972 -3867 -8532
837 -8532 -3621 5982 7440 -1606 -11377 -11043 -802 6979 5319 -769 -1170 4315 5579 -85 -5142
852 -5142 -2957 4969 8586 3088 -5704 -7373 -2148 2091 -1038 -5709 -3820 4126 8077 2098 -7129
867 -7129 -8603 346 8483 8199 677 -4964 -2473 1268 324 -5154 -7227 -2089 4847 4272 -3155 -7678
883 -7678 -4686 2640 4200 1118 -612 2716 6529 2813 -4587 -8289 -1832 5934 6548 -1167 -8940
898h940J208N932L170l130l383K759O520K643o007o544j72O689N453j798n723
913a323j932J860J985m223l883K069P391M222n085p279j503O334N364j037m919
928a959q74N325L208m949q335j750O496P245n30o476m478J354M386Q99k282r10
944c630M601M538j341o489m095L567N953J863m635m598R14M093n77o416l297M594
960d955Q432K849o093p506R80O355M092k841m305J166M281J031n610o132J136
975g120O334M122k827n167q12L688K229k041l430J969O530L582l843q396k772
990g954N730O214o50o252l170L499L313j587o032j649O310P327m91o464m029L046
1006b839M946J86l856j562L246L462k392p033l757M125O908J417m522m593J744
$$ plain form
898 -8940 -7732 -1800 1370 -1760 -5143 -2384 4136 6779 772 -5772 -5944 745 6198 4400 -1323
913 -1323 -3255 -1395 590 -3633 -7516 -5447 1944 6166 1081 -6198 -7701 -1367 3997 2960 -1959
928 -1959 -2833 2492 5700 751 -7584 -9334 -2838 4407 3877 -2599 -7077 -5723 -1337 -438 -2720 -3630
944 -3630 971 5509 4168 -2321 -6416 -2849 3104 4967 332 -4266 -3352 741 164 -6252 -9549 -4955
960 -4955 3477 6326 233 -7273 -6293 62 4154 1313 -2992 -1826 2455 3486 -2124 -8256 -7120
975 -7120 -786 3336 509 -4658 -5470 -1782 447 -1594 -5024 -3055 3475 7057 3214 -5182 -7954
990 -7954 -2224 3990 3340 -2912 -6082 -2583 730 -857 -6889 -8538 -2228 5099 4608 -1856 -5885 -2839
1006 -2839 2107 2293 -1563 -3125 121 3583 1191 -5842 -9599 -5474 1434 2851 -1671 -6264 -4520
1021d520M830J804m064l539L274O534K580n680p195j244N297M780k024n000p17
1036d884L819J527l611m930J952P405M793l331o585j505M716M094k334m390o40
1051c904M998L099l944o716k670N288O345J005m888l280K052M268O88m167j830
1066c656L456N192R1o598n563K328M705J845m017l615K786M719j06n714m337M540
1082c944P702L086m667n642l24M646K854k961m180O10M474J640m393n799k76M795
1098b379M846o02m065j362L210K999k140l756R5N038M065k704o783l432L751M911
1114A692m70m606j809L723M243j028n556k237M665O026J205m490m133Q36L272
1129A333L31l289k298K231L803k33m966l974J592N737K519j866l568O36M122J561
$$ plain form
1021 -4520 310 2114 -1950 -5489 -2215 4319 6899 1219 -5976 -7220 -1923 2857 833 -4167 -4884
1036 -4884 -1065 462 -3149 -8079 -6127 1278 6071 2740 -3845 -5350 -634 3460 1126 -3264 -3904
1051 -3904 1094 4193 249 -6467 -9137 -3849 2496 3501 -1387 -4667 -2615 1653 2341 -1826 -3656
1066 -3656 -200 4992 5083 -1515 -7078 -4750 -45 1800 -2217 -5832 -3046 1673 1567 -4147 -8484 -3944
1082 -3944 3758 6844 2177 -3465 -3789 857 3711 750 -3430 -2820 1654 3294 -1099 -6898 -7174 -2379
1098 -2379 2467 1865 -2200 -3562 -352 2647 507 -3249 -3154 1884 5949 3245 -3538 -6970 -3219 1692
1114 1692 1222 -3384 -5193 -1470 2773 1745 -3811 -6048 -1383 4643 5848 1358 -2775 -1939 1333
1129 1333 1664 -1625 -3923 -1692 2111 1878 -3088 -7062 -5470 267 2786 920 -2648 -2012 2110 3671
1145C671l678l668J087N791K431l871o253j439M230L282j053l831J46L586K517
1160B948k554m615M20M972M329j516m556j823K097K789j934l757p17L539L829
1175C451j475n527k715L340N383J463l458k322J998L677l42m604k353L053M552
1190D121P1m643l950P04M057Q80k644j723K103L775K79l577l436J844N157K211
1206E229k249m268p14L138J506k258l806R41M000K532k786m665q24L895L657o10
1222B718l223k37K667J878k348l975o08M305L472j802n108j766K918L258j030
1237A119k957l08L038L255q45m093k211K466M354J090k886l453M48K561K13k788
1253i97k600K000M183R08m145l165J215M503J989k131k893J149L519Q17l846l639
$$ plain form
1145 3671 -7 -3675 -2588 3203 5634 1763 -4490 -5929 -1699 1583 530 -3301 -3155 431 2948
1160 2948 394 -4221 -3801 1171 5500 3984 -572 -2395 -298 2491 557 -3200 -3917 -378 3451
1175 3451 1976 -3551 -6266 -2926 2457 3920 462 -1860 138 3815 3473 -1131 -3484 -431 4121
1190 4121 4192 -451 -4401 -3697 360 1240 -1404 -3127 -1024 2751 3030 -547 -3983 -2139 3018 5229
1206 5229 2980 -1288 -2002 1136 2642 384 -3422 -2481 1519 4051 1265 -3400 -4224 -329 3328 2718
1222 2718 -505 -742 1925 3803 1455 -2520 -3128 1177 4649 2847 -2261 -4027 -1109 2149 1119
1237 1119 -1838 -2146 892 4147 3302 -791 -3002 -536 3818 4908 2022 -1431 -983 1578 1791 -997
1253 -997 -3597 -1597 2586 3494 -651 -3816 -2601 1902 3891 1760 -1133 16 3535 4352 506 -3133
1269c133P87M558K288k523m892n1K983K323j360k244n9L192K386j678l680j053
1285b156L112K980m77l299j756J749K026p39l592j063L895L724p51m273k522K096
1301a046M545P78l168k150J519L094p12l564k912J981M091J034k948l113O60K850
1317I39J524j405j821P71L542J168k670l489oL466K175j554l654o56K459K208
1333B997j809m017k15M281L600j657m376j264K457L378m78k792j292K535J785
1348C133j073l476j422K277L689M8l107k089J149L048Q24k311j508J587L327L22
1364D418l332l429L36M023J530k066l652r4K929J728k159l123J037M433K009k260
1380B328l392m22L224K232j757l014J49K632J653k221l667q55L398L077q09l172
$$ plain form
1269 -3133 -2346 2212 4500 1977 -2915 -2966 17 2340 980 -1264 -1323 1869 4255 2577 -1103 -2156
1285 -2156 956 3936 3459 160 -1596 153 2179 1440 -2152 -3215 680 4404 3653 -620 -3142 -1046
1301 -1046 3499 4277 1109 -1041 478 3572 2860 -704 -3616 -1635 2456 3490 542 -2571 -1911 939
1317 939 2463 1058 -763 8 3550 4718 2048 -1441 -1447 2019 4194 2640 -1014 -1670 789 2997
1333 2997 1188 -2829 -3044 1237 4837 3180 -1196 -2460 -3 3375 2897 105 -1187 1348 3133
1348 3133 2060 -1416 -2838 -561 3128 3176 69 -2020 -871 2177 3001 690 -818 769 4096 4418
1364 4418 1086 -2343 -2007 2016 3546 1480 -2172 -2266 663 2391 232 -2891 -1854 2579 4588 2328
1380 2328 -1064 -1486 1738 3970 2213 -801 -652 1980 3633 1412 -2255 -3110 288 3365 2556 -616
1396f16j284J914K390J21k830j384K742K821m46l881k546J613L841M18l264k233
1412b624J363L443J13k935j998K472L467R27k937l143J443K836R66k521k553O40
1428a041K885O56k755l084P00L427K200j744k624m00K844J911j085k960q5L032
1444A877K164j964l576j254L008K375j115l200q18K937K008j362k973o51K829
1459B85L437m24l679j958K011K811j07k770j754J746K543m10l012j729J838L242
1475B070L92k287k112J623K747O00l036k066J441L329O97l134l068K32L537J296
1491B261k239k395O97L081J257k189k763P65L171J798j540l099k27K105J687j482
1507H88k243n89K363J701r96l581o03L035K716m74l100j109K068K668p83l298
$$ plain form
1396 -616 -1900 14 2404 2525 -305 -1689 1053 3874 3428 -453 -2999 -1386 2455 2873 -391 -2624
1412 -2624 -1261 2182 2295 -640 -2638 -166 3301 4228 1291 -1852 -409 2427 3393 872 -1681 -1041
1428 -1041 1844 2500 -255 -3339 -2639 788 2988 1244 -1380 -1780 1064 2975 1890 -1070 -1155 1877
1444 1877 4041 2077 -1499 -2753 255 2630 1515 -1685 -2503 434 2442 1080 -1893 -2544 285
1459 285 3722 3298 -381 -2339 -328 2483 2376 -394 -2148 -402 2141 1731 -1281 -3010 -1172 2070
1475 2070 2462 175 -1937 -314 2433 3033 -3 -2069 -628 2701 3398 264 -2804 -2572 965 2261
1491 2261 22 -2373 -1676 1405 2662 473 -2290 -1525 1646 3444 1904 -1195 -1422 683 2370 888
1507 888 -1355 -1944 419 2120 1124 -2457 -3060 -25 2691 2217 -883 -1992 76 2744 1961 -1337
1523a337r92K417K601q29l251j621J696K227O06k466j292J695K660j43k898j617
1539b544K064K424N89k190k282Q47K271M97k207k045P25K951J114k386l136N22
1555b786L225K229j492k779J07K634J085j576k707M77K498J536j564l307k06K295
1571c31K120j285k429JK155J576n51k390r03K204J706k78k186j582J688J813n38
1588G90j969j508J996K189K41k960j490J047L239K02j385k264R93K200Q00k274
1604a53k068Q38K320R12j024k596p84K970M56o94k080P86J795L23o06k370O69
1621a306J754J479j539j713k66N57K517j114j939q3J282J874p60k243j049J690
1637h59K439k08k446q13J412K200p24k123j315J286K182N5j933j285P03J855P04
$$ plain form
1523 -1337 -2329 88 2689 1860 -1391 -3012 -1316 911 1517 -949 -2241 -546 2114 1971 -927 -2544
1539 -2544 -480 1944 2533 343 -1939 -1092 1179 1676 -531 -2576 -1851 1100 2214 -172 -3308 -2786
1555 -2786 439 2668 1176 -1603 -1496 1138 2223 647 -2060 -1583 915 2451 887 -2420 -2626 -331
1571 -331 1789 504 -1925 -1924 231 1807 1256 -1134 -2037 167 1873 1595 -591 -2173 -485 1328 790
1588 790 -1179 -2687 -691 1498 1739 -1221 -2711 -1664 1575 1777 392 -1872 -879 1321 2121 -153
1604 -153 -2221 -1383 937 1849 825 -1771 -2555 415 871 177 -1903 -1117 678 1001 395 -1975 -1306
1621 -1306 448 1927 388 -1325 -1591 -1034 1483 369 -1570 -1653 -371 1503 743 -1500 -2549 -859
1637 -859 1580 1372 -1074 -1887 -475 1725 1001 -1122 -2437 -1151 1031 1086 -847 -2132 -1429 426 1130
1654A130j393j208N76K056N91j595k012P65J922P12j414k394J87K008R94j144
1670b19k050K21K307J410j457k259J3K078J712r84j974k16J695J189r15k223k20
1687a892J644J446p08j681o35J524R48m16j318m99J359J620l85j833q65R58J512
1704G79K19j668j341Q53J740K19j448j411J014K246K76j664j803J066J916O30
1720A623j803j298P44J331K49j203j512M86J263Q03r82j602O80J312R04m93j471
1737i69j37J453J345q14k417k06J360J456j97j982q68J729J376n80j519p43J588
1754a25J750n22k244n51J259J500k31j847k83R11J257l28j358p18P68J676P0j130
1772a46j169M99J666K75q65j318J33J634Q45j388j732M96J366Q50j232j433K49
$$ plain form
1654 1130 -263 -1471 -895 1161 1752 157 -1855 -1090 832 1544 130 -2264 -2077 -69 925 -219
1670 -219 -2269 -2048 259 1669 212 -2047 -2034 44 1756 772 -1202 -1418 277 1466 551 -1672 -1892
1687 -1892 -248 1198 490 -1191 -1826 -302 646 230 -1088 -1587 -228 1392 1007 -826 -1691 -733 779
1704 779 998 -670 -2011 -1158 582 801 -647 -2058 -1044 1202 1478 -186 -1989 -923 993 1623
1720 1623 -180 -1478 -734 597 846 -357 -1869 -1383 -120 683 -299 -1901 -1221 91 995 502 -969
1737 -969 -1106 347 1692 878 -1539 -1745 -385 1071 874 -1108 -1976 -247 1129 549 -970 -1713 -125
1754 -125 1625 1103 -1141 -1692 -433 1067 836 -1011 -1294 -383 874 546 -812 -1530 -762 914 984 -146
1772 -146 -1315 -816 850 1125 260 -1058 -925 709 1554 166 -1566 -1070 296 1146 -86 -1519 -1270
1789a270J596R47j462j109J34J751J169r86j401l58J167J384r93j083n49J450
1805C87Q44j132q03q01J163J664m15j606o30R25J379K60j430j011Q43J332P6j544
1823d99j106R38J492L36j543q79M69J539M23j115j272R56J178J36r02j088O00
1840c37P67M12q25r11M6R92Q42r39j227J92O22J160m21p58p75J431J125o04j119
1859c27k17P94J234q68j282l65J126N11J10j309m73J155Q13n42j060j72Q89P40
1877G57K26j194r10Q51Q21L89j209n26J22J439j64o17j063M78J141N49r32q10
1895f52L80R93L97r04j028K6J341L74p29j105j27J366K62k33j024J40Q79M12m22
1914C46r05J97P21N12l23m08q44Q15L88K73j221k14N67Q48l37o85k34J99R82J72
$$ plain form
1789 -1270 326 1273 -189 -1298 -1164 587 1756 770 -631 -989 178 1562 569 -514 -1063 387
1805 387 1231 99 -704 -1505 -342 1322 907 -699 -1329 -404 975 1235 -195 -1206 -363 969 1045 -499
1823 -499 -1605 -667 825 1161 -382 -1261 -792 747 1170 55 -1217 -261 917 1053 151 -937 -337
1840 -337 430 842 17 -894 -848 144 986 47 -1180 -988 -366 794 373 -385 -1160 271 1396 792 -327
1859 -327 -544 250 1484 616 -666 -1031 95 606 716 -593 -1066 89 902 360 -700 -872 17 757
1877 757 983 -211 -1121 -270 551 940 -269 -795 -673 766 602 -15 -1078 -600 541 1090 158 -652
1895 -652 -272 721 1118 214 -814 -788 553 927 198 -907 -1034 332 594 361 -663 -523 356 768 346
1914 346 -559 -362 359 871 548 140 -704 111 499 772 -449 -663 -96 752 415 -270 -504 -305 677 849
1934H49j114n76O88R31j69p40p33Q62L67K72j107l6L59N56j25m34k88M31P48Q
1954G49o94m53M5N69N06l19p27o4L83N44m43r12P5R08M56n99r50M17R55J18R9
1975F63q81j3N52P39q43n56m9Q31O8m29n53J35N78K05k97n34k33P68K83l2o12
1996b10m02K69R48K8q66o51J173L6k18k33j549J705L34P57q24j239M54J180L24
2015A016j270l46N68L04L90p61m91L48P58J57o56n06K80J11L96n40K96m67L41
2034g2Q70J21p52q47Q30j80P51o27n89N46P64n33l49l95q97J718o6k1n98m50J457
2055F81l91m10nK49M88j6r55l68N32J80J058j251m40J99O10K08M25j486O62J46
2075A16L38K12o14r14J102l00K10j311k37J612P39o79j104O89O45O40o61j416
$$ plain form
1934 849 -265 -841 -153 778 609 -131 -864 -2 365 637 -470 -506 -147 409 284 -150 -438 -7 741 749
1954 749 55 -398 -353 216 722 403 -324 -388 -5 539 96 -816 -741 167 623 24 -926 -509 446 564 663
1975 663 -218 -231 321 1060 217 -339 -388 443 511 82 -471 -336 242 447 150 -384 -617 151 434 402 -210
1996 -210 -612 -343 605 633 -233 -884 289 325 107 -126 -1675 30 364 1121 297 -942 -488 692 1016
2015 1016 -254 -600 -32 272 662 -99 -590 -242 516 673 17 -489 -209 -98 298 -242 54 -413 -72
2034 -72 798 919 167 -680 150 -30 721 94 -495 51 815 282 -67 -462 -1359 359 293 272 -326 -776 681
2055 681 290 -120 -125 124 612 596 -359 -727 -195 -15 1043 -208 -648 -449 161 369 794 -692 -30 116
2075 116 454 666 52 -862 240 -60 150 -1161 -1398 214 953 274 -830 -141 504 1144 483 -933
2093i33j21J780m29J29m38l68N54N00J6o90n99L50P60O7o62k88k11O68N21k92
2113C14p28k25J015O23q01p04l14J059M82m25q35q4P70N42m69l95k04N59N96o19
2133A57m03l51M85O23K3p85k69O19M26k3p18n23M85Q09k67l60k62j55R01J05p66
2154b49o50K60J267mm16r55Q85O87l92r42K9j56O85O00o39q63O89Q28p1j592L18
2175f81p60J372R94p49p58m83J798p96O68j660Q77j82J318r67l17p27J499K05
2193F51o14j137K46J179K05j25r35j33P62M00j85p85k15R07N63n78r16J93R27
2212D10N6j96m84J7N67K43j63o42l11M71O09k78o52n37O15J021m06o83k76N24
2232i5O74p4r06l45M04J022q00n10K90N12Q67kj585J23P27K23o5p65j88K13P24
$$ plain form
2093 -933 -1054 726 297 426 -12 -380 174 674 690 0 -599 -249 511 578 -84 -372 -583 85 606 314
2113 314 -414 -639 376 999 198 -506 -820 239 721 296 -539 -623 147 689 220 -175 -379 180 776 157
2133 157 -246 -597 -112 511 534 -251 -520 99 525 502 -216 -739 -254 555 288 -72 -334 -489 412 517 -249
2154 -249 -899 -639 628 624 208 -747 138 825 433 -509 -480 -636 49 649 10 -853 -164 664 593 -999 -681
2175 -681 -1441 -69 925 176 -582 -1065 733 -63 605 -1055 -178 -360 958 -9 -326 -1053 446 651
2193 651 37 -1100 -854 325 530 405 -530 -663 99 499 314 -471 -686 221 784 206 -710 -517 410
2212 410 466 270 -214 -197 370 613 450 -192 -503 -32 577 299 -353 -890 -275 746 340 -343 -619 -95
2232 -95 579 505 -401 -746 -342 680 -120 -630 -340 172 1039 1037 -548 -425 302 525 460 -305 -493 -280 444
2253D44k5q10j70L56N36k67r3l87K57N75N1o70m88K35R56N7n85o39N51L95L60
2274F39q47n07M56P01M56r35n35M52N09L01j143l37P37L60K39q33m14N91P40j75
2294D55n68l82K13Q63n8o35l25L6O81L73p86j00L14J84N21n30p10K35K17M18p1
2315C45q69qP47L48k25r67L28N91j53l06j88L39N43J31q01k17K24N46l56j8k14
2336a80MN01j86n2k14K78o6L01l15l58K27P6J54k10l03M12k87P24l81o8m75M70
2358E2K09P3l09k66N52k56L00o17J07M18r0l04j99J83M13k85J8q6L04O7j66j21
2380cj36K92J82l93K0k62M03K12j3k45j10j75R8N45m54R0j19L30j41l32j82L12
2402h1N51k40l74j33R9O71l8p08p0K16K00O21r13m10O40M27j42q52L49K06N02
$$ plain form
2253 444 419 -391 -561 -205 331 64 -29 -416 -159 416 467 -203 -691 -456 500 557 -28 -667 -116 279 639
2274 639 -208 -715 -259 442 898 -37 -572 -120 389 690 -453 -790 -53 307 546 -287 -701 -110 630 455
2294 455 -113 -495 -282 581 523 -112 -437 -401 280 653 -133 -233 81 265 786 256 -454 -219 -2 416 345
2315 345 -524 -532 215 563 338 -629 -301 290 137 -169 -357 -18 525 656 -145 -362 -138 408 52 34 -180
2336 -180 -176 325 139 87 -127 151 85 386 71 -287 -60 16 170 -40 -343 69 -218 506 125 57 -418 52
2358 52 261 334 25 -241 311 55 355 -262 -155 263 173 -131 -330 -147 266 -19 -1 -87 217 284 118 -3
2380 -3 -139 153 335 -58 -38 -300 103 315 302 57 -53 -228 -130 415 -39 51 -68 262 121 -211 -393 -81
2402 -81 470 230 -144 -277 -178 493 455 -253 -323 -107 93 714 -199 -609 31 458 316 -536 -187 19 521
2423E21K7q15p1O55M24m20n77k3J18M34l77o3l95Q23M93j18j014O5J14M30j45
2444H6k93j97L53Q02l6q97m65L66R86k5p61l79N67O39j22p19l41M23O75k31p37
2465c06m84O75J125r27l74m46O55O06j05o03l07L33R54jp56o37L27N58M23p24
2485a4p51M52R50Pp25o24K91N31O66q45q38M67J254l69m65p46N23Q20n2o92o18
2506g78N19P70k12m85m62J73J188j75n23p26O84O73j03l65p34R2P65O18j041q34
2526i56L11R03L59o66q13N52Q06M19j116l67J00J168P9n77p47K87O47M96n75p70
$$ plain form
2423 521 548 -267 -338 317 741 321 -256 -279 -161 273 -104 -167 -562 261 754 636 -378 -313 -199 231 86
2444 86 -207 -404 -51 751 715 -182 -647 -281 705 680 -81 -460 107 746 624 -95 -436 -13 662 431 -306
2465 -306 -790 -115 1010 83 -291 -737 -82 524 419 -184 -491 -158 796 795 39 -598 -271 287 710 -14
2485 -14 -765 -313 637 644 -81 -705 -414 117 783 -62 -900 -433 821 452 -13 -759 -236 584 532 -160 -778
2506 -778 -259 511 299 -186 -648 -475 713 538 15 -711 -27 646 543 178 -556 -464 301 919 -122 -956
2526 -956 -645 258 617 -49 -862 -310 496 915 -201 -568 -468 700 779 202 -545 -258 389 885 310 -460
$$ [...]
8191A5
##END NTUPLES=NMR FID
##END=
