##TITLE=1H_SA_28.187
 CDCl3, 8 sc, 
 6.3.2020
##JCAMPDX= 6.0         $$ Bruker NMR JCAMP-DX V2.0
##DATA TYPE= NMR FID
##DATA CLASS= NTUPLES
##ORIGIN= UXNMR, Bruker Analytische Messtechnik GmbH
##OWNER= root
$$ XWIN-NMR		Version 3.5
$$ Fri Mar  6 14:20:32 2020 Russian Standard Time (UT+4h)  she@DPX200
##.OBSERVE FREQUENCY= 200.1315
##.OBSERVE NUCLEUS= ^1H
##.DELAY= (6, 6)
##.ACQUISITION MODE= SIMULTANEOUS
##.ACQUISITION SCHEME= undefined
##.AVERAGES= 8
##.DIGITISER RES= 18
##SPECTROMETER/DATA SYSTEM= spect
##.PULSE SEQUENCE= zg30
##.SOLVENT NAME= D2O
##.SHIFT REFERENCE= (INTERNAL, D2O, 0, 15.7039)
##AUDIT TRAIL= $$ (NUMBER, WHEN, WHO, WHERE, WHAT)
$$ ##TITLE= Audit trail, XWIN-NMR		Version 3.5
$$ ##JCAMPDX= 5.01
$$ ##ORIGIN= Bruker BioSpin GmbH
$$ ##OWNER= she
$$ F:/spectra/data/she/nmr/H-F/1/audita.txt
$$ ##AUDIT TRAIL=  $$ (NUMBER, WHEN, WHO, WHERE, WHAT)
(   1,<2020-03-06 14:19:21.04 +0400>,<she>,<DPX200>,
      <created by zg, POWCHK disabled, PULCHK disabled
       configuration hash MD5:
       00 E9 B6 7A A2 85 ED C7 34 08 36 98 17 FE 4E 26
       data hash MD5: 16K
       1A 70 10 49 EF 4F B4 2C 77 9D E7 ED 76 DA 7D 85>)
$$ ##END=
$$ 
$$ hash MD5
$$ 3F 1C EC 9C 1D 6C 94 DF 61 8F EA 67 9F CC B6 A9
##$RELAX= 
##$RELAX= 
##$RELAX= 
##$RELAX= 
##$RELAX= 
##$RELAX= 
$$ Bruker specific parameters
$$ --------------------------
##$DU= <F:/spectra>
##$EXPNO= 1
##$NAME= <H-F>
##$PROCNO= 1
##$TYPE= <nmr>
##$USER= <she>
##$AMP= (0..31)
100 100 100 100 100 100 100 100 100 100 100 100 100 100 100 100 100 100 
100 100 100 100 100 100 100 100 100 100 100 100 100 100 
##$AQSEQ= 0
##$AQ_mod= 1
##$AUNM= <au_zg>
##$AUTOPOS= <>
##$BF1= 200.13
##$BF2= 200.13
##$BF3= 200.13
##$BF4= 200.13
##$BF5= 200.13
##$BF6= 200.13
##$BF7= 200.13
##$BF8= 200.13
##$BYTORDA= 1
##$CFDGTYP= 0
##$CFRGTYP= 5
##$CHEMSTR= <none>
##$CNST= (0..31)
1 1 145 1 1 1 1 1 1 1 1 1 1 1 1 1 1 1 1 1 1 1 1 1 1 1 1 1 1 1 1 1 
##$CPDPRG= <>
##$CPDPRG1= <>
##$CPDPRG2= <>
##$CPDPRG3= <>
##$CPDPRG4= <mlev>
##$CPDPRG5= <mlev>
##$CPDPRG6= <mlev>
##$CPDPRG7= <mlev>
##$CPDPRG8= <mlev>
##$CPDPRGB= <>
##$CPDPRGT= <>
##$D= (0..31)
0 1.2 0 0 0 0 0 0 0 0.06 0 0.03 0 0 0 0 0.0002 0 0 0 0 0 0 0 0 0 0 0 0 
0 0 0 
##$DATE= 1583489960
##$DBL= (0..7)
120 120 120 120 120 120 120 120 
##$DBP= (0..7)
150 150 150 150 150 150 150 150 
##$DBP07= 0
##$DBPNAM0= <>
##$DBPNAM1= <>
##$DBPNAM2= <>
##$DBPNAM3= <>
##$DBPNAM4= <>
##$DBPNAM5= <>
##$DBPNAM6= <>
##$DBPNAM7= <>
##$DBPOAL= (0..7)
0.5 0.5 0.5 0.5 0.5 0.5 0.5 0.5 
##$DBPOFFS= (0..7)
0 0 0 0 0 0 0 0 
##$DE= 6
##$DECBNUC= <off>
##$DECIM= 24
##$DECNUC= <off>
##$DECSTAT= 4
##$DIGMOD= 1
##$DIGTYP= 9
##$DL= (0..7)
0 120 120 120 120 120 120 120 
##$DP= (0..7)
150 150 150 150 150 150 150 150 
##$DP07= 0
##$DPNAME0= <>
##$DPNAME1= <>
##$DPNAME2= <>
##$DPNAME3= <>
##$DPNAME4= <>
##$DPNAME5= <>
##$DPNAME6= <>
##$DPNAME7= <>
##$DPOAL= (0..7)
0.5 0.5 0.5 0.5 0.5 0.5 0.5 0.5 
##$DPOFFS= (0..7)
0 0 0 0 0 0 0 0 
##$DQDMODE= 0
##$DR= 18
##$DS= 0
##$DSLIST= <SSSSSSSSSSSSSSS>
##$DSPFIRM= 0
$$ [...]
##$SUBNAM2= <"">
##$SUBNAM3= <"">
##$SUBNAM4= <"">
##$SUBNAM5= <"">
##$SUBNAM6= <"">
##$SUBNAM7= <"">
##$SUBNAM8= <"">
##$SUBNAM9= <"">
##$SW= 24.9337058887773
##$SWIBOX= (0..15)
0 0 2 0 0 0 0 0 0 0 0 0 0 0 0 0 
##$SW_h= 4990.01996007984
##$TD= 16384
##$TD0= 1
##$TE= 0
##$TE2= 300
##$TE3= 300
##$TEG= 300
##$TL= (0..7)
0 120 120 120 120 120 120 120 
##$TP= (0..7)
150 150 150 150 150 150 150 150 
##$TP07= 0
##$TPNAME0= <>
##$TPNAME1= <>
##$TPNAME2= <>
##$TPNAME3= <>
##$TPNAME4= <>
##$TPNAME5= <>
##$TPNAME6= <>
##$TPNAME7= <>
##$TPOAL= (0..7)
0.5 0.5 0.5 0.5 0.5 0.5 0.5 0.5 
##$TPOFFS= (0..7)
0 0 0 0 0 0 0 0 
##$TUNHIN= 0
##$TUNHOUT= 0
##$TUNXOUT= 0
##$USERA1= <user>
##$USERA2= <user>
##$USERA3= <user>
##$USERA4= <user>
##$USERA5= <user>
##$V9= 5
##$VALIST= <valist>
##$VCLIST= <CCCCCCCCCCCCCCC>
##$VD= 0
##$VDLIST= <DDDDDDDDDDDDDDD>
##$VPLIST= <PPPPPPPPPPPPPPP>
##$VTLIST= <TTTTTTTTTTTTTTT>
##$WBST= 1024
##$WBSW= 4
##$XGAIN= (0..3)
0 0 0 0 
##$XL= 0
##$YL= 0
##$YMAX_a= 405111
##$YMIN_a= -234774
##$ZGOPTNS= <>
##$ZL1= 120
##$ZL2= 120
##$ZL3= 120
##$ZL4= 120
##$ABSF1= 10
##$ABSF2= 0
##$ABSG= 5
##$ABSL= 3
##$ALPHA= 0
##$AQORDER= 0
##$ASSFAC= 0
##$ASSFACI= 0
##$ASSFACX= 0
##$ASSWID= 0
##$AUNMP= <proc_1d>
##$AZFE= 0.1
##$AZFW= 0.1
##$BCFW= 1
##$BC_mod= 2
##$BYTORDP= 1
##$COROFFS= 0
##$CY= 11.3945322036743
##$DATMOD= 1
##$DC= 2
##$DFILT= <>
##$DTYPP= 0
##$F1P= 16.9975609425685
##$F2P= -3.02152046262296
##$FCOR= 0.5
##$FTSIZE= 0
##$FT_mod= 4
##$GAMMA= 1
##$GB= 0.15
##$INTBC= 1
##$INTSCL= 1
##$ISEN= 128
##$LB= 0.24
##$LEV0= 0
##$LPBIN= 0
##$MAXI= 10000
##$MC2= 0
##$MEAN= 0
##$ME_mod= 0
##$MI= 1.114404
##$NCOEF= 0
##$NC_proc= 0
##$NLEV= 6
##$NOISF1= 3.799351
##$NOISF2= 2.8
##$NSP= 1
##$NTH_PI= 0
##$NZP= 0
##$OFFSET= 15.70392
##$PC= 1
##$PHC0= -9787.529
##$PHC1= 17.40082
##$PH_mod= 1
##$PKNL= yes
##$PPARMOD= 0
##$PSCAL= 0
##$PSIGN= 0
##$REVERSE= no
##$SF= 200.130013532006
##$SI= 16384
##$SIGF1= 3
##$SIGF2= 2
##$SINO= 400
##$SIOLD= 16384
##$SREGLST= <1H.CDCl3>
##$SSB= 0
##$STSI= 0
##$STSR= 0
##$SW_p= 3612.71676300578
##$SYMM= 0
##$S_DEV= 0
##$TDeff= 0
##$TDoff= 0
##$TI= <>
##$TILT= no
##$TM1= 0
##$TM2= 0
##$TOPLEV= 0
##$USERP1= <user>
##$USERP2= <user>
##$USERP3= <user>
##$USERP4= <user>
##$USERP5= <user>
##$WDW= 1
##$XDIM= 8192
##$YMAX_p= 0
##$YMIN_p= 0
$$ End of Bruker specific parameters
$$ ---------------------------------
##NTUPLES= NMR FID
##VAR_NAME=  TIME,          FID/REAL,        FID/IMAG
##SYMBOL=    X,             R,               I
##VAR_TYPE=  INDEPENDENT,   DEPENDENT,       DEPENDENT
##VAR_FORM=  AFFN,          ASDF,            ASDF
##VAR_DIM=   8192,          8192,            8192
##UNITS=     SECONDS,       ARBITRARY UNITS, ARBITRARY UNITS
##FACTOR=    0.0002004,     1,               1
##FIRST=     0,             0,               0
##LAST=      1.6414764,     0,               0
##MIN=       0,             -234774,         0
##MAX=       1.6414764,     405111,          0
$$ Real data points
##PAGE= N=1
##DATA TABLE= (X++(R..R)), XYDATA
0@%%%%%%%Qj6J6k3L1l3M1n4O3p3Q9j08J29j52J79k08K40k78L18l64M16m71N32
30B82o03O80p62Q54r54J063j185J320j465J623j801J994k205K444k706K998l329
47a752L701m126M617n188N864o680P688q972J0672j3043J6608k2654L5591j12804
61i0478J54375J74930k55756j62639L8717R3294j6538K8066N7304J3860k5881
72I254L8592j0036j33494j02927J33332J99253k2805k25418j19069R7503J51012
83A5197L4898n5764n0970J4694N5181M1556j4430m4518j2720N4854O4832m1322
95F1488j56029p8837J44447K03858k0670k15791j13162J07883J40757K1735l1547
106F4132k593k398k1071q570k5234o1392J2233J48478R5260j43456k20922j0283
$$ y = [0, 0, 0, 0, 0, 0, 0, 0, 8, -8, 8, -15, 16, -17, 24, -30, 33, -40, 49, -59, 70, -82, 97, -111, 129, -149, 169, -195, 221, -250, 282, -321, 359, -403, 451, -503, 560, -625, 695, -770, 853, -948, 1046, -1159, 1285, -1421, 1577, -1752, 1949, -2177, 2440, -2748, 3116, -3564, 4124, -4848, 5824, -7219, 9389, -13265, 22326, -90478, 63897, 238827, -16929, -179568, -140851, -47557, -64095, -36029, 21275, 35135, 9254, 47846, 37810, -95684, -198611, -65279, 133974, 111169, -114249, -233318, -135815, 15197, 50095, -5669, -56639, -41945, 13236, 54792, 40362, -4156, -16876, 37978, 102810, 61488, -94541, -173378, -28931, 174927, 154257, -61534, -174696, -66813, 73944, 95679, 64132, 61539, 59141, 38070, 29500, 4266, -57126, -44893, 103585, 198845, 55389, -165533, -175816]
118a75816J82086J27782k0331p3674n4072j8425L1430M1009k2634n4150K4779
129a2016Q1938j3773j35536r2680O6753J38770O0523o0314j12788n1874P9076
140e1921J31517J8498j08902p0305N3021N5743m4528p2851R120P9932O1573k5263
152C5634j05446q2760N1822J59629R9199o5428j36366m9452O4145P3283N736l9460
164A0536j9870K3047J7028m6231p6608P454J18282J07751j7590j08099q4287J0608
176e7979R8650R7261j7382j19922o5003O4062O3420n0866p3370L7917R6181J1011
188H3980q0234o4621R931O5771Q5920L3881q6166j36744k1813J10161P0549n7624
200A2991p2569J5111M2503j4942n0527j4303N1683Q5664M7847n1723j18505o1994
$$ y = [-175816, 6270, 134052, 113721, 40047, -14025, -32450, -1020, 39989, 17355, -36795, -12016, 69922, 56149, -79387, -172067, -105314, 33456, 93979, 33665, -79123, -130997, -51921, 79596, 98094, -10808, -81113, -28092, 27651, -16877, -89728, -80608, -676, 60897, 35634, -69812, -152572, -100750, 58879, 158078, 92650, -43716, -93168, -29023, 44260, 49996, 10536, -9334, 13713, 30741, -15490, -92098, -84644, 33638, 141389, 123799, 15700, -68587, -57979, 40671, 137932, 120550, 628, -64375, -313, 63107, 12241, -61129, -23212, 72969, 83980, 3746, -60875, -50944, 14827, 100747, 134628, 48462, -88282, -110095, 66, 70615, 12991, -59578, -44467, -1964, -16906, -67433, -81736, -30053, 55611, 103458, 51735, -66770, -128764]
212a28764P3393J28529L5922r0940j04115j0570N9085L4217k4945k1361M1749
223g800O4158o615p8766m5665N1198R3377M2141m4140r7621o7442L7816J02600
235D3241L8056o8467o8002K2317N8470L416l7504J641N7800N3576q352p1643p8732
248e4183k637R6232R0573l5898j27838o7922M8213P3337J5425k1556m631K1210
260C0325J4962k7261n7865j8925O5806Q8039q53j06841j04074R63Q7132O7763
272C9171j3455o1447l8549J9710M6467J4185k5268o417M3690L5145l8306q2590
284f7664l5910N4589Q7976K1237p7604r4136l410Q4002O9297r632m6495j2959
296c0709L0127K0755k5295l8147J3220O9404M8237m8948j10789m9710P1730J08376
$$ y = [-128764, -55371, 73158, 109080, 18140, -85975, -96545, -37460, -3243, -28188, -49549, -7800, 56358, 49743, -29023, -74688, -23490, 69887, 112028, 67888, -29733, -97175, -59359, 43241, 81297, 12830, -55172, -32855, 25615, 29031, -8473, -6832, 50968, 104544, 96192, 24549, -54183, -56820, 39412, 129985, 94087, -33751, -101673, -53460, 19877, 35302, 13746, 9115, 30325, 45287, 18026, -39839, -58764, 7042, 95081, 94228, -12613, -116687, -115724, -28592, 39171, 25716, -35731, -74280, -54570, -8103, 6082, -19186, -25603, 18087, 53232, 14926, -67664, -103574, -48985, 38991, 60228, -17376, -111512, -114922, -30920, 38377, 28745, -17750, -30709, -582, 20173, -5122, -43269, -30049, 39355, 87592, 38644, -72145, -121855, -50125, 58251]
308E8251K7828n4273n4933o139K8197L1895J1219r933k849K0186K020n2749o0437
321f1717J3124Q6298O0227l8569r2972m6324M2021Q0132M1373k7522n7296k1165
333b2390K8663K0312k7997l2623K2243N1450j832p2496o7232K0727R4298O8967
345H2090k2641p5963m5456J8941M9014K6922j2075k4029l434O141j9184m3030
357f2704j5478M7584P2571J8028o0600p1162k310O8594P1499J2303m8195n6677
369b6547q235L5614J9381k3685j8373K7359L5160j8814n9103k2481N6218Q3078
381G9572K4903n3936p2382j6986M9974O1020N745m9356m0900L264J4199j3587
393h470j9821J6602M9438L3588k4372o4309l9532K9921P4434M5475k9653p6031
$$ y = [58251, 86079, 31806, -23127, -29266, -1069, 30826, 42045, 32112, 29263, 49449, 51469, -1280, -61717, -48593, 37705, 97932, 59363, -33609, -79933, -37912, 42220, 83593, 56071, -1225, -22390, 6273, 26585, -1412, -34035, -11792, 39658, 37826, -34670, -101902, -81175, 13123, 82090, 59449, -16514, -61970, -43029, 5985, 32907, 20832, -3197, -6631, -490, -19674, -62704, -78182, -30598, 41973, 60001, -599, -71761, -74071, -5477, 66022, 78325, 30130, -26547, -34782, 832, 20213, -3472, -21845, 5514, 40674, 21860, -37243, -59724, -3506, 79572, 104475, 50539, -21843, -38829, 11145, 72165, 77910, 28554, -12346, -9082, 5117, -8470, -28291, -11689, 37749, 71337, 46965, -17344, -56876, -26955, 47479, 92954, 63301, -12730]
405a2730m8653J6571M1931R747k0278o426J8853Q048k9264l8994O477O4059O2488
418G1829q563p4316o3598R313O5081M3584k6392o1146k4491K4919K5452n531j0202
431c4061J8631L4169R826l4313m4699m16N7465O0578j251o7944o8590j440N7910
444a4135M5440p602l0141p281J4231O546j3318r017K6111N3708K5430m5628q1053
457c6709l2122M9595P4813J7812n2951n7735m967L3404K2088l981m533J5033K0518
470D0265o856m1258l4804J8581N9176L3087l8750p7122l8365L7954O6527K1848
482D0283l3031l5677Q9K1428R605r798o381J9098K9192p326n6515n3277J2387
495f9923P1055N2476k5143p0074l4986K9516M9028K0186q018q803M845O354j4926
$$ y = [-12730, -61383, -44812, -2881, 6866, -13412, -19838, -985, 7063, -22201, -61195, -54718, 9341, 71829, 63266, -11050, -74648, -65335, -254, 43330, 16938, -44208, -68699, -43780, -18328, -23859, -34061, -15430, 18739, 28565, -5748, -50447, -50863, 6602, 67180, 65929, -2015, -70605, -72045, -14135, 31305, 23703, -6438, -13719, 512, 7058, -6260, -15277, 10834, 64542, 89972, 44344, -36709, -68831, -19236, 55577, 73389, 20438, -37297, -42264, -8860, 13228, 9247, 4714, 19747, 40265, 33409, -7849, -42653, -24072, 35104, 68191, 29441, -47681, -86046, -48092, 18435, 40283, 7252, -28425, -28336, -6908, 2697, -7101, -13482, 5616, 34808, 27482, -29033, -82310, -69923, 1132, 53608, 28465, -41609, -76595, -47079, 1949, 22135, 14117, 5314, 10159, 16513, 1587]
508A587l3246j0952L9200N4485N028n9304o3548K982O8525O1502l721m8557l1255
521a7274J2580K9450P799j5004n093J9174J3520k8982n2684j8704M5504O7765
533E8051J7091n6136o6093n73N9941M7294o020l3907j8982K392N30j7314j6357
546c0083J2059L7451K1222k8085n7887k8732L7890P0296L1494l3554n4996j9755
558d2680K5105L0689j859k5147p823J6979J889l4405l2640J6461N7664M2878j5094
571C2017n8900l8074K7293O6742L3094l1281m8843j1748K1773P466j7088l943
583b1492K6452K4759r450l6173k7566J1482N3896N5217J110n7377n5074L472M6983
596A6239L0206j5722l0625m625J3751m659k7036q935L3812M9250J2607l9903n5153
$$ y = [1587, -31659, -42611, -3411, 51074, 56102, -3202, -66750, -63768, 4757, 66259, 62538, 13981, -17274, -4694, 24756, 32555, 17551, 12458, 31632, 45152, 16170, -36514, -55218, -9714, 58051, 75142, 19006, -47087, -47660, 12281, 59575, 53555, 19648, 666, 3058, 3588, -13726, -30083, -18024, 19427, 40649, 12564, -45323, -74055, -36165, 34131, 65625, 32071, -22925, -42680, -17575, 13114, 11255, -13892, -21715, -4736, -2847, -37252, -69892, -53431, 4233, 47111, 32017, -26883, -64957, -37664, 29078, 62172, 30891, -17952, -29700, -7927, -461, -17549, -21492, 4960, 29719, 20269, -15904, -43470, -31988, 21908, 77125, 78235, 20858, -34216, -30744, 16239, 46445, 30723, 98, -4527, 9224, 4565, -22471, -31406, 2406, 51656, 64263, 24360, -30793]
609c0793j2945M5908N9092Q006n4202n6477J914M1028J2074k6345r409K9008J8535
622B5394k5342l6857k594L4681M2287J6000l1837o1986l3113L3570O0694J5744
634C6641m1101l7954N646J9304j894j1363J1656L4468K6046j2811m8445l7747
646e7554J7773O1073M0043k5502o4116l5548K8154N0415J0560k8901j0027K9095
658A5465J9597k6561l7372R149N1084L2872k1388n1544l5937P793M5342M2714
670E1214j0074n4293l0969K6866L7310r83j7629R220K7679J491l8175m4003j955
683d4301M6112N0203R61n5210n9104m978N1121M8001k693l4149j2493J8092R074
696A0636k7110k8485K1689N5974J6116n2981o1951o003M1834M3950J4412k2475
$$ y = [-30793, -43738, 2170, 61262, 69268, 15066, -41411, -39497, 1531, 13605, -12740, -22149, 6859, 25394, 52, -36805, -39399, -4718, 37569, 53569, 21732, -40254, -73367, -39797, 20897, 36641, -4460, -42414, -36768, -17464, -19358, -30721, -19065, 15403, 41449, 28638, -19807, -57554, -39781, 21292, 61335, 35833, -28283, -63831, -35677, 14738, 25298, -3603, -13630, 15465, 35062, 8501, -28871, -19722, 31362, 64234, 42846, -8698, -44635, -36842, 8500, 51214, 41140, -13153, -44122, -17256, 20054, 19071, 1442, 10662, 38341, 39832, 1657, -42346, -44301, 1811, 52014, 52975, -2235, -61339, -66317, -15196, 32805, 30112, -4037, -16530, 1562, 10636, -16474, -44959, -23270, 32704, 48820, -4161, -66112, -72115, -30281, 13669, 28081, 5606]
708E606l9530j1464L5118L6681r310l1793L983L2552K6m4738k7930L0931N0812
721C0944J1388l4494m5597j6146L3560N8365K7457l0779m6128n961K7739J4277
733B4625j7507j2223K2873L0287j6286o0773l6509L3487O9076L3893k3659m8026
745g42k7753J1813L5997K4643j0515k5834r74J8996j1113m7466j8102M7774N3651
758E0375j0057n5339l3386J6480M2244L2045m699l7633l1326J0421L2048L384
770A4557k8965j5005K3048K0003k4126m1789j192M9263M9390k978m9945m2386
782e0125Q621M6058L4190k972k7303k5537n652R240P94j2326O244M0889K9239
795E1360l1747o2794j6754N1607O0798J0155l5532l9783j4213J4416K5024N493
$$ y = [5606, -33924, -45388, -10270, 26411, 17101, -14692, -10709, 21843, 21869, -22869, -50799, -19868, 30944, 42332, 7838, -37759, -53905, -20345, 38020, 65477, 34698, -11430, -17391, 10348, 24625, 7118, -5105, 17768, 48055, 31769, -29004, -65513, -32026, 37050, 70943, 47284, -742, -28495, -16682, 19315, 43958, 33443, 7609, 6635, 25631, 14518, -32948, -51050, -3276, 50375, 40318, -15021, -48407, -31927, 10317, 42362, 37663, 30, -31296, -20875, 11173, 14557, -14408, -29413, -6365, 13638, -10488, -52277, -53469, -4206, 45184, 42206, -7739, -50125, -41504, 4554, 38744, 35772, 8469, -17068, -22720, -13480, -12686, -25012, -18768, 22121, 51360, 19613, -43181, -59935, -8328, 52470, 62625, 27093, -12690, -26903, -12487, 12537, 18030]
807A8030j7284p312J9292R575k9766l2686J7910N4437K9062k7423n0171j9996
819c6332K7471L9881R131k7401l1829p631J4584J4101k425r423M303J8611O281
832A9322k7932l7693N329N5832M3475k5668o4507l0693K3356L6559J5270r006
844C644j7600n933R466M099j5867j0556K8738M7456N747n2323n3567N473N1315
857I2L7288r114l6135k4552N456K2617J2460o301k763J2810J4167q883k6632j5869
871b5359K0382M3951J7123m0517n7041p240M7551M2092o236l1791j4630J1594
883a21J4059j91r544L34J9885K0973j3877n1833l3338L1340O1606J6210m4225
896A1278m6264m551K8575K5124K865r788l528P484L49j8458k2622K612L4219K9556
$$ y = [18030, 746, -6566, 12726, 22301, -7465, -40151, -22241, 32196, 61258, 33835, -16336, -36332, -8861, 31020, 40151, 12750, -19079, -26710, -12126, 1975, -450, -9873, -5570, 13041, 19322, -8610, -46303, -40974, 14858, 58333, 32665, -31842, -62535, -39179, -2620, 12650, 3644, -13956, -19889, -10423, -6324, -22191, -32747, -4009, 43447, 49194, -3129, -56696, -51223, 92, 37380, 28266, -7869, -32421, -26965, -4348, 8112, 1811, -952, 11858, 26025, 17142, -9490, -25359, -4977, 38974, 56097, 15580, -41461, -48701, -1150, 40942, 34706, 2915, -11715, -121, 13938, 13747, 4203, 4537, 24422, 45395, 31518, -20315, -53653, -22313, 39293, 55503, 11278, -34986, -39537, -10962, 14162, 17027, 7239, 3711, 11195, 11544, -6914, -29536, -26924, 7295, 36851]
910C6851j4979n1902l3482K1622N3202K7705k2454l9726o939K5818J7962q655
922E023j2990O857J8182K502k7619l5771k130M5247M4739j0344n3739l2111K4814
935b7340M7038J7137j7503j8232J409Q129m322j6507p536J7794L0980P206l6014
948B239m3998j455M4119M4239K777l5362l2685M099K9780J4843j4686j4967P807
961F750J3132j1504l3098j5807K5547M3209J3525l2636m5828r771L8506M4417
973C6442R17l6937k4094J0737J5731p026j6465K396K2685J5832j5306l6680j9015
986e0783K4907M8623K4238k4682m5266j6953K4524L1578J897j9727r875R242P518
999E241j5233k2309N611L7583L0602j2142m2466k7699J7212M5768K7819j9300
$$ y = [36851, 21872, -30030, -63512, -41890, 11312, 39017, 16563, -23163, -30102, -4284, 13678, 5023, -7967, -1110, 17072, 19574, -8045, -43816, -45946, -699, 44040, 33696, -20043, -52154, -27340, 19698, 36835, 19332, 1100, 2509, 10638, 6316, -10191, -17727, 67, 31047, 38253, 2239, -41759, -43214, 905, 45144, 47921, 12559, -20126, -16027, 13753, 28596, 13910, -1057, 6750, 19882, 8378, -24720, -40527, -14980, 28229, 41754, 9118, -36710, -46481, -7975, 36442, 37359, 422, -23672, -12935, 2796, -4230, -20695, -18299, 4386, 20218, 4912, -31768, -50783, -25876, 22747, 46985, 22303, -22963, -39916, -15392, 16186, 18083, -1644, -11519, -2277, 5241, -9992, -32301, -26690, 10893, 41495, 29353, -13113, -40812, -23600, 22168, 49987, 30687]
1011C0687m0640j4839K0101J8254p052j3233P409K0363L060k3504k4786N478L5886
1024A7184L2785m985m1610l6929O663L8734K2078j5282k5585n583J0274L240j0980
1037i996q623J4555K9164J0487k7714m0200q604L4444L9556J354l7712l2877K268
1050c3898K4498J3903n994q288O582J2400m198k3559j3500K0144L6288J3459k7506
1063A0331m3758j6059K8376L9561P484k6902k5187J668J8627R189o033k722J5565
1076A0140J8686o846l3370k5082J5495M3500K4035k5179m4428j5533K3634K9911
1088A4963O781j2771q439N683Q520o742j7443j895K5064K5595p751l9306l2413
1101d0154P856L8837K5890j0330l1356j7195J0921K2646O744j0922m789J2563
$$ y = [30687, -9953, -24792, -4691, 13563, 6511, -6722, 687, 21050, 24110, 606, -24180, -18702, 17184, 49969, 44984, 3374, -33555, -26892, 11842, 33920, 18638, -6947, -12530, -2256, 984, -9996, -18619, -4064, 25100, 35587, 7873, -32327, -40931, -6487, 33069, 34423, -3289, -36166, -33898, -9400, 4503, -1491, -9779, -3197, 9203, 5005, -18554, -32054, -11910, 24378, 37837, 10331, -33427, -49486, -21110, 18451, 25935, -967, -26154, -24486, -5859, 3330, -2703, -5425, 10140, 28826, 21980, -11390, -36472, -20977, 22523, 46558, 21379, -23049, -38582, -14948, 14963, 21744, 8973, 534, 6217, 14737, 7995, -9448, -11343, 13721, 39316, 31565, -7741, -40154, -32298, 6539, 32429, 22099, -9257, -26452, -15531, 7115, 13859, 2937, -1852, 10711]
1113A0711Q822j7526k9107n797K9836L4978j352m0324l6692P101L9002K6910p687
1126A8875k3250q703J0350Q209r138j1125Q520K4065P833k4494l6201q163L1294
1139a1928L8440O574k6535k7803k097K1225K0107j60j2400k212J1033R79k0539
1152e316j9101J0562L4599J9705k0723m0710j5253K6592L9329J2347k2515k7664
1164h148k418J6709P292j1173p328J2649J4985r122k9250j9599J4863L8025K1419
1177C8904j7575l6196j6189J5612K6496J1277j0824j5732l601M592l089j2123
1189a8448k967J7683K4538L79l0510k9394N761L6095K7908p207l0953k1227P432
1202b0910K0150N298j1038m677J1758Q184j3322k3236k579K8045L3154J997l1028
$$ y = [10711, 19533, 2007, -27100, -32897, -3061, 31917, 30565, -9759, -46451, -39350, -348, 26562, 18875, -4375, -13078, -2728, 5481, -3657, -14782, -6262, 17803, 25636, 1142, -35059, -43222, -11928, 26512, 33086, 6551, -21252, -23349, -2124, 17983, 17823, 5423, 3211, 14244, 15223, -5316, -24417, -13855, 20744, 40449, 19726, -20984, -36237, -9645, 29684, 42031, 19516, -8148, -10566, 6143, 13435, 2262, -5066, 7583, 22568, 13446, -15804, -35403, -20540, 17485, 38904, 21329, -14867, -31056, -15444, 11052, 22329, 11505, -4227, -7828, -3236, -6325, -18448, -21415, -3732, 20806, 21185, -9325, -38719, -32958, 3137, 31045, 23838, -7115, -28342, -20910, -760, 4538, -6500, -11177, 581, 8765, -4557, -27793, -30372, -2327, 30827, 32824, 1796]
1215A796l0494J691K8843K3591l997k0778j2517L791O258j487k749N734J5133
1228A4815R875j1652k7978j2873K2561L6435Q865k6462l2342o590J8832J8129
1240A1615n30j1287l544N980K837j0490j2681O863K8594J9611j6151l7914j8797
1253c5894J8380L2929J1762j7752k4477n743R352P435M03J217P395P118k743j6039
1267f657j7578L454K8258K4995r242l7060k4365J2124K9065J2774r579j1115j609
1280f535M042J575j839j717Q391J8494M888k3066k9509j217L1041K7473o181k9829
1294c989j8186P818J7874P985j866k131L194K136o203j3632p058J2880K4729Q517
1308C2068k2594l5013r906K7011L1431J925k1318j3869L909N792m81j102M619
$$ y = [1796, -28698, -27007, 1836, 25427, 21430, 652, -11865, -8074, -1816, -3303, -6052, -318, 14815, 24690, 13038, -14940, -27813, -5252, 31183, 40048, 13586, -18756, -25346, -6514, 11615, 11085, -202, -3746, 2234, 5071, -5419, -18100, -11237, 17357, 36968, 20817, -17097, -35894, -17514, 15415, 27177, 9425, -15052, -20795, -11443, -4008, -3605, -2388, 5007, 12125, 9382, -6657, -24235, -20781, 7477, 32472, 23230, -13830, -38195, -26071, 2994, 15768, 6189, -4926, -6535, -2493, -918, -2757, -4474, 3917, 22411, 27299, 4233, -25276, -26493, 4548, 32021, 25840, -3989, -22175, -14357, 3517, 11502, 9636, 7505, 10699, 12835, 6632, -7000, -14058, -1178, 23551, 32068, 9474, -25539, -35445, -8434, 22997, 24922, 3604, -10265, -6356, -564, -1045, -2147, 2472]
1321B472R157N831r514k2544j6927J1825L2587J6987k0436l3304p356K0888J9945
1334I611O47r135m830J442Q72n550p980K097J5132J4371n973k5616k0205R592
1348b5525L4094K2267j3574k9369r863J5371J4739j019n369L947P097n511j6967
1361i682j2669N584K2415K3329M67k9541k8578N404L2435J9481r699j6825l525
1374a404L739k796p036o0J0720J2679P98j4008k0658o559K0143K9594O507k4170
1388G489k6227J104K1639J2555r533j3291K284R517m920j6094l559J5743J8790
1401A5497L955j5250k3480r981J8940L0086Q334k2141k3494j010J2320L085m909
1414h048N281J3369K426j3564j5879m715J1159K3284J8354q026k9813k1226Q884
$$ y = [2472, 11629, 17460, 7946, -14598, -31525, -19700, 12887, 29874, 9438, -23866, -31222, -10334, 9611, 10258, 1123, -3707, -2265, -1393, -6943, -14923, -12826, 2306, 16677, 10704, -14912, -35117, -25525, 8569, 30836, 17262, -12107, -21970, -6599, 8140, 7121, 1752, 5699, 12796, 7285, -9682, -22351, -16767, 5648, 28977, 29444, -97, -28675, -23271, 9164, 28645, 18946, 2121, -1404, 2335, -461, -7497, -7557, 3163, 15842, 16640, 2632, -18026, -24585, -4442, 25152, 31659, 7489, -18738, -17634, 4005, 16560, 7027, -6264, -3980, 5537, 617, -15477, -19036, -3293, 15497, 19452, 4202, -19278, -29259, -10319, 19767, 28101, 5960, -17534, -18544, -6224, -3139, -8048, -2767, 10602, 13028, -536, -16415, -21130, -9971, 13313, 31667, 23641, -6172, -27398, -18514]
1427a8514K6341J2119j1099j3724J686P362n526j2249K509K0562J6037o060k2083
1440b639j5923M767K1277J6967m414k3312j7565P494J9019L901j1683j709J1458
1453G638J923j4470j0956Q551J7419J0937k942j7963k1672n337J9966K5904K171
1466B1169k3529j8348M256J2468N16m767O902J5259K909j7292k2634m606J9705
1479g992K4589O269j7793k4267r014J4750K0395L526j1696l344Q830K681j3264
1492f330r200J1501K0403N141j4743j8760p592P807J8202J4647o795k2603j0417
1505a8739J3383J6513m84q375J616Q585j874j5856j2415P879K3151J4683j1228
1518A6839k6048j6477Q107K4972J6268n792j6664p029M726M036n786m095J1353
$$ y = [-18514, 7827, 19946, 8847, -4877, -3191, 4171, -1355, -13604, -11095, 9467, 25504, 19444, -2639, -18562, -13795, 7482, 24449, 20035, -3277, -20842, -13348, 5671, 9572, -2111, -3820, 7638, 9561, -4909, -15865, -7314, 10105, 21042, 18100, 137, -21535, -26872, -6906, 18998, 21169, -2360, -20708, -16452, -3984, -3468, -8235, -1333, 13926, 16835, -457, -23091, -27697, -7992, 16597, 22866, 5073, -19194, -28208, -13458, 6937, 10463, -1233, -4577, 4253, 6934, -6330, -15530, -4029, 16374, 21515, 6772, -11988, -19580, -11773, 6429, 21076, 14281, -8322, -18739, -5356, 11157, 10673, 2298, 3914, 12499, 10625, -5231, -17646, -9767, 13384, 28067, 16839, -9209, -25686, -17579, 7393, 23661, 17869, 1205, -5824, -1098, 2938, -2848, -6943, 4410]
1531D410J6533l040k5491k0274O536K3419J6793p79j6183j8207k814J5480J4792
1544A1175k366j1229p87Q136j849j5453q093J5106K1842J959j9315k0573j202
1557b2649J9546K1810L213j7026j5860j17J0750N870m604m246P362Q739p571k1847
1571a6630q413J8748K6914O368j8102k1823o149J2438J7307Q156p983j3421k830
1584e420N985j159j0970m88J9892J6116j0272k6148j1889J3543K3966J1307j0177
1597A4286k0166j0126P445J1953J639p381k679O841K935j1280j4041L324K1661
1610D411J7910n678k4611j7434Q056K2169J2279p379j4726q011K816O876J66l930
1624g086M105J4004M826j6062k1434o2K4812K2761l227k3368j7516K225J4029
$$ y = [4410, 20943, 17903, -7588, -27862, -21326, 2093, 18886, 18107, 1924, -16283, -19097, -3617, 11175, 8809, -2420, -3207, 4929, 3080, -12373, -20466, -5360, 16482, 18441, -874, -21447, -22649, -3103, 18707, 21920, 4894, -10966, -11083, -333, 5537, 933, -3313, 4049, 12788, 5217, -16630, -25043, -6295, 20619, 26987, 8885, -12938, -19087, -6649, 10658, 18814, 10831, -2590, -5420, 565, -594, -11564, -12052, 7840, 23956, 13684, -12464, -24353, -10810, 13156, 24463, 14286, -5880, -16006, -8561, 3392, 5031, -2350, -5029, 1812, 4747, -6533, -20574, -17250, 4411, 22321, 16643, -7968, -25402, -17346, 4823, 17102, 9723, -5003, -13014, -10198, -3322, -3156, -7086, -2981, 11023, 15849, -213, -21647, -21709, 3103, 25864, 22637, -731, -18247, -16022, -1993]
1637a993J0221j053o782j807M028o71r635m264J2044J9053N172j5948k2804n808
1651b0247J7240K1794K801j6397j5028j159Q842O921j216k024L897O247k025j4272
1665d626j1816Q024K4249J2491j7062k7413q050J5729J7484K928r227p667L12
1678d644L574q39n544J503J1872J1665n815k0940j5025Q657K2636J2874q821j9058
1692g905j0259O075J3505N682l653k977L363K212o763j0976j818J4642J8256m36
1706A8948k2592k1316L860K3714J6162n866j5199p103N928O697j872l411L742
1719A692J0179K528j2754j8399k965J8607J9982M96j7934j6704n5J3414J3020
1732A1107Q69q080m709J126N78o482n365N389J4782O889j1757k1806q109J5063
$$ y = [-1993, 8228, 7175, 393, -1414, 2614, 1943, -7692, -11956, 88, 19141, 24313, 8365, -14439, -20247, -3007, 18787, 21588, 5191, -9837, -10996, -2154, 4767, 3551, 1527, 5424, 11671, 9646, -4626, -16442, -8418, 15831, 28322, 11260, -16153, -24203, -8474, 9010, 11938, 2711, -4956, -4644, -1070, -1909, -7453, -5950, 5922, 17587, 11772, -9168, -24193, -15536, 7100, 19974, 11153, -7905, -18164, -12089, 1416, 7098, 3445, 468, 3831, 6043, -720, -11696, -13514, 1128, 19384, 18948, -3644, -24960, -21100, 2614, 18776, 12910, -2289, -9392, -3464, 3233, 1361, -2050, 1692, 11871, 14399, 1645, -16754, -19719, -1112, 18870, 19366, 1432, -15272, -15327, -1913, 11107, 11976, 3896, -813, 313, 891, -5591, -10956, -5567, 9215, 16104, 4347, -17459, -25568, -10505]
1746a0505K3235P815j4189j8988k405J2843P833l794m862M259O103l490j4461
1759a0606j0056Q628K1753J1434j1534k1671q643J1986J7905O303q021j0171k073
1772d766L439M18m092r27Q236J0718k137j6241j4268N650K1136J5608m299j9396
1786i21j3420N381J5093N818o715n671K782L683n550j1514j299J5368J7027n67
1800A9495j9052j8435K271J9325J6023l352j5892r742K725N076L94j942K027O582
1814E503K828p988j4582l476J5028J9453L687j5918j9373l206J3443J4082j28
1827I353r543n451K328K472m309o025M725J5599Q340j1019j9418p781J3116J9887
1841A2274O862j2884j7343l811R141P867m45k872K501N102j903j0174p688O277
$$ y = [-10505, 12730, 20545, 6356, -12632, -15037, -2194, 5639, 1845, -3017, 1242, 7345, 3855, -10606, -20662, -12034, 9719, 21153, 9619, -12052, -20695, -8709, 9196, 15499, 7478, -2693, -4766, -1327, -909, -5001, -5928, 2308, 13026, 10889, -5352, -19620, -13970, 7166, 22774, 18475, -921, -14341, -8960, 6133, 11951, 5236, -435, 2347, 6030, 480, -11034, -12333, 3035, 20062, 19495, 443, -17992, -15721, 3604, 19627, 16275, 383, -9359, -6634, -1558, -1164, -3106, -1079, 5503, 8331, 343, -14239, -17715, -2687, 16766, 20453, 4535, -14838, -18044, -4601, 9481, 9353, -190, -5641, -3313, -841, -5150, -11175, -6450, 9149, 17489, 6470, -12948, -20729, -7613, 12274, 19136, 6252, -11091, -14902, -5761, 2106, 1661, -1211, 1290, 6392, 4489, -5685, -13373, -7096]
1855g096J7203J0857p986k0136j2212Q367J7981P996p586j1582k879M067L265
1868B59k271j013O797R673j629j5614j3240L975J7253J3048m334j7107j2652L564
1882a3291J2687P355k445n144O49L140l368q356r16J1082J2829J25j4356j7000
1896a7009k101J5617J6663O31j3195j1284J517Q028L738j969m93N878L532p283
1910B270j3596m202J2567J6706L721j4435j6393k681J1926J3034L660o520p198
1923a141m73L812j065n027K118J0916O333q754j6444p721R260J7702R002p775
1937A0743j5670p635P018J1388K644n473k655M384R74r569r697L437J5130J1319
1951A6338o613j8001j0206P718J5839P985l841r789n783J744M094L72k498K349
$$ y = [-7096, 10107, 20964, 12978, -7158, -19370, -11003, 6978, 14974, 7388, -4194, -7073, -3006, 259, -2012, -3025, 3772, 13445, 11816, -3798, -17038, -13063, 4190, 17238, 12904, -4203, -16855, -13291, -604, 6751, 4306, -838, -189, 2951, -417, -8773, -9689, 1393, 14222, 14347, -9, -17009, -19110, -3493, 13170, 13801, 606, -10678, -9161, -1133, 2605, 636, 143, 6021, 9553, 2270, -11326, -15528, -2961, 13745, 17466, 3031, -13362, -16043, -4117, 8917, 12577, 6057, -1141, -1614, 2198, 1133, -3894, -1776, 9140, 15473, 6719, -9725, -17446, -8186, 9516, 18518, 10743, -4927, -12562, -5544, 5844, 8488, 3015, 360, 4744, 5718, -3851, -13548, -10111, 5019, 16338, 9725, -8276, -18482, -10764, 5075, 13060, 9219, -570, -6353, -4609, -515, -143, -2641, -292]
1965b92P010N1j1214j2479K076J6556J3253l046j3783j0826k30J0841J0920K49
1979I086q564n387L510J303p016m709Q590J5300L344j4577j6954j78J5647J4824
1993A4219Q35j0777j0237j509N077L865k52m04K990K308m206j0472n584R400J6669
2008A1922N867j1962j5544k828Q583J0704L914n309r036l700L392L704k150k194
2022d637O545R052k575j6153r756J0019J8854O360j0131j4310o022N414Q678L595
2036D933k558k177M49k23m699n693J767J2630J2177l366j6913j2046L996J4448
2050B725Q675k764p781n512q49K027K889J372J485L606L725n249j2592m408J3418
2065G67J6344r74j6838j2073L159J1127O126j949m907k359L60R43j413j238L786
$$ y = [-292, 6718, 6769, -4445, -16924, -14848, 1708, 14961, 11915, -1868, -12694, -12924, -2083, 8837, 9086, 522, -4865, -1355, -52, -7068, -11777, -3187, 12113, 15457, 880, -16074, -16252, -605, 14219, 15054, 4277, -5960, -7469, -2392, 1473, 1221, 817, 3807, 6115, 1909, -8563, -14147, -4747, 11922, 17789, 5827, -9717, -12545, -3962, 6742, 10656, 5347, -3689, -7389, -3997, -293, -2443, -4637, 1908, 10960, 8385, -7768, -17524, -7505, 11349, 17709, 7578, -6732, -12754, -7340, 1338, 4933, 2375, 198, 647, 424, -4275, -9968, -8201, 4429, 16606, 13240, -3673, -15719, -11723, 2725, 11400, 8636, 855, -4657, -5506, -3479, -590, 782, 2267, 5873, 9598, 4349, -8243, -12651, 767, 17111, 16137, -701, -12774, -9615, 1512, 7638, 5689, 782, -1577, -1217, -274, -1687, -2925, 861]
2080H61Q635L502j0315j5187k529J3056J4356Q19j1525j1069m87N440M490K901
2094B948J905P47k450l591n142m961L690J3502J0037q288j9672q443J0370J5007
2108E659K846n864m769r65m50k13P59K082L796M465q83j0584j0051K937J4569
2123C334J0319n812j4215o251P091Q843K874k017j818q66j610k070j963J011N623
2138B473P236l22j1025j3421N35J5995J3251l129j2431o148K679L048Q36K259
2152A836L334J205k322n879p630k321Q369J4063N015j1415j5582k145J1676R930
2166H134J02n174l631J3o25k394j328L196O561K710n198j0290n335O948J4314
2181H003O693q922j3342k606Q375P209j323k890P80R39l628n730j246O004Q115
$$ y = [861, 9496, 12998, 2683, -12504, -15033, -1977, 12379, 13198, 1673, -9396, -9883, -4443, 47, 2948, 4853, 5600, 3150, -441, -5583, -10544, -6854, 6648, 16685, 8397, -11275, -19718, -9348, 5659, 8505, 2641, -2128, -3093, -3543, -3756, -2997, -915, 2881, 7346, 6463, -4121, -14172, -11235, 3334, 13653, 7841, -6374, -12625, -5534, 3309, 6183, 4166, 2348, 1482, -128, -2198, -4161, -3150, 2473, 9709, 9387, -1638, -15059, -14524, 1471, 14722, 11593, -838, -6986, -4307, -1259, -423, 1836, 5170, 6375, 4053, -1826, -9456, -11777, -3408, 10655, 15670, 4255, -11327, -13472, -1796, 8134, 8236, 3062, -569, -556, -1181, -3575, -4903, -1707, 4854, 7564, 2366, -7924, -13259, -6311, 8003, 14696, 5774, -7568, -10174, -1799, 5410, 4087, 1197, 1977, 2916, -712, -6442, -7688, -1684, 6431]
2196F431N491l713j2473r457N400J4952Q265n750j0600m258K344K066n84J050
2210h36M586L702k901q826o550K684J0820J1076j240j2759j1271K019J1332O170
2224H006m200o156P58L086l202n704J599Q845N919k385p949p937n25Q969J0684
2239I808Q55j0638r857K62P269L465j478k06L040J36n259n724j54O841J0476L882
2255A2718q887j3594m992Q652J2943L108p356p325N58L330j297k873L981Q914
2269G880L190p751j1091k831P216J0001M474n321j0128n923M214Q432L123l349
2283B136k195J726J02m128l198L642P604M906m167j0070p630L364J1045Q086l234
2298G989j0212n738L925N193N71j575K402M263r11q977q339K755J2118Q419l574
$$ y = [6431, 11922, 8209, -4264, -13721, -8321, 6631, 14896, 9146, -1454, -5712, -3368, -1302, -1886, -836, 3750, 7452, 4551, -4275, -10825, -8141, 2679, 13755, 12515, -244, -11515, -9496, 1836, 8006, 3806, -2350, -1592, 1494, -1708, -7412, -5813, 3032, 8951, 6566, -1383, -9320, -9845, -876, 9808, 10663, 25, -9832, -9570, -2301, 1164, -314, -520, 2520, 2656, -2603, -8327, -8481, -1640, 8836, 12718, 3831, -9763, -14755, -6103, 6840, 9948, 2592, -4733, -4175, -845, -2142, -5015, -1034, 7880, 11070, 3319, -7772, -10603, -3387, 6614, 11088, 5767, -4361, -10284, -6070, 2362, 5485, 2136, -59, 1667, 1769, -2359, -5557, -1915, 5689, 10595, 6428, -3642, -11272, -7908, 3137, 11223, 7989, -2223, -7961, -4036, 1157, 1728, 153, 2555, 6818, 5907, -3070, -11409, -8654, 3464, 11883, 8309]
2313H309j1086q004J116P771P553P94m568k749J94l0k825m83N848O647n74q532
2329f19q739m00Q173Q937K403o581q966j946O476N487p6k395j1J900k226o296
2345d879l697N792J0921K747q753j0875k424P431R643L268m600n990k374J167
2359b623J453M67J256L181K792m485r242m148O079J0755N120m349r551o691K975
2374g011Q195M829j641m389j272L20k175l913Q96Q103O618k778j0336p640L728
2389h466J0742P299k496q295m746J606L344K025j90J57J703j1m538o184N22Q575
2405A047R054m81r553q549L92P745P163L29m785m378j102J445j95p15K735O292
2421F444J535o773r085j231Q549J0004K193p867q744k306M957M979R82j459r75
$$ y = [8309, -2777, -10781, -9665, -1894, 5659, 6453, 1885, -864, -670, -700, -3525, -4008, 1840, 8487, 7913, -619, -9358, -9758, -1585, 7352, 9755, 3174, -5792, -7738, -1262, 4225, 4149, 1754, 1743, 3643, 1417, -4879, -8576, -2784, 8137, 10884, 2131, -8744, -11168, -3737, 5906, 9174, 4574, -1416, -3790, -2623, -1170, -703, 553, 3734, 6526, 2041, -7201, -11349, -5270, 5485, 10605, 6256, -3295, -9986, -7011, 1184, 6013, 4372, -17, -1289, -969, -3144, -7057, -6161, 1942, 8560, 5782, -4554, -12194, -8466, 2276, 9575, 7079, -1216, -5962, -4356, -1012, 1013, 823, 980, 2683, 2672, -1866, -8050, -7528, 1047, 10101, 9620, 67, -8482, -8090, -345, 6818, 7147, 2362, -2016, -3118, -1673, -1868, -2583, 152, 6444, 7979, 1206, -7879, -9110, -561, 9443, 11636, 3769, -4975, -7281, -2324, 2655, 3637, 2178, 1203]
2436A203L81j867l765k254M462Q581L674n463j0793m822N932R984L454m605o759
2451b657k609J513K565M57L21K789L533k397p508m948L978J0255O127m554j0448
2466c583n525K973P382L939r69l934j753K46j204j602J663N866M448j857q016
2481a926p250R57R045Q405j152q803o448J113M829L075q1k02J024M96l518n414
2497e850l55O715Q250M36r289r216k01P603P019P99m190l996j069J321r1K33K650
2514G69M189M96n283p058k514N536R070L525n830q564l566M245P280K361k372
2529B284k037O99n39l280k306K899P043M126m921j0274m642N515J0162L777l970
2544D536o523k635K025K436J030N03J697J509k389n896l677K669Q080N515k458
$$ y = [1203, 1584, -283, -4048, -6302, -1840, 6741, 10415, 4952, -5841, -10663, -4731, 5253, 8707, 4102, -2657, -5266, -3753, -1188, -731, -410, 2379, 5912, 3515, -3993, -8941, -4963, 5292, 11419, 6865, -3583, -9108, -6135, 1247, 5186, 4217, 283, -1470, -1224, -2428, -4030, -2367, 3499, 7947, 6090, -1926, -9176, -8219, 826, 9231, 8079, -724, -7172, -6059, -1230, 1845, 1764, 1562, 2586, 3082, -436, -5850, -6205, 510, 8760, 9196, -93, -9309, -9510, -1907, 5112, 5911, 1721, -2275, -3344, -2023, -2114, -1881, 769, 4958, 5454, 171, -6887, -9401, -3865, 5205, 8730, 2900, -5664, -9230, -4985, 2295, 4656, 2284, 247, 946, 407, -2873, -5179, -2280, 4763, 8889, 3968, -6306, -10948, -5433, 4729, 8506, 4536, -1987, -4622, -2597, -161, 869, 1372, 3069, 4578, 2189, -3707, -7384, -4715, 3365, 8880, 6422]
2559F422q191o092J768O935O070m23m705k844L08K31j541N17L642M451o63p102
2575a217p483L43Q485Q723j50q054o915J036N481K521r60k38R04r64l619l483
2591e590J86N334O525J001o643p308j595O238P414J949m192n322j435J301J167
2606i70P1J133K736J386l305o695k506M663Q672M273m811r067m341M923P119J469
2622D750l241j767M54n82l155j566L254N710L200l198p178n307L306Q638N107
2637H425k444p688l530J409K815J277L15J050O46j183l953l574J679O573N853
2652G670j595o935p248N45P448O295j187n576k710J163R09j487O9M154N025j174
2668E366o525n658L53O297O716J531o167p803q69M910M108k34j232N21P33k334
$$ y = [6422, -1769, -7861, -6093, 842, 6912, 6489, 1784, -1060, -752, -521, -2062, -1545, 2097, 6548, 5885, -1217, -8700, -8357, 128, 8851, 8701, 647, -6268, -5232, 249, 2770, 1810, 1572, 2476, 1512, -2107, -5590, -5404, -70, 6455, 7456, 813, -6495, -8090, -1852, 5562, 7511, 3319, -2003, -3438, -2137, -970, -899, 234, 2970, 4356, 1051, -5644, -8150, -3487, 5185, 9458, 4647, -4420, -8761, -3838, 3281, 4750, 1509, -258, 196, -386, -3541, -5107, -1853, 3857, 7057, 3859, -3319, -8626, -5320, 3318, 8425, 5981, -1707, -5237, -3828, -1013, 264, 579, 1629, 2275, 1092, -2861, -6435, -4756, 1817, 7670, 6075, -860, -8108, -7563, -115, 6180, 4993, -583, -3293, -2130, -1221, -2708, -2639, 1515, 6540, 5366, -1159, -6817, -6464, -167, 6549, 8080, 1913, -5890, -6759, -1849, 2259, 2025, 793, 1314, 2047, -287]
2684b87l738l92M830N788Q92n302o727k352M372P296K859m056n788j496L073J900
2700H72m18J78K816K046l545o569j727N273O538K284l673p348m158K086O837L919
2716E411j540l903j134O34j284j830J705O134L317l845p132m537K141P085N731
2731F953j069n906m978N47L807K549m52m34J622k8m186m623J340O776M695k334
2747D279o294m031K30M797M929J197l308m972n86K864J316j231J198L890L18n767
2763a171n924N85O209O520M45n011o024k164L778N612J869k260k135J62q62l749
2779d120j255M309O510J740n599p400j604M282N981K297j246l763l816L45K766
2794e73J378l51O79J608o20m901l753L413P130L121m052o049k961K155N524L208
$$ y = [-287, -4025, -4417, 413, 6201, 7093, 1791, -4936, -7288, -2916, 4380, 7239, 3183, -2605, -4101, -1028, 872, 454, 632, 3448, 5494, 1949, -4620, -6347, -1074, 5464, 7748, 4075, -3273, -7431, -5345, 1492, 5411, 3871, -32, -1166, -532, -1816, -3646, -1941, 4193, 7510, 3665, -3467, -8004, -5863, 1222, 6953, 5884, -22, -5000, -4453, -646, 1903, 1451, 1017, 2639, 2611, -1575, -6198, -4858, 1918, 6613, 4279, -2015, -6046, -5816, -1019, 3910, 5107, 1799, -3173, -3759, -895, 421, -810, 388, 4278, 4596, -1171, -7095, -6510, -301, 6219, 6664, 1653, -4371, -6535, -2757, 2855, 4724, 2464, 329, 491, -371, -4120, -5375, -1066, 5444, 7184, 1585, -5815, -7419, -3137, 2844, 5141, 3895, 132, -3684, -3339, -573, 805, 454, 1133, 2741, 2121, -2780, -6533, -3120, 4010, 7131, 3079, -2970, -5931, -3776, 1748, 4956]
2810D956q28m510k454J059R26q91N04L306L553k116o990m192L151P848M281k158
2826E445n464l718m32K465L262J761k14r76j862j803k101n63M639O250P31o792
2842F28o559K45N379M423P43k455l905j511J204J846j16j65K343K040l145n959
2858d964j450O340O633K18o297n389J40L306L422J151j206j468j603j365k59R36
2874a855J828L299K239k705p354l593M507P263K664l732m679k103N39J663K419
2889D00J425Q5o52n20k573l530N67O931N449k633p796m109K874N359J951r77j994
2906B57j150p60l69O64J477J639J543o36l821m106M55N885M727m74o488m577J581
2923d153L698K011P73n3j097j919j478o24O81K782M589P73n098p293n41N846O374
$$ y = [4956, 4128, -382, -2836, -1777, -851, -1742, -1238, 2068, 5621, 3505, -3485, -7677, -4526, 3322, 7603, 5445, -19, -3737, -4169, -1704, 1558, 3319, 3105, 2129, 267, -1536, -3637, -4200, 439, 6689, 7420, 628, -5931, -5686, -307, 4116, 4859, 2404, -1501, -3012, -1808, 38, -78, -243, 2100, 4140, 995, -4964, -6414, -74, 6559, 6777, 480, -4909, -4769, -1463, 1959, 3110, 1904, 436, -1167, -2532, -2791, -1855, -27, 3272, 5511, 2806, -4548, -8141, -3634, 3629, 6293, 2561, -2118, -4221, -3682, -2019, 400, 1825, 1910, 1258, 738, -1835, -5365, -4798, 2133, 7582, 4949, -2847, -6956, -4082, 1277, 3228, 2251, 257, -893, -1653, -2022, -1358, 119, 1758, 3301, 2665, -1156, -5262, -4807, 1078, 5805, 5331, -1157, -5734, -4153, -455, 1556, 2329, 2276, 1179, -740, -2218, -2842, -2161, 621, 5210, 5983, 885, -6408, -6949, -1103, 5271]
2940E271j82m065k659o90P28M11J253J670J672n50k836l776j160L412N326K102
2956E927l418n752k144L295M611J107j593j654n05o31o83L56J784K423Q99k206
2972A816m295l006K294O470L633l177n865k264K047K721R60Q3L59K16k139k668
2988b815j505K310M025L157j064n185m955Q37N535M517p31l397k509j95O05j85
3004a555Q67K573J997j541m243l024J152M100M483R8m793m762K39L652L036m21
3020A858j322n04l77j575j635J285L072K558m9l115m332j264L666N224J897l583
3036A804m248j193J391K311K60M42J324J63l060l294m08L154N093J619k890n209
3052b741k742K539M272K534j606k583o28q2r46k02K330L206O31k978l156j976
$$ y = [5271, 5089, 1024, -1635, -2325, -1597, -1186, 67, 1737, 3409, 2859, 23, -3753, -4913, -1501, 3825, 5927, 2509, -3243, -5387, -2092, 2519, 3626, 2033, 379, -126, -757, -1440, -1084, 700, 3123, 4022, 1816, -2479, -5485, -3191, 3279, 6912, 3735, -2130, -4394, -2347, 374, 1334, 1417, 1776, 1992, -147, -2815, -4320, -2010, 2015, 5172, 4108, -1077, -6032, -5195, 340, 4857, 4126, 729, -1780, -1975, -1370, -1555, -688, 1885, 3882, 2341, -1902, -4926, -3774, 326, 4809, 4907, 114, -4648, -4409, -757, 2279, 1858, 536, 32, -345, -1920, -3555, -2270, 802, 3360, 3311, 196, -4136, -5400, -1734, 3490, 5387, 1804, -2444, -3637, -2246, 65, 325, 767, 2091, 2254, -806, -4100, -4508, -1354, 3739, 5358, 2468, -2741, -5483, -2944, 1328, 3862, 2256, -327, -955, -1037, -1983, -2185, 145, 3351, 3982, 1004, -2152, -4128]
3068d128J551M361L658j815m084l461Q49K992K324n21q17J8p43j758j616J254
3084a936L717L248j142n417l818J206M542L914o13l060k727j63J056M73P44K171
3100B195J840j924l683k581P59M170L574J24l482l980j526K509L913J587j430
3115B065j979j177k52m99M12J761K947J086l553m898j269L853N043J267l093m139
3131b425j289K105K105K64N6R25j0j930k760q18K900M139J356l027m214k073J756
3148b940L464K545n07k331j999n9m1Q45J146J779J026j449l916k502J547M695
3164A303L595j067m573l513J071K979K423k12r44m98l42j735j306Q26L358K989
3180D354j185m551l311P62L948L087M29k398k688j100R01J443J184Q59M45m11
$$ y = [-4128, -2577, 1784, 5442, 3627, -457, -3918, -3069, -77, 2247, 1726, 909, 927, 184, -1574, -3190, -1936, 1781, 5029, 3887, -1530, -5348, -4142, 400, 4314, 3701, 641, -2086, -2249, -1193, -720, 24, 2195, 4035, 2111, -1572, -4153, -3394, 776, 4350, 4474, 992, -2988, -4514, -2005, 1908, 3495, 2065, 86, -1091, -1343, -1842, -1430, 331, 3278, 4364, 811, -4087, -5356, -1503, 3540, 4807, 1714, -2425, -3714, -1609, 496, 760, 816, 1741, 1731, -199, -2959, -3777, -877, 3262, 4618, 1591, -2623, -4696, -2940, 524, 3069, 2562, 231, -1768, -1827, -1868, -1023, 123, 1902, 2928, 1479, -2437, -4939, -3392, 1303, 4898, 3831, -742, -4255, -3184, -205, 2218, 2006, 1062, 564, 222, -1513, -2819, -1993, 1365, 4354, 3169, -1382, -4693, -3931, 17, 3104, 3533, 1135, -1553, -2653, -1752, -309, 875, 1734, 2179, 1768]
3196A768k356k892M37L234L952O0k930l990j788K921M140R48j757j766p02k81
3212a002o33M03J996K128N55k857l992j011L449L909J492k168l825j745J321K081
3228A01J396J57P3p25j679j362q76K301L487J412k316l952j779J127L955K196
3244C516q52k298j790k31K48J043P21J419P99j186l518k275J684L946L058j115
3260C169l512l281N09K443K248K38r39o84j050r11k87O64K409J988j21l346l633
3277d096N4L771L427J8k620k783p04J253J169J154O97q7m08j786k270J22L048
3294d1L184P76l049m024o48K077L461J021p81k263j208j38L55N45J336J606K03
3311B412j700l104j850K208M417K080k542l618j230R95K111J268Mk75p98r98j430
$$ y = [1768, -588, -3480, -3043, 191, 4143, 4203, 1273, -2717, -4505, -1584, 2556, 3504, 1747, -19, -721, -1002, -1635, -1232, 764, 2892, 3447, 590, -3402, -4413, -964, 2945, 4437, 2269, -1556, -3301, -1980, 101, 1497, 1654, 1727, 1002, -677, -2039, -2915, -614, 2873, 4285, 1969, -1983, -3762, -2635, 1320, 3516, 2664, 366, -1424, -1655, -1407, -364, 357, 1776, 2575, 1389, -2129, -4404, -2720, 1226, 4284, 3169, -343, -3624, -3115, -672, 1576, 1814, 875, 191, -859, -1770, -2057, -1393, 1016, 3004, 2883, -463, -4096, -4042, -271, 3156, 3174, 554, -2229, -2933, -1680, -511, 643, 1340, 1253, 845, -941, -3211, -3089, -41, 3143, 3919, 870, -3154, -3802, -1725, 1736, 2757, 1976, -287, -1495, -1633, -1278, -733, 603, 2209, 2412, 712, -2392, -4242, -2034, 2383, 4463, 1921, -1697, -2927, -1932, 179, 1447, 1451, 1176, 378, -620, -2050]
3328b050k40J586K560K069j861l819k176J885L083K378p43j993j872p50Q17J293
3344A67R57O09L8r67k058j595Q11K639L518k38l888l319J72L150J961J14j022
3361A049p48o53q53m68O69K071J632J02k904l042j33L552L016o8k485k255n65
3378b083N84J695O38Q48j82j035j668j323L40J835K955O27j935l563j855J940
3394b182L704J388j431k162p29K02k57J65J834J683J18j589k837j367J454L586
3410A580K345j395m013j788J380J836R33k99O08o29j480j397J68J908J829O11
3426B197o88k431k201L97K854K956k02l052k151L92J482R21M03O41J08j021k133
3443a528j378J261K424K292J41l084l401p77L269K797M82j522q46l71j082n68
$$ y = [-2050, -2290, -704, 1856, 3925, 2064, -1755, -3931, -2046, 1037, 3415, 2672, 679, -1193, -1943, -1126, 167, 1124, 1733, 1771, 804, -1254, -2849, -2038, 601, 4119, 3881, -7, -3326, -3154, -4, 1957, 2071, 1049, 301, -352, -1205, -1673, -1004, 1067, 2699, 2801, -103, -3145, -3278, 274, 3290, 3222, 737, -1518, -2083, -1499, 196, 834, 1682, 1500, 465, -1203, -2526, -2186, -351, 2604, 3231, 1296, -2267, -4122, -2182, 1522, 2910, 1479, -683, -1412, -1210, -1467, -1302, 532, 2215, 2333, 744, -2093, -3460, -2006, 1580, 3925, 2530, -1483, -3271, -1891, -55, 878, 579, 1187, 558, -922, -2319, -2151, -243, 1586, 2197, 1509, -922, -3123, -2726, 128, 3084, 2882, -170, -2321, -1929, -447, 474, 877, 1518, 1626, 605, -1528, -2906, -1645, 779, 3071, 3212, 128, -3273, -4050, -781, 2016, 2498, 976, 130, -241, -1323, -1891]
3459a891O73K701J704j116k739j642m52J473L299J654j665k971j742J345J635
3474B66J086l11R8l53j131j409l19K306J762N85j940k087j360J128K791K015j283
3491A844k407j193O47J121J84O57J451q0k371k415R6J500K671J188k17k818k718
3508b860J71K613J987K62r72j341l60q73j055J553K343J501j346k845j801L97
3524b626K212K492N91j672k591m64J141J446k40j50Q04J06j993j717Q89K885J424
3541B537q15k019j910l73J202K955J197j266k295q06K45J64L56J298J952l4l019
3558f31k399k34K729K613O76j539k425j313K12J961K025J75j004n69m40j729m02
3575b294J861K909N76k259k645q34J292J840K062n71j505j900n31J627R51l8N09
$$ y = [-1891, -1218, 1483, 3187, 2071, -668, -2310, -2762, -1289, 2010, 3664, 1999, -972, -2714, -1369, 266, 1352, 1041, 1139, 786, -345, -1754, -2073, 233, 1995, 2580, 640, -1447, -2807, -1679, 1112, 3127, 1844, -563, -1756, -1109, 12, 196, 853, 2304, 2224, -147, -2562, -2466, -966, 1705, 2893, 2676, -142, -2860, -2689, -76, 1911, 2173, 1201, -140, -500, -1373, -2428, -875, 1468, 2969, 1623, -1222, -3023, -2626, -414, 2078, 2669, 997, -1594, -2058, -917, 529, 289, 139, 943, 1049, -944, -2661, -1772, 1113, 2537, 1722, -297, -2207, -2580, -1378, 1577, 2774, 1508, -787, -1593, -1348, -1184, -828, 470, 2422, 2388, -631, -3030, -3264, -535, 2078, 2754, 1215, -1210, -2523, -2311, -350, 1675, 1850, 846, 277, -163, -1892, -2294, -433, 2476, 3052, 793, -1852, -2686, -1394, 446, 2508, 1937, 432, -1468, -1999, -372, 579, 541, 1050]
3592A050M87r56k378q78J612K922J165j079k809j378M30J654J812N72r68j580
3608c22r05j81M73P07J737J323p33k785k266P23L235J048L41j281j995j120M57
3625a544J885J157j48n34l86l60j630m46J714K675L87k544k325l52J808J837N08
3642A702n08j186j138j29N80P01Q78P55k44j336k265n33K174K827K46j364k804
3659a644o54K70J502J646J012j273j227j062m4L05Q55J443J409r02l420j966J471
3676b279L087J788j101j568j173q6J07R14J142L82qj226j366r85P60K628J253
3693B269q61k215j791M96J962J275J18r8j141r69o41R36J197P98pl11j294k190
3711b467p8K367K911Q7k439k122j26J049J088J048J97m63r02j258l62k13J949
$$ y = [1050, 1537, 581, -1797, -2675, -1063, 1859, 3024, 1945, -864, -2242, -1812, -158, 1654, 2226, 1258, -322, -1227, -1408, -935, -228, 1509, 2832, 2099, -686, -2952, -2229, 1006, 2054, 2395, 1114, -881, -2001, -1544, 341, 1498, 1350, 816, 430, 70, -1560, -2006, -292, 2383, 2770, 226, -2099, -2451, -643, 1194, 1702, 1194, 8, -1130, -1259, -679, 22, 900, 1655, 1411, 75, -2190, -2723, -549, 2278, 2524, 1160, -1644, -2298, -2028, -526, 1120, 2132, 859, -368, -1430, -1474, -1169, -314, 1129, 2538, 1636, -1784, -3750, -2279, 808, 2596, 1495, -73, -1246, -1332, -1225, -311, 831, 1213, 1205, -21, -1387, -2372, -1612, 1016, 2269, 1408, -807, -2598, -2102, -140, 1135, 1253, 1155, 14, -955, -1596, -660, 537, 1335, 1328, 1017, -277, -2467, -2545, -178, 2733, 2820, 381, -1741, -1867, -818, 270, 1318, 1515, 1052, 150, -1108, -1470, -1683, 266]
3728B66J836M80k153k274o68J754K358O60r14j025r03m29P5J100J312K96p97j161
3746a87j206m61J211K180J084r70k601j422J014K006P51j30o26q82l73n86J45
3763a053J146R58R47q83k175j183O27K292J712m91j887j280j55O58O57J153M19
3780A462l52j095j196p88R59J698J445l39j512k199k69J722K065L0r34j020p79
3797a102L2r0Q12J495L25n55j519j587O99J369J546O84j625k045o67J135J507
3814D14L87J42l03p43r16o75O20J466J397L7j500j802j036J325K024J065q76j126
3832a00j018l20N89Q60P18O86l25j434j448K23J260J562R55q04k248j190M08J492
3850a34J348L97r38p65q30j06K26R27J361K52q00j668j465Q78J970J470rj727
$$ y = [266, 2102, 2582, 429, -1845, -2513, -759, 1599, 2259, 1345, 320, -583, -1012, -937, 163, 1475, 1771, 974, -187, -1393, -1854, -643, 1537, 2621, 1651, -950, -2372, -1358, 648, 1399, 1269, 643, -239, -612, -1198, -1053, 93, 1051, 1998, 1115, -1060, -2243, -1616, 676, 2388, 1897, 10, -1270, -1425, -767, -110, 1043, 1462, 1110, 15, -1181, -1969, -1010, 688, 2133, 1794, 282, -1917, -2186, -464, 1601, 1631, 697, -323, -1102, -1070, -1160, -348, 1147, 1472, 917, -602, -2189, -1490, -121, 1425, 2109, 484, -1561, -2228, -1093, 414, 801, 943, 640, -103, -1019, -1694, -1074, 392, 1789, 1826, 326, -1476, -2512, -1187, 837, 1902, 1026, -100, -1118, -1438, -849, 11, 729, 1415, 1090, -344, -1792, -1569, -309, 1253, 2208, 1404, -844, -2034, -1626, -134, 1214, 1611, 673, -92, -922, -1028, -802, 125, 1486, 1738, 938, -730, -2195, -1317, 653, 2123, 2114, 387]
3868C87j699j69J156R07P04m2k40o05j090r06P68J914R01l00j668j432l29J339
3886d04J455K84l42j251m57n89O70P92R75Q0n79j246p67k56J014K114P31j463
3904G61j883j055R16J745J037j66r90m93m46j077P61R78J170N73j683j612p51
3921b215J126J949M70M2j426j087k60M50J018N61L22j77j258r90j39Q76J581R11
3939A754m79j560j490p2J649J630K61j334q02k43J50k52R60R14J13m49j750j139
3957b139O69K179J310l66j468j275l80P56P11Q42K14n96l81j028k37M82J187J194
3975A674q2j585j516K42O16J570R35q13j093j122J71M06J097K59M05k85j140j223
3993a484q0J575J399M39j181j465p60N81J406N73j5m31n67r92K9M22R60J308M4
$$ y = [387, -1312, -1481, -325, 582, 1286, 1244, 1004, 399, -691, -1597, -829, 1085, 1986, 1686, 18, -1414, -1743, -404, 1051, 1335, 993, -258, -715, -1304, -634, 158, 1133, 1213, 634, -612, -1379, -1635, -621, 1493, 2224, 761, -1122, -2177, -1261, 484, 1521, 1355, 365, -128, -574, -1651, -890, 88, 1258, 1831, 148, -1464, -2215, -1089, 860, 1330, 1372, -54, -1141, -1401, -951, 67, 628, 950, 773, -485, -1475, -1614, -738, 843, 1754, 1275, -285, -1775, -1847, -198, 1432, 1693, 359, -443, -686, -536, -788, 172, 1086, 1199, 750, -1000, -2139, -1470, 709, 2019, 1653, 185, -1090, -1470, -714, -3, 839, 1053, 457, 76, -952, -1189, -707, 480, 1674, 1592, 7, -1509, -1267, -651, 919, 1854, 1041, -52, -1174, -1003, -597, 500, 759, 1164, 879, -261, -1484, -1564, 11, 1410, 1849, 668, -797, -1557, -976, 430, 1003, 988, 557, -10, -1002, -973, -551, 409, 1717, 1761]
4012A761j290j812m10Q73J605P66k55j073j298m23Q78J338N96l51m78m52r08o47
4030a580O41K238M60n03j972q63j00J423J146L91n39j006o23j0J00R08P26K14
4048A051j26j550r55J64J625J322l78j309q07o69O44Q87J068k4m44j335p7L21
4066e92m8J022J006l25j129j699k5J241J605M60m72j357o46k59Q25P14P11l34
4084F98J93j156q54k44J063J381P13j040j541o91M07J103M94P77p43o58j237L71
4102i64L08Q54O30J06n26j259r00Q33J600J009n37j334o40j03N84Q88O17p2p12
4121C82r15o20L6R25J017O54k48j855r44J90J467R89M39n94j122m64k01N67O01
4140C04N75K17n72p04j084j65J640J402J66j680j186J75K81P51M43K98k39q64
$$ y = [1761, 471, -1341, -1751, -878, 727, 1493, 1238, 165, -1133, -1556, -678, 660, 1256, 905, 427, -25, -933, -1580, -939, 1299, 1759, 1256, -716, -1579, -1679, -256, 890, 1281, 742, -264, -887, -897, -797, 111, 837, 1051, 925, -625, -1580, -1416, 209, 1531, 1153, -156, -963, -1632, -988, -101, 967, 943, 499, -836, -913, -592, -640, 382, 1388, 1063, -66, -1765, -1790, -549, 1056, 1516, 1044, -313, -959, -1218, -393, 321, 1032, 698, 891, -265, -1119, -1363, -300, 1081, 1794, 754, -787, -1478, -1071, 32, 526, 1303, 560, -98, -1335, -964, -656, 198, 828, 934, 408, -851, -1751, -918, 682, 1691, 1154, -180, -820, -923, -339, 549, 1166, 1094, 382, -533, -1153, -1117, -192, 825, 1479, 1231, -624, -1568, -1378, 89, 1078, 1517, 923, -199, -663, -864, -297, 304, 879, 1096, 524, -180, -1264, -1429, 211, 1613, 1779, 99, -1087, -912, -631, 120, 563, 861, 622, -242]
4158b42p92J4P68P92M27j10p72j381j90J025J876n2q89q71o55K41L28O14Q40o
4178I65o48j154l24L31O72N99J084m54j716j593R15J212P31J24k70n74n21p69
4196a390N38J059Q78k18k72j550o71M88J275J200K1j415p90k39N72M81N61M45
4214I73n58r44m03K76O19Q84K94j50j176j180m56J575J374M66j531p39j14J54
4232f36K54N32Q87M64j159j159p75O95J396O41L7o83j025q46M06J383O11k60j91
4251E72n34o47j98M47Q46P95j86q68j099N9Q5J198P55l36j272r99Q16R26R1R3
4271E44J14j60n96j269M22J022J180Q7j189n16q43J72J203R99j09q21o08o86K18
4290h36J76J187N79j15j167r66j54N42R42O79K32q94q34j002R20R83N92k17m28
$$ y = [-242, -1034, -1020, -252, 540, 967, 857, 85, -1296, -1486, -461, 1415, 1363, 474, -397, -1052, -811, -483, 131, 971, 965, 317, -837, -1161, -830, -158, 441, 1525, 1071, -645, -2238, -1323, -111, 620, 744, 474, -100, -621, -1390, -852, 207, 1085, 867, 595, -955, -1626, -1138, 137, 1337, 1358, -57, -847, -1086, -514, -33, 528, 973, 415, -529, -932, -656, -37, 847, 1141, 991, -185, -1365, -1821, -246, 1128, 1594, 63, -676, -790, -636, -382, 150, 1037, 1501, 342, -817, -1592, -897, 499, 1140, 1177, 494, -531, -1377, -971, 412, 1023, 763, 572, 38, -609, -807, -360, 486, 1281, 1095, 227, -872, -813, -728, 470, 1225, 889, -383, -1382, -566, 360, 451, 544, 658, 498, -98, -1367, -945, 77, 1257, 1344, 155, -361, -1204, -1032, 171, 1170, 1061, 240, -368, -1054, -836, -660, 527, 1106, 991, -176, -1142, -1296, -754, 188, 867, 1099, 205, -629, -1631, -711, 272, 864, 647, 219]
4309B19k7q36o11P37J222O18o63j153p88M58L42J060N57r56p71m16M66O27r9M76
4329D62K72n41r47m67O15P58P98j14q14o28l52j05J416Q60l42o31q83k35K15L55
4349c08O04P16j57q77r88m44J083J106L79q6o51j127k68P72R88p9j67j96k13o96
4369f09k91R57R72N0n86j009m23Q7Q66R13J58m26j216k89M15O68K58K17o0o74
4389b2o88k18M27J222O95n62p10j160l33Q00Q44Q62nj116n79k14K81K75Q21L45
4409I65N2j545m72j27Q98Q56L54m79o75q05J48O02M37N86l01l23n27m74j16J006
4429F0Q14N01j183r76k8J78O40L61L20n22m96l00j1O18O02L03l14o60r83m1O08
4450e09J195N33m89p06p85j70L76R27M10n40k65n30l20J81K63P56R82p72j288
$$ y = [219, 192, -644, -1255, -518, 704, 1322, 659, -494, -1282, -824, -482, 578, 1135, 179, -592, -1008, -542, 85, -14, 462, 734, 193, -754, -1221, -606, 152, 950, 836, 22, -606, -958, -1063, 353, 1213, 871, 240, -643, -878, -663, -308, 296, 1012, 855, -22, -1010, -1454, -371, 735, 1114, 1028, 377, -750, -1018, -246, 742, 663, 496, 300, 87, -609, -900, 57, 1029, 1079, 493, -516, -939, -852, 14, 927, 1085, 659, -557, -846, -431, 237, 495, 712, 652, -22, -710, -928, -501, 721, 1416, 854, 144, -1016, -1349, -549, 295, 1157, 1152, 36, -543, -757, -476, -201, 620, 965, 1017, -528, -1000, -1127, -229, 627, 981, 502, -173, -978, -830, -228, 209, 795, 494, 171, -356, -830, -946, 60, 874, 1375, 192, -784, -812, -634, 6, 367, 687, 165, -331, -631, -642, -24, 578, 881, 567, -93, -1076, -1117, -509, 686, 1219, 730, 24, -761, -931, -555, 372, 782, 242, -23, -553, -873, -692, -429, 327, 1309, 537, -751]
4469g51k76K03Q02O35j30n0p97l61j76P80O79O67n22o12p57m87O73M65J196m86
4489F95p26o95k65Q77K02R01k86p45k42m87N19K75N45L70l77n50r93k12J211P67
4509G84L38o12p59l37o1O85L10M51ll50j017l55M91N00O89J41j45j018n28L38
4529d58P55N54M2n94o67n15J26P72K39M38j97p73m46k84K95J245P00m96j125m61
4549h50J29N34Q56J98m53k11o72j96J40J69R34L0o0r04p28K64P36O71J58k41r25
4570d21n56K65N05N22L50k60o71k87k35L61P50L09K76o90r35o28Q25J048L46j64
4590G10m86n67k82K78L26L09N36l43o91q22K98O17M84O19k96j151k84J08N13O59
4610E35j4O6o32m95j84P9Q68N40K39n88p91n57J31R90P01k06j75o47m87L56N05
$$ y = [-751, -1027, -824, -22, 613, 483, 433, -364, -725, -901, -121, 558, 1225, 703, 91, -666, -1153, -480, -15, 1181, 695, -31, -726, -991, -114, 88, 989, 703, -42, -284, -771, -252, 23, 568, 938, 561, 11, -982, -1194, 17, 784, 1122, 510, -249, -586, -647, 38, 348, 799, 796, 446, -571, -926, -435, 65, 754, 895, 750, -268, -796, -458, 297, 851, 893, 299, -368, -883, -757, 15, 254, 692, 495, -278, -724, -1008, -713, 532, 1232, 736, -389, -850, -721, -187, 669, 867, 414, 203, -469, -665, -525, -356, 578, 608, 548, -356, -1084, -820, -84, 587, 745, 504, -421, -977, -712, -207, 315, 665, 405, -266, -553, -788, -427, 323, 632, 908, 218, -717, -1345, -520, 528, 874, 710, 224, -343, -625, -347, -21, 288, 824, 481, -210, -1032, -734, -117, 367, 986, 690, -461, -745, -637, -124, 535, 521, 587, -45, -540, -724, -645, 223, 763, 1002, 414, -377, -934, -803, 187, 888, 682, 507, -140, -627, -271, 234]
4631B34J87L88j70m67o76j45L57Q09O16l18r18n01J92K81K12J284n66o06n30k03
4651e40L03M45N3O42p82k23n10r4P21N32M95l71j244o6J13O65L32K84k38o02n44
4672f29l61O06O19M45n7o09m36o20P30N77L88K70q05n29L9k23M13O93K70k23r09
4693c51m27j47N77P72O31q05o41l71J39K30P58j85L74k08o58o49K80Q36M47j60
4713D42l39o23l35K6J063K98m0k30p92l95M11L70M30J94k9m87m36k24K51R91J69
4734G15j1n66o15k16N80O07J83m3o09j65n41J82M38P85r2l76o72m61K50M76Q23
4755F72K5k71m47q22Q7Q13J76J02r7j64o05k28N26N47O1L78o85m34n77L69J015
4776D41L58j28n01o07J80rO0N48K07J56p84o02J66M97N97Q8l58m02l54j74J35
$$ y = [234, 421, 809, 639, 172, -504, -649, -292, 517, 1133, 815, -103, -604, -412, -131, 81, 1365, 799, 193, -337, -540, -237, 208, 261, 903, 121, -102, -612, -706, 15, 547, 1042, 671, -573, -639, -526, 139, 471, 755, 517, -85, -629, -990, -384, 235, 680, 623, 14, -422, -1042, -312, 265, 653, 923, 118, -411, -372, -595, -182, 511, 781, 558, -351, -778, -925, -348, 424, 1055, 250, -391, -762, -623, -393, 365, 180, 554, 346, -312, -961, -681, 155, 602, 442, 103, -520, -855, -829, 234, 532, 492, 262, -530, -925, -514, -144, 286, 480, 451, -36, -472, -696, -445, 546, 715, 704, 138, -477, -693, -113, 494, 677, 634, 25, -140, -681, -499, -61, 724, 632, 256, -416, -877, -627, -151, 672, 697, 426, -21, -843, -756, 57, 233, 335, 238, 74, -531, -759, -233, 314, 375, 753, 68, -366, -943, -574, 441, 799, 671, 170, -437, -257, -266, -206, 342, 549, 705, -79, -681, -515, -18, 579, 667, 309, -93, -447, -621, -486]
4797d86Q58L10o7p09o04O1L91M27L38K19q36l75k84J14P28N21j3m63o29j41K57
4818c83M26J29K63l16j49j84p74L36R94N32m09m64o21K78j23M28L33J05j54p60
4838e13P5R9M03N03J81m89o87l07L68K76P60m2o01q9p92K16M59Q11K4k07m68m76
4860d96j13M6O29R61k89n82q36l14N16P22J85J30j99o81k97n5P49L00J41m8l52
4881A17p27j06P75L39J07o4o96K3o0j04P67N12n49l21k51k34O82j71N07j30L0
4902D46p32o69L72Q26N13k82l97n71Pj23L99P07M45l56q60n11K08L14K75O09J9
4923F39p59n33j75M71O96J26L2k30n05l62J07O14O98l74m86kn54k49O42L05M15
4944E16k55p41RJ80K36L28J25j76k90k79k28M13L15J48l4k90p00l35P78N41M48
$$ y = [-486, 372, 682, 615, -94, -698, -637, -246, 181, 519, 738, -98, -473, -757, -643, 85, 606, 593, 130, -499, -640, -383, 43, 172, 435, 119, -30, -214, -988, -652, 342, 874, 465, 1, -620, -342, -465, -37, 296, 401, 247, -513, -438, -339, 64, 567, 748, 259, -428, -735, -367, -91, 669, 627, 26, -63, -855, -639, -180, 631, 655, 448, -20, -496, -609, -563, 66, 1027, 738, 156, -680, -994, -478, 244, 429, 559, 360, -321, -618, -673, 76, 376, 517, 469, 117, -610, -716, 59, 398, 505, 441, -255, -232, -292, -396, 371, 883, 334, 13, -238, -472, 210, 39, 546, 416, 446, -286, -955, -583, 243, 756, 474, 77, -494, -487, -610, -211, 496, 941, 585, -275, -786, -578, -264, 11, 620, 639, -120, -653, -828, -357, 339, 465, 497, 267, -238, -600, -493, 121, 819, 445, -41, -43, -597, -846, -204, 101, 516, 261, -480, -471, -291, -55, 273, 398, 222, -68, -347, -575, -162, 153, 301, 267, -23, -723, -1058, -280, 261, 709]
4965G09k27q19n9j53LO27N98o8m01m81k25l27O14O64J64k54o58l86Q0O92L1M84
4987F08l06n3m95k90O8O34L85n03J52k87j93k58N50L74J20l62o14l46L86K28M18
5008B16K01J82n85o25O7O33L52J40J26q25n09k6N73O07lj76m62j14l56K27K95
5029f2Q75j52o85m17l7l9N73N20K22r9p65n31p1O30K60R4k9j85n44j29K57N99
5051B85K80l93k4k94m00K52M97M81m36m64%P4Q2n5O43J80l94n49L7l34N17P55
5073G40r5k85n33k26l05Q87K33k2k88l56n0k46K81N07K79O0n71n70M0mM10O67
5095E53K93o63n84j69R8O03L1K07pn5q64k81P25O30j47o0p02j92J15J98J94N87
5117E10J56o12l83l55K97N64K04J23l54m57l27J77L85L65K09k46m69m03K45N53
$$ y = [709, 482, -337, -396, -549, -546, 81, 679, 611, 210, -271, -496, -823, -209, 455, 619, 365, -293, -679, -599, 93, 124, 608, 302, 249, -246, -536, -468, 166, 551, 48, 200, -87, -280, -538, 12, 386, 506, 144, -470, -816, -430, -202, 216, 417, 599, 14, -611, -544, 89, 441, 581, 707, -118, -627, -653, -80, 527, 524, 348, -114, -228, -584, -357, -62, 813, 661, -24, -441, -478, -517, 56, 576, 798, 699, -66, -597, -668, -38, 222, 316, 287, 102, -442, -571, -314, 285, 565, 172, 148, -146, -546, -294, 203, 684, 248, -216, -216, -142, -60, -115, 528, 708, 314, -235, -198, -532, -15, 740, 645, 360, -173, -399, -704, 183, 416, 394, 106, -250, -300, -546, -265, 242, 521, 581, 10, -560, -520, -524, -114, 553, 846, 183, -401, -570, -472, 131, 162, 369, 362, 307, -557, -838, -113, 517, 370, 310, -392, -584, -469, -271, -77, 510, 666, 54, -329, -684, -387, 177, 381, 504, 150, -307, -634, -457, -72, 293, 502, 256, -213, -616, -371, 182]
5137A82O02k93l13m75o0r3J20P09K04k76p1p04m11Q34L69J06j24k57l78j4L1O06
5159B94L47k10j53m56k84J71L79L48R8p3o22m04L50N8L68K41J83o68m43J76L31
5180C1o0N06n7l00m84j30M68K71K66O6k58p04m00M60L58M19K91n82o16P5j52N27
5202eK5O09j91p27k1k77N28K40K73k59j95l56m1K99J89J12M37p33l04j35K89L59
5224A16J23J71m25k46l50J38P33oJ10l43j42m99K10L91K95J71l64k88k26j32J90
5245c73J94P14O8o31k44m73N64K47M38k01L6n45Jk43M72N32k99K0l83k77J91M75
5267B83k57L77k72j81m96K72L06J11L56j28k83k44j61j4M42N07r2m22P2m87O0
5288b51M19J54K58k76l43k68l0L52M42L30m76k32n82J36L15N16Nl82o4j93k71
$$ y = [182, 784, 491, 178, -297, -357, -450, -330, 379, 583, 307, 236, -468, -879, -45, 324, 430, 306, 49, -329, -343, -312, 294, 641, 431, 278, -178, -462, -291, 88, 436, 534, 461, -161, -565, -215, -157, 211, 452, 635, -33, -476, -300, 31, -29, 477, 420, 120, -364, -494, -26, 245, 511, 577, 319, -385, -785, -325, 33, 452, 743, 161, -455, -380, -532, -5, 20, 629, 438, -289, -310, -587, -59, 181, 454, 195, 0, -356, -397, -98, 91, 203, 640, -93, -397, -532, -243, 116, 239, 410, -15, -261, -611, -473, 260, 254, 364, 21, -121, -620, -410, -19, 276, 447, 83, -205, -431, -563, -373, -179, 535, 603, -28, -272, -745, -181, 66, 504, 303, 339, -206, -205, -448, 24, 556, 257, 277, -106, -383, -192, 283, 26, 403, 131, -50, -546, -274, 32, 143, 499, 371, 88, -156, -317, -331, 111, 618, 526, 104, 176, -311, -251, 168, 322, 580, 304, -39, -307, -337, 15, 457, 787, 311, 79, -503, -367, -52, 464, 469, 87, 23, -170, -441]
5309d41L87j26R22j67n19n86O3P8M13M30J4k50o64O0j09N19L17L32n36l63n09
5330g35N23O1L78k4J61o28l64M21J01L20K48j63j55m00j48K19N9K99L61n56n7
5351g9k82L38O8L00j1q5j83m45NM48J92N89n53m95k40l01M06M23O3J85k28k93
5373a78l44J98N00L74l15j53l99o2J78J22L44J2J12n74l98K25N07L06j1m00k9
5394A5l18l2J51M30M00j89n26k61j02J70M05K09R6l85l23j15J00M74L85j20l70
5415I4l03rj51K67Q17k29m38m62K77l43L24O05l7l72j42k34L8K39q1N04K58n07
5437A15p15L76J6K25K26O6m75j11k89L06K18M32j1k10m33l1n0J54P94l43k47q0
5459f7m06M0L19L44p3K14k81n98J82J04R0K49M3O0k76m35J56N52k65N44k68k61
$$ y = [-441, -54, -180, 742, 575, 56, -530, -467, -389, 24, 454, 468, 218, -446, -386, -495, 24, 341, 673, 137, -226, -735, -212, -151, 227, 203, 364, -264, -628, -207, -106, 214, 462, 299, 144, -256, -404, -185, -126, 173, 534, -22, -79, -361, -23, 45, 345, 334, 249, 66, -379, -374, 74, 266, 855, 302, -193, -433, -734, -328, 95, 158, 343, 115, -178, -522, -324, 176, 550, 235, 82, -317, -379, -201, -79, 265, 277, 389, -185, -583, -358, 149, 455, 444, 44, 15, -303, -335, -184, 246, 646, 457, -69, -330, -432, -262, 143, 352, 448, 63, -260, -375, -275, 199, 584, 464, 94, -209, -218, -369, -102, 715, 486, 48, -414, -137, -480, -156, 449, 412, 40, -102, -336, -298, -59, -140, 364, 622, 115, -600, -224, -208, 17, 243, 309, -166, -277, -566, -260, -42, 390, 379, 169, -264, -295, -345, -191, 603, 260, 13, -67, -473, -433, -114, 230, 157, 371, 90, -508, -326, -222, -132, 117, 160, 220, -56, -491, -335, 217, -48, 496, 228, -33]
5481c3l37J65K57K17n9J14p08K76j91L14K65k05L78o86j01Q2l31P35L4J10l27
5502c1L8o6k44M95J11k31L0j97j43lK79K60%n0m86q1q5L22m0K19J01J02o88K64
5526a24K36O2J61j8j22l05l14K03M66pQ1l02l78kK3K72M13L06n04k33k59J78K23
5549E6K01J08m6k51n05j14N31K44M2j33J50l53j90L09J65L80l00j82k77j3J44
5570c4NK28J74j5l47n92M07K89K3J03k0l99k07J8L66L15l0k9j42l65l58P84J59
5593C33J78m11k34j33m4o3L19M56J0l44k21l52o2N04K49K5r0j90n07L31L17K32
5615C03M15m93l72j90p1n5Q82r9l52K6q0l68K37K35M10Rn75k25k2K66M81l26K45
5638B81j17l01l70M03J42n5O01m33n88L5K47J82J47L23l64k51o3q8JM10N70l59
$$ y = [-33, -370, -205, 52, 269, 210, 324, -384, -108, -299, 15, 280, 75, 453, -233, -334, -252, -583, 152, 186, 296, -31, 7, -59, -303, 192, 303, 72, 102, -95, -238, -241, 38, 298, 298, 248, -238, -319, -404, -82, -122, 97, 198, 300, -388, -124, 112, 174, 335, 317, 195, -110, -424, -221, 245, 238, 319, 17, -361, -363, -340, -68, 345, 651, 147, -86, -345, -167, 56, 257, 365, 319, 68, -437, -551, -20, 224, 266, 133, 283, -70, -260, 49, 214, 594, 294, 112, -165, -178, -34, -29, 199, 373, 358, 11, -581, -174, 115, 138, 241, 221, -178, -385, -367, -1, 314, 284, 255, 113, -252, -610, 174, 333, 511, 100, -134, -267, -311, -374, -55, 401, 411, 67, -154, -506, -568, -64, 185, 210, 120, -70, -577, -246, 71, 303, 718, 225, -147, -337, -408, -463, 419, 320, -32, -6, -86, -454, -217, 18, 428, 437, -138, -363, -385, -119, 362, 36, 281, 164, -137, -507, -104, 38, -17, 584, 151, -437, -402, -155, 27, 174, 497, 133, -118, -181, -269, -268, 142, 712, 353]
5660C53j67m24M3o6K07L47k1r7J46r00L72M20J93j17k22k80J83l41K86L27j08
5681A34M7j27k83J01j20N49J53m07J7j98n7K80KK56R0j09l42k73J82K25K10j31
5703A99l56K89k7n78O6N63J25J3m81m2n5J44J65L82k07j00n49K21J22J27N9N52
5725F32o59l50k1K20L90k02L71m08N4m74J72K16L93k0l23l10J53r0K17K34J99
5746C94k36n17K94k58K53L31m2Q6m18k75L22j14K38K2L6p2j56j64j6K53L38pl55
5769f3j43n7j18K12P36l5k07n49l09M10j08L89K67l51q3o0l74N22Q9M2m2r8k3
5792D7l40O8M14Q4j66p9r0l86M25j42L36J09r4l04J28k74M02L09j15k71r7k07
5814b43j0K47L22J45n3r0l29p4m86O13L01j23n2p28L57K81n7Q4K87l93J54l48
$$ y = [353, 186, -238, -195, -261, -54, 293, 272, 175, 321, -579, -207, 213, 406, 289, 67, -213, -30, -371, -85, 242, 134, 181, 54, -229, -128, -248, 301, 454, 47, 64, -134, -191, 89, 91, 347, 437, 328, -14, -287, -105, 120, 330, 199, -157, 132, 105, -473, -407, 156, 281, 294, -187, -229, -284, -140, 25, 407, 200, 100, -449, -228, -106, 21, 80, 632, -27, -377, -398, -178, 212, 10, 381, -27, 27, -447, -275, -59, 334, 314, -9, -319, -166, -256, -39, 195, 394, 158, -359, -65, -323, -70, 261, 219, 305, -113, -388, -66, -180, 58, 80, 116, 44, -112, -276, -292, -39, 299, 292, -63, -206, -263, -381, -169, 567, 532, 325, -224, -533, -123, -231, 158, 425, 74, -9, -69, -443, 79, 168, 210, 168, 70, 47, -293, -225, 189, 273, 107, 28, -62, -448, -23, -165, 171, 280, 186, -118, 10, -264, 138, 447, 332, 61, -36, -243, -253, -6, 316, 461, 408, 318, -11, -85, -571, 42, 343, 220, 168, -560, -203, 78, 21, 105, 392, -1, 153, -195]
5836a95l29M17M94r4k6l43M6m66L95l9M21j55O9j16n88M54K25l28K80k53j96P8
5858b49k33Q25nn7l28k33O2l2j88N95K30j98m98j98J83L15K07J22K86l84j35p16
5880f29L14L61M15k19p6j84k54J46j7L89j45j24j85L6O0k4J64K65J9l23l30RK54
5903g8J57J92M7n27k02J35J22L38L1J04m03l96J75L10J37j4M2J3m82J76L9J6L24
5926B56q4k8k87K43l15k56O88j18m2p5l98K01P9L32L36m41q1p5k86M66j95L54
5948B74P1o29K58J04l31K27P52l96k07l06j85J47J30K13m8j02j9j91J68p5M60
5969C15j40j7m93N6J5L3K10L00J01l52j47n0O9J78oK92o8m07j68j77P07r5L85
5992E41m34k58j63J97K46K88p0q7m37j94k4N34Q3qq7o9k86q9K82M5J60P2N0m96
$$ y = [-195, -524, -107, 387, 293, 267, -76, -30, -496, -101, -140, 281, 126, 195, 79, -509, -55, 170, -158, 122, -131, -327, -249, -482, 343, 338, 281, -47, -280, -218, -250, -438, 157, 387, 189, -309, -507, -324, -9, 198, 320, 606, 222, 87, -629, -315, 46, 461, 242, 166, -18, -272, -126, -143, 246, 101, -23, -208, -172, -112, -136, 28, 293, 312, -11, -341, -332, -78, 79, 271, 318, -209, -411, -276, -154, 184, 215, 319, -84, -480, -305, 5, 142, 128, 170, 183, -299, -123, -84, -68, 256, 172, 144, -143, 100, -215, -471, 217, 99, 57, -18, -416, -215, -136, 196, 532, 91, 10, -65, -351, 115, -80, 274, 345, -284, -26, 78, -253, -26, 726, 330, 123, -183, -368, -221, -91, 122, 74, -28, -47, -238, -70, -145, 315, 175, 158, -335, -279, -264, -231, -21, 279, 380, 28, -119, -169, -100, 78, 72, 364, 296, -111, -279, -456, 251, 156, 541, 107, -151, -314, -117, 129, 417, 347, 260, -177, -371, -395, 139, 222, 214, 127, 58, -228, -317, -35, 10, 170, 242, 292, -204]
6016b04k39L9M98P0j02M9l40p8P9n4M76K65l43o8j28k89K67%M12l25J12l98J65
6039a36J8L11j19K89k01n06N96m58K24L7K24r7l38q3J67p5L51L20l57m37N4N0
6061a66L33k49O35m60l3k48J80o9L62l03lJ20k12k81L48J95J03j51Ql40m00O54
6083B3j17M36kk75O0m30J38J96K25J17k18m53M1J99p5K40K0Jk44m09P3L46K68
6106A60Q7J91k06l89j40O6M64J80j49j55l40L22k23R6j28M04Ml02r5j39K30L20
6128B58J41o4l38J9l61L09L3N2K16j76l10k4l7J96L73l05L3q8k27m8J55N50l26
6151C1p2j15k44L79K62j22K90k71k39k01j98J79K68M70n9m65k52K11j53N94l5
6172B58j07j92k02m44L20L82K83n6j3k33l73K20K04J31j45j49J21j91p5j06M49
$$ y = [-204, -443, -404, 94, 164, 62, 111, -229, -307, -228, -282, 194, 459, 116, 48, -80, -369, -102, -102, 310, -15, 97, -301, -136, -118, 193, 74, 363, 162, -344, 252, -206, 18, 55, 279, 182, -156, -239, -72, -147, 204, 524, 167, -270, -216, -166, 167, -82, 553, 93, 60, -188, -8, -77, 285, -18, -21, 99, -113, -394, -46, 149, 252, 101, 109, -231, -631, 23, -94, 342, 340, 65, 125, -305, -167, 29, 254, 371, 153, -300, -259, -60, -135, 105, 125, 126, -118, -527, -454, -108, 160, 247, 438, 232, -157, -297, -231, 233, 413, 264, 109, -231, 91, -132, -36, -164, 240, 244, -58, -153, -292, -62, 258, 399, 335, -3, 16, -345, -36, -3, 49, 265, 89, -221, -245, -282, -86, 287, -18, 15, -73, -300, -348, -193, 357, 31, -41, -156, -400, -21, 241, 119, 409, 138, -101, -302, -500, -321, -53, 417, 358, -107, -359, -148, -301, 293, 258, 151, -41, -243, -687, -367, 15, 298, 242, 229, -4, -377, -157, 47, 178, 33, -116, 5, -186, -261, -367, 82]
6193H2K23p7k73k14j9m9K54N03q3j07m10j10K54J50N1J49j43m24r2K04o5P40p9
6216D65k40m76q3J50J96L34j21O6k03l93J61l03L68L61N9j79m57J26l06O66j46
6237D5M00k80k27j37k26K15N63l54K13k94L3j90K75P7J63k28l51K97k9j99O38
6258D04r5l07O2n85p1L56K17L8p1K4l01j32K15M41K8j03L32m03P6k87J23J27J31
6281B19k71o7k56M15j22n6M37r3j78m3J5q5L48m1M06m91k23l21K97K14o7K82n53
6304b34L27m24L02q2J03L79l99p5p0M9Q0K60j07K28k48l30Mj5K24K08J09k25r3
6327b9j60O7K32r4P9j65N0L1m57P03K4R9k33k11l92K22o9L37L98k01k71l30K40
6350a30K46j82K67R4o4m37M3K2K66J24k93m1K03j50k8K05j11L54l44j66l1K50
$$ y = [82, 305, 228, -45, -259, -278, -327, -73, 430, 347, 240, -170, -280, -26, 124, 175, 324, 181, -243, -335, -131, -196, 544, 465, 225, -251, -334, -184, 12, 346, 225, 291, 88, -305, -144, -447, -79, 282, 341, 162, -295, -169, -475, 191, 45, 445, 165, -62, -199, -425, -210, 353, -1, 212, -82, -49, -239, 36, 113, 276, 48, -303, -6, -35, -234, 404, 309, 2, 64, -521, -592, -236, -19, 19, -52, -28, -329, -461, -246, 195, 223, 120, 452, 49, 125, -162, -39, 88, 219, -52, -119, -375, 40, -82, -138, 299, 206, 28, -15, 0, -85, 263, 222, 628, 137, -86, -407, -110, 104, 37, 319, -234, 93, -331, -29, -111, -8, 371, -28, -103, -173, -124, -44, 216, 109, 337, 89, -241, -237, -252, -28, 180, 289, 64, -29, -189, -122, 110, 16, 95, -70, -20, 11, -446, 257, 281, 380, 147, -64, -456, -234, -303, 34, 432, 231, -40, -370, -130, 116, -66, 201, 295, 231, -206, -163, -141, 125, 249, -44, -85, 118, -32, -60, 145, 34, 388, 44, -122, -153, 97]
6372I7k79N78j37k04j77k00j72K82O21m00J48k81M0k30J28K77j18K48j68k96K
6393b41j50L79L95l00K25n28m6K29rp1K93Jl91m6k0J12K22J02r0j62j40j7K98
6416D5K93l48L34m67K5m45L13N97j50L7k45j38j0J86Pj00M22l6k67j32j51L16
6438H6K72k26J58j82m11L2J40L45j68L77m18j03k15J34K33L75l82k14Q0m1R9K7
6460bq1L42j77k90l9k17Q03m46j57L1L83l76%j18N89j64o6R1KJ36l5p1q3J83j11
6485A27k57j4l0K2L37o0L49m74m2k39L27K02o5K09n39J33k02j0O00l04k43J25
6507d8K5k7k90N76k37l5R6O9n73J99J31M09m27J41l5m09J80J60L00k80L63l82
6529i4K03l11R0K37j71lj67n5j44N0O20l5mR1p01L07k47J69P8J65P6k65l6O1J47
$$ y = [97, -182, 396, 259, 55, -122, -322, -494, -212, 409, 9, 157, -124, -84, -314, -186, 91, -27, 221, 53, -243, -241, -391, -12, 383, 83, 308, -220, -266, -37, -46, -117, 176, 177, -214, -260, -280, -168, 54, 156, 66, -96, -236, -253, 45, 338, -10, 324, -143, -118, -563, -250, 347, 197, 234, -11, -149, -159, 27, 34, -66, 356, 320, 53, -79, -230, 86, 358, 132, 290, 108, -303, -271, -131, 214, 46, 423, 5, -98, -313, -179, 54, 429, 47, -167, -87, -128, -29, -2, -83, 259, 82, -208, -247, -464, 339, -107, -264, -233, 150, -226, -226, -344, 245, 81, 15, 106, 108, 244, 209, 138, 55, 238, 127, -130, -144, -174, -152, 185, 125, 474, 0, -42, -281, 46, 248, 183, 392, -147, -14, -216, -226, 374, 70, -173, -48, -23, -50, -340, 236, -1, -36, 60, 129, -444, -245, -114, 295, -132, 9, -26, -435, -255, -95, 205, -75, 288, -94, 109, -202, -112, 125, -46, -49, -216, -271, -415, -365, 255, 220, 216, 307, -394, -87, -334, -165, -87, 78, 154, -111, -147, -86, 61]
6554F1J40O5k06j81J34n07L86K60L82k99k0n42L19j35K61J41J51o68K25k49N3
6575b29N88j37K50n69j0k12L50J79j04J30j10j41j62J20R4j20M23j46j34l03j51
6596c94L02M43m69J25J45k18k22K21L4P3K68m06L30l55K65k17K52J03l29j32k64
6617d45N41J40j17J08m9l44r6L8N22j36m5K12k14l43k6L12j86K13k49J78j39j87
6639c12K97n0K48K9m26k0N1k27M94k03J94p6j98M42m18k3L86k5q1j23k40K81n2
6662e2L49k91L53l21k34k4K98k65K84p3K7j37k38K36J70K40m92L4K3N6k17K44
6684c0Q6J16j48J18l43J19M33j50o7qj09l68L54J18q2K42n8m66N31l22k26L73
6706A13nJ48l65J91k39j74%P23l95P5j52j74M6J42J28K61l06K8j27K1L0J96Q0
$$ y = [61, 201, 266, 60, -121, 13, -494, -108, 152, 534, 235, 215, -327, -8, -143, 118, 259, 410, -258, -33, -282, -229, 359, 222, 472, -97, -107, -319, 31, 210, 106, 236, 126, -15, -177, -57, 37, -83, 340, 194, 60, -243, -394, -92, 351, -118, 7, 152, -66, -288, -67, -33, 40, 308, -98, 232, -123, 142, -75, 177, 280, -49, -181, -445, 96, 236, 119, 227, 178, -166, -262, -224, 298, 162, 117, 329, 115, -228, -254, 58, -128, 85, -164, 14, -125, -312, -15, -65, 183, 212, -214, -234, -183, -410, 84, -119, 75, -1, -199, 243, -175, -198, 188, 163, 82, -41, -281, 0, -52, 297, 6, 359, 38, -196, -220, 78, -187, 97, 24, 51, -86, -324, -88, 82, 322, -170, -136, -113, -57, -274, -30, 56, 172, 24, 142, -201, -82, 351, 201, 134, 126, 17, -351, 3, 121, 39, 281, 223, -243, 288, -34, -260, 113, 108, 256, -109, 82, -157, -331, -331, 392, -3, 72, -80, -254, -208, -66, 62, 323, 17, 45, -82, -61, -31, 165, 245]
6729B45j10r3l70K50R8O4J03J04j76o18L06J8Q7J1L93m08K64m68J09j18L27K5
6751D3M8j82o2k2K64K40l52K17j08l26l08L81mL59m2Q1m36L6j62O1O80j72p5l40
6775a81K05m60L10J96n3K69r2l79L28K4k22L71q5m69J37j92J26J04L77n26J18
6796i4K15k11Q2M9J15K8j25o7k86j05L67L03M3k36j49k13O0J71K38j46J32r7m66
6819c92R2L55K9J20j86l07J35k5J10p3L34nK63m37j28k99J26M10J00n58L99l66
6841c03K8L00J65RJ5l83j18J35K20Mk56J38k04J83k0O4K08k91K1N03n99Q3J59
6864F1R4k0k16k34J67l9j01N23jnl85Lr4K34Q9j76K12L95o12k5o6r0L49l7K93
6889C19m96k08K07pJ35K37M1k42j99J79J46L2N7J6l25J5j51j4K17J7L18Q5m95
$$ y = [245, 135, 42, -328, -78, 20, 84, 187, 291, 115, -503, -197, -179, -92, -81, 312, -96, 168, -300, -191, -309, 18, 43, 91, -91, -153, -175, 89, 329, -23, 194, 86, -240, -548, -167, -171, 188, 146, 227, -209, -173, -335, -274, 406, 234, 159, -181, 24, -436, -126, 70, 17, 286, 194, -185, 143, 167, -55, 316, 231, -238, -101, -293, -167, -63, 314, -212, -94, 121, -90, -8, 41, 156, 184, 59, -8, -294, -399, -32, 271, 314, 78, -71, -284, -224, -53, 185, 39, 171, 74, -392, -300, 55, 84, 204, 18, -289, -154, -179, -69, -142, 192, 187, 450, 13, -115, -414, -288, 122, 222, -336, 63, -303, -275, 25, 190, 199, 214, -169, -287, -152, 68, 72, -184, -46, -250, -67, -87, -23, 185, -106, -85, 418, -181, -98, 61, 155, 135, -81, -315, -148, -187, -288, 235, 234, 229, -156, -153, -247, -13, 76, -100, 112, 507, -105, -130, -196, -286, 63, 26, 319, -177, -385, -178, -185, -50, 187, 228, -14, -213, -34, 112, 144, 201, 217, -108, -93, -244, -258, -41, -24, 294, 379, -116]
6912a16Q7k41K43L43l1j18j29j52KK51l97L38j35j29r1K12L43r0l7j4p7k23K8
6935a33o2k3O97l58l3j08j80J80k08L12L2Kl22j88J20L29r9Q0P4n6j21k13K34
6958d4J63m9J43J4j01l61K07m42N77r0r4p5r7J25L57j31J13Mk38j31o0M23k04
6981IJ30j81J4k32k71M46J98J68j84n3J12k0r9J51J95k36J26k24n88N64J18J0
7003A53K8j44k98J19k57O63m88M20j44J5j65j06j22L75j69K66k00j85J2K01K26
7024B00l64M01r0L8l88J29j88L78P6J12m25j47j59K29J88J57l34K08l8k83J05
7045a95K17J11k21j32J69l70M14R3M4l3m14J45J88J02j95NJ75J89j29m02M30j88
7067CL3K49l09P7j20q5J21L53j16j40k35O0M2Q1P3l9L0q4j48pK16j17K57J61m13
$$ y = [-116, -29, -270, -27, 316, 285, 167, 38, -114, -112, 139, -258, 80, -55, -184, -275, -63, 280, 190, 153, 139, 62, -161, -133, -195, -218, 479, 121, 88, -20, -200, -20, -228, 84, 116, 118, -204, -392, -272, 57, -42, 38, 112, 56, -65, -278, -44, 119, 70, 213, 227, 126, -235, -28, -470, 107, 17, -77, -152, -249, -124, 233, 102, 215, 219, -19, -150, -210, 213, 9, 139, -42, -28, -260, -531, -85, 113, 281, 97, 44, 156, 136, 37, 188, 383, 147, 273, 49, -539, 25, 143, 153, 181, 37, -261, -142, -399, 264, -224, 196, 52, 67, -98, -204, -326, 49, -120, 146, -54, -239, -227, -26, 200, -164, 237, 147, 185, -203, -74, -262, 116, 192, 304, -121, -268, -427, -198, -10, 147, -187, 21, -17, -300, -195, 22, 133, -88, -220, -51, -421, -7, 86, 130, 97, -317, -172, 16, 118, -77, -72, 103, 292, 163, -239, 191, 3, 36, 285, -24, 53, -67, -152, -31, 322, 206, 66, -169, -109, -67, 14, 87, 48, 78, -6, -154, -161, 55, -62, 195, 356, -57]
7092e7O0k06K62J68L1O7k80j58J86m1RRL16m67J72j84j2O9J17K15n6o0n8K92m27
7117c3l4K09K6j65K31n79K41K46l10J49K40k29l78J21L14J71j66j4j92J53j71
7138a70P7Jk0L48j57j9j11o2P3N0K22k85o0l5l1K86M43m38%j10k46o8N62j51N5
7163A54K1j44j23p2k20L99M53k33k4l72J8p3J49N38k62P0k83l53J86J24M25k74
7185A04K77m1m91k26M42J69n2j23m71M24j93K7L35K32l43L05m16k98K64Q9j41
7206a27K79k69p9M2n3L32j3K14k94j83J75j1J44o3k0K71m72jk94J25P6N51j84
7229A46m38J00K90l27L20L74k22j3l65k48L70l6L14Q9k85l28O5O8J0J17J53oq4
7252F4k85M2j6L17J06%j77j22l04M64N5M1L3j42p7m6l9J07J54l5j07m7JL3j44
$$ y = [-57, 3, -203, 59, 227, 258, 325, 45, -113, 73, 32, 41, 50, 366, -101, 71, -113, -125, -56, 61, 276, 220, 160, 102, 394, -33, -67, 142, 168, 3, 234, -345, -104, 142, -168, -19, 221, -8, -386, -265, 49, 220, 54, 40, -152, 1, -170, -93, -92, -112, 236, 79, 60, -51, -113, -40, 10, 232, -53, -113, -148, -179, 107, 550, 112, 112, 2, -244, -312, 250, 99, 154, 175, 31, -92, -164, -384, 15, 468, 235, 211, -161, -143, -216, -67, 471, 209, 279, -4, -357, -171, -47, 378, 104, 381, 340, -151, -377, 65, 234, 182, 59, -412, 12, -181, -154, 181, 413, 70, 375, -41, -339, -75, 14, -127, 152, -117, -196, -154, -207, 125, 112, 326, 32, -151, 24, 13, 157, 94, 74, 345, -127, -128, -422, -297, -221, 330, 146, -292, -192, 98, -229, 91, 465, 243, 230, -135, -383, -13, -49, 265, 354, 69, -259, -194, -126, -116, 1, 154, 148, 64, -221, -179, -195, 122, 228, 228, 51, -71, -375, 89, 144, 185, 218, 76, -1, -47, -86, 21, 175, 140, 33, -14, -13, 20, -124]
7277a24K58k65rJ37r1P3nQ2K34j01k70l50Q1L26J00l4J98j01l35k83N31PK4L69
7301D52m38o4j24J81j13J52K5k21p4L32k20K77N0j51M8J43l04J1r5L96l51J01
7323A3J67l19l7N2R0K3L41m00J27j09n3L81k29J58m41m0Q1K50K49j31j58j0j52
7346a47k9K43O3jM0n06K83j9J9r3L5P8On7l6P0l6K97lk8l34L8j54L02R2k48L2
7373i3KJ12l66M53l2K96k52j29q8l00J5Q1L84J68l90L66k98l37K89j84M72k89
7395a20J64j40N6m7L06p3l5P0k56r9K11k3J9J83k57K23p5k14K63M3L1J35j5o09
7419b59PK11P1j00K10k40K45l36P9K27j14J24K00m37k83K63J96J84p6K21j93k59
7441e9Q9O3j10J92O1l76P7K20k75J59j38L57k80JPL43m39O4J2J06j56k47J02K56
$$ y = [-124, 134, -131, -140, -3, -94, -21, -26, 56, 290, 189, -81, -431, -350, -24, 76, 42, 240, 139, -196, -479, 52, 59, 83, 452, 14, -50, -174, 7, -106, 46, 71, -150, -224, 108, -112, 165, 215, 64, 112, 255, -49, -38, -133, 263, -88, 13, 180, -139, -176, -124, -34, -11, 330, -70, 57, -52, -105, 276, 47, 205, -236, -276, -195, 55, 304, 173, 15, 5, -147, -176, 67, 130, 129, 169, -337, -54, -73, -54, -147, -112, -34, -28, -85, -121, -51, -87, 210, 207, 179, -155, -117, -271, 31, 123, -125, -93, -91, 21, -345, 108, 76, 372, 120, -9, -97, -397, -382, -301, 83, 251, -139, 227, -71, -408, -119, -303, 169, -120, 44, -96, -40, -87, 219, 146, 111, 181, -75, -174, 37, 14, 33, 216, -41, 182, 107, -107, 156, 199, 230, 365, 350, -259, -252, -41, 30, -70, 140, -100, 145, -191, -112, 115, 1, 125, 325, -112, -395, -132, 64, 248, 172, 393, 200, -59, 30, 93, -17, 175, 236, -140, -63, 157, -118, 41, -97, 260, -20, -19, -12, 331, -108, -44, -32, 74, -82, -329, -227, 29]
7465B9K7P7j9k16k0J2K18k31J99M9j5m23J38MJ51K32K34o42J45j62j10M64o0K20
7489C01k31l2m14K06K96j96M96l81k07J90l3k60K26K35k22P1J06k39j24N49p1
7510B66l07R7k62L22l69N11K0j87k38Nk6J43M66l69J69j34J3j76l17L46M25n38
7532a40J65j8l76L01N2R1p1J33j84J0j21n2L68j48J95k67Qk15NL50k50J9J46p0
7556f9Q5n6M62K3l29j5o14K56K30P2J04N7K68o04k50j4M66Q7Q8j75l01K83l8N9
7580G5J01k48n4K71l4j45l40M29M0r0j96N7L2k2K07k9L38l10j88J89k59m4M94
7603B74J6j65m3k16l2O2K04jl25R3P9PJ9J61j43Q6J55Q5k10l01jL16J65j93k92
7628b00P6R5K35R2k32J10j26q7j18r1M91J26m84N57n20j4r9L69j82N8K38j76j13
$$ y = [29, 56, 133, 114, -102, -122, -110, 108, -123, 76, 125, 110, -313, -175, -171, -20, 212, 446, -196, -51, -213, -323, 141, 81, 301, 70, 38, -376, -170, 126, -70, 426, 45, -162, 28, -5, -265, -39, 196, -26, 45, 151, -88, -212, 337, 266, -41, 56, -206, 116, -253, 258, 278, 91, -147, -142, -168, -25, 441, 72, 241, 107, 120, -56, -373, -27, 398, -140, 25, 7, -369, -68, -16, 75, 4, 137, -47, -37, -158, -210, 158, 10, 205, -62, -54, -269, -264, 86, -164, -145, 1, -69, 16, -40, 422, 445, 116, 101, -513, -257, -27, 45, 149, 206, 474, -130, -380, -394, 72, 159, 247, 72, -229, 54, 16, 75, 176, -72, -126, 145, 111, -34, -374, 55, 95, 5, -191, -134, -102, -124, 83, 54, 392, 82, -106, 83, -176, -220, 274, 290, 125, 82, -134, -166, -104, 100, 99, -226, -133, -54, -47, -28, 133, -10, 76, 231, 316, 106, -195, -196, 120, 285, 92, -200, -124, -29, 206, 298, 66, 176, 50, -37, -155, -246, 245, 371, -113, 444, -76, -90, -189, 180, -2, 56, 294, 118, 5]
7651EJ4QJ59P0l73K29j43Q2K00l95K39M8j63j93K91k5q0M53m15J71n11K31J06
7674HJ35J2j97K70j52q41P47L9J42O5k50k94o3L29J55o5J79p1l96R5J6j02K64
7697B5J08L15m70K7j71J40lJ69j68q8K6mj00L93J99k63J34l74J78j80P4P0j91
7720a54L42n6j08K0k12J36J80M2j35k39k09M98R7j12N1j67J95k58p9L70j77l1
7742fJ12l05J52j42k6N45l25K00k42k03J72Q9J70l03r5P5K93n40L28K71J10j58
7764A72k15l0N2rJ57j78O5j8k12L0K52K39k12K33j97j72k39J98K9OK23m8j81J54
7788I9l92M28QJ32k48k43J59k76l7L87J91j27j37q5j23rN35k27j45L1J71k36j21
7811b65K87K34j59p4k21K82k6p4P3j10J35j76k1L4n1J89j6K00o03J85k9L83k09
$$ y = [5, 19, 27, 186, 256, -117, 112, -31, 51, 251, -144, 95, 143, -20, -213, 78, 53, -27, 426, 11, 182, -329, -98, 8, 143, 155, -42, 228, 76, -765, -18, 21, 163, 228, -22, -316, -379, -50, 105, 40, 219, 148, -248, -153, -137, -239, 25, 133, 448, -22, 5, -166, -26, -29, 140, -28, -116, -90, -94, -194, 199, 398, 135, 269, -105, 73, -107, -33, 37, -154, 188, 132, 24, 44, -168, -32, 148, 190, 55, -184, -393, 105, 202, 90, 141, -26, 169, -89, -168, 202, 25, -6, 106, -199, -47, -189, -215, 330, 5, 205, -37, -240, -68, 21, 191, -112, -207, -132, 161, -379, -51, 220, 330, 172, -43, -73, -21, -30, 127, -51, 14, -4, -216, -186, 66, 305, 93, 326, 129, -43, -282, -84, -55, -49, 174, 126, -55, 99, -293, 135, 143, 275, 27, -216, -57, -333, -370, 17, 208, 81, -56, -141, -264, -273, 262, 35, -110, -79, 92, -144, -265, 22, 256, 97, 23, -198, 84, 58, -16, 57, -53, 82, -94, -115, -81, -132, 57, 41, 241, -362, -177, -206, 177, -32]
7834c2N16k16j24j24j30J80k2J93P0m7j73m07L04l13N61J52j50l70o0K75k38J53
7856bJ61q1P3l14Q7j5K52j03l79N19p3j78j01M53N6k16l65j33L91j57R5K62O1
7879B93k00l65J08j6J97K62m11L16k29Q2J1j68K35K64k23k49K4K3j55K24K3J50
7901A96o3j95O3k94N32L6k10j13J31j52Q4k91M08l8J6l39J83p2J18J18r4J21l28
7924a83J85j94L59qj28L0J10k51m8j15J72J12qj15L7j09K3J85j13j39m7K66l0
7947ij05Q5j31J03j2L4k81J80M18j54M2k82J37k8O4m16K92K74J93m75j61M2K3
7970a67j56K72K84j94n2j63Q5J50n2P4K54j56j10j08l6M29l32J54n55J44J2J95
7992b8J35j7j4k90J38m23P69k59RR4k05O1K8j47j04K76J69q4k35kk42L61j9J64
$$ y = [-32, 484, 268, 144, 20, -110, 70, 48, 241, 311, 264, 91, -316, -12, -325, 236, 388, 238, -132, -192, 83, -155, -2, 159, 78, 151, -163, -76, -91, 161, 58, -321, 198, 125, -53, -154, 299, 355, 139, -226, -359, 32, -125, -30, 232, 293, 93, -272, -164, -180, 17, 279, -132, 184, -45, 37, 48, -120, 115, 379, 156, -93, -69, -46, -201, 23, 46, 196, 133, -62, 1, -293, 239, 275, 65, -48, 83, -69, 15, -276, 132, 94, 110, -229, -46, -118, 0, 118, 24, 145, -183, 2, -192, 167, 159, 31, 61, 171, -80, -128, -243, -71, 41, 33, -82, -45, -154, -131, 54, -59, -198, -245, 21, -9, -114, -29, -160, -57, -69, -35, -316, -136, 282, 128, 170, -112, 25, -3, 61, -355, -63, 211, 404, -71, -232, -190, -167, -323, -51, 233, 39, -13, -176, -91, 59, 7, 81, 335, 179, 69, -39, -75, 354, 22, 176, -379, -235, -223, -28, 107, 90, 76, -214, -76, -499, 270, 11, 20, 114, -91, -30, -2, -149, -253, 23, 192, 108, -127, -129, -371, -10, -29, 135]
8016A35QK4j21n7P3J12j76K15k65J53k53J62n9K59J36p0J29k84j68Q1k3M3J4P
8040G5l32J03L58n8j41L78o00j0K78k24J61n4M39n68j08P9L55l55N50l39J49m8
8062H8j98K13l8L1K15m29P2j31J86l4K89m83M8K51l6m82M53nJ25k20J74n85J76
8085c20k0J91K50Q5j32m6m62K10K40M58l75j20O0J24k38j8L35j59R6j38j16J5
8107h0K91k56j9J27j24j14J81M9j36K84j46L24l48k49LL93l54K53L9k38J0j22
8129b32L61l9j52K14j30J42j23%J8K3j77n0N8Q1j45R4K57j22J19k09j54M1K15
8152I0J4J58m79O5k29L44L6j36L51r2J19m78K66m3Mn9R7nk18o5N97k38k02N7K66
8177B20K2k25J19j31J33M5pk09j53M67j00j95J21p2
$$ y = [135, 143, 167, 46, -11, 62, 174, -2, 213, -52, 101, -152, 10, -49, 210, 346, 276, 405, 121, -47, 34, 11, 54, 68, 75, -257, -154, 204, 146, 5, 383, -217, -227, 51, -173, -12, -66, 373, -195, -303, -224, 131, -224, 326, -13, 136, 88, -110, 103, 65, 96, 311, -118, -46, -177, 9, -25, 264, -219, -171, 80, 44, -438, 15, 10, 135, -85, 89, -496, -320, -340, -149, 101, 186, 54, 8, -454, -244, -4, 454, 79, -41, 19, 143, -95, -113, 222, 63, 159, 21, -95, -80, 211, -45, -64, 63, -61, -175, 6, 55, -81, 203, 57, 381, 33, -216, -213, 180, -174, 79, 118, -120, -110, -232, 129, 90, -62, 152, 22, 164, 41, 41, 59, 82, -95, -145, -87, -6, -151, -57, 200, 78, 197, -12, -166, -125, 90, 104, 262, -217, -152, -381, -37, -1, -137, 214, 122, 241, -237, 29, -14, -10, -69, 28, 23, -195, -260, 337, 99, -103, -46, 220, 242, 17, 136, 5, 138, 183, 176, -33, -186, 281, 181, -14, 107, 35]
8191C5
$$ Imaginary data points
##PAGE= N=2
##DATA TABLE= (X++(I..I)), XYDATA
0@%%%%QqQj6J6k4L2m0N0n9P4r0J08j32J55j80K16k52K89l37L89m44N08n78O54
29C47p40Q35r39J053j178J316j468J635j815K014k235K476k741L034l359L719
45A954m123M581n098N692o381P187q154R331j0802J2710j5289J8992k4797L5280
59B1083o0147K24272K19903l94107j73734Q2774J38884m0196j4799K5116M70n2601
71b3082J7586J486o9691k9295J62045J54737r0299k44507o6317J53238J39274
82A05175l9440j17754o2465K9688N7170K6594k5851k9784J4730O2789M1772n1632
94A0992j14411j2917J57519J37078j07187k41523o4325J67502J46374k6435q1039
105b8372j2690J6115j283R135J4099o637L6195J08832K4782j75611j80634O5588
$$ y = [0, 0, 0, 0, 0, 8, 0, 8, -8, 8, -16, 16, -24, 26, -33, 41, -49, 59, -73, 82, -98, 118, -134, 155, -182, 207, -237, 271, -307, 347, -393, 442, -497, 556, -622, 694, -774, 861, -954, 1060, -1175, 1301, -1440, 1594, -1765, 1954, -2169, 2412, -2686, 3006, -3375, 3812, -4342, 4989, -5813, 6897, -8392, 10600, -14197, 21083, -39064, 185208, 405111, 11004, -162730, -79956, 58928, 18732, 3933, 29049, 29519, -23082, -5496, -4010, -73701, -102996, 59049, 213786, 123487, -121020, -187337, -34099, 105175, 65735, -52019, -114484, -84796, -27626, -1032, -26883, -56667, -41937, 20852, 62624, 10992, -103419, -116336, 41183, 178261, 71074, -170449, -234774, -67272, 79102, 52667, -28372, -41062, -24947, -26230, -17095, -2996, -9633, 26562, 135394, 160176, -15435, -196069, -130481]
117a30481K16520Q1330j05022j15404k8148L1688O0467N0815j0291l6017K8027
128D3484O2991l3678j24387m6774J03118J16689j5160j22376j06729J083J08019
139a3720J07308k2582j21933m5088Q5814O9918m4526o2751K6100P1016J1891p5580
151a4133j04267l3824Q9321J35731K7542j21830j27829J1782J19325Q4065j4683
162E1200n4702j9693J9499N065m5030n0445L0993J03136M8674q0828j21143l2808
174a46082P9494J19744O4522n2091j11452k5311R5167O8848n7352p1801L8654
185B340P6214k4774r9819m1537N5968Q4683N2800j4007r1648q5439M3956J40934
197I9671N6385q8175q5576J9298M1904k7070n4595j540N4640N1990p135p8798
$$ y = [-130481, 86039, 167369, 62347, -53057, -81205, -49517, 10950, 61765, 51474, 15457, 43484, 106475, 72797, -51590, -98364, 4754, 121443, 106283, -16093, -122822, -121739, -13720, 93588, 71006, -50927, -96015, -10201, 59717, 15191, -47560, -21460, 49556, 61447, -14133, -118400, -152224, -62903, 72828, 100370, -21460, -149289, -137507, -18182, 65883, 51200, -3502, -23195, -3696, 1369, -43661, -94106, -63113, 40023, 88697, 7869, -113274, -146082, -66588, 53156, 117678, 65587, -45865, -71176, 23991, 92839, 35487, -36314, 2340, 78554, 53780, -46039, -87576, -31608, 53075, 105875, 91868, 220, -85219, -41263, 99671, 156056, 67881, -17695, 1603, 43507, 16437, -38158, -39698, 14942, 66932, 59797, -19001]
209a9001q5910Q307J21497J16751j5181j21785q5976K9898P9240K0465m7344l7281
221c6320K2344L1520l4495p5260j1907Q2731Q8191M242p1265p4636q301P8549
233d607R3874k742j01698p1520L2541N7445j0747m5901M631N5144L1857l1082
245G195n9181k3837N5618J08135N3696p5396j26675k6989Q7461P4870j5937n3531
257E429j9770J3986O161k1477k5662K2603Q1737O4638l6110j08544n9197N7020
269a9186J02608L2417o4054q5814l0301L3678M2977J015l1358n280L9481K2757
281C8940m0669n6092J0471P9776O5885k5873j02419p4605L0386R1332L7007n2016
293B123o7113p584L9260K3001j8888j7664L1400O1102J4246p0869q9940r66R9026
$$ y = [-19001, -104911, -96604, 24893, 141644, 126463, 4678, -81298, -51400, 27840, 48305, 961, -36320, -13976, 17544, -16951, -92211, -104118, -21387, 66804, 71046, -219, -74855, -83156, -4607, 89267, 86525, -15173, -86693, -54152, 3293, -7454, -53355, -48724, 6420, 38277, 7195, -51986, -75823, -20205, 87930, 141626, 66230, -60445, -87434, 27, 74897, 58960, 5429, -14341, -355, 5806, -15671, -41333, -18730, 63007, 127645, 91535, -17009, -76206, -19186, 83422, 115839, 51785, -34029, -64330, -30652, 12325, 13340, -18018, -23298, 16183, 38940, -1729, -57821, -47350, 32426, 98311, 72438, -29981, -104586, -74200, 17132, 54139, 2123, -64990, -72574, -33314, -10313, -29201, -46865, -15465, 45637, 59883, -10986, -100926, -101892, -2866]
306b866Q4753k6535r6240n5576K0330M9383L2107L869j1626j630J7871K921l5232
319a8471k5445M1579P9271J8502p7131r2293r914P5032P4527O015n4964n2219
331c5511M781N1334L0706k0227k1930K5952L6010k4243p4784l9612M8521Q5207
343F6204K1981o9019q4720j5109N6736O2625J7822k4977k6363k6R698j2953k7942
356b6043J983M4678L7509k8994q3262n4659L2914Q3284M8537k5168o2569l6464
368f8254K4019N4885K1166k7372k1157J7761J6041l4865n5096k250O3260N7807
380D5945j6444p3242m8400K9646P9968N6103j5721n7208k9051K2333K5848q833
392A0944j7254J4400L0700m8m7075n3603j941O3031P3901J6765n3416o5993j0170
$$ y = [-2866, 81887, 55352, -40888, -96464, -76134, -26751, 5356, 9225, -2401, -4031, 13840, 16761, -18471, -43916, -2337, 76934, 95436, 18305, -73988, -83902, -8870, 65657, 71672, 16708, -35511, -30730, 20604, 51310, 31083, 9153, 35105, 71115, 46872, -27912, -67524, -19003, 66204, 88185, 19166, -65554, -80663, -23927, 38698, 56520, 31543, 5180, 5154, 14852, 1899, -26043, -24060, 20618, 58127, 29133, -54129, -108788, -75874, 7410, 55947, 30779, -31790, -68254, -44235, 10650, 31816, 4444, -16713, 1048, 17089, -17776, -72872, -75122, -11862, 45945, 29501, -43741, -92141, -62495, 17473, 73576, 57855, 647, -28404, -6071, 19777, 10944, -6310, 8090, 38790, 38742, -8333, -61936, -63877, -846, 73055, 89820, 36404, -29589, -39759]
405c9759N1515N2439j136l6403j8931O738n105l2090k4736K4166O0679L2037l8512
418C0902p2213k5091N3635P7552K3597n0959o3324r736L7115K1073k0263k2420
430b0132N623J6257j0297l7005k2489K9286O5996L8830l0492p1707l8672L6474
442c8328O9596K5379l8872m9625j1521J5420N286r426N84L0048L8784Q82n2004
455a3797n1879J6467P9510O3873j7732p5721n0842J6826M5811J5753j6912j3563
467b206Q284J1989j0501k7296n314M2097N6637P056n6518o4615l290O0126N5919
480G2368j2154o0610l9397J0800K9685R757q756j676J8908J8821j6312m6594k2210
493d7370M0048O5991J5501o1958p7324j4985N0395M7138k43k8217j6551M634P408
$$ y = [-39759, 11756, 64195, 63059, 26656, 7725, 14463, 9358, -22732, -47468, -23302, 37377, 69414, 30902, -41311, -66402, -12767, 64785, 88382, 37423, -25901, -35637, 1478, 22551, 2288, -20132, -14509, 1748, -8549, -45554, -68043, -38757, 27239, 66069, 35577, -36130, -74802, -38328, 31268, 56647, 17775, -31850, -43371, -27951, -22665, -32091, -31507, -1459, 37325, 38207, -13797, -65676, -49209, 30301, 94174, 76442, 721, -50121, -33295, 12516, 28269, 11357, -2206, 6078, 18067, 7566, -19730, -25044, 17053, 73690, 80746, 24228, -40387, -43677, 16449, 72368, 60214, -396, -39793, -28993, 692, 10449, 1693, 17, 18925, 37746, 21434, -25160, -47370, -7322, 58669, 74170, 12212, -65112, -80097, -29702, 17436, 17193, -11024, -27575, -22941, -15533]
506a5533p180j4007R943M2796L3000k6023o9203m2390L1954P2068L1715l9977
518G163o2048j7521L5533M0710Q147j3773j586J8667P110k7836l5140P551N3966
531B0943M3167k2226p3977m8818L1412P3520L4691k7584m1071o554J9926J4291
543A7720m405l772J6768K4212n174m5722m9655k254N3884N6233j940n6713m7522
556d8340R747M9819L5653p052k7282o480J5160k345l2771k1555K4520M3592P352
569D0018m7087n9627j1612N2809O4814R899m8280m3759R765L8636J3383j7240
581A719p786J6884N743k8149l8715j0453L0305M9694K7376k7431n9887k6193L9972
594b6921O4410K3548k9620l5000n62J5998m691k2586j718L2243K7829j4974m9648
$$ y = [-15533, -22713, -36720, -26777, 16019, 49019, 22996, -46207, -88597, -56643, 15425, 47140, 7163, -54885, -72406, -36873, 3837, 11984, -1789, -3375, 15292, 22402, -5434, -40574, -33023, 20943, 64110, 41884, -32093, -80911, -49499, 24021, 58712, 31128, -9943, -16497, 3429, 17720, 13315, 9543, 26311, 50523, 45349, -373, -50028, -52282, 1602, 57835, 55895, -818, -48340, -38593, 11226, 46879, 39827, 12545, 6065, 21225, 18880, -13891, -35446, -10926, 32666, 40018, -7069, -66696, -78308, -25499, 39315, 49214, 934, -42825, -33060, 5576, 18959, 1719, -6067, 10817, 16560, -11589, -50304, -60757, -30452, 19242, 46618, 19187, -40700, -66893, -26921, 37489, 61037, 31417, -3583, -4145, 11853, 7162, -15424, -17142, 15101, 42930, 27956, -21692]
607b1692l4497K1920O4495M6992j6475o0834l6643K7814N1787P018l5931j6888
619b934K1240O777l2673k9244J5856M3600K8337r180m1788m1326L297N6467N3708
632G2137j1293o0473l8628J3883K4519m883j5212P426K2416M844k7619l9182p481
645e9546M4130N9940J3823m9571o1480j0132M7497M5624r124m4032j5637K4460
657a4048J3274k6805k3671K6581N3180J6366l7390m5966o840L5236M7265J7571
669E4753l5095n8632j6689M0774L7935r226k4448O654K2873l995l2102j8550K7390
682h358N4250K9062k8694o4452l8886K4956O0784L0138k9017m6313r678K4987
694a221J3225j7151j1538L1626M5815o573o3882m6427K2382N5485K6515j8844
$$ y = [-21692, -56189, -34269, 30226, 77218, 60743, -91, -36734, -8920, 42867, 49885, 13954, -2934, 18306, 25083, -7590, -36834, -20978, 22622, 50959, 41779, -9, -41335, -38038, 18429, 72137, 60844, 371, -38257, -24374, 145, -4738, -19950, -12524, 9892, 14736, -12883, -52065, -59546, -15416, 44524, 58347, 8776, -52704, -62836, -15339, 30285, 21161, -22871, -38508, -14048, -774, -27579, -51250, -24669, 28511, 44877, 7487, -38479, -45319, -10083, 37182, 54753, 19658, -38974, -55663, -14889, 23046, 13820, -10628, -3974, 18899, 14904, -17198, -35748, -8358, 45892, 74954, 46260, -18192, -57078, -32122, 28662, 58800, 29783, -16530, -26208, -1221, 12004, -5147, -16685, 14941, 60756, 54183, -9699, -56126, -33744, 21741, 48256, 29412]
706B9412m3481l5555L040M0749K9201j8722l2925Q690L3629p90l7192j1835M1214
719E435L8847j5368n3123l6874Q248M4388M2882j987m9045l9982J4846M4026J9463
732B1756j5059q652K0440J7446k6994n1766j0440N1565N7131j701n4573n0389
744e1236l896L7225M3552J5467j7937k3794M045K1444n334l3369j074M8887L3236
757F7216l6983o4596j7218L8298M4590J2358k3787l7458j2447K8548L7680J45
769C6346l0559j1755K1820J0901l0310l5598J0863M6390K3229l2219n6357k1504
781f8753L6326N5729K1142k2866l5039j5541R514J8209N083r978K282K2576L186
794B1870m5306n0722J1028O7929M7666j7780n1068k8923J2415L3791K6383j734
$$ y = [29412, -14069, -49624, -46584, -5835, 23366, 4644, -28281, -19591, 14038, 13248, -23944, -35779, 5435, 44282, 28914, -24209, -61083, -52835, -8447, 34435, 32448, -16597, -56579, -41733, 2293, 21756, 6697, -1955, 18485, 35931, 8937, -42829, -53269, -1704, 55427, 53726, -847, -51236, -55132, -17907, 25645, 41112, 23175, -619, 3426, 24870, 19536, -13833, -14907, 33980, 67216, 30233, -34363, -51581, -13283, 31307, 43665, 19878, -17580, -30027, -1479, 36201, 36346, 5787, -5968, 15852, 26753, -3557, -39155, -28292, 18098, 41327, 9108, -47249, -68753, -32427, 23302, 44444, 21578, -13461, -29002, -19488, -1279, 3804, -6174, -3892, 18684, 21870, -23436, -74158, -63130, 4799, 52465, 34685, -16383, -45306, -32891, 900, 27283, 25549]
806B5549k2011j0762J2821K707k8334k0566K7753M7886O977m3834m1827P316M7652
819A1327L8288n880l6293k4319P414K4507J1649r295j3602k16J1113l408k4475
832a3190j9224K3987N4731K0849m5141o0522m432M7275L8793l113k7967k4356
844a2310o042Q989L790j1104l023K7144L0159j4602n4034l0017L5090O0640K0256
857E4936l4184m5023j4936J7916K4172M196j4306q950Q670P364j0638j8253K687
870b6349L1143L4294k928m7709m1310J7329N6937K6305k9995m3769r732K0464
882a5320J7140j273o974N218J7932J1005j8001l7050n979M8400N1606j1377o1896
895f569m0337J6651M0330J8797j1063j8312m567P639K007j0562p385J6000L2647
$$ y = [25549, 3538, -7224, 5597, 8304, -20030, -40596, -12843, 35043, 42020, -1814, -43641, -36325, 11327, 49615, 43735, 7442, -16877, -9463, 15044, 26693, 17398, 3796, 3580, 14693, 11285, -13190, -32414, -8427, 46304, 67153, 22012, -38510, -42942, 4333, 43126, 40013, 12046, -12310, -18352, -9363, -5573, -16677, -19700, 7444, 37603, 23001, -31033, -61050, -25960, 34680, 54936, 20752, -24271, -39207, -21291, 2881, 7077, -7229, -16179, -7509, -145, -10783, -29036, -26349, 4794, 39088, 36160, -11549, -52859, -35530, 21407, 47712, 17717, -26052, -35784, -15320, 1820, 547, -6427, -1209, 16723, 27728, 9727, -27323, -33302, 15098, 66704, 55327, -6569, -46906, -30255, 10075, 28872, 17809, -503, -5070, 2569, 4576, -5986, -13371, 2629, 35276]
908C5276J1580l2396m8462j2733L8130M5945J490m4467l9991N348L5735J8081
920A3536j2207j2564J0217J5800m094k5325j9673J5248M3225K1325l5728n9168
932d9408j4967M2507M5266K94l2034j9586R995J5601M81q041L357J9797J8781
945C2043j1027m1367k9624J8593M8636K6043k2962m4333k0172K3385L8698J2636
957C0549j7475j3317J1300J2612j1538k4327p11L1313K8756j1425m5561l4969
969d4793J3378M8945L2583j7355m2905j4537K4968K2765o102j4603L908J7027
981B3279J531k5731l2010k179L5527L8038j540m1377l9050M774M1023L0778p998
994B5065k6297r322J1000N416j4836j5265J1698L0866R831l0417m1707p263L6548
$$ y = [35276, 46856, 14460, -34002, -46735, -8605, 37340, 38830, -5637, -45628, -40280, -4545, 13536, 1329, -11235, -1018, 14782, 10688, -14637, -34310, -19062, 24163, 45488, 9760, -49408, -64375, -21868, 23398, 23692, -8342, -27928, -17933, -2332, -1851, -9892, -6535, 13262, 32043, 21016, -20351, -49975, -31382, 17254, 43297, 20335, -23998, -44170, -20785, 17913, 30549, 13074, -243, 11057, 23669, 12131, -12196, -12907, 18406, 47162, 35737, -9824, -44793, -31415, 17530, 50113, 32758, -10147, -24684, 284, 23049, 16947, 2344, 6252, 23279, 24810, -921, -32931, -35110, 417, 38455, 36915, -4462, -43512, -38738, 2285, 33063, 25065, -1232, -10554, 446, 5862, -8974, -24239, -12541, 18325, 28156, -2261, -43968, -51231, -14683]
1007a4683M4820R038l4448l8090J381L2497J9693j2150j6411M544J3632n802k4782
1020b0761j3379J9307L6299J6407k2065m0590j5291K9277M5186J1337k8799k9038
1032a2110P25J5129L510j0544m491J4005J9178m814l1904k5364J4061M4831K8522
1045E0734j7832m4519k2001J8981L0595O844j6783j4178K810O698p345j7627r19
1058b4542K7666K8984l770l5862l1870P370M0889L1101j2810m0224k3409J1414
1070b5063K1622N280j0798m482J1643J0277j2769k5684m922L1548L9438M594l9482
1083A202m0606J881L6201K5500q216k3122j0947P842R385l535q709Q566K6095
1096B1537J5779j8889l6109j3217K7525L8955R446k9877l5798p168K1248K3199
$$ y = [-14683, 30137, 39175, 4727, -33363, -31982, 515, 20208, 8058, -8353, -3809, 9823, 4021, -20761, -34140, -14833, 21466, 37873, 15808, -24782, -40073, -10796, 34390, 45727, 16928, -12110, -11385, 3744, 7254, -3290, -7781, 6224, 25402, 20588, -11316, -36680, -22619, 22212, 50734, 32902, -11617, -33618, -14637, 15958, 22802, 6019, -8159, -5349, 1349, -5996, -23623, -24542, 3124, 32108, 28338, -7524, -39394, -32024, 8865, 39966, 27156, -13068, -36477, -25063, -3441, 1839, -8959, -13441, -1798, 8479, -4290, -29974, -34896, -3348, 36090, 40684, 1202, -39404, -37523, -1322, 24178, 15962, -7160, -18107, -10265, -880, -4415, -13124, -4558, 21537, 37316, 18427, -17682, -30899, -3374, 35581, 45027, 15150, -20648, -27816, -6568, 16631]
1108A6631M07j5111n221J1549O591j4685j7075R937L3180K0457k1096m5393k2420
1121d2249K4611M1188J1658k5479k9265l081J7686J1058n797o593J2043J7894
1133B3674l757k8592k5627Q737L6898K4214j6196l9060k2169J2125K8606J5722
1145A4575p980j5616r65J1483J656j5452p844J8691K7852J361l3210l4922K482
1158c7889L7943L2415o043l3900k2085J0996K6150R496j0485n615J1802Q813j4347
1171G251k5676n725K5287L1042J703l2724l3084J27L0779K7162J316j9064j5111
1184f717J201R593P66p830J343J5237J1837j4353l2200j6942K1866L8258J3589
1197C5648k3148l2890q413K0250K4561J357j6227o621Q054K293j5787j7015P237
$$ y = [16631, 17038, 1927, -3294, 8255, 14846, 161, -16914, -6977, 26203, 46660, 25564, -19829, -42249, -17638, 23550, 35208, 9729, -19536, -22617, -4931, 6127, 330, -6263, 5780, 23674, 19917, -8675, -34302, -25565, 11333, 35547, 19351, -19709, -41878, -29753, -1147, 14575, 6595, -9021, -9986, 1497, 3153, -12299, -20143, -1452, 26400, 27761, -5449, -40371, -37889, 54, 32469, 26426, -7474, -29559, -18563, 7587, 17083, 6598, 983, 12785, 21598, 7251, -18425, -24150, 1137, 32179, 33882, 1158, -31926, -31799, -1020, 26142, 27458, 8394, -6717, -5516, 4077, 4843, -2987, -1644, 13593, 25430, 11077, -21123, -38065, -16199, 22059, 35648, 12500, -20390, -28803, -8553, 16008, 17365, 1138, -5483, 2571, 4864, -10923, -27938, -20701]
1210b0701K8555J9504j5292l6335j7592K0556L5805J5078j6101k4843p338J0968
1222g736R892j564l517L569P713m00j6259j9266L114L1955K9458o366l4243k3551
1236b7201J0828K8676J5406r339j7595n878N682J482q571n689J1880K3140O058
1249B8879k4687l1128L70L3846L1047k834k9119k3380K089J6515Q234m315l769
1262A748K819N31p254j2643m703J4191K7233J2169k2257l5518r885K6038K9895
1275B2364M85k2663j7174J40O115K476r85J085Q027J0677l177k1819j6852J4993
1289a6308L5044J5401k1738l4087r807J8525K0558J849r408n749J642J377l861
1302f562n467L295J8071J8213m357k8168k4662P107L3803K3476j4308l0837j1636
$$ y = [-20701, 7854, 27358, 12066, -24269, -41861, -21305, 14500, 29578, 13477, -11366, -18704, -7736, 2156, 592, -2925, 644, 8357, 7957, -8302, -27568, -24454, 7501, 36959, 30593, -3650, -27201, -16373, 12303, 27709, 18370, 775, -5103, 579, 2061, -6510, -12199, -319, 22821, 28879, 4192, -26936, -26566, 7280, 38327, 35493, 6374, -17006, -14917, 1598, 9832, 5517, 1748, 4567, 5098, -2156, -14799, -19502, -5311, 21922, 34091, 11834, -23684, -33569, -7531, 22364, 22849, 186, -16988, -16848, -10733, -8257, -9242, -8157, -130, 10547, 7370, -14449, -31301, -16308, 18736, 34137, 12399, -21688, -31495, -12970, 7588, 9437, 29, -5720, -4078, -2701, -6562, -12029, -8734, 9337, 27550, 23193, -4975, -29637, -22530, 11273, 34749, 20441, -10396, -22032]
1315b2032J1069J1874J280n21N142O138o17j1273j5619k001K0703K6625J316l1379
$$ y = [-22032, -10963, 911, 2191, 1670, 6812, 12950, 12333, 1060, -14559, -16560, 4143, 30768, 32084, 705]
$$ [...]
8191d1
##END NTUPLES=NMR FID
##END=
