##TITLE=1H_SA_28.129
 DMSO d6/CCl4, 72 sc, 
 20.8.2019
##JCAMPDX= 6.0         $$ Bruker NMR JCAMP-DX V2.0
##DATA TYPE= NMR FID
##DATA CLASS= NTUPLES
##ORIGIN= UXNMR, Bruker Analytische Messtechnik GmbH
##OWNER= root
$$ XWIN-NMR		Version 3.5
$$ Tue Aug 20 14:05:20 2019 Russian Standard Time (UT+4h)  she@DPX200
##.OBSERVE FREQUENCY= 200.13155
##.OBSERVE NUCLEUS= ^1H
##.DELAY= (6, 6)
##.ACQUISITION MODE= SIMULTANEOUS
##.ACQUISITION SCHEME= undefined
##.AVERAGES= 72
##.DIGITISER RES= 18
##SPECTROMETER/DATA SYSTEM= spect
##.PULSE SEQUENCE= zg30
##.SOLVENT NAME= DMSO
##.SHIFT REFERENCE= (INTERNAL, DMSO, 0, 15.7039)
##AUDIT TRAIL= $$ (NUMBER, WHEN, WHO, WHERE, WHAT)
$$ ##TITLE= Audit trail, XWIN-NMR		Version 3.5
$$ ##JCAMPDX= 5.01
$$ ##ORIGIN= Bruker BioSpin GmbH
$$ ##OWNER= she
$$ F:/spectra/data/she/nmr/H-F/1/audita.txt
$$ ##AUDIT TRAIL=  $$ (NUMBER, WHEN, WHO, WHERE, WHAT)
(   1,<2019-08-20 14:04:22.50 +0400>,<she>,<DPX200>,
      <continue with go, POWCHK disabled, PULCHK disabled
       configuration hash MD5:
       00 E9 B6 7A A2 85 ED C7 34 08 36 98 17 FE 4E 26
       data hash MD5: 16K
       F6 68 08 2E 3A 4F AB CC 6A E3 8C E1 84 96 34 2D>)
$$ ##END=
$$ 
$$ hash MD5
$$ 43 91 C6 A3 89 DD 1D 22 DF 54 2D 4F 02 6B 83 87
##$RELAX= 
##$RELAX= 
##$RELAX= 
##$RELAX= 
##$RELAX= 
##$RELAX= 
$$ Bruker specific parameters
$$ --------------------------
##$DU= <F:/spectra>
##$EXPNO= 1
##$NAME= <H-F>
##$PROCNO= 1
##$TYPE= <nmr>
##$USER= <she>
##$AMP= (0..31)
100 100 100 100 100 100 100 100 100 100 100 100 100 100 100 100 100 100 
100 100 100 100 100 100 100 100 100 100 100 100 100 100 
##$AQSEQ= 0
##$AQ_mod= 1
##$AUNM= <au_zg>
##$AUTOPOS= <>
##$BF1= 200.13
##$BF2= 200.13
##$BF3= 200.13
##$BF4= 200.13
##$BF5= 200.13
##$BF6= 200.13
##$BF7= 200.13
##$BF8= 200.13
##$BYTORDA= 1
##$CFDGTYP= 0
##$CFRGTYP= 5
##$CHEMSTR= <none>
##$CNST= (0..31)
1 1 145 1 1 1 1 1 1 1 1 1 1 1 1 1 1 1 1 1 1 1 1 1 1 1 1 1 1 1 1 1 
##$CPDPRG= <>
##$CPDPRG1= <>
##$CPDPRG2= <>
##$CPDPRG3= <>
##$CPDPRG4= <mlev>
##$CPDPRG5= <mlev>
##$CPDPRG6= <mlev>
##$CPDPRG7= <mlev>
##$CPDPRG8= <mlev>
##$CPDPRGB= <>
##$CPDPRGT= <>
##$D= (0..31)
0 1.2 0 0 0 0 0 0 0 0 0 0.03 0 0 0 0 0 0 0 0 0 0 0 0 0 0 0 0 0 0 0 0 
##$DATE= 1566295182
##$DBL= (0..7)
120 120 120 120 120 120 120 120 
##$DBP= (0..7)
150 150 150 150 150 150 150 150 
##$DBP07= 0
##$DBPNAM0= <>
##$DBPNAM1= <>
##$DBPNAM2= <>
##$DBPNAM3= <>
##$DBPNAM4= <>
##$DBPNAM5= <>
##$DBPNAM6= <>
##$DBPNAM7= <>
##$DBPOAL= (0..7)
0.5 0.5 0.5 0.5 0.5 0.5 0.5 0.5 
##$DBPOFFS= (0..7)
0 0 0 0 0 0 0 0 
##$DE= 6
##$DECBNUC= <off>
##$DECIM= 24
##$DECNUC= <off>
##$DECSTAT= 4
##$DIGMOD= 1
##$DIGTYP= 9
##$DL= (0..7)
0 120 120 120 120 120 120 120 
##$DP= (0..7)
150 150 150 150 150 150 150 150 
##$DP07= 0
##$DPNAME0= <>
##$DPNAME1= <>
##$DPNAME2= <>
##$DPNAME3= <>
##$DPNAME4= <>
##$DPNAME5= <>
##$DPNAME6= <>
##$DPNAME7= <>
##$DPOAL= (0..7)
0.5 0.5 0.5 0.5 0.5 0.5 0.5 0.5 
##$DPOFFS= (0..7)
0 0 0 0 0 0 0 0 
##$DQDMODE= 0
##$DR= 18
##$DS= 0
##$DSLIST= <SSSSSSSSSSSSSSS>
$$ [...]
##$SUBNAM2= <"">
##$SUBNAM3= <"">
##$SUBNAM4= <"">
##$SUBNAM5= <"">
##$SUBNAM6= <"">
##$SUBNAM7= <"">
##$SUBNAM8= <"">
##$SUBNAM9= <"">
##$SW= 24.9336996594482
##$SWIBOX= (0..15)
0 0 2 0 0 0 0 0 0 0 0 0 0 0 0 0 
##$SW_h= 4990.01996007984
##$TD= 16384
##$TD0= 1
##$TE= 0
##$TE2= 300
##$TE3= 300
##$TEG= 300
##$TL= (0..7)
0 120 120 120 120 120 120 120 
##$TP= (0..7)
150 150 150 150 150 150 150 150 
##$TP07= 0
##$TPNAME0= <>
##$TPNAME1= <>
##$TPNAME2= <>
##$TPNAME3= <>
##$TPNAME4= <>
##$TPNAME5= <>
##$TPNAME6= <>
##$TPNAME7= <>
##$TPOAL= (0..7)
0.5 0.5 0.5 0.5 0.5 0.5 0.5 0.5 
##$TPOFFS= (0..7)
0 0 0 0 0 0 0 0 
##$TUNHIN= 0
##$TUNHOUT= 0
##$TUNXOUT= 0
##$USERA1= <user>
##$USERA2= <user>
##$USERA3= <user>
##$USERA4= <user>
##$USERA5= <user>
##$V9= 5
##$VALIST= <valist>
##$VCLIST= <CCCCCCCCCCCCCCC>
##$VD= 0
##$VDLIST= <DDDDDDDDDDDDDDD>
##$VPLIST= <PPPPPPPPPPPPPPP>
##$VTLIST= <TTTTTTTTTTTTTTT>
##$WBST= 1024
##$WBSW= 4
##$XGAIN= (0..3)
0 0 0 0 
##$XL= 0
##$YL= 0
##$YMAX_a= 3630615
##$YMIN_a= -7126985
##$ZGOPTNS= <>
##$ZL1= 120
##$ZL2= 120
##$ZL3= 120
##$ZL4= 120
##$ABSF1= 10
##$ABSF2= 0
##$ABSG= 5
##$ABSL= 3
##$ALPHA= 0
##$AQORDER= 0
##$ASSFAC= 0
##$ASSFACI= 0
##$ASSFACX= 0
##$ASSWID= 0
##$AUNMP= <proc_1d>
##$AZFE= 0.1
##$AZFW= 0.1
##$BCFW= 1
##$BC_mod= 2
##$BYTORDP= 1
##$COROFFS= 0
##$CY= 11.3945322036743
##$DATMOD= 1
##$DC= 2
##$DFILT= <>
##$DTYPP= 0
##$F1P= 20.1720416913024
##$F2P= 0.152960286110954
##$FCOR= 0.5
##$FTSIZE= 0
##$FT_mod= 4
##$GAMMA= 1
##$GB= 0.15
##$INTBC= 1
##$INTSCL= 1
##$ISEN= 128
##$LB= 0.24
##$LEV0= 0
##$LPBIN= 0
##$MAXI= 10000
##$MC2= 0
##$MEAN= 0
##$ME_mod= 0
##$MI= 1.114404
##$NCOEF= 0
##$NC_proc= 0
##$NLEV= 6
##$NOISF1= 3.799351
##$NOISF2= 2.8
##$NSP= 1
##$NTH_PI= 0
##$NZP= 0
##$OFFSET= 15.70392
##$PC= 1
##$PHC0= -9212.392
##$PHC1= 12.20096
##$PH_mod= 1
##$PKNL= yes
##$PPARMOD= 0
##$PSCAL= 0
##$PSIGN= 0
##$REVERSE= no
##$SF= 200.130013532006
##$SI= 16384
##$SIGF1= 3
##$SIGF2= 2
##$SINO= 400
##$SIOLD= 16384
##$SREGLST= <1H.CDCl3>
##$SSB= 0
##$STSI= 0
##$STSR= 0
##$SW_p= 3612.71676300578
##$SYMM= 0
##$S_DEV= 0
##$TDeff= 0
##$TDoff= 0
##$TI= <>
##$TILT= no
##$TM1= 0
##$TM2= 0
##$TOPLEV= 0
##$USERP1= <user>
##$USERP2= <user>
##$USERP3= <user>
##$USERP4= <user>
##$USERP5= <user>
##$WDW= 1
##$XDIM= 8192
##$YMAX_p= 0
##$YMIN_p= 0
$$ End of Bruker specific parameters
$$ ---------------------------------
##NTUPLES= NMR FID
##VAR_NAME=  TIME,          FID/REAL,        FID/IMAG
##SYMBOL=    X,             R,               I
##VAR_TYPE=  INDEPENDENT,   DEPENDENT,       DEPENDENT
##VAR_FORM=  AFFN,          ASDF,            ASDF
##VAR_DIM=   8192,          8192,            8192
##UNITS=     SECONDS,       ARBITRARY UNITS, ARBITRARY UNITS
##FACTOR=    0.0002004,     1,               1
##FIRST=     0,             0,               0
##LAST=      1.6414764,     0,               0
##MIN=       0,             -7126985,        0
##MAX=       1.6414764,     3630615,         0
$$ Real data points
##PAGE= N=1
##DATA TABLE= (X++(R..R)), XYDATA
$$ plain form
0 0 0 0 0 -72 72 -72 72 -144 216 -288 360 -432 576 -663 794 -1006 1208 -1440 1689 -1975 2309
21 2309 -2728 3157 -3623 4167 -4790 5468 -6200 7026 -7966 8974 -10070 11295 -12644
34 -12644 14121 -15726 17488 -19441 21579 -23910 26479 -29325 32462 -35950 39816 -44153
46 -44153 49067 -54643 61017 -68432 77159 -87620 100404 -116460 137357 -165768
56 -165768 206826 -271805 390695 -679164 2818526 1126267 -5375216 -1213509 2220694
65 2220694 1025648 -844124 1189509 1141588 -1109263 -1317958 1002434 599790 -774626
74 -774626 258568 1600450 -420381 -1794054 115726 1386653 -507847 -826461 1349054
83 1349054 1025250 -2108177 -1804428 1708006 2084370 -863430 -1187381 787690 282974
$$ packed form
0@%%%p2J44j44J44k16L60n04O48p92J008j239J457j800K214k648L129l664M284
21B309n037N885o780P790q957J0258j1668J3226j4992J6940j9044K1365k3939
34a2644K6765k9847L3214l6929M1020m5489N0389n5804O1787o8412P5766q3969
46d4153R3220j03710J15660j29449J45591j64779J88024k16864K53817l03125
56a65768L72594m78631O62500j069859L497690j692259o501483M161707L434203
65B220694j195046j869772K033633m7921k250851k08695K320392m02644j374416
74g74626J033194J341882k020831j373673J909780J270927j894500l18614K175515
83A349054l23804l133427L03749L512434L76364k947800l23951J975071n04716
$$ plain form
92 282974 -1535787 -260778 1911319 805751 -1304297 -682058 486811 -226666 -422699
101 -422699 1035690 977629 -910500 -976090 639098 314834 -1000256 186879 1848062
110 1848062 152960 -2128134 -669533 1698963 617218 -1244390 -47744 1413762
118 1413762 -177224 -1748155 -182790 1563848 590141 -765639 -339027 142907 -305841
127 -305841 -121665 624461 262567 -449700 66970 458752 -586100 -922587 713647 1428230
137 1428230 -347387 -1433807 32136 1055809 -165404 -910077 301546 906545 -295764
146 -295764 -923445 10130 529518 -13748 -124643 236334 -131934 -616088 -31169 611942
156 611942 82598 -471976 45976 403678 -240109 -500980 264597 557630 -122767 -286806
$$ packed form
92B82974j818761J275009K172097j105568k110048O22239J168869p13477j96033
101d22699J458389n8061j888129o5590J615188l24264j315090J187135J661183
110A848062j695102k281094J458601K368496j081745j861608J196646J461506
118A413762j590986j570931J565365J746638r73707j355780M26612M81934m48748
127c05841J84176P46126l61894p12267N16670L91782j044852l36487J636234P14583
137A428230j775617j086420J465943J023673j221213p44673J211623O04999j202309
146b95764o27681R33575N19388n43266j10895L60977l68268m84154N84919O43111
156F11942n29344n54574N17952L57702o43787k60871P65577K93033o80397j64039
$$ plain form
166 -286806 313787 196861 -553304 -277407 750725 614631 -516624 -643348 334051 624594
176 624594 -82086 -391049 64095 338727 113850 -116959 -161737 -83214 158902 268094
186 268094 -73717 -311416 123858 477375 -66356 -591703 -7746 716786 195585 -699116
196 -699116 -384940 521639 422737 -341716 -352747 242097 294099 -154460 -240812 42408 145698
207 145698 60723 -679 -112008 -188920 9862 212969 15059 -220609 11481 276144
217 276144 -1059 -340068 -98031 270286 118969 -172537 -40085 155133 -32447 -212074
227 -212074 1337 210026 56582 -122434 -38590 45217 -46778 -84173 36729 130838 102099
238 102099 -12555 -169812 -190035 73600 282284 41956 -282217 -81519 302413 107165
$$ packed form
166b86806O00593j16926p50165K75897J028132j36094j131255j26724R77399K90543
176F24594p06680l08963M55144K74632k24877k30809m4778P8523K42116J09192
186B68094l41811k37699M35274L53517n43731n25347N83957P24532n21201q94701
196f99116L14176R06579r8902p64453j1031N94844N2002m48559q6352K83220J03290
207A45698q4975o1402j11329p6912J98782K03107j97910k35668K32090K64663
217B76144k77203l39009K42037L68317j51317k91506J32452J95218j87580j79627
227b12074K13411K08689j53444j79016Q3844Q3807r1995l7395J20902R4109k8739
238A02099j14654j57257k0223K63635K08684k40328l24173K00698L83932j95248
$$ plain form
248 107165 -365256 -200424 400875 380817 -281430 -509274 8778 393667 124085 -258087
258 -258087 -190781 108495 174903 -35937 -201431 -81410 174669 183640 -113418 -276593 -43270
269 -43270 206553 89774 -142055 -88866 94977 77056 -53609 -48294 29837 20216 -18268
280 -18268 -8718 -10404 -31933 -10156 17234 -14451 -22602 40276 45653 -39476 -51685 37845 48396
293 48396 -33322 -26736 46451 7950 -76448 -9789 99316 22509 -120183 -58273 114088 98676
305 98676 -72910 -116404 21524 105584 4377 -124648 -80012 96996 139712 -49713 -191604
316 -191604 -32447 187777 90361 -178801 -159938 110626 157939 -86338 -192648 914
326 914 155617 53206 -106650 -104936 7482 94578 77230 -34745 -119968 -49757 79523
$$ packed form
248A07165m72421J64832O01299k0058o62247k27844N18052L84889k69582l82172
258b58087O7306K99276O6408k10840j65494J20021K56079Q971k97058j63175K33323
269d3270K49823j16779k31829N3189J83843j7921j30665N315P8131r621l8484
280a8268R550j686k1529K1777K7390l1685q151O2878N377q5129j2209Q9530J0551
293D8396q1718O586P3187l8501q4398O6659J09105p6807j42692O1910J72361j5412
305I8676j71586m3494J37928Q4060j01207j29025M4636J77008M2716j89425j41891
316a91604J59157K20224r7416k69162J8863K70564M7313k44277j06310J93562
326I14J54703j02411j59856J714J12418Q7096j7348j11975q5223P0211J29280
$$ plain form
337 79523 63758 -54996 -63797 40458 57823 -27191 -54869 2509 39262 33512 17116 -18075
349 -18075 -40354 20764 85651 16577 -89094 -28701 113001 79593 -80528 -99808 33839
360 33839 88012 3285 -57941 -25990 31333 60184 22077 -78809 -110756 18133 130634
371 130634 20661 -147652 -71609 131105 113113 -91122 -127486 46008 116610 -14889 -106669
382 -106669 -22339 76647 43214 -51449 -74984 640 87914 76277 -29679 -96931 -31852 63471
394 63471 49490 -35103 -54318 -4821 28173 25635 13930 -11773 -34174 -1796 58441 41775
406 41775 -39679 -54080 13870 36703 -20958 -40713 28625 67813 4651 -59875 -28383 43615
418 43615 42725 -28896 -60957 4069 75473 31897 -86792 -100957 36925 132276 29387 -118847
$$ packed form
337G9523j5765j18754q801J04255J7365q5014k7678N7378L6753n750j6396l5191
349a8075k2279O1118O4887o9074j05671O0393J41702l3408j60121j9280J33647
360C3839N4173q4727o1226L1951N7323K8851l8107j00886l1947J28889J12501
371A30634j09973j68313P6043K02714j7992k04235l6364J73494P0602j31499r1780
382a06669Q4330R8986l3433r4663k3535P5624Q7274j1637j05956o7252O5079R5323
394F3471j3981q4593j9215M9497L2994k538j1705k5703k2401L2378O0237j6666
406D1775q1454j4401O7950K2833n7661j9755O9338L9188o3162o4526L1492P1998
418D3615q90p1621l2061O5026P1404m3576j18689j4165J37882R5351j02889j48234
$$ plain form
430 -118847 -86781 69244 97777 -35827 -105233 -3604 100995 43982 -89706 -103536 24285
441 24285 119319 55256 -78122 -90161 27955 89906 1348 -78628 -17004 66752 22064 -63673
453 -63673 -25948 64565 42723 -45136 -39723 35056 47231 720 -8783 6116 -9496 -13603 29385
466 29385 42253 -18045 -51008 3423 53863 24071 -23032 -20648 7462 24635 23755 -2464 -25881
479 -25881 1042 48283 17697 -61710 -40597 69512 75376 -48359 -95428 14541 95597 29787
491 29787 -58116 -40748 27510 46939 6147 -48761 -46050 34441 77615 -14840 -103278 -939
503 -939 144834 61161 -139668 -112536 93389 122270 -46599 -92842 29765 64637 -24975
514 -24975 -33437 44402 41848 -14757 -1851 19900 -31371 -35837 52590 58304 -54050 -66409 56302
$$ packed form
430a18847L2066J56025K8533j33604o9406J01629J04599n7013j33688j3830J27821
441B4285R5034o4063j33378j2039J18116O1951q8558p9976O1624Q3756m4688q5737
453f3673L7725R0513k1842q7859N413P4779J2175m6511r503J4899j5612m107M2988
466B9385J2868o0298l2963N4431N0440k9792m7103K384K8110J7173q80k6219k3417
479b5881K6923M7241l0586p9407K1113J10109N864j23735m7069J09969Q1056o5810
491B9787q7903J7368O8258J9429m0792n4908K711Q0491M3174r2455q8438J02339
503i39J45773q3673k00829K7132K05925K8881j68869m6243J22607L4872q9612
514b4975q462P7839k554n6605J2906K1751n1271m466Q8427N714j12354j2359J22711
$$ plain form
527 56302 73688 -44043 -58979 53258 57103 -43523 -34574 44976 -1790 -79556 2584 104977
539 104977 16037 -102317 -29556 77526 22575 -48074 12100 46222 -36531 -58580 37049
550 37049 57702 -17275 -14205 40877 -12356 -68949 27403 101259 -28685 -115247 45132 157051
562 157051 -19358 -163896 -6479 148440 25004 -97340 12871 100014 -21708 -95492
572 -95492 19547 80367 -3405 -18431 42989 -8029 -85781 6401 108792 -907 -106093
583 -106093 22626 123262 -34370 -146973 22283 159537 17461 -110624 -9549 61413
593 61413 -33055 -40134 77898 49759 -93246 -55740 89989 43641 -75381 3661 111092
604 111092 -10557 -133681 -7337 111640 2735 -67505 49318 62581 -101495 -95637 104592
$$ packed form
527E6302J7386j17731j4936J12237L845j00626Q949P9550m6766p7766Q2140J02393
539A04977q8940j18354P2761J07082n4951p0649O0174L4122q2753k2049R5629
550C7049K0653p4977L070N5082n3233n6593R6352P3856j29944q6562J60379J11919
562A57051j76409j44538J57417J54919j23436j22344J10211Q7143j21722p3784
572i5492J15039O0820q3772j5026O1420n1018p7752R2182J02391j09699j05186
583a06093J28719J00636j57632j12603J69256J37254j42076j28085J01075P0962
593F1413r4468p079J18032k8139j43005L7506J45729m6348j19022P9042J07431
604A11092j21649j23124J26344J18977j08905p0240J16823J3263j64076N858K00229
$$ plain form
615 104592 101834 -90095 -61410 129613 57760 -172421 -104355 149193 134520 -72954 -86271
626 -86271 27662 6363 -34466 58642 83154 -52430 -77563 57943 46733 -102204 -48194
637 -48194 142581 84715 -131386 -96819 94684 64073 -77840 -6656 112250 -6323 -141727
648 -141727 -26597 101503 17110 -59506 28209 43395 -79022 -67992 75112 62299 -59988
659 -59988 -11537 86055 -34379 -162865 825 187603 51401 -143574 -53436 92422 9516
670 9516 -79650 32815 98608 -25731 -81019 22929 40966 -50954 -9411 111415 42521
681 42521 -111536 -72535 59124 38538 -21835 35913 49350 -77341 -93018 69171 104204
692 104204 -51877 -77667 71143 64785 -104563 -92401 100416 121177 -44978 -93921 -1151
$$ packed form
615A04592k758j91929K8685J91023p1853k30181O8066K53548j4673k07474j3317
626h6271J13933k1299m0829R3108K4512j35584k5133J35506j1210j48937N4010
637d8194J90775n7866k16101L4567J91503l0611j41913P1184J18906j18573j35404
648a41727J15130J28100q4393p6616Q7715J5186j22417J1030J43104j2813j22287
659e9988M8451R7592j20434j28486J63690J86778j36202j94975R0138J45858q2906
670I516q9166J12465O5793j24339n5288J03948J8037r1920M1543J20826o8894
681D2521j54057L9001J31659k0586o0373N7748J3437j26691j5677J62189L5033
692A04204j56081k5790J48810o358j69348J2162J92817K0761j66155m8943R2770
$$ plain form
703 -1151 19139 -12285 37892 59928 -39165 -79673 19360 53116 -44637 -41687 88689 77653
715 77653 -82402 -93925 49513 65476 -45901 -28602 76722 28015 -100680 -58198 75827
726 75827 61376 -35229 -20539 32467 -10965 -45599 19877 52925 -16438 -36926 24771 18203
738 18203 -47908 -10415 74157 17757 -86398 -26808 82826 24158 -77584 -7628 90011
749 90011 4506 -105957 -25707 88551 31793 -54268 -6558 39079 -25393 -51390 32082 58381
761 58381 -22249 -47297 12634 10817 -33289 10264 61467 -12923 -80174 7840 75728 -22584
773 -22584 -82423 37602 103259 -36438 -125338 5343 108741 10624 -72807 903 49604
784 49604 -17722 -36486 30085 25472 -35250 -4051 52060 -13531 -79354 8309 90829 6886
$$ packed form
703a151K0290l1424N0177K2036r9093m0508R9033L3756r7753K950J30376j1036
715G7653j60055j1523J43438J5963j11377J7299J05324m8707j28695M2482J34025
726G5827j4451r6605J4690N3006m3432l4634O5476L3048o9363k0488O1697o568
738A8203o6111L7493Q4572n6400j04155N9590J09634n8668j01742O9956R7639
749I0011q5505j10463Q0250J14258n6758q6061M7710M5637o4472k5997Q3472K6299
761E8381q0630k5048N9931j817m4106M3553N1203p4390o7251Q8014O7888r8312
773b2584n9839J20025O5657j39697q8900J30681J03398r8117q3431P3710M8701
784D9604o7326j8764O6571m613o0722L1199N6111o5591o5823Q7663Q2520q3943
$$ plain form
796 6886 -72683 -1447 49915 -28477 -40543 68167 66749 -76466 -88852 59891 91272 -38507
808 -38507 -65063 39331 41151 -57903 -44325 54020 44458 -26785 -15910 13282 -26042 -30443
820 -30443 44533 46171 -45412 -45245 46059 24587 -72118 -27108 94394 47699 -87151 -60575
832 -60575 59156 36558 -53924 -13092 64143 3366 -77075 -18365 61007 22409 -31709 -471
844 -471 20368 -17144 -20019 19183 3971 -30019 12839 49176 -21641 -71538 15003 88339 7658
857 7658 -76843 -16207 58916 11515 -45446 657 44447 -327 -40218 -5895 22436 3124
869 3124 -2339 15101 -590 -27330 -10775 13844 3555 -465 22715 6241 -43488 -29633 42326
882 42326 41004 -32070 -38639 34288 40271 -41458 -58583 26987 70277 1508 -60696 -23036 35461
$$ packed form
796F886p9569P1236N1362p8392j2066J08710j418j43215j2386J48743L1381j29779
808c8507k6556J04394J820r9054J3578R8345r562p1243J0875K9192l9324m401
820c0443P4976J638r1583J67R1304k1472r6705M5010J21502m6695j34850K6576
832f0575J19731k2598r0482M0832P7235o0777q0441N8710P9372l8598n4118L1238
844d71K0839l7512k875L9202j5212l3990M2858L6337p0817m9897Q6541P3336q0681
857G658q4501O0636P5123m7401n6961M6103M3790m4774l9891L4323K8331j9312
869C124n463J7440j5691k6740J6555K4619j0289m020K3180j6474m9729J3855P1959
882D2326j322p3074o569P2927N983q1729j7125Q5570M3290o8769o2204L7660N8497
$$ plain form
895 35461 30122 -12137 -22520 3334 16923 3175 -18741 -15352 13943 26322 -714 -28549
907 -28549 -13477 19187 13962 -11684 -6297 18597 8454 -23390 -15950 26884 26080 -25215 -36859
920 -36859 15027 44897 1743 -45618 -19471 32236 30836 -15373 -29772 3613 27485 11754
932 11754 -21957 -24061 5015 26107 8615 -20384 -14177 12980 5432 -22995 -9033 36270 27816
945 27816 -32025 -44094 13395 40043 -5421 -32230 5582 31692 -5340 -38822 -9708 33836
957 33836 25029 -18664 -31266 -1533 24695 7712 -24717 -16278 28168 32772 -22760 -49371 6134
970 6134 55314 15678 -43342 -19897 33390 14469 -39920 -24946 35022 39170 -14648 -37916
982 -37916 -7105 22816 17916 -5337 -13408 2002 17969 1872 -26587 -14579 27657 26517 -19134
$$ packed form
895C5461n339m2259j0383K5854J3589j3748k1916L389K9295J2379k7036k7835
907b8549J5072L2664n225k5646N387K4894j0143l1844P440M2834q04n1295j1644
920c6859N1886K9870m3154m7361K6147N1707j400m6209j4399L3385K3872j5731
932A1754l3711k104K9076K1092j7492k8999O207K7157p548k8427J3962M5303q454
945B7816n9841j2069N7489K6648m5464k6809L7812K6110l7032l3482K9114M3544
957C3836q807m3693j2602K9733K6228j6983l2429Q439M4446M604n5532k6611N5505
970F134M9180l9636n9020K3445N3287j8921n4389J4974N9968M148n3818k3268
982c7916L0811K9921m900k3253q071J5410J5967j6097k8459J2008M2236j140m5651
$$ plain form
995 -19134 -28391 16836 25098 -25754 -39606 23878 57144 -830 -58572 -25829 37590 36251 -13218
1008 -13218 -31902 447 28045 8540 -25487 -19128 25198 34535 -15918 -45782 2869 51693
1020 51693 14593 -48154 -26551 38025 31516 -27253 -30962 23079 31096 -16100 -32089 7815
1032 7815 30491 65 -26515 -5076 25422 14065 -26326 -31411 11900 46190 14317 -42146
1044 -42146 -35855 24250 40221 -12262 -41323 2398 42795 10452 -36527 -20741 26365 23856
1056 23856 -15907 -24175 12077 28460 -1196 -28646 -14417 19696 21818 -7972 -20877 3238
1068 3238 23165 988 -26822 -7826 29068 20310 -24724 -25963 19316 30975 -13735 -39134
1080 -39134 4820 44752 13226 -38301 -25901 25518 28387 -18541 -32124 11181 38185 5419
$$ packed form
995a9134r257M5227Q262n0852j3852O3484L3266n7974n7742L2743O3419j339m9469
1008a3218j8684L2349K7598j9505l4027O359M4326R337n0453k9864M8651M8824
1020E1693l7100o2747K1603O4576o509n8769l709N4041Q017m7196j5989L9904
1032G815K2676l0426k6580K1439L0498j1357m0391n085M3311L4290l1873n6463
1044d2146O291O0105J5971n2483k9061M3721M0397l2343m6979J5786M7106k509
1056B3856l9763q268L6252J6383k9656k7450J4229L4113K122k9790j2905K4115
1068C238J9927k2177k7810J8996L6894q758m5034j239M5279J1659m4710k5399
1080c9134M3954L9932l1526n1527J2400N1419K869m6928j3583M3305K7004l2766
$$ plain form
1092 5419 -34888 -19419 21810 25445 -10456 -22193 6703 28313 1218 -33950 -19626 24202
1104 24202 29521 -7959 -26180 -182 17568 -3973 -21347 7584 31501 3576 -34558 -19794
1116 -19794 24688 26658 -12211 -25246 5326 25723 2424 -26269 -17256 19715 30115 -4183
1128 -4183 -33976 -11453 29019 23118 -22657 -29747 16018 35558 -6575 -38065 -5314 33557
1140 33557 15432 -23331 -15768 15275 11839 -14881 -14390 11093 16554 -4426 -17684 -2914 13276
1153 13276 5525 -15692 -13826 16648 28189 -4687 -38441 -16303 31306 25716 -23353 -27142 16495
1166 16495 29535 -11523 -32626 1528 31894 10299 -22917 -17190 8637 15143 -426 -12700
1178 -12700 -5710 10977 16129 -3513 -19782 -5017 17233 8865 -13296 -5232 16440 4067 -22269
$$ packed form
1092E419m0307J5469M1229L635l5901j1737K8896K1610k7095l5168J4324M3828
1104B4202N319l7480j8221K5998J7750k1541j7374K8931K3917k7925l8134J4764
1116a9794M4482J970l8869j3035L0572K0397k3299k8693R013L6971J0400l4298
1128d183k9793K2523M0472n901m5775p090M5765J9540m2133l1490L2751L8871
1140C3557j8125l8763P563L1043l436k6720M91K5483N461k0980j3258J4770J6190
1153A3276p751k1217J866L0474J1541l2876l3754K2138M7609n590m9069l789M3637
1166A6495J3040m1058k1103L4154L0366k1595l3216N727K5827O506j5569j2274
1178a2700O990J6687N152j9642j6269J4765K2250q368k2161Q064K1672j2373k6336
$$ plain form
1191 -22269 -10636 23269 16412 -17789 -20669 12609 21463 -6345 -20633 -1396 16661 11692 -6837
1204 -6837 -18215 -6767 16785 19091 -8201 -19791 2661 17638 -6274 -23410 6445 31093
1216 31093 2629 -30529 -12654 19023 10370 -9798 -376 14170 -384 -17867 -7157 7094
1228 7094 8598 5888 1746 -10689 -12685 4626 8482 -8605 -8368 20962 22210 -21121 -35656 5167
1242 5167 30479 2933 -15541 5775 13289 -12703 -21991 5415 19405 5467 -3910 -2111 -9936
1255 -9936 -9311 8989 15278 -4749 -8757 10926 6421 -22089 -13705 24246 24858 -16865 -22350 12469
1269 12469 15200 -15455 -12378 18850 15685 -14040 -13883 6136 4901 -3866 6969 10055 -10299
1282 -10299 -13949 6623 9586 -9361 -1068 19563 208 -32150 -9728 30906 16592 -25776
$$ packed form
1191b2269J1633L3905o857l4201k880L3278Q854k7808j4288J9237J8057m969j8529
1204f837j1378J1448K3552K306k7292j1590K2452J4977k3912j7136K9855K4648
1216C1093k8464l3158J7875L1677q653k0168R422J4546j4554j7483J0710J4251
1228G094J504k710m142j2435j996J7311L856j7087K37K9330J248m3331j4535M0823
1242E167K5312k7546j8474K1316P514k5992r288K7406J3990j3938r377J799p825
1255i936O25J8300O289k0027m008J9683m505k8510Q384L7951O12m1723n485L4819
1269A2469K731l0655L077L1228l165k9725J57K0019j235q767J0835L086k0354
1282a0299l650K0572K963j8947Q293K0631j9355l2358K2422M0634j4314m2368
$$ plain form
1294 -25776 -14050 23727 11107 -24007 -12834 18880 11770 -10921 -4840 5280 -3783 -4991 10497
1307 10497 5616 -13353 -4219 15995 506 -21075 2269 26208 -902 -30921 -2524 32068
1319 32068 6745 -28047 -8226 22363 6843 -16540 -875 14178 -2415 -10505 4968 4237
1331 4237 -9231 -198 16170 2162 -17166 -442 15087 -6790 -18405 13956 27437 -11677
1343 -11677 -32787 5732 29296 -3391 -24292 8065 24575 -8135 -25061 1304 18689 3712
1355 3712 -6160 792 -4223 -11310 5313 12567 -8046 -11872 15176 15815 -21558 -23652 20890 27785
1369 27785 -16084 -23643 17245 21671 -22693 -24952 19014 27570 -7977 -19830 1456 6599 -3101
1382 -3101 4378 8215 -8465 -9264 14910 10445 -22354 -15010 23701 18008 -20238 -12868 23362 6180
$$ packed form
1294b5776J1726L7777j2620l5114J1173L1714p110k2691O081J0120r063j208J5488
1307A0497m881j8969R134K0214j5489k1581K3344K3939k7110l0019K8397L4592
1319C2068k5323l4792J9821L0589j5520k3383J5665J5053j6593q090J5473p31
1331D237j3468R033J6368j4008j9328J6724J5529k1877j1615L2361J3481l9114
1343a1677k1110L8519K3564l2687k0901L2357J6510l2710j6926K6365J7385j4977
1355C712r872O952n015p087J6623P254k0613l826K7048O39l7373k094M4542O895
1369B7785m3869p559M0888M426m4364k259M3966Q556l5547j1853K1286N143r700
1382c101P479L837j6680p99K4174m465l2799P344L8711n693l8246P370L6230j7182
$$ plain form
1396 6180 -34234 -11565 38181 23488 -29743 -28496 12756 18916 -3763 -5343 1633 -2125 -1003
1409 -1003 7965 -2766 -17355 1843 26626 5339 -25280 -8116 16910 -280 -18312 12016
1421 12016 28563 -10083 -37239 -376 30935 3371 -20040 2210 19414 -6048 -23878 -4968
1433 -4968 16279 14814 5860 -8101 -23103 -9103 25090 21730 -19071 -26133 14041 26424 -11607
1446 -11607 -26861 6046 22939 -1901 -12994 4486 7236 -9424 -8902 10990 14853 -1646 -12370
1459 -12370 -9156 648 14086 13999 -6367 -21054 -663 19047 3834 -15672 -111 18988 324
1472 324 -24562 -7278 25007 16154 -15480 -19007 5803 16239 1274 -14850 -7286 9685 11900
1485 11900 -4059 -15173 -4209 10135 5537 -5335 -1627 6139 -3280 -13931 -512 18805 12781
$$ packed form
1396F180m0414K2669M9746j4693n3231J247M1252O160k2679j580O976l758J122
1409a003Q968j0731j4589J9198K4783k1287l0619J7164K5026j7190j8032L0328
1421A2016J6547l8646k7156L6863L1311k7564k3411K2250J7204k5462j7830J8910
1433d968K1247j465q954j3961j5002J4000L4193l360m0801p062M0174J2383l8031
1446a1607j5254L2907J6893k4840j1093J7480K750j6660N22J9892L863j6499j0724
1459a2370L214R804J3438q7k0366j4687K0391J9710j5213j9506J5561J9099j8664
1472C24k4886J7284L2285q853l1634l527K4810J0436j4965j6124P564J6971K215
1485A1900j5959j1114J0964J4344m598j0872L708P766r419j0651J3419J9317o024
$$ plain form
1498 12781 -11703 -21606 -3327 16756 16495 -3803 -14805 -3912 8320 -1246 -11377 6825 23847
1511 23847 924 -30875 -16997 22081 23282 -8873 -17120 4625 10920 -4041 -12444 -2950 9761
1524 9761 15668 6719 -15806 -22617 2503 22958 6443 -11946 2153 9870 -16318 -23504 16268
1537 16268 36916 -1810 -33853 -7500 19373 2680 -10531 8213 15857 -7888 -20550 -2468
1549 -2468 10532 9438 8233 499 -17992 -13866 13926 15271 -13161 -9307 22922 14632 -30094
1562 -30094 -28316 21286 31731 -6380 -15964 6698 3984 -19322 -7405 21447 15858 -7092 -10764
1575 -10764 -6015 -9259 1196 20600 9699 -19371 -11157 16154 5020 -20130 -2056 26520
1587 26520 5991 -26623 -7909 22812 6695 -19711 -2221 21995 3030 -22446 -10203 14434
$$ packed form
1498A2781k4484r903J8279K0083k61k0298j1002J0893J2232r566j0131J8202J7022
1511B3847k2923l1799J3878L9078J201l2155q247K1745O295j4961q403R494J2711
1524I761N907q949k2525o811K5120K0455j6515j8389J4099P717k6188p186L9772
1537A6268K0648l8726l2043K6353K6873j6693j3211J8744P644k3745j2662J8082
1549b468J3000j094j205p734j8491M126K7792J345k8432L854L2229q290m4726
1562c0094J778M9602J0445l8111r584K2662k714k3306J1917K8852n589k2950l672
1575a0764M749l244J0455J9404j0901k9070Q214K7311j1134k5150J8074K8576
1587B6520k0529l2614J8714L0721j6117k6406J7490K4216j8965k5476J2243K4637
$$ plain form
1599 14434 15577 3711 -5884 -17115 -13152 13613 24020 -1144 -19753 -597 13978 -8051
1611 -8051 -19484 8788 26910 250 -21961 -6005 6360 -4827 -4226 19581 19098 -14982 -26726
1624 -26726 -5183 18185 12748 152 -4777 -9500 -3395 4432 254 -7508 3055 19246 5132
1637 5132 -24710 -21204 13819 26149 529 -17063 -3957 5132 -3911 -7864 5390 12494 2394
1650 2394 -8701 -7857 -1692 3357 5507 2940 -624 -1401 -521 -4261 -6672 4537 13564 3351 -13046
1665 -13046 -10177 6986 7132 -5689 -2677 11457 8230 -14023 -16154 8844 17523 1120 -13101
1678 -13101 -4411 9430 6000 -6797 -7840 1333 9084 4947 -5692 -11492 -1706 10685 8117 -5273
1692 -5273 -7632 2005 3749 -2274 -1529 6426 2682 -7018 -4405 6208 3071 -5698 -3132 8882 7951
$$ packed form
1599A4434J143j1866r595j1231L963K6765J0407k5164j8609J9156J4575k2029
1611h051j1433K8272J8122k6660k2211J5956J2365j1187O01K3807m83l4080j1744
1624b6726K1543K3368n437j2596m929m723O105P827m178p762J0563J6191j4114
1637E132k9842L506L5023J2330k5620j7592J3106R089r043l953J3254P104j0100
1650B394j1095Q44O165N049K150k567l564p77Q80l740k411J1209R027j0213j6397
1665a3046K869J7163J46j2821L012J4134l227k2253k131K4998Q679j6403j4221
1678a3101Q690J3841l430j2797j043R173P751m137j0639n800R786J2391k568j3390
1692e273k359R637J744o023P45P955l744r700K613J0613l137q769K566J2014r31
$$ plain form
1707 7951 -5309 -11457 -1865 7986 8912 1396 -7986 -6940 3698 7820 -2848 -8984 4426 14333
1721 14333 455 -15317 -7394 10268 9897 -4592 -7386 2598 5481 -2433 -4907 235 2781 1693
1735 1693 887 -432 -767 -2303 -2226 -760 3468 5027 -978 -6849 -1752 6938 3095 -7514 -4092 7400
1751 7400 6766 -5159 -9420 2431 9337 1023 -6895 -4700 3694 5335 -524 -5382 -3763 3578 6283
1766 6283 -856 -7106 -2599 4759 3924 -3164 -5603 -428 3096 1253 -308 -1227 -1784 -730 1370 2038
1782 2038 -849 -2953 -1938 2169 4787 -1758 -5917 -2818 4925 6715 -2067 -9643 -1925 10159 7604
1797 7604 -6387 -10258 790 9057 3893 -5511 -4194 1889 2612 -1209 -2821 19 1542 1654 -137
1812 -137 -1236 -450 -1292 792 2462 3296 -2590 -3817 423 2632 405 -2798 -1159 3825 4472 -1314
$$ packed form
1707G951j3260o148R592R851R26p516r382J046J0638M122j0668o136J3410R907
1721A4333j3878j5772P923J7662l71j4489k794R984K883p914k474N142K546j088
1735A693q06j319l35j536P7J466M228J559o005n871N097Q690l843j0609L422J1492
1751G400o34j1925m261J1851O906q314p918K195Q394J641n859m858J619P341K705
1766F283p139o250M507P358q35p088k439N175L524j843j561r19n57J054K100O68
1782B038k887k104J015M107K618o545m159L099P743J790q782p576P718J2084k555
1797G604j3991l871J1048Q267n164r404J317O083P23l821j612K840J523J12j791
1812a37j099P86q42K084J670Q34n886j227M240K209k227l203J639M984O47n786
$$ plain form
1828 -1314 -7096 -3991 4745 6950 -1508 -7102 -2946 4659 3832 -2017 -4142 -585 2188 1249 -520
1843 -520 -2440 -1375 1953 3135 -859 -3278 -196 3130 1852 -2560 -1507 52 -500 -319 2999 1469
1859 1469 -4828 -2343 5772 4215 -5414 -5075 5817 7422 -2406 -7160 -384 5632 2772 202 -1597
1874 -1597 -2378 100 4239 1485 -3192 -3148 2680 1973 -2307 -690 2182 445 -3678 866 5060 -2189
1890 -2189 -5553 3232 8386 -2906 -10628 1179 12137 1602 -10172 -4405 4588 3684 -1765 -874
1904 -874 -685 -2907 625 3717 -1049 -5828 1464 8082 -147 -8414 -855 6784 719 -4120 3368
1919 3368 5587 -4529 -6453 5767 7522 -4838 -6940 5216 7442 -3577 -5873 1959 3847 -1111
1933 -1111 439 3435 -3374 -3548 5289 4885 -7856 -6417 9721 8196 -9705 -10444 8160 9080 -8294
$$ packed form
1828a314n782L105Q736K205q458n594M156P605q27n849k125L557K773r39j769
1843e20j920J065L328J182l994k419L082L326j278m412J053J559n52J81L318j530
1859A469o297K485Q115j557r629L39J0892J605r828m754O776O016k860k570j799
1874a597p81K478M139k754m677M4N828p07m280J617K872j737m123M544M194p249
1890b189l364Q785N154j1292p722J1807J0958j0535j1774N767Q993r04n449Q91
1904h74J89k222L532L092m766m779P292O618q229q267P559P639o065m839P488
1919C368K219j0116j924J2220J755j2360k102J2156K226j1019k296P832J888m958
1933a111J550K996o809j74Q837m04j2741J439J6138j525j7901p39J8604R20j7374
$$ plain form
1948 -8294 -6480 8830 6147 -9619 -6219 8838 4068 -8056 -3161 8616 1718 -6593 -1194 4902
1962 4902 -1743 -1794 5019 28 -10241 -1394 12562 1293 -13548 253 14822 -1066 -17706
1975 -17706 -174 18233 2899 -16138 -3614 11742 357 -9133 1697 9663 -2745 -4924
1987 -4924 5725 1562 -10581 -519 14018 2632 -11068 -1788 8748 -4401 -9468 10025 15709
2000 15709 -10764 -18607 7570 16383 -8458 -12733 12006 16599 -10104 -17539 3074 10279 -28
2013 -28 -477 4474 -6205 -10569 4740 10345 -5603 -7890 10086 5875 -17656 -10457 18167 13497
2027 13497 -17073 -12866 13419 8614 -16155 -5726 20382 9046 -18759 -13520 10938 10037 -4273
2040 -4273 -1725 3693 -4572 -6457 5630 3665 -7916 1588 15877 -1206 -22092 -4985 19565
$$ packed form
1948h294J814J5310k683j5766L400J5057m770j2124M895J1777o898q311N399O096
1962D902o645n1O813m991j0269Q847J3956j1269j4841J3801J4569j5888j6640
1975a7706J7532J8407j5334j9037J2524J5356j1385r490J0830P966j2408k179
1987d924J0649m163j2143J0062J4537j1386j3700R280J0536j3149n067J9493N684
2000A5709k6473p843K6177Q813k4841m275K4739M593k6703p435K0613P205j0307
2013b8m49M951j0679m364J5309N605j5948k287J7976m211k3531P199K8624m670
2027A3497l0570M207K6285m805k4769J0429K6108j1336k7805N239K4458r01j4310
2040d273K548N418q265j885J2087j965j1581R504J4289j7083k0886J7107K4550
$$ plain form
2053 19565 8449 -13241 -3127 12930 -2716 -17892 3273 20936 2150 -16010 -3383 11015
2065 11015 1726 -7083 1035 5322 -2733 -3086 3271 -950 -5390 5907 10906 -6283 -16424 4805
2079 4805 16762 -3889 -15438 7058 15304 -8562 -20287 5699 22061 1046 -16849 -3524
2091 -3524 8727 -763 -7565 3497 7377 -1200 -4368 -2248 -3933 -637 10303 5805 -12775 -12367
2105 -12367 10775 13157 -8369 -12540 9121 12002 -10760 -14449 8765 14271 -6269 -12387 6936
2118 6936 8850 -8757 -10445 9073 12922 -1095 -7616 -4284 -3732 1836 12931 8692 -9988 -13488
2132 -13488 4027 8297 -4148 42 14046 1695 -20355 -10641 17959 14053 -11642 -9921 11988
2145 11988 7434 -14584 -11615 12106 15160 -1452 -9274 -7417 -3817 3198 11453 3544 -7201 -2619
$$ packed form
2053A9565j1116k1690J0114J6057j5646j5176K1165J7663j8786j8160J2627J4398
2065A1015r289q809Q118M287q055l53O357m221m440J1297M999j7189j0141K1229
2079D805J1957k0651j1549K2496Q246k3866j1725K5986J6362k1015j7895J3325
2091c524J2251r490o802J1062L880q577l168K120j685L296J0940m498j8580M08
2105a2367K3142K382k1526m171K1661K881k2762l689K3214N506k0540o118J9323
2118F936J914j7607j688J9518L849j4017o521L332N52N568J1095m239j8680l500
2132a3488J7515M270j2445M190J4004j2351k2050R714K8600l906k5695J721K1909
2145A1988m554k2018K969K3721L054j6612p822J857L600P015Q255p909j0745M582
$$ plain form
2159 -2619 6012 -6863 -14969 8797 25934 3215 -27485 -13235 13825 8931 -7474 2614 12255
2172 12255 -4233 -21097 -5816 15442 11921 -2606 -5089 -2516 -5202 -1715 5147 3103 745
2185 745 4973 1827 -12974 -12991 8768 17748 1090 -10415 685 4967 -10683 -8145 14029 20406
2199 20406 -4710 -20981 -7329 11103 9823 315 -1996 -1125 -1911 -2781 -3987 249 8664 10016
2213 10016 -2775 -15500 -6179 10964 7970 -6868 -3216 9905 4905 -14528 -15538 9106 20805
2226 20805 3208 -16507 -9493 6586 4842 -5407 -1899 10162 5577 -9067 -12767 615 12738
2239 12738 6352 -3972 -6527 -1683 2899 1278 -1979 -793 4432 3580 -7472 -8080 4354 9134
2253 9134 -1353 -8505 4329 9030 -6778 -12630 6793 19672 81 -18229 -6957 12207 7107
$$ packed form
2159b619Q631j2875q106K3766J7137k2719l0700J4250K7060m894j6405J0088R641
2172A2255j6488j6864J5281K1258l521j4527k483K573k686L487O862k044k358
2185G45M228l146j4801j7K1759Q980j6658j1505J1100M282j5650K538K2174O377
2199B0406k5116j6271J3652J8432j280r508k311Q71p86q70j206M236Q415J352
2213A0016j2791j2725R321J7143k994j4838L652J3121n000j9433j010K4644J1699
2226B0805j7597j9715P014J6079j744j0249L508J2061m585j4644l700J3382J2123
2239A2738o386j0324k555M844M582j621l257J186N225q52j1052o08J2434M780
2253I134j0487p152J2834M701j5808n852J9423J2879j9591j8310J1272J9164n100
$$ plain form
2266 7107 -6547 -3730 3627 2369 -1684 -3322 -3755 2343 9990 5273 -11327 -11508 10852 12460 -11143
2281 -11143 -13598 11687 16116 -11662 -19625 7877 19375 -4750 -14637 4122 11199 -3785 -10365
2294 -10365 1284 7583 2227 259 -954 -8287 -3148 11094 4628 -12320 -3989 15609 5825 -20111
2308 -20111 -10732 18526 12184 -15109 -8975 13609 5030 -15992 -5010 17181 7966 -11251 -6107
2321 -6107 6283 621 -5643 4256 5745 -3461 -1482 3811 -5274 -9630 8034 17847 -5807 -19229
2335 -19229 4002 17545 -5897 -19670 8147 25382 -2179 -26870 -7213 18599 9058 -6535
2347 -6535 -4388 22 62 766 955 -4476 -2008 10907 7596 -14511 -15503 11776 17586 -8245 -13990
2362 -13990 7558 12351 -10824 -14139 9788 15342 -4626 -12030 2807 6486 -4909 -3762 8060
$$ packed form
2266G107j3654K817P357j258m053j638m33O098P647m717j6600j81K2360J608k3603
2281a1143k455K5285M429k7778p963K7502J1498k4125r887J8759P077j4984o580
2294a0365J1649O299n356j968j213p333N139J4242o466j6948Q331J9598r784k5936
2308b0111R379K9258o342k7293O134K2584q579k1022J0982K2191r215j9217N144
2321f107J2390n662o264R899J489r206J979N293r085m356J7664R813k3654j3422
2335a9229K3231J3543k3442j3773K7817J7235k7561k4691J9657K5812r541j5593
2347f535K147M410M0P04J89n431K468J2915l311k2107r92K7279N810k5831n745
2362a3990K1548M793k3175l315K3927N554j9968p404J4837L679j1395J147J1822
$$ plain form
2375 8060 5013 -5440 -6728 -1980 -463 4716 7019 -1614 -11775 -921 12019 1470 -11449
2388 -11449 -773 15180 2102 -17081 -6742 13515 7639 -10341 -7198 9514 6367 -8196
2400 -8196 -7768 4453 8512 933 -4742 -4801 557 6041 2947 -6673 -6518 7788 8200 -8579 -13011
2415 -13011 4861 16713 -2163 -17751 -3170 15161 6836 -11808 -9098 6683 8726 -2209
2427 -2209 -7967 -1534 4377 4533 -1525 -5478 -2808 5000 3692 -4833 -4570 3662 3947 -5120 -4961 4773
2443 4773 6864 -3661 -6449 3113 5265 -4707 -6173 5527 9130 -1782 -10423 -1677 8892 6234
2457 6234 -6325 -5588 4873 7651 -2108 -9990 -4329 9235 11341 -1780 -14478 -2175 11039
2470 11039 5566 -9424 -7166 9759 9807 -6672 -13184 1690 12091 3491 -7955 -4617 5459
$$ packed form
2375H060l047j0453j288M748J517N179K303q633j0161J0854J2940j0549j2919
2388a1449J0676J5953j3078j9183J0339K0257n876j7980L143J6712l147j4563
2400h196M28J2221M059p579n675n9N358N484l094r620J55J4306M12j6779m432
2415a3011J7872J1852j8876j5588J4581J8331q325j8644K710J5781K043j0935
2427b209n758O433N911J56o058l953K670P808j308q525K63Q232K85r067J59R734
2443D773K091j0525k788R562K152r972j466J1700L603j0912q641Q746J0569k658
2457F234j2559P37J0461K778r759p882N661J3564K106j3121j2698J2303J3214
2470A1039n473j4990K258J6925M8j6479o512J4874J0401q600j1446L338J0076
$$ plain form
2483 5459 4961 -4844 -4609 2060 7564 1374 -6221 -6269 2847 6672 -2258 -7169 1683 9515 924 -10731
2499 -10731 -6338 8407 7900 -4561 -8278 1625 5694 -284 -4710 -319 3624 350 -3252 -2120
2513 -2120 1946 298 -644 418 1975 466 -3399 -5944 1350 8613 3814 -7032 -6838 5221 8478
2528 8478 -3745 -8845 2149 12447 326 -12523 -6474 9317 9966 -2305 -9301 -1553 7967
2541 7967 4277 -6070 -7709 1740 11597 2962 -9760 -7014 6633 9641 -4386 -9273 2901 9857
2555 9857 -561 -9240 -3899 6112 4419 -2461 -1741 1212 926 -1032 -916 -221 1155 2014 -839 -2565
2571 -2565 -237 1362 -1470 -2842 2989 5470 -1401 -8318 -1896 9048 3355 -6655 -3816 5247
2585 5247 4245 -5069 -5335 3953 5191 -2108 -4163 1492 4679 429 -4507 -2273 2312 5983 -104
$$ packed form
2483E459m98r805K35O669N504o190p595m8R116L825q930m911Q852P832q591j1655
2499a0731M393J4745n07j2461l717R903M069n978m426M391L943l274l602J132
2513b120M066j648r42J062J557j509l865k545P294P263m799j0846J94J2059L257
2528H478j2223n100J0994J0298j2121j2849O049J5791O49j2271o996P748R520
2541G967l690j0347j639R449R857q635j2722K746J3647L008j4027m887J2174O956
2555I857j0418q679N341J0011j693o880P20K953k86j958J16O95J376Q59k853j726
2571b565K328J599k832j372N831K481o871o917O422J0944n693j0010K839R063
2585E247j002r314k66R288J238p299k055N655L187m250m936K234M585L671o087
$$ plain form
2600 -104 -5988 -3151 7505 7852 -5532 -8888 3348 9815 -232 -10944 -2847 10817 7111 -6840
2614 -6840 -9800 359 8193 3169 -4587 -4269 1041 6298 779 -5847 -4177 6877 6749 -4005 -7005
2629 -7005 106 6873 890 -5000 567 5337 762 -4513 -874 3135 874 -1794 944 2573 -2319
2644 -2319 -4392 -69 4576 2519 -3212 -2653 1211 2653 866 -3716 -2113 4208 4700 -2524 -7567
2659 -7567 -1083 7741 4339 -7396 -5232 5908 7263 -4520 -9753 -1053 9408 4412 -5961 -4972
2673 -4972 964 3390 -118 -2801 -1314 3511 3846 -3764 -7296 -1372 8337 5887 -5835 -6930 3589
2688 3589 5313 -5200 -6048 4880 9311 -936 -9268 -2805 4758 2121 -1313 593 1740 -1421
2702 -1421 -2304 -415 -508 -832 3339 1771 -3505 -4183 1100 3452 -459 686 1865 -1676 -6090 388
$$ packed form
2600a04n884K837J0656L47j3384l356J2236O467j0047j0712Q097J3664l706j3951
2614f840k960J0159P834n024p756L18N310N257n519o626J670J1054j28j0754l000
2629g005P111O767n983n890N567M770m575n275L639M009k261k668K738J629m892
2644b319k073M323M645k057n731N59L864J442j787m582J603O321M92p224n043
2659g567O484Q824l402j1735K164J1140J355j1783n233Q700J0461m996j0373R89
2673d972N936K426l508k683J487M825L35p610l532N924R709k450j1722j095J0519
2688C589J724j0513q48J0928M431j0247q332O463P563k637l434J906J147l161
2702a421q83J889r3l24M171j568n276o78N283K352l911J145J179l541m414O478
$$ plain form
2718 388 7694 1826 -7019 -1170 7351 809 -9635 -1045 10664 6508 -7153 -7327 785 5164 2511
2733 2511 707 -1691 -3357 595 3332 -3731 -4579 5517 11204 -1593 -15306 -4831 10750 8420
2747 8420 -6465 -4798 5963 1686 -6855 -4084 5318 6559 98 -2642 -3816 -3773 3031 7481 2406
2762 2406 -5373 -2962 2329 -114 -4885 3173 7942 -1193 -7884 -3163 4260 620 -3103 4876 4625
2777 4625 -5707 -9100 1353 7662 1207 -2511 2458 1236 -6478 -6755 5361 9067 2812 -3207
2791 -3207 -4623 -6172 -1044 6897 6612 -2742 -6561 1927 3312 -6184 -4613 8417 11947 -5141 -13913
2806 -13913 -152 8010 1740 -4458 764 3603 -1121 -5372 -2149 545 3217 5743 2800 -8157
2820 -8157 -8895 3987 9494 669 -6458 1778 3527 -6374 -7289 6747 10418 -3388 -8281 799 2926
$$ packed form
2718C88P306n868q845N849Q521o542j0444Q590J1709m156j3661j74Q112M379k653
2733B511j804k398j666L952K737p063q48J0096N687j2797j3713J0475J5581k330
2747H420j4885J667J0761m277q541K771R402J241o461k740j174M3O804M450n075
2762B406p779K411N291k443m771Q058M769r135o691M721P423l640l723P979k51
2777D625j0332l393J0453O309o455l718M969j222p714k77J2116L706o255o019
2791c207j416j549N128P941k85r354l819Q488J385r496J571J3030L530j7088q772
2806a3913J3761Q162o270o198N222K839m724m251L223K694K672K526k943j0957
2820h157p38J2882N507q825p127Q236J749r901r15J4036L671j3806m893R080K127
$$ plain form
2835 2926 -3086 -1112 7611 2070 -7999 -2660 6507 1747 -6340 1143 8161 629 -8102 -1265 4009
2850 4009 -424 -216 5670 1254 -10406 -4084 9748 5198 -7917 -2787 9520 901 -11932 -1357
2864 -1357 12750 4189 -10382 -5400 5688 1454 -2241 1861 1957 -4891 -1501 9759 141 -11023
2878 -11023 -1065 12447 2656 -12133 -2703 11209 1998 -10697 -45 11470 -534 -9833 302
2891 302 8772 -1396 -5547 4219 3401 -6409 -2952 8771 3956 -9058 -3680 7954 2337 -6581
2905 -6581 -344 5113 -3587 -7475 6226 7397 -6077 -7834 6677 7212 -7159 -5816 7844 5792
2919 5792 -8561 -5779 8520 5823 -7155 -3537 5221 1879 -2675 1995 2679 -5604 -2179 9628
2933 9628 4495 -10888 -6917 10319 8129 -7628 -4697 7759 2486 -9702 -3688 8565 4789
$$ packed form
2835B926o012J974Q723n541j0069N339R167m760q087P483P018p532q731O837N274
2850D009m433K08N886m416j1660O322J3832m550j3115N130J2307q619j2833J0575
2864a357J4107q561j4571M982J1088m234l695M102R6o848L390J1260r618j1164
2878a1023R958J3512r791j4789R430J3912r211j2695J0652J1515j2004r299J0135
2891C02Q470j0168m151R766q18r810L457J1723m815j3014N378J1634n617q918
2905f581O237N457q700l888J3701J171j3474j757J4511N35j4371J343J3660k052
2919E792j4353K782J4299k697j2978L618Q758l342m554M670O84q283L425J1807
2933I628n133j5383L971J7236k190j5757K931J2456n273j2188O014J2253l776
$$ plain form
2946 4789 -7052 -2062 3113 -988 -3324 3568 2992 -4227 -3756 3727 1953 -5032 -2449 5680 2994
2961 2994 -5399 -3216 4179 421 -4258 2082 4717 -1967 -6725 1213 6011 -274 -3771 3129 3562
2976 3562 -4912 -6594 3804 8763 -411 -5544 -1761 621 -155 1532 2210 -2044 -1993 3045 3322 -5391
2992 -5391 -5367 4850 7726 -3498 -9075 -45 6747 477 -5339 531 4700 -845 -5190 -181 4197
3007 4197 573 -528 346 -2272 -3011 1592 4617 -245 -3217 626 2376 -2341 -2705 2627 3504 -3014
3023 -3014 -4137 2748 3133 -3983 -2922 4953 3655 -4274 -4776 4112 2456 -3149 -2438 3557 1531 -3249
3039 -3249 -1280 2475 964 -133 1222 473 -3279 -882 4319 75 -5474 -968 5430 1942 -6059
3054 -6059 -2669 7224 3569 -6547 -3142 5266 3896 -3773 -2603 1512 2375 1111 -986 -1744 -3010
$$ packed form
2946D789j1841M990N175m101k336O892n76p219M71P483j774o985K583Q129k686
2961B994q393K183P395l758m679O340K635o684m758P938M798o285l497O900M33
2976C562q474j682J0398M959r174n133L783K382p76J687O78m254N1N038K77q713
2992e391K4J0217K876j1224n577R030O792o270n816N870M169n545m345N009M378
3007D197l624j101Q74k618p39M603L025m862k972L843J750m717l64N332Q77o518
3023c014j123O885L85p116J061P875j298p929n02Q888j656n605P11N995k026m780
3039c249J969L755j511j097J355p49l752K397N201m244n549M506O398l488q001
3054f059L390R893l655j0116L405Q408j370p669J170M115Q63j264k097p58j266
$$ plain form
3069 -3010 1805 4315 -1878 -5319 343 5529 258 -6413 -721 5392 -164 -5158 -181 3021 -1133
3084 -1133 -3928 2587 3781 -1640 -3542 1107 3217 -1543 -3366 591 2022 -295 -1243 -158 -1040
3099 -1040 509 3215 1147 -3830 -1901 4157 1715 -5627 -3433 5897 5702 -3697 -5723 1238 4610
3114 4610 -672 -3933 347 2893 292 -2483 -1262 1190 2622 2975 -1537 -3890 1371 4433 -126
3129 -126 -4743 -224 5232 1042 -5069 -1607 5198 4212 -2746 -3589 1598 1477 -1607 -2955 67 2852
3145 2852 32 -1514 -1991 766 3002 746 -2216 -2077 1823 1776 -1338 -1276 1141 2362 -1137 -2627
3161 -2627 1222 2637 -548 -3902 -333 3250 1389 -3431 -805 3206 3296 -1720 -3878 714 2934
3176 2934 1863 -2538 -1914 2634 4438 -192 -4931 -1640 4829 3304 -3658 -5504 1320 4997 -566
$$ packed form
3069c010M815K510o193l441N662N186n271o671N692O113n556m994M977L202m154
3084a133k795O515J194n421j902M649K110m760j823L957J431k317r48J085q82
3099a040J549K706k068m977J929O058k442p342K194R330j95r399k026O961L372
3114D610n282l261M280K546k601k775J221K452J432L53m512k353N261L062m559
3129a26m617M519N456m190o111L462O805r86o958q43N187j21l084j348L022K785
3145B852k820j546m77K757K236k256k962J39L900m7l114O2K417J221l499j490
3161b627L849J415l185l354L569L583j861m820K626M011R0n016k158M592K220
3176B934j071m401O24M548J804m630m739L291O469j525o962j846O824L677n563
$$ plain form
3191 -566 -5125 -1102 4058 2161 -2456 -2732 1889 2240 -616 -1581 518 2169 372 -3136 -1141 1951
3207 1951 1433 -865 -2525 157 3435 1068 -2862 -379 3248 2446 -3284 -3392 2364 4144 -820 -3319
3223 -3319 -378 3139 1657 -1387 -1446 907 1516 -1448 -2059 251 2197 987 -2739 -2628 487 1977
3239 1977 -1569 -2123 856 4485 -115 -4631 -1389 3618 2535 -4051 -4180 1696 4608 -139 -3389
3254 -3389 -1966 3011 2497 -2002 -3430 -53 4060 1370 -3594 -1924 3115 4241 -961 -4033 1258
3269 1258 3517 117 -2749 -600 1989 1236 -2448 -825 1155 664 -1989 -1931 727 1770 455 -1948
3285 -1948 -423 1660 1510 -2641 -1720 1645 3448 -713 -4193 -1139 2384 1965 -2954 -2945 912 3060
3301 3060 -1041 -3870 -533 4174 1943 -3181 -3379 73 2589 -682 -1515 -287 3051 813 -2845
$$ packed form
3191e66m559M023N160j897m617k76M621L51k856r65K099J651j797l508J995L092
3207A951n18k298j660K682L278k367l930K483L627q02n730j08N756J780m964k499
3223c319K941L517j482l044n9K353O09k964o11K310J946j210l726J11L115J490
3239A977l546n54K979L629m600m516L242N007j083o586j29N876K912m747l250
3254c389J423M977n14m499j428L377M113k690m964J670N039J126n202l072N291
3269A258K259l400k866K149K589p53l684J623J980m91k653N8K658J043j315k403
3285a948J525K083j50m151R21L365J803m161l480L054L523m19m919RL857K148
3301C060m101k829L337M707k231n124j98L452K516l271q33J228L338k238l658
$$ plain form
3316 -2845 -1537 1667 3084 -624 -2159 73 2632 1623 -2699 -2234 1806 2729 -2067 -3355 1092
3331 1092 3799 1086 -3100 -1520 2191 1989 -1649 -1625 789 2213 -57 -2548 -702 1358 1151 -1022
3347 -1022 -2020 -406 1336 152 -1439 682 1995 646 -766 -2938 971 1969 -914 -1821 1281 3055
3363 3055 -800 -3820 -1042 3579 1741 -2513 -1902 664 1816 -49 -2081 -65 1792 874 -1535
3378 -1535 -2752 -3 2484 1505 -2151 -2990 353 3058 -989 -1713 319 2450 -602 -1744 622 2175
3394 2175 -862 -1598 912 927 562 -629 -521 757 974 572 -1154 -1825 -510 2327 1945 -2270 -1323
3411 -1323 2505 851 -2691 -1284 4270 3263 -3972 -4087 1290 1544 -698 -778 1197 -174 -2347 -34
3427 -34 822 -886 -1998 1212 610 -2766 -719 2890 179 -3101 -328 3912 -686 -5885 482 4471
$$ packed form
3316b845J308L204J417l708j535K232K559j009m322M65M040R23m796j288M447
3331A092K707k713m186J580L711k02l638K4K414J424k270k491J846K060k07k173
3347a022r98J614J742j184j591K121J313j349j412k172L909R98k883r07L102J774
3363C055l855l020K778M621j838m254O11K566J152j865k032K016J857r18k409
3378a535j217K749K487r79l656q39L343K705m047p24K032K131l052j142K366J553
3394B175l037p36K510J5l65j191J08J278K17m02j726o71J315K837l82m215R47
3411a323L828j654l542J407N554j007p235j15N377K54k242q0J975j371k173K313
3427c4Q56j708j112L210o02l376K047L609k711l280K773M240m598n199O367L989
$$ plain form
3443 4471 759 -3720 -380 4133 330 -2905 65 2940 -259 -1761 -76 550 -1492 923 2571
3458 2571 -855 -3562 1231 4690 -460 -3566 1096 4576 -935 -3745 2395 3622 -1940 -1756 2310
3473 2310 3011 -3612 -2684 2725 1524 -2267 -582 3233 544 -2271 575 1920 -1789 -1777 3997 2570
3489 2570 -3151 -2310 2282 1536 -4375 -602 5143 2651 -4652 -1675 2441 1275 -1716 7 2884
3504 2884 -2127 -4192 613 3554 -875 -1607 2139 1286 -3783 -1111 3560 645 -4088 -104 3763
3519 3763 -513 -5536 749 4037 632 -3689 261 2017 -2332 -2223 2601 3743 -590 -2943 -207
3534 -207 -311 -1063 1166 3546 -912 -4616 310 3834 312 -2647 746 2060 -2137 -3483 2072 2378
3550 2378 -830 -1571 2713 1241 -4315 -3230 3381 3055 -1257 -1627 972 -1097 -3348 753 3736 1011
$$ packed form
3443D471l712m479L340M513l803l235K970K875l199j502J685O26k042K415J648
3458B571l426k707M793L459n150l106M662L480n511k810O140J227n562J84M066
3473B310P01o623R28N409j201l791J685L815k689k815K846J345l709J2N774j427
3489B570n721Q41M592p46n911L773N745k492p303K977M116j166k991J723K877
3504B884n011k065M805K941m429p32L746q53n069K672M671k915m733L984L867
3519C763m276n023O285L288l405m321L950J756m349J09M824J142m333k353K736
3534b07j04p52K229K380m458l704M926L524l522k959L393J314m197j346N555L06
3550B378l208p41M284j472n556J085O611l26m312l70K599k069k251M101K983k725
$$ plain form
3566 1011 -1414 -167 673 -3259 -1834 4083 3471 -2954 -3092 950 1566 -1238 -136 2580 463 -2766
3582 -2766 -459 2730 216 -2232 89 2328 -1384 -2597 811 2756 -549 186 1909 -523 -3075
3597 -3075 -948 3825 1526 -2573 -2043 1698 -347 -2089 827 3680 -117 -3281 -1342 1785 -1367
3612 -1367 -2187 2782 2866 -2528 -2456 1841 1817 -1777 -1009 2275 587 -3016 -1440 3548 630 -2133 1545
3629 1545 2236 -2031 -3374 2120 4000 -335 -2593 821 -415 -1959 -529 3022 1252 -2454 -858
3644 -858 2009 -310 -2819 1461 2762 -1345 -2998 1662 2466 -1933 -2528 2225 2611 -3133 -866 2264
3660 2264 925 -3142 -155 3100 49 -3596 160 2628 903 -2883 1215 1704 -1469 -677 1901
3675 1901 748 -2459 -1203 3247 898 -3086 49 2582 -350 -2276 709 1698 -755 -1858 2015
$$ packed form
3566A011k425J247Q40l932J425N917o12o425j38M042O16k804J102K716k117l229
3582b766K307L189k514k448K321K239l712j213L408J945l305P35J723k432k552
3597c075K127M773k299m099N30L741k045j742K916K853l797l164J939L127l152
3612a367q20M969Q4n394P2M297k4l594P68L284j688l603J576M988k918k763L678
3629A545O91m267j343N494J880m335k258L414j236j544J430L551j770l706J596
3644h58K867k319k509M280J301m107j653M660Q04m399n95M753L86n744K267L130
3660B264j339m067K987L255l051l645L756K468j725l786M098M89l173P92K578
3675A901j153l207J256M450k349l984L135K533k932j926K985R89k453j103L873
$$ plain form
3690 2015 1647 -1589 -1871 2325 1756 -1482 -608 2303 -688 -2237 1308 2827 -832 -2919 9 1594
3706 1594 -1702 -1338 2449 2178 -2484 -2409 1820 1769 -913 367 1449 -230 -2521 -763 2579 -324
3722 -324 -1045 1003 528 -2875 -1336 1324 1980 -555 -413 879 -1265 -2929 -360 2409 321 -1210
3738 -1210 -1155 -243 -1298 -460 1795 574 -1032 -1038 487 731 -626 1061 1442 -848 -1062 490 1040 -343
3756 -343 -667 1106 1772 -1366 -1296 -188 134 540 79 449 -1184 -1869 -995 320 968 -66 51 -345
3774 -345 -476 -209 490 -21 -248 -471 456 348 -1494 -876 413 924 -301 -211 -363 -824 -427 171 174 408
3794 408 -44 -470 -576 -75 446 520 -831 436 -23 -270 808 584 -341 -504 -570 346 1187 561 516 -138
3814 -138 -801 -261 796 -790 -67 606 344 -128 -321 -324 1245 256 -827 132 121 -1011 -1115 -786 1132
$$ packed form
3690B015l68l236k82M196n69l238Q74K911k991j549L545J519l659k087K928J585
3706A594l296L64L787k71m662P5M229n1k682J280J082j679k291J758L342k903
3722c24p21K048m75l403J539K660O56k535J42J292k144j664K569K769k088j531
3738a210N5R12j055Q38K255j221j606oJ525K44j357J687L81k290k14J552N50j383
3756c43l24J773O66l138P0J108L22M06m61L70j633o85Q74J315O48j034J17l96
3774c45j31K67O99n11k27k23R27j08j842O18J289N11j225R0j52m61L97N98LK34
3794D08m52m26j06N01N21P4j351J267m59k47J078k24r25j63o6R16Q41o26m5o54
3814a38o63N40J057j586P23O73k62m72j93lJ569r89j083R59j1j132j04L29J918
$$ plain form
3833 1132 268 810 -36 -1074 -316 -581 962 -316 -851 -663 -49 410 1062 671 -396 1244 44 468
3851 468 -381 -66 -1029 161 -77 60 -649 146 -594 -315 995 845 382 -51 251 -648 682 459 1425
3870 1425 814 -829 -1098 654 1021 123 -560 -68 -237 -677 387 -364 365 698 -539 61 111 -253 -856
3889 -856 -107 469 -94 692 -456 83 -722 355 -28 -591 -393 655 626 -1320 -620 -106 482 176 -888
3908 -888 -612 254 508 -421 439 -714 -255 -361 409 -1477 229 1395 1248 -464 -669 -321 36 600
3926 600 586 -191 896 -149 70 290 129 -1116 -702 583 549 -174 -492 -394 214 639 -953 -853 -594
3945 -594 460 -366 -118 -98 101 336 373 -1099 -961 896 1116 -1309 -768 -687 1141 -515 -1369 209 460
3964 460 -189 -498 702 -418 -382 -355 461 343 298 -503 -613 -587 235 415 212 -306 219 872 -218 -645
$$ packed form
3833A132q64N42q46j038P58k65J543j278n35J88O14M59O52l91j067J640j200M24
3851D68q49L15r63J190k38J37p09P95p40K79J310j50m63m33L02q99J330k23R66
3870A425o11j643k69J752L67q98o83M92j69m40J064p51P29L33j237O00N0l64o03
3889h56P49N76n63P86j148N39q05J077l83n63J98J048k9j946P00N14N88l06j064
3908h88K76Q66K54r29Q60j153M59j06P70j886J706J166j47j712k05L48L57N64
3926F00j4p77J087j045K19K20j61j245M14J285l4p23l18R8O08M25j592J00K59
3945e94J054q26K48K0J99K35L7j472J38J857K20k425N41Q1J828j656q54J578K51
3964D60o49l09J200j120L6K7Q16j18m5q01j10K6Q22J80k03n18N25O53j090m27
$$ plain form
3984 -645 -42 1674 888 436 -860 -278 593 -1402 -468 847 274 58 144 -687 -418 -252 1410 -874
4002 -874 -798 -374 890 -91 -1441 358 735 -341 -1236 962 251 -160 -281 846 761 -64 -126 1315 447
4021 447 329 -169 -370 1120 31 602 -420 -1227 -662 524 939 -1554 -746 307 1423 -388 -1140
4038 -1140 -85 753 -490 -373 1582 400 306 365 305 -155 121 667 -339 -521 -643 1361 18 -214
4056 -214 -975 1126 -638 -1510 -562 2327 666 -1884 -397 1230 877 -1164 -1211 455 807 625 -285
4073 -285 -343 -711 -960 1389 -363 -1439 -773 1701 311 -1174 428 1564 257 -1285 70 296 -821
4090 -821 -932 -505 530 -1260 -725 912 258 -608 -245 168 360 -593 272 1429 -25 -1523 1114 1433
4108 1433 -887 -968 593 730 -1218 -1932 1277 1286 -406 -1266 -245 114 -63 268 433 -582 -1639 -403
$$ packed form
3984f45O03J716p86m52j296N82Q71j995R34J315n73k16Q6q31K69J66J662k284
4002h74P6M24J264r81j350J799L77j076q95K198p11m11j21J127q5q25o2J441q68
4021D47j18m98k01J490j089N71j022q07N65J186M15k493Q08J053J116j811p52
4038a140J055Q38j243J17J955j182r4N9o0m60K76N46j006j82j22K004j343k32
4056b14p61K101j764q72R48K889j661k550J487J627l53k041m7J666L52j82r10
4073b85n8l68k49K349j752j076O66K474j390j485J602J136j307j542J355K26j117
4090h21j11M27J035j790N35J637o54q66L63M13J92r53Q65J157j454j498K637L19
4108A433k320q1J561J37j948p14L209Rj692q60J021L59j77L31J65j015j057J236
$$ plain form
4126 -403 273 -767 -321 1096 1217 -678 -1191 277 801 -445 -283 1491 190 -309 -864 2343 1596
4143 1596 -642 -409 1143 -579 -1608 -1359 735 -624 524 690 -1287 -1191 63 2501 106 -1439
4159 -1439 -678 1577 -382 -1359 352 2461 -191 -1984 -359 220 -408 -883 583 813 -1459 -2033 -363
4176 -363 1476 -298 278 -12 149 -1336 -62 1462 576 -816 -219 1319 -1522 -2477 1050 2331 740
4193 740 -2698 -138 1858 -79 -678 664 1290 -907 -1574 786 1542 -772 235 2068 -467 -1582
4209 -1582 -358 725 49 -1388 859 739 -2137 -2255 1523 1376 -830 -1814 1540 255 -1895 -1541
4225 -1541 1762 1001 -911 -561 1094 131 -1011 1576 1174 -1621 -1567 1086 2372 13 -2132 1748
4241 1748 620 -1337 -299 2905 626 -1901 -526 1998 84 -1884 164 2275 -418 -1514 367
$$ packed form
4126d03O76j040M46J417J21j895n13J468N24j246J62J774j301m99n55L207p47
4143A596k238K33J552j722j029K49K094j359J148J66j977R6J254K438k395j545
4159a439P61K255j959r77J711K109k652j793J625N79o28m75J466K30k272n74J670
4176c63J839j774N76k90J61j485J274J524q86j392N97J538k841r55L527J281j591
4193G40l438K560J996j937n99J342O26k197o67K360P56k314J007J833k535j115
4209a582J224J083o76j437K247j20k876j18L778j47k206r84L354j285k150L54
4225a541L303p61j912L50J655r63j142K587m02k795N4K653J286k359k145L880
4241A748j128j957J038L204k279k527J375K524j914j968K048K111k693j096J881
$$ plain form
4256 367 1098 -653 -1024 1775 1140 -1590 -704 675 941 -1115 900 1649 -1146 -2612 632 4047 412
4273 412 -1646 -578 863 -1402 -223 2869 1899 -1933 -1269 1686 894 -1247 345 1761 -238 -1796
4289 -1796 262 1124 -53 -745 1214 814 -2089 -1765 1726 850 -465 1084 1531 -699 -2828 -350
4305 -350 1359 1584 -1491 -353 639 -825 -616 1785 2095 -1257 -2020 791 408 -1459 -188 2025 881
4322 881 -808 420 381 -361 -872 637 1330 -1215 -1143 -167 619 281 246 1337 182 -2068 -1499 -158
4340 -158 1959 525 913 164 -593 -1044 290 1250 376 -776 235 110 -259 -270 615 -164 57 697 -698
4359 -698 -121 -338 1163 1259 816 -1208 -604 -412 586 373 225 -796 -417 -824 -497 351 -200 618 -397
4378 -397 -871 223 314 730 911 -730 -993 -432 24 607 -332 1031 758 290 -783 -698 1018 922 -182
$$ packed form
4256C67P31j751l71K799o35k730Q86J379K66k056K015P49k795j466L244L415l635
4273D12k058J068J441k265J179L092r70l832O64K955p92k141J592J416j999j558
4289a796K058Q62j177o92J959m00k903L24L491q76j315J549M47k230k129K478
4305c50J709K25l075J138R92j464K09K401L10l352p63K811l83j867J271K213j144
4322H81j689J228l9p42n11J509O93k545P2R76P86l38l5J091j155k250N69J341
4340a58K117j434L88p49p57m51J334R60q74j152J011j25l69j1Q85p79K21O40j395
4359f98N77k17J501R6m43k024O04J92R98k13j48j021L79m07L27Q48n51Q18j015
4378c97m74J094R1M16J81j641k63N61M56N83r39J363k73m68j073Q5J716r6j104
$$ plain form
4397 -182 1369 1453 85 -1697 -1132 2117 408 -120 39 -457 -403 -568 -119 -439 -1284 281 616 -807
4415 -807 -308 1421 74 -234 -259 714 1070 -980 -478 789 1562 -328 -799 349 -386 -615 252 1179
4433 1179 -263 351 -155 -682 -265 -353 968 -43 -1170 536 833 321 -1305 -390 537 263 -1282 -861
4451 -861 1183 -298 -706 1421 446 -505 -536 -901 363 -101 -285 200 -82 -1662 225 497 -197 -331
4469 -331 90 701 34 -1518 -451 1009 88 -622 761 731 -252 -419 -294 1033 2018 -157 -63 -970 -176
4488 -176 679 1191 -167 -437 772 -704 -1395 -1578 293 -655 -374 -400 1302 738 -258 -284 403 1209 -269
4507 -269 -176 -225 324 681 -156 -666 -171 146 67 2 -423 746 -189 -960 -1864 -92 538 342 -16 -1055
4527 -1055 -385 1283 -323 -1074 -569 1103 662 -392 319 -354 11 -474 -158 866 41 -959 -892 -1019
$$ packed form
4397a82J551Q4j368j782N65L249j709n28J59m96N4j65M49l20q45J565L35j423
4415h07M99J729j347l08k5R73L56k050N02J267P73j890m71J148p35k29Q67R27
4433A179j442O14n06n27M17q8J321j011j127J706K97n12j626R15R27k74j545M21
4451h61K044j481m08K127r75r51l1l65J264m64j84M85k82j580J887K72o94j34
4469c31M21O11o67j552J067J460r21p10J383l0r83j67J25J327R85k175R4r07P94
4488a76Q55N12j358k70J209j476o91j83J871r48K81k6J702n64r96k6O87Q06j478
4507b69R3m9N49L57q37n10M95L17p9o5m25J169r35p71r04J772O30j96l58j039
4527a055O70J668j606p51N05J672m41j054P11o73L65m85L16J024q25j000O7j27
$$ plain form
4545 -1019 783 552 -755 618 179 851 147 -510 -324 134 771 -1218 -416 257 182 367 -678 -588 905
4564 905 -158 -1617 -474 -15 806 472 90 6 -167 286 953 385 -614 415 -113 -611 -272 238 233 -614
4584 -614 -887 1341 504 -740 -1050 823 857 -798 -1345 -340 263 -569 -356 437 -180 25 -106 1296
4602 1296 -185 268 497 438 -829 298 505 64 -1249 803 1689 -372 -833 193 598 911 -219
4619 -219 -605 202 652 -84 -436 20 432 347 -852 -1130 720 358 433 -169 -1828 346 1041 324 -1246
4638 -1246 189 830 -350 -291 -121 35 -273 -1053 -235 278 1073 -124 -806 68 245 336 -200 -466 -146
4657 -146 555 -497 40 -190 508 487 -363 661 1099 656 -1633 -869 1167 902 49 -1211 -611 92 -812
4676 -812 225 -399 212 431 652 -407 -1033 -700 1194 901 -1432 -149 808 338 -1210 312 1012 -442
$$ packed form
4545a019J802k31j307J373m39O72p04o57J86M58O37j989Q02O73p5J85j045R0J493
4564I05j063j459J143M59Q21l34l82q4j73M53O67n68r99J029n28m98L39N10nq47
4584f14k73K228q37j244l10J873L4j655n47J005O03q32K13P93o17K05j31J402
4602A296j481M53K29n9j267J127K07m41j313K052Q86k061m61J026M05L13j130
4619b19l86Q07M50p36l52M56M12q5j199k78J850l62P5o02j659K174O95p17j570
4638a246J435O41j180N9J70J56l08p80Q18N13P95j197o82Q74J77R1n36k66L20
4657a46P01j052N37k30O98k1q50J024M38m43k289P64K036k65q53j260O00P03r04
4676h12J037o24O11K19K21j059o26L33J894k93k333J283R57m70j548J522P00j454
$$ plain form
4694 -442 -209 -401 1045 605 -401 -267 479 418 -186 -833 -416 -222 -68 -753 511 -147 508 601 -332 -1344
4714 -1344 356 1156 -545 -1901 122 758 727 -976 -331 -450 214 -1026 -140 1189 -478 -905 188
4731 188 -338 153 586 334 -237 -573 1042 966 97 -822 754 492 -926 -1617 488 989 -988 -811 107
4750 107 -96 -721 -1500 -144 1548 504 -536 239 -713 -99 514 770 -1371 -229 965 163 -762 -610
4768 -610 973 683 -1339 -1492 1091 -196 -357 -1321 820 711 -396 -742 295 942 -135 359 -105
4785 -105 -212 -942 -258 424 -596 -337 973 303 -994 -229 1286 374 -1199 154 653 99 -532 -327
4803 -327 1043 263 -1077 529 583 -816 -220 1068 325 -1358 -302 1351 370 72 -176 580 306 -954
4821 -954 1191 2675 -379 -1189 507 931 -703 -1672 900 1371 -262 -732 134 320 -234 -586 1091
$$ packed form
4694d42K33j92J446m40j006J34P46o1o04o47M17J94J54o85J264o58O55R3r33j012
4714a344J700Q00j701j356K023O36l1j703O45j19O64j240Q86J329j667m27J093
4731A88n26M91M33k52n71l36J615p6q69r19J576k62j418o91K105N01j977J77R18
4750A07k03o25p79J356J692j044j040P75r52O14O13K56k141J142J194q02r25J52
4768f10J583k90k022j53K583j287j61r64K141j09j107l46J037O47j077M94m64
4785a05j07p30O84O82j020K59J310o70j297P65J515r12j573J353M99n54o31K05
4803c27J370p80j340J606N4j399N96J288p43j683J056J653r81k98k48P56k74j260
4821i54K145J484l054q10J696M24j634r69K572M71j633m70Q66J86n54l52J677
$$ plain form
4838 1091 -324 -807 -218 987 -304 -1244 351 654 97 -704 228 1130 -817 -90 1176 218 -1417
4855 -1417 589 1554 630 -1613 -1130 68 -556 -690 1177 1910 -890 -363 -259 -237 -1840 -237 1453
4872 1453 177 -1218 -696 1426 333 -435 -122 1373 390 -1442 -275 395 185 -794 1384 939 -949
4889 -949 118 83 997 -866 -63 -1193 -466 -326 1249 1635 -155 -1615 -41 650 -96 -517 564 1024
4907 1024 -1104 -646 199 690 -475 109 -92 792 -940 -161 -67 -28 999 798 79 -649 -746 1714 895
4926 895 1030 627 38 -127 -270 355 1147 946 -569 -167 -315 -860 -682 135 -43 1169 -76 -547 -128
4945 -128 -199 -214 668 298 705 214 768 174 1347 712 1051 -538 -1096 -133 1085 886 69 -591 566
4964 566 -22 -1302 653 329 864 -1394 -239 297 -154 -650 -483 633 714 -539 370 -88 334 177
$$ packed form
4838A091j415m83N89J205j291r40J595L03n57q01R32R02j947P27J266r58j635
4855a417K006R65r24k243M83J198o24j34J867P33k800N27J04K2j603J603J690
4872A453j276j395N22K122j093p68L13J495r83j832J167O70k10r79K178m45j888
4889i49J067l5R14j863Q03j130P27J40J575L86j790j460J574O91p46m21J081M60
4907A024k128M58Q45M91j165N84k01Q84j732P79R4L9J027k01p19p28r7K460q19
4926H95J35m03n89j65j43O25P92k01j515M02j48n45J78Q17j78J212j245m71M19
4945a28p1j5Q82l70M07m91N54n94J173o35L39j589n58R63J218j99q17o60J157
4964E66n88j280J955l24N35k258J155N36m51m96J67J116Q1j253R09m58M22j57
$$ plain form
4982 177 1243 -84 -787 -754 266 773 22 127 625 -60 -1279 -739 1147 1276 -211 -1410 -581 -661
5000 -661 -107 -367 1705 115 -559 836 932 -354 -314 -624 363 419 496 164 178 -96 838 1003 622 296
5020 296 -217 1062 -239 -84 -164 655 -97 -1557 69 268 1091 -175 -649 120 893 -215 -631 161
5038 161 -131 181 853 -110 -522 -306 141 124 819 766 106 -522 -899 651 223 401 -999 484 374 -694
5058 -694 -429 662 68 -1162 245 -226 311 657 -229 -437 399 66 -482 -652 -285 256 -16 -239 -99
5077 -99 -1032 236 840 153 -284 55 869 315 -1501 688 1244 449 -285 -185 850 813 -589 -417 809
5096 809 574 -70 -84 -1136 -428 598 900 178 -632 -705 280 -223 -562 1215 1093 187 -966 -901 528
5115 528 333 76 480 870 -499 -1225 422 710 653 -397 364 -442 305 -289 566 -659 -237 761 -399
$$ packed form
4982A77J066j327p03L3J020N07p51J05M98o85j219N40J886J29j487j199Q29q0
5000f61N54k60K072j590o74J395R6j286M0l10R87N6P7l32J4k74R34J65l81l26
5020B96n13J279j301J55q0Q19p52j460J626J99Q23j266m74P69P73j108m16P92
5038A61k92L12O72r63m12K16M47j7O95n3o60o28l77J550m28J78j400J483j10j068
5058f94K65J091n94j230J407m71N37L46q86k08Q36l33n48j70L67N41k72k23J40
5077i9r33J268O04o87m37L39Q14n54j816K189N56p95p34J00J035l7j402J72J226
5096H09k35o44j4j052P08J026L02p22q10p3R85n03l39J777j22r06j153O5J429
5115E28j95k57M04L90j369p26J647K88n7j050P61q06P47n94Q55j225M22R98j160
$$ plain form
5134 -399 -1558 -1008 528 647 -816 -849 113 -92 -880 -935 923 593 -349 -699 62 1044 -466 552 343
5153 343 -976 -357 930 -532 -977 484 1270 -108 -1122 585 867 207 -1608 -547 -403 -22 -1656
5170 -1656 -615 1033 211 -494 592 312 -221 15 236 -431 -398 470 613 -666 -625 214 769 -904 -969
5189 -969 827 490 -598 -255 81 666 -418 -1431 1400 1199 94 18 -536 0 -228 688 481 -26
5207 -26 1126 1150 280 -1361 -183 666 64 -1084 -998 520 1424 -373 -739 398 334 328 -820 599 51
5226 51 93 -100 231 1294 936 -574 -563 -317 -319 618 194 -1396 99 413 -798 -139 -415 335 -261 -766
5246 -766 -276 1349 -780 -160 534 265 -175 10 -408 -436 475 429 442 515 -106 -43 -183 228 38 665 -117
5267 -117 -36 10 647 700 -421 -994 -291 83 -178 -1156 -491 149 128 -152 -451 1132 963 476 -897 -844 162
$$ packed form
5134c99j159N50J536J19j463l3R62k05p88n5J858l30r42l50P61R82j510J018k09
5153C43j319O19J287j462m45J461P86j378j014J707K82o60j815J061J44L81j634
5170a656J041J648q22p05J086k80n33K36K21o67L3Q68J43j279M1Q39N55j673o5
5189i69J796l37j088L43L36N85j084j013K831k01j105p6n54N36k28R16k07n07
5207b6J152K4q70j641J178Q49o02j148Q6J518R04j797l66J137o4oj148J419n48
5226E1M2j93L31J063l58j510J1K46kR37m24j590J495L14j211O59k76P50n96n05
5246g66M90J625k129O20O94k69m40J85m18k8R11m6J3P3o21O3j40M11j90O27p82
5267a17Q1M6O37N3j121n73P03L74k61r78O65O40k1k80k99J583j69m87j373N3J006
$$ plain form
5288 162 220 -490 -832 -564 191 335 81 -473 407 849 -457 -11 50 612 74 -755 -142 -482 -2 -1039
5308 -1039 307 304 -195 -876 -958 -224 -66 -577 -462 -14 -270 -449 -642 -134 321 -886 323 -1022 -56
5327 -56 241 238 783 -239 -301 -127 64 92 -76 508 129 -368 56 375 14 742 -72 -221 585 470 -307
5348 -307 504 164 -99 -212 -1152 -508 -484 -150 392 -192 136 -369 -371 -747 859 711 -594 -956 -354 -309 223
5369 223 497 -294 773 90 1 -182 -299 -541 305 491 558 75 90 -210 -892 298 -276 -376 -819 368
5389 368 21 -212 -743 -593 855 921 43 -325 -87 -143 8 29 -690 647 1320 426 -750 154 314 244
5409 244 -497 -479 354 793 -557 -282 713 693 -245 -306 -27 -524 551 191 -448 -293 -788 -211 98 241
5429 241 -30 -210 1023 -84 990 -33 74 10 266 375 829 534 343 1109 1153 610 -371 -202 139
$$ packed form
5288A62N8p10l42K68P55J44k54n54Q80M42j306M46O1N62n38q29O13l40M80j037
5308a039J346lm99o81q2P34J58n11J15M48k56j79j93N08M55j207J209j345R66
5327e6K97lN45j022o2J74J91K8j68N84l79m97M24L19l61P28q14j49Q06j15p77
5348c07Q11l40k63j13r40O44K4L34N42n84L28n05kl76J606j48j305l62O02M5N32
5369B23K74p91J067o83q9j83j17k42Q46J86O7m83J5l00o82J190n74j00m43J187
5389C68l47k33n31J50J448O6q78l68K38n6J51K1p19J337O73q94j176R04J60p0
5409B44p41J8Q33M39j350K75R95k0r38o1K79m97J075l60o39J55m95N77L09J43
5429B41k71j80J233j107J074j023J07o4K56J09M54k95j91P66M4n43r81J69L41
$$ plain form
5448 139 316 330 43 319 645 -833 774 19 -785 219 -919 675 1164 -395 17 82 345 500 -92
5467 -92 -401 796 268 -324 -1240 -63 -911 348 426 -553 -533 670 -88 150 330 434 81 -623 -531 -949
5487 -949 340 173 -12 -529 -258 901 -764 362 431 375 757 -142 -292 805 -232 -473 274 282 378 314
5507 314 224 521 -104 -101 -189 -595 -108 101 98 263 16 43 -227 -15 -450 -113 368 402 -541 -321 48 -431 -757
5530 -757 126 406 814 -376 433 483 587 -149 -774 -7 310 316 -177 -710 8 539 -451 -485 -406 -946 247
5551 247 -796 -403 383 569 772 -376 -695 -26 -245 1 -253 -351 -343 287 -277 -499 -221 -686 758 1180
5571 1180 567 1058 -309 -102 98 113 -266 -1386 6 535 -742 279 -1491 213 -100 265 918 -734
5589 -734 -746 -453 -401 -417 371 356 -481 -1413 709 -131 577 760 -188 -76 805 -397 -758 23 191 436 572
$$ packed form
5448A39J77J4k87K76L26j478J607p55q04J004j138J594M89j559M12O5K63J55n92
5467i2l09J197n28n92r16J177q48J259P8r79K0J203p58K38J80J04l53p04R2m18
5487i49J289j67j85n17K71J159j665J126O9n6L82q99j50J097j037k41P47QR6o4
5507C14r0K97o25Lq8m06M87K09lJ65k47K7k70K12m35L37M81L4r43K20L69m79l26
5530g57Q83K80M08j190Q09N0J04p36o25P67L17Om93n33P18N31r90l4P9n40J193
5551B47j043L93P86J86K03j148l19O69k19K46k54r8QO30n64k22K78m65J444M22
5571A180o13M91j367K07K00J5l79j120J392N29j277J021j770J704l13L65O53j652
5589g34j2K93N2j6P88j5q37r32K122q40P08J83r48J12Q81j202l61P81J68K45J36
$$ plain form
5610 572 71 -611 -133 -321 -153 693 -60 -319 -271 445 11 -11 -167 526 -806 454 -565 -559 849 430
5630 430 103 694 556 -60 -320 193 944 -393 59 -298 -147 -312 189 355 -114 306 172 135 -756 334
5650 334 90 -557 89 750 207 -387 -879 884 380 65 138 434 -322 552 -234 679 245 -505 237 808
5670 808 763 -469 82 607 -394 -767 -353 -125 310 -145 265 -172 -562 -921 137 2 -369 1262 167
5689 167 80 67 808 661 -1007 -647 926 749 -460 -70 723 229 -1176 -174 -140 273 -564 -126 569
5708 569 297 -28 955 -892 -1179 -92 -73 449 66 598 303 -318 316 -245 492 663 -654 386 -486
5727 -486 346 -1007 515 627 -253 250 404 -39 323 235 255 10 -870 677 1 -313 -568 654 371
5746 371 12 -308 -38 378 297 333 379 618 -1050 383 588 -38 -257 988 384 -593 -722 8 630 533
$$ packed form
5610E72n01o82M78j88J68Q46p53k59M8P16m34k2j56O93j332J260j019OJ408m19
5630D30l27N91j38o16k60N13P51j337M52l57J51j65N01J66m69M20j34l7q91J090
5650C34k44o47O46O61n43n94m92J763n04l15P3K96p56Q74p86R13m34p50P42N71
5670H08m5j232N51N25j001l73M14K28M35m55M10m37l90l59J058j35l71J631j095
5689A67q7j3P41j47j668L60J573j77j209L90P93m94j405J002L4M13q37M38O95
5708E69k72l25R83j847k87J087J9N22l83N32k95o21O34n61P37J71j317J040q72
5727d86Q32j353J522J12q80N03J54m43L62q8K0k45q80J547o76l14k55J222k83
5746C71l59l20K70M16q1L6M6K39j668J433K05o26k19J245o04r77j29P30O22r7
$$ plain form
5766 533 218 15 330 -842 274 802 -14 -237 214 -98 36 -117 -264 601 -321 -252 -28 -292 -127 -1677
5786 -1677 349 1240 -593 -572 334 1073 -386 -144 707 -336 -526 -61 -77 513 75 318 642 -203 -1
5805 -1 402 -793 -97 -475 -42 165 51 -57 -249 391 300 1002 242 -81 -532 -187 337 -736 -37 -68 -370
5826 -370 76 558 601 83 -65 -692 -139 -305 791 389 524 -132 -287 70 505 -139 -27 556 986 -44
5846 -44 -241 -109 595 -678 -117 -195 360 599 184 365 269 -108 14 -236 916 60 -161 -171 364 -377 46
5867 46 -53 -239 -160 -366 20 -100 592 -224 -183 -565 -62 259 1063 65 -703 -321 46 -763 -323 -102 220
5888 220 516 -484 -220 653 -459 569 -316 -503 286 971 206 -419 534 924 251 -650 -931 245 125
5907 125 -391 820 -467 -295 -454 -591 433 298 40 -6 -186 107 -799 439 31 -1064 -358 820
$$ packed form
5766E33l15k03L15j172J116N28q16k23M51l12J34j53j47Q65r22O9K24k64J65j550
5786a677K026Q91j833K1R06P39j459K42Q51j043j90M65j6N90m38K43L24q45K02
5805aM03j195O96l78M33K07j14j08j92O40r1P02p60l23m51L45N24j073O99l1l02
5826c70M46M82M3n18j48o27N53j66J096m02J35o56j55L57M35o44J12N83M30j030
5846d4j97J32P04j273N61p8N55K39m15J81r6l77J22k50J152q56k21j0N35p41M23
5867D6r9j86P9k06L86j20O92q16M1l82N03L21Q04r98p68L82L67q09M40K21L22
5888B20K96j000K64Q73j112J028q85j87P89O85p65o25R53L90o73r01k81J176j20
5907A25n16J211j287J72j59j37J024j35k58m6j80K93r06J238m08j095P06J178
$$ plain form
5925 820 380 492 -717 -811 -211 -804 229 -285 170 -414 180 353 355 403 441 -249 47 -693 961 729 138
5946 138 390 544 350 312 -122 714 -967 -901 624 308 -223 -996 -536 -521 -229 -621 -72 -320 -140 90
5966 90 381 -410 -625 -291 -181 -154 531 710 651 -219 52 97 771 -251 85 -441 551 -206 -764 -20 -94
5987 -94 -653 493 1095 -311 -643 607 426 -344 10 -523 -29 266 269 -563 462 127 -614 -411 -102 77
6007 77 514 385 416 -142 -610 -77 601 -79 654 -161 -535 -710 -129 227 -422 642 503 231 33 -844
6027 -844 -72 246 -104 189 345 97 350 -108 -324 -413 -333 462 1 170 7 -149 -226 788 -7 356 263
6048 263 -141 169 -150 -413 -130 -171 -627 -553 -202 285 136 -729 -503 80 514 -493 132 -298 265 -426
6068 -426 193 277 -720 -36 556 28 -544 -425 -596 731 597 -287 265 895 695 653 -814 58 31 119 -327
$$ packed form
5925H20m40J12j209r4O00n93J033n14M55n84N94J73KM8L8o90K96p40J654k32n91
5946A38K52J54j94l8m34Q36j681O6J525l16n31p73M60J5K92l92N49k48J80K30
5966I0K91p91k15L34J10K7O85J79n9q70K71M5O74j022L36n26R92p57n58P44p4
5987i4n59J146O02j406l32J250j81p70L54n33M94K95Lq32J025l35p41K03L09J79
6007G7M37j29L1n58m68N33O78o80P33q15l74j75N81L56o49J064j39k72j98q77
6027h44P72L18l50K93J56k48K53m58k16q9Q0P95m61J69j63j56p7J014p95L63r3
6048B63m04L10l19k63K83m1m56P4L51M87j49q65K26N83M34j007O25m30N63o91
6068d26O19Q4r97O84N92n28n72J19j71J327j34q84N52O30k00m2j467Q72k7Q8m46
$$ plain form
6089 -327 -107 267 -98 309 228 -216 -895 18 338 723 -799 0 -407 -387 174 -537 751 -223 103 -136
6109 -136 -931 989 102 747 -674 410 407 -70 -344 -279 -245 123 -443 472 434 1369 -1053 354 76 184
6129 184 -180 480 491 -85 283 -841 193 -112 -613 39 856 -343 -335 -119 31 582 565 251 457 159
6149 159 -442 58 281 -290 170 -238 86 -602 220 862 525 274 -20 -685 255 -969 -751 0 -169 467
6169 467 44 -651 314 -249 267 -293 440 97 -1257 1051 -221 -311 78 -196 -402 -408 -348 -442 -392 -126 223
6190 223 -547 167 1093 -231 873 -175 -42 7 277 19 644 -799 -128 -511 -788 258 194 -375 50
6209 50 -1029 343 -165 61 -356 410 -83 790 -140 -16 21 81 -639 -708 -948 -971 933 102 83 -73 1026
6230 1026 -145 321 1039 93 507 -407 -350 -514 325 1379 484 -428 -359 -496 13 319 1404 325 1
$$ packed form
6089c27K20L74l65M07q1m44o79R13L20L85j522P99m07K0N61p11J288r74L26k39
6109a36p95J920q87O45j421J084lm77k74O5L4L68n66R15l8R35k422J407k78J08
6129A84l64O60J1n76L68j124J034l05n01O52Q17j199QK16J50N51j7l14K06k98
6149A59o01N00K23n71M60m08L24o88Q22O42l37k51k94o65R40j224K18P51j69O36
6169D67m23o95R65n63N16n60P33l43j354K308j272r0L89k74k06oO0r4N0K66L49
6190B23p70P14R26j324J104j048J33M9K70k58O25j443O71l83k77J046o4n69M25
6209E0j079J372n08K26m17P66m93Q73r30J24L7O0p20o9k40k3J904q31j9j56J099
6230A026j171M66P18r46M14r14N7j64Q39J054q95r12O9j37N09L06J085j079l24
$$ plain form
6249 1 495 770 817 32 -214 47 644 -57 286 511 -136 -601 -256 290 624 630 -34 -81 -635 -277 -498 222
6271 222 -1010 785 985 -30 603 -273 346 176 -764 14 441 -188 -15 86 100 -758 -681 607 -925
6290 -925 131 65 -190 13 -267 91 692 212 -34 -624 455 110 265 -694 212 -233 -355 275 354 -185
6310 -185 408 639 -785 -1037 -362 276 -77 -325 -725 936 -983 -1023 -577 168 -517 -416 195 679 -103
6329 -103 75 -150 -30 634 168 -17 310 -147 -326 21 -375 -631 -170 -18 -514 -1127 327 72 -50 341
6349 341 349 -517 568 -455 13 -275 -783 -18 169 -50 -1112 -1053 258 400 -1194 78 -204 -278 133
6368 133 1279 353 -228 429 -401 -607 132 -558 1029 -330 -1092 211 421 370 520 -33 -41 153 678 -507
6388 -507 -15 29 -702 -88 -525 -803 -327 -80 -16 -1167 432 -302 -445 280 890 561 -426 135 649 -380
$$ packed form
6249AM94K75M7p85k46K61N97p01L43K25o47m65L45N46L34Oo64m7n54L58k21P20
6271B22j232J795K00j015O33q76O19j70r40P78M27o29J73J01J4q58P7J288j532
6290i25J056o6k55K03k80L58O01m80k46n90J079l45J55r59R06m45j22O30P9n39
6310a85N93K31j424k52O75O38l53k48m00J661j919m0M46P45o85J01O11M84p82
6329a03J78k25J20O64m66j85L27m57j79L47l96k56M61J52m96o13J454k55j22L91
6349C41Qq66J085j023M68k88n08P65J87k19j062N9J311J42j594J272k82p4M11
6368A33J146r26n81O57q30k06P39o90J587j359p62J303K10n1J50n53qJ94N25j185
6388e07M92M4p31O14m37k78M76K47O4j151J599p34j43P25O10l29r87N61N14j029
$$ plain form
6408 -380 147 -80 -263 -1016 -459 99 343 671 -500 -553 638 689 -113 -821 619 518 -1128 -134 454
6427 454 371 1431 -105 477 -657 290 -384 -39 -291 -36 109 -516 518 22 -128 225 -289 -752 209
6446 209 -1 -56 559 353 278 177 283 -163 -806 -760 -449 -133 239 -1026 -24 733 577 -155 -559 41
6466 41 348 85 4 -622 -417 -150 -473 328 -232 498 -588 369 -222 -57 -6 18 -892 -104 -408 -455 322
6487 322 -395 363 40 78 500 73 -272 881 -13 389 435 -291 -666 5 103 454 -265 328 863 495 410
6508 410 593 778 -373 -574 -697 -526 79 368 927 -336 389 -466 113 707 -71 601 342 -239 -356
6527 -356 207 827 547 -307 -204 -841 38 331 -475 908 264 347 653 -210 -12 -39 -339 -33 174 -653
6547 -653 -477 -432 335 -814 -547 -654 112 -90 378 644 10 238 -355 464 156 -417 -76 -355 431 347
$$ packed form
6408c80N27k27j83p53N57N58K44L28j171n3J191N1q02p08J440j01j646R94N88
6427D54q3J060j536N82j134R47o74L45k52K55J45o25J034m96j50L53n14m63R61
6446B09k10n5O15k06p5j01J06m46o43M6L11L16L72j265J002P57j56p32m04O00
6466D1L07k63q1o26K05K67l23Q01n60P30j086R57n91J65N1K4r10P88l04m7P77
6487C22p17P58l23L8M22m27l45J153q94M02M6p26l75O71R8L51p19N93N35l68q5
6508D10J83J85j151k01j23J71O05K89N59j263P25q55N79N94p78O72k59n81j17
6527c56N63O20k80q54J03o37Q79K93q06J383o44Q3L06q63J98k7l00L06K07q27
6547f53J76M5P67j149K67j07P66k02M68K66o34K28n93Q19l08n73L41k79P86q4
$$ plain form
6567 347 -1 -280 -246 -73 -202 -203 -318 -528 175 -641 354 39 110 1345 -273 -518 154 -116 -563 40 -242
6588 -242 -155 283 -115 343 744 -457 507 500 421 21 233 -609 -331 -200 163 -5 -11 97 -551 -732 29 283
6610 283 418 -245 -119 421 262 426 -313 45 -555 524 -193 395 513 -629 518 726 -245 267 -160
6629 -160 -338 601 82 -31 741 319 183 -96 111 63 -51 -876 843 1171 524 -1075 56 503 470 129
6649 129 60 27 76 867 100 -942 727 779 285 602 340 174 -76 316 582 868 197 457 583 168 -279
6670 -279 430 -443 -586 259 416 -166 -44 -529 450 839 -251 -200 -888 -1159 -180 424 -986 -283 539 -485
6690 -485 -279 440 107 1046 -361 -595 575 -713 1080 -502 158 -534 224 198 610 316 -58 746 -244
6709 -244 -110 -908 -723 -58 390 98 54 -555 561 487 -398 725 -123 435 -116 444 453 292 -630 -227 -277
$$ packed form
6567C47l48k79L4J73j29jj15k10P03q16R95l15P1J235j618k45O72k70m47O03k82
6588b42Q7M38l98M58M01j201R64pp9m00K12q42K78J31L63j68oJ08o48j81P61K54
6610B83J35o63J26N40j59J64p39L58o00J079p17N88J18j142J147K08r71N12m27
6629a60j78R39n19j13P72m22j36k79K07m8j14q25J719L28o47j599J131M47l3l41
6649A29o9l3M9P91p67j042J669N2m94L17k62j66k50L92K66K86o71K60J26m15m47
6670b79P09q73j43Q45J57n82J22m85R79L89j090N1o88k71R79O04j410P03Q22j024
6690d85K06P19l33R39j407k34J170j288J793j582O60o92P58k6M12k94l74Q04r90
6709b44J34p98J85O65M48k92m4o09J116p4q85J123q48N58n51N60Rj61r22M03n0
$$ plain form
6730 -277 715 183 -325 501 327 -751 -34 -355 138 -355 933 165 348 -611 377 679 -1082 337 -746
6749 -746 -10 -75 23 -210 184 -119 -821 41 -438 400 -111 484 115 33 373 -127 100 -872 287 -645 -39
6770 -39 207 -317 340 -235 -290 -333 -801 -66 -89 26 20 29 80 457 -182 -588 -725 -733 -179 353 -330 736 -7
6793 -7 -237 -160 114 424 -432 -2 -30 395 401 -150 -371 357 103 144 154 -43 -464 734 -307 193 128 276
6815 276 -490 -150 -872 -1386 -20 -252 -271 -655 -283 115 418 -13 640 -764 500 -703 191 60 -734
6834 -734 -706 661 66 367 -463 -675 571 -484 -185 8 17 240 -402 380 11 -312 396 -354 63 -73
6854 -73 -371 -58 -173 -285 815 499 833 130 -210 -240 -122 603 310 -479 -198 773 125 -10 -34 94 89
6875 89 136 -105 -157 -35 500 -464 606 11 -74 159 -96 723 -206 -280 -37 -480 -216 -594 420 -123 -360
$$ packed form
6730b77R92n32n08Q26j74j078P17l21M93m93J288p68J83r59R88L02j761J419j083
6749g46P36o5R8k33L94l03p02Q62m79Q38n11N95l69q2L40n00K27r72J159r32O06
6770c9K46n24O57n75n5m3m68P35k3J15oRN1L77o39m06j37qN54N32o83J066p43
6793gk30P7K74L10q56M30k8M25On51k21P28k54M1J0j97m21J198j041N00o5J48
6815B76p66L40p22n14J366k32j9l84L72L98L03m31O53j404J264j203Q94j31p94
6834g34K8J367n95L01q30k12J246j055K99J93RK23o42P82l69l23P08p50M17j36
6854g3k98L13j15j12J100l16L34p03l40l0J18P25k93p89K81R71o48j35k4J28n
6875H9M7k41n2J22N35r64J070n95q5K33k55Q19r29p4K43m43K64l78J014n43k37
$$ plain form
6896 -360 -338 -513 106 -522 -486 315 585 -379 329 359 -882 440 234 -162 679 -394 53 -297 -23 -318
6916 -318 579 552 -185 138 -1242 186 -102 193 -1644 -156 101 288 -543 -1325 -392 696 -29 521 377
6935 377 -170 153 693 -476 157 309 248 373 -220 230 185 -325 -450 -487 644 395 -395 -558 902 -170
6955 -170 -1399 876 875 -402 -253 44 -403 -443 -64 -194 -480 176 511 -412 -1021 581 334 -802 -579
6974 -579 -1052 424 702 -280 566 -281 190 -354 -457 115 -26 39 -225 -143 524 361 31 138 94 -271 538
6995 538 -182 374 24 -162 -269 -25 21 515 -112 -293 -540 96 187 199 236 -179 566 -269 316 -396 -610
7016 -610 1601 -263 362 -442 -332 379 180 218 -84 196 -632 244 -198 -237 -95 -629 -27 316 150 -173
7036 -173 542 31 -490 -381 546 -239 -303 176 434 -206 17 396 -199 59 -180 -501 286 -412 202 738
$$ packed form
6896c60K2j75O19o28L6Q01K70r64P08L0j241J322k06l96Q41j073M47l50K74k95
6916c18Q97k7p37L23j380J428k88K95j837J488K57J87q31p82R33J088p25N50j44
6935C77n47L23N40j169O33J52o1J25n93M50m5n10j25l7J131k49p90j63J460j072
6955a70j229K275jj277J49K97m47m0L79j30k86O56L35r23o09J602k47j136K23
6974e79m73J476K78r82Q46q47M71n44j03N72j41O5k64Q2O67j63l30J07m4l65Q09
6995E38p20N56l50j86j07K44M6M94o27j81k47O36R1J2L7m15P45q35N85p12k14
7016f10K211j864O25q04J10P11j99L8l02K80q28Q76m42l9J42n34O02L43j66l23
7036a73P15n11n21J09R27p85o4M79K58o40K23L79n95K58k39l21P87o98O14N36
$$ plain form
7056 738 563 -414 -910 -188 -217 621 -757 -384 334 2 65 -34 -46 -515 -370 -17 615 -174 108 359 542
7077 542 -243 -170 107 -946 -1019 301 -159 655 362 -397 572 -60 446 -156 -563 -55 -205 -213 203 626 659
7098 659 -220 -169 19 502 -302 -268 260 51 678 -214 -798 -638 -186 433 196 -612 -412 124 514 559 87
7119 87 -335 -553 332 519 406 26 -495 683 614 -326 -122 -294 -155 387 -405 75 -317 -608 -59 -295
7139 -295 243 135 -87 -585 100 -581 -33 109 -810 379 -389 484 139 968 -429 -472 256 52 346 -78
7159 -78 -86 -116 -607 57 -675 -680 -42 102 523 -608 247 427 897 396 162 -416 34 -252 550 -263 -105 -548
7181 -548 93 -694 454 767 -50 789 653 -563 802 -322 372 677 -854 -140 -830 -317 -626 253
7199 253 -142 -167 -130 -199 1195 290 742 53 -482 465 110 -151 -474 -160 -118 534 -615 864 -3 -668
$$ packed form
7056G38j75r77m96P22k9Q38j378L73P18l32O3r9j2m69J45L53O32p89K82K51J83
7077E42p85P3K77j053p3J320m60Q14k93p59R69o32N06o02m07N08j50qM16M23L3
7098F59q79N1J88M83q04L4N28k09O27q92n84J60M52O19k37q08K00N36L90M5m72
7119H7m22k18Q85J87j13l80n21J178o9r40K04j72J39N42p92M80l92k91N49k36
7139b95N38j08k22m98O85o81N48J42r19J189p68Q73l45Q29j397m3P28k04K94m24
7159g8ql0m91O64p32nO38J44M21j131Q55J80M70n01k34n78M50k86Q02q13J58m43
7181e48O41p87J148L13q17Q39j36j216J365j124O94L05j531P14o90N13l09Q79
7199B53l95k5L7o9J394r05M52o89n35R47l55k61l23L14M2O52j149J479q67o65
$$ plain form
7219 -668 21 -342 177 336 366 -589 389 -378 95 -261 314 819 -516 -196 492 -603 6 -324 -323 937
7239 937 -513 484 283 105 97 -436 111 577 834 -298 381 -905 165 -731 192 -409 2 -574 -292
7258 -292 559 843 580 -436 13 481 -183 -754 340 -6 -552 -700 172 -534 549 -190 -150 140 -32
7277 -32 -143 -29 -736 694 725 -916 -156 1145 -852 269 362 -181 -594 -35 -1199 396 536 304 -152
7296 -152 -638 664 -681 588 542 1003 -1071 150 165 12 -396 -700 713 362 -668 116 -33 -1077
7314 -1077 228 -13 82 -432 -569 219 295 -126 410 550 -75 656 315 418 -388 -653 -514 -383 -85 45
7334 45 -159 -149 -74 -301 -73 464 881 1099 567 -324 -268 -748 580 -22 -727 -111 118 138 80 526 -312 -21
7356 -21 -1049 46 322 1103 322 406 352 -1279 -305 -891 -78 696 490 325 360 -258 -815 -382 -196 406
$$ packed form
7219f68O89l63N19J59L0r55R78p67M73l56N75N05j335L20O88j095O09l30JJ260
7239I37j450R97k01j78qn33N47M66K57j132O79j286J070q96R23o01M11n76K82
7258b92Q51K84k63j016M49M68o64n71J094l46n46j48Q72p06J083p39M0K90j72
7277c2j11J14p07J430L1j641P60J301j997J121R3n43m13N59j164J595J40k32m56
7296a52m86J302j345J269m6M61k074J221J5j53m08l04J413l51j030P84j49j044
7314a077J305k41R5n14j37P88P6m21N36J40o25P31l41J03q06k65J39J31K98J30
7334D5k04J0P5k27K28N37M17K18n32q91N6m80J328o02p05O16K29K0n8M46q38K91
7356b1j028J095K76P81p81Q4n4j631R74n86Q13P74k06j65L5o18n57M33J86O02
$$ plain form
7376 406 140 361 -359 1030 -173 -360 100 -26 364 325 -986 -275 71 393 -82 90 -118 -226 327
7395 327 393 57 -228 54 -450 -493 443 44 244 -635 -965 -754 316 190 704 914 -251 46 -382 563
7415 563 -612 -332 -451 282 644 -99 303 657 258 -764 224 340 42 429 185 -376 651 6 -730
7434 -730 721 368 -356 -348 -232 405 -799 -197 834 156 -76 123 176 -613 905 538 -465 -749 677
7453 677 857 -610 -580 802 -438 98 420 -93 10 -580 389 -713 -4 396 -106 731 -688 -838 -320
7472 -320 380 102 -129 -83 228 379 34 261 501 65 118 -284 241 -295 -605 -354 -190 -483 -77 -338 -442
7493 -442 -533 -533 -174 -353 270 340 -63 140 -1235 -281 -259 -384 761 -721 -71 535 323 -110 -765 896
7513 896 52 193 -99 84 -599 263 -345 -203 1014 -103 353 1391 330 268 708 945 -523 33 -78
$$ packed form
7376D06k66K21p20J389j203j87M60j26L90l9j311P11L46L22m75J72k08j08N53
7395C27O6l36k85K82n04m3R36l99K00q79l30K11J070j26N14K10j165K97m28R45
7415E63j175K80j19P33L62p43M02L54l99j022R88J16k98L87k44n61J027o45p36
7434g30J451l53p24QJ16O37j204O02J031o78k32J99N3p89J518l67j003k84J426
7453F77J80j467L0J382j240N36L22n13J03n90R69j102P09M00n02Q37j419j50N18
7472c20P00k78k31M6L11J51l45K27K40m36N3m02N25n36l10K51J64k93M06k61j04
7493d42r1%L59j79O23P0m03K03j375R54K2j25J145j482O50O06k12m33o55J661
7513H96q44J41k92J83o83Q62o08J42J217j117M56J038j061o2M40K37j468N56j11
$$ plain form
7532 -78 341 -77 4 106 1129 -403 239 9 139 1179 -304 -549 -887 613 228 757 110 -440 270
7551 270 -414 -315 -815 -168 -148 -475 368 144 377 500 -451 -153 233 208 -841 -167 236 -1286 226 -91
7571 -91 606 -363 253 -55 367 249 721 -95 -948 -282 156 -490 -395 -56 364 -175 777 -155 459 13 -3
7592 -3 -669 167 423 -832 -641 -120 124 -428 -254 306 -448 -237 174 285 183 717 -455 581 -601
7611 -601 136 -167 365 1066 288 -674 411 -288 693 -161 -49 -142 -340 297 583 -469 -318 168 -616 -408
7631 -408 433 -327 38 656 -730 74 919 48 -1274 -571 -1153 208 -100 64 290 -533 342 705 -743
7650 -743 585 -357 277 -981 -590 298 -107 200 542 262 -9 -22 164 212 -267 -580 261 720 -720 -745
7670 -745 -618 308 616 -483 113 258 -205 -605 27 375 111 207 -29 120 302 -487 -84 324 37 309
$$ packed form
7532g8M19m18Q1J02J023j532O42k30J30J040j483k45l38J500l85N29o47n50P10
7551B70o84R9n00O47K0l27Q43k24K33J23r51K98L86k5j049O74M03j522J512l17
7571i1O97r69O16l08M22j18M72q16q53O66M38o46R5L39M20n39R52r32O14m46j6
7592co66Q36K56j255J91N21K44n52J74N60p54K11M11J11j02N34j172J036j182
7611f01P37l03N32P01p78r62J085o99R81q54J12r3j98O37K86j052J51M86p84K08
7631d08Q41p60L65O18j386Q04Q45q71j322P03n82J361l08J64K26q23Q75L63j448
7650g43J328r42O34j258L91Q88m05L07L42k80k71j3J86M8m79l13Q41M59j440k5
7670g45J27R26L08j099N96J45m63m00O32L48k64R6k36J49J82p89M03M08k87K72
$$ plain form
7690 309 651 330 -99 560 -531 465 -292 -848 347 -26 1 6 271 554 163 -346 -132 -428 -111 21
7710 21 960 -471 -11 -610 -221 -94 -95 -519 -114 -384 -511 374 -164 494 -130 383 1491 -32 366 109
7730 109 51 890 70 562 -828 72 911 551 200 530 -501 -713 -914 -241 -185 325 38 -217 -59 93
7750 93 364 -700 -674 307 -1444 294 470 -317 380 -437 116 1254 -19 547 1245 387 378 -337 -50 -420
7770 -420 83 480 914 491 361 -269 1177 349 -462 754 98 90 124 59 18 207 -316 1003 -90 -423
7790 -423 283 169 5 -411 -395 310 260 254 266 -150 811 87 -567 -1037 233 -65 409 206 -381 -641 -1001
7811 -1001 -1032 -207 832 -382 539 -572 -188 -498 -258 -29 316 -32 -478 231 527 -83 -1039 11 26
7830 26 -278 601 -152 716 723 -507 -894 631 -316 528 505 -79 -249 23 158 634 619 -490 779 -290
$$ packed form
7690C09L42l21m29O59j091R96p57n56J195l73K7NK65K83l91n09K14k96L17J32
7710B1R39j431M60n99L89J27jm24M05k70j27Q85n38O58o24N13J108j523L98k57
7730A09n8Q39q20M92j390R00Q39l60l51L30j031k12k01O73N6N10k87k55J58J52
7750I3K71j064K6R81j751J738J76p87O97q17N53J138j273N66O98q58rp15K87l70
7770d20N03L97M34m23j30o30J446q28q11J216o56qL4o5m1J89n23J319j093l33
7790d23P06j14j64m16J6P05n0oJ2m16R61p24o54m70J270k98M74k03n87k60l60
7811a001l1Q25J039j214R21j111L84l10K40K29L45l48m46P09K96o10r56J050J5
7830B6l04Q79p53Q68Pj230l87J525r47Q44k3n84j70K72J35M76j5j109J269j069
$$ plain form
7850 -290 -260 220 -974 -176 57 -859 304 -233 -512 -35 666 251 49 -579 -540 -481 -360 209 -750 40
7870 40 -248 419 106 -61 47 111 -362 -269 4 -120 315 66 506 241 -349 248 -426 -422 326 -231 -382 -446
7892 -446 -230 1219 438 -262 -147 -875 -187 674 -315 284 -98 659 -324 124 476 -317 600 396 434 -842
7912 -842 254 -597 395 -26 341 298 -688 -238 -16 -289 -30 -257 72 -171 333 285 -193 160 316 23
7932 23 9 -836 -923 711 -489 535 166 -151 -547 -387 295 -403 -119 -126 687 -284 508 181 -215 220 -238
7953 -238 -311 -888 -245 -414 528 122 22 -150 -59 37 -447 -314 852 -1070 -754 593 100 -281 -52 142
7973 142 373 723 383 600 -694 14 -338 49 -67 33 288 653 187 500 -109 315 358 215 638 219
7993 219 -9 -180 978 -815 226 245 140 157 -40 -271 453 -237 -55 73 -225 -326 -321 -408 556 -482
$$ packed form
7850b90L0M80j194P98K33r16J163n37k79M77P01m15k02o28L9N9J21N69r59P90
7870D0k88O67l13j67J08O4m73R3K73j24M35k49M40k65n90N97o74MP48n57j51o4
7892d46K16J449p81p00J15p28O88Q61r89N99l82P57r83M48L52p93R17k04L8j276
7912h42J096q51R92m21L67m3r86M50K22k73K59k27L29k43N04m8m78L53J56k93
7932B3j4q45q7J634j200J024l69l17l96J60O82o98K84pQ13r71P92l27l96M35m58
7953b38p3n77O43j69R42m06j00j72R1R6m84J33J166j922L16J347m93l81K29J94
7973A42K31L50l40K17j294P08l52L87j16J00K55L65m66L13o09M24M3j43M23m19
7993B19k28j71J158j793J041J9j05J7j97k31P24o90J82J28k98j01Nq7R64j038
$$ plain form
8013 -482 57 800 886 312 179 469 261 -663 -75 -186 -545 -154 -56 114 -302 -763 185 540 -163 -153 79
8034 79 -719 43 340 -377 -280 -191 -176 -192 254 -27 174 -512 -355 -615 272 -615 251 -17 -74 54 172 -857
8056 -857 674 -492 -469 -550 -112 211 -41 -286 751 201 570 -997 -406 -282 918 345 133 994 -140
8075 -140 -442 -167 -913 7 213 -303 589 813 634 -897 402 -241 -1081 323 -50 -301 148 360 -311
8094 -311 -155 -396 65 -507 -179 -839 -426 -298 -394 -291 -532 19 -279 -863 -339 -837 149 375 -201 -2
8114 -2 -332 -174 -253 4 -23 -456 -335 -374 849 478 -370 -356 28 -666 -171 -1031 343 250 -375 -294 233 -136
8136 -136 -740 -279 -46 229 108 327 571 -348 -427 108 547 -205 374 102 -115 34 -984 280 102 -24
8156 -24 -316 -33 231 24 -738 -854 -290 -217 -272 591 362 161 530 -55 367 771 -41 -251 573 1012 218
$$ packed form
8013d82N39P43Q6n74j33K90k08r24N88j11l59L91R8J70m16m61R48L55p03J0K32
8034G9p98P62K97p17R7Q9J5j6M46k81K01o86J57k60Q87q87Q66k68n7J28J18j029
8056h57J531j166K3q1M38L23k52k45J037n50L69j567N91J24J200n73k12Q61j134
8075a40l02K75p46R20K06n16Q92K24j79j531J299o43q40J404l73k51M49K12o71
8094c11J56k41M61n72L28o60M13J28r6J03k41N51k98n84N24m98R86K26n76J99
8114bl30J58p9K57k7m33J21l9J223l71q48J4L84o94M95q60J374r3o25Q1N27l69
8136a36o04M61K33K75j21K19K44r19p9N35M39p52N79k72k17J49j018J264j78j26
8156b4k92K83K64k07p62j16N64P3n5Q63k29k01L69n85M22M04q12k10Q24M39p94
$$ plain form
8177 218 -519 773 -95 244 -327 39 -334 70 -468 -461 -483 -263 925 -196
$$ packed form
8177B18p37J292q68L39n71L66l73M04n38Pk2K20J188j121
8191a96
$$ Imaginary data points
##PAGE= N=2
##DATA TABLE= (X++(I..I)), XYDATA
$$ plain form
0 0 0 0 0 72 -72 0 -72 72 -74 144 -144 216 -288 303 -366 477 -576 661 -785 923 -1086 1260 -1437
23 -1437 1664 -1917 2193 -2482 2805 -3192 3602 -4028 4522 -5078 5671 -6316 7021 -7810
37 -7810 8685 -9613 10641 -11795 13054 -14445 15998 -17736 19702 -21923 24451 -27384
49 -27384 30829 -34936 39901 -46084 54041 -64663 79573 -102116 140032 -215555 423564
60 423564 -2143476 -7126985 -1203457 3630615 1491075 -1473123 122486 774846 -1259304
69 -1259304 -1410755 946375 734528 -1049648 -336221 1129517 -421738 -1731568 225618
78 225618 1624094 -285550 -1077352 856097 791383 -1897854 -1469085 1969197 2062236 -1258923
88 -1258923 -1702681 713657 696371 -1089714 -109841 1850669 534252 -1745809 -907013
$$ packed form
0@%%%P2j44P2p2J44j46K18k88L60n04N91o69Q43j053J237j446J708k009K346k697
23a437L101l581M110m675N287n997O794p630Q550r600J0749j1987J3337j4831
37g810J6495j8298K0254k2436K4849k7499L0443l3734L7438m1625M6374n1835
49b7384N8213o5765P4837q5985J00125j18704J44236j81689K42148l55587O39119
60D23564k567040m983509N923528M834072k139540k964198J595609O52360k034150
69a259304j51451K357130k11847j784176P13427J465738j551255j309830J957186
78B25618J398476j909644p91802J933449o4714k689237M28769L438282R3039l321159
88a258923m43758K416338j7286j786085R79873J960510j316417k280061Q38796
$$ plain form
97 -907013 817910 279736 -336597 715949 673520 -1091869 -1103748 725189 688016 -729855
107 -729855 -963 1403103 -124431 -2106794 -454958 1956649 709321 -1450728 -375895
116 -375895 1239597 -156882 -1623008 31241 1729847 428715 -1193638 -538673 397310
125 397310 15915 -82265 521337 210784 -569518 -165327 385169 -359268 -663297 712827
135 712827 1207569 -569334 -1510363 131777 1233901 -84439 -979900 207177 849371
144 849371 -375990 -977730 134788 744390 2505 -353803 56077 -69654 -442729 91553
154 91553 672144 78428 -569362 -67645 403602 -137219 -408551 308545 564982 -194215
164 -194215 -448235 197279 252915 -385248 -176990 676614 408391 -711391 -686234 420743
$$ packed form
97i07013J724923n38174o16333J052546m2429j765389j1879J828937l7173j417871
107g29855P28892J404066j527534j982363J651836K411607j247328k160049J074833
116c75895J615492j396479j466126J654249J698606j301132j622353O54965R35983
125C97310l81395r8180O03602l10553p80302M04191N50496p44437l04029J376124
135G12827M94742j776903r41029J642140J102124j318340q95461J187077O42194
144H49371j225361o01740J112518O09602p41885l56308M09880j25731l73075N34282
154I1553N80591n93716o47790N01717M71247n40821k71332P17096K56437p59197
164a94215k54020O45514N5636o38163K08258Q53604k68223j119782K5157J106977
$$ plain form
174 420743 663300 -189446 -522122 44144 349835 30420 -207434 -119724 21446 143873
184 143873 138750 -158963 -320216 89822 394956 -99349 -541270 33597 668881 114039
194 114039 -700830 -283168 614266 390058 -469013 -431910 266648 323731 -185659 -257165
204 -257165 105404 201471 15242 -78035 -102382 -114699 42320 185788 -10467 -223536 -1968
215 -1968 248933 -11640 -319986 -55104 311199 120204 -219311 -93428 137409 -24281
225 -24281 -197663 22580 226715 35851 -176196 -77047 46019 -30160 -68117 56312 123502
236 123502 30180 -92755 -160051 -95194 134971 251628 -20353 -312442 -107902 242124
246 242124 53439 -352468 -144503 401973 294099 -361461 -472231 133681 456256 56198
$$ packed form
174D20743K42557q52746l32676N66266L05691l19415k37854Q7710J41170J22427
184A43873n123k97713j61253M10038L05134m94305m41921N74867O35284n54842
194A14039q14869M17662Q97434k24208q59071L7103O98558N7083n09390p1506
204b57165L62569R6067j86229r3277k4347j2317J57019J43468j96255k13069K21568
215a968K50901k60573l08346K64882L66303j90995l39515J25883K30837j61690
225b4281j73382K20243K04135j90864k12047R9149J23066p6179l7957J24429O7190
236A23502r3322j22935o7296O4857K30165J16657k71981k92089K04540L50026
246B42124j88685m05907K07965N46476j07874o55560j10770O05912L22575m00058
$$ plain form
256 56198 -348472 -196480 143611 150219 -93444 -195400 -14609 208190 147632 -148151 -248256
267 -248256 18098 234927 61317 -183376 -102189 107368 73110 -81558 -64723 46964
277 46964 45751 -12838 -12684 -6921 -33455 -23224 7203 -11300 -25104 21880 24932 -51155 -53990
290 -53990 46786 70831 -11003 -20159 46074 15114 -65357 -8859 91690 20149 -107547 -38661
302 -38661 118791 81141 -87161 -93805 65202 122414 -7674 -120218 -46969 110261 109147
313 109147 -77444 -173093 4306 191623 65767 -176449 -111212 160697 169173 -99764 -182567
324 -182567 41116 178867 28928 -134506 -83559 60062 109707 46430 -57778 -95022 -4981
335 -4981 101770 56795 -72042 -66083 50060 65824 -31720 -57570 13361 51115 22517 -4409
$$ packed form
256E6198m04670J51992L40091O608k43663j01956J80791K22799o0558k95783j00105
267b48256K66354K16829j73610k44693Q1187K09557l4258j54668J6835J11687
277D6964j213n8589J54N763k6534J0231L0427j8503j3804M6984L052p6087k835
290e3990J00776K4045q1834r156O6233l0960q0471N6498J00549p1541j27696O8886
302c8661J57452l7650j68302o644J59007N7212j30088j12544P3249J57230j114
313A09147j86591r5649J77399J87317j25856k42216O5237K71909Q476k68937q2803
324a82567K23683J37751j49939j63434N0947J43621M9645o3277j04208l7244R0041
335d981J06751m4975j28837N959J16143J5764r7544k5850P0931L7754k8598k6926
$$ plain form
347 -4409 -24484 -32912 12543 54665 -7001 -83962 -11008 113269 53981 -109574 -106284 47214
359 47214 92114 -12980 -73500 -16269 42784 41912 -3019 -61981 -52237 62772 126599 -8220
371 -8220 -156872 -58081 137865 96630 -107741 -115751 76993 134112 -16999 -98475 5942
382 5942 94432 25728 -78870 -72870 21610 85968 47433 -51815 -80520 7517 92504 51423
394 51423 -42797 -52124 11689 35307 7020 -17144 -25831 -22374 19500 66392 37936 -40714 -45823
407 -45823 26891 47403 -14038 -33290 27750 54000 -14340 -64423 -10532 65209 51163 -23505
419 -23505 -43151 22780 70032 13629 -81924 -62431 68798 120188 -6642 -132333 -59950
430 -59950 103163 103447 -43821 -97596 16498 103116 21592 -98713 -76222 56523 109905
$$ packed form
347d409k0075q428M5455M2122o1666p6961P2954J24277n9288j63555L290J53498
359D7214M4900j05094o0520N7231N9053q72m4931n8962R744J15009O3827j34819
371h220j48652R8791J95946m1235k04371q010J92744N7119j51111q1476J04417
382E942Q8490o8704j04598O000R4480O4358l8535r9248k8705Q8037Q4987m1081
394E1423r4220r327O3813K3618k8287k4164q687L457M1874M6892k8456p8650n109
407d5823P2714K0512o1441j9252O1040K6250o8340n0083N3891P5741j4046p4668
419b3505j9646O5931M7252n6403r5553J9493J31229N1390j26830j25691P2383
430e9950J63113K84j47268n3775J14094Q6618q1524j20305K2491J32745N3382
$$ plain form
441 109905 7122 -110805 -80463 54339 94532 -11160 -87193 -14806 71355 20203 -63750
452 -63750 -24702 58425 25615 -62848 -44424 45499 52074 -11751 -29969 -4379 -6127 -10329 22751
465 22751 28597 -27663 -54256 5236 49693 11209 -36974 -21606 15741 20991 4228 -15395
477 -15395 -22997 7176 43774 11380 -55274 -31051 62775 53521 -64741 -90250 28892 94602
489 94602 5054 -80235 -34951 47872 49768 -10200 -52573 -33146 34270 53225 -32473 -95558
501 -95558 5264 121867 27558 -143876 -84238 127028 130120 -66268 -115789 25035 66399
512 66399 -35743 -53976 34074 38983 -26994 -19339 19986 -10223 -21417 45952 45642 -60624
524 -60624 -71397 49208 68343 -48814 -62498 55033 65307 -42829 -42593 45621 17843 -61111
$$ packed form
441A09905j02783j17927L0342J34802M0193j05692p6033P2387Q6161n1152q3953
452f3750L9048Q3127l2810q8463J8424Q9923O575o3825j8218K5590j748m202L3080
465B2751N846n6260k6593N9492M4457l8484m8183J5368L7347N250j6763j9623
477a5395p602L0173L6598l2394o6654K4223R3826r254j18262k5509J19142O5710
489I4602q9548q5289M5284Q2823J896n9968m2373J9427O7416J8955q5698o3085
501i5558J00822J16603r4309j71434N9638K11266L092j96388m9521J40824M1364
512F6399j02142j8233Q8050M909o5977P655L9325l0209j1194O7369l10j06266
524f0624j0773J20605J9135j17157j3684J17531J0274j08136K36Q8214k7778p8954
$$ plain form
536 -61111 3924 90884 767 -109816 -22897 96267 35106 -56481 -5274 43397 -27343 -52953
548 -52953 38755 60633 -29604 -43676 20287 -5669 -57005 22749 87280 -30163 -112881 32680
560 32680 130942 -39240 -167381 5543 159580 17450 -126520 -11619 89309 -25927
570 -25927 -103449 18358 86159 -13049 -53695 18956 5142 -62765 12512 103738 -1286 -107629
582 -107629 10517 113341 -30009 -135713 33052 159733 1831 -132693 -12176 88547
592 88547 -6359 -45928 55623 40830 -92567 -56787 91815 51613 -82363 -21259 91461
603 91461 -9768 -122171 6215 128999 10097 -92766 15204 53802 -85534 -82666 104856
614 104856 101794 -94512 -81742 108468 57553 -150401 -76724 170546 126492 -115027 -122419
$$ packed form
536f1111O5035Q6960r0117j10583Q6919J19164o1161r1587N1207M8671p0740k5610
548e2953R1708K1878r0237j4072O3963k5956n1336P9754O4531j17443q2718J45561
560C2680R8262j70182j28141J72924J54037j42130j43970J14901J00928j15236
570b5927p7522J21807O7801r9208m0646P2651j3814o7907P5277R1226j05024j06343
582a07629J18146J02824j43350j05704J68765J26681j57902j34524J20517J00723
592H8547r4906l9569J01551j4793j33397L5780J48602m0202j33976O1104J12720
603I1461j01229j12403J28386J22784j18902j02863J07970L8598j39336K868J87522
614A04856l062j96306J2770J90210n0915k07954P3677K47270m4054k41519p392
$$ plain form
625 -122419 38945 43661 -26800 32623 64223 -54983 -81045 58072 67090 -73861 -42282
636 -42282 124664 62066 -147457 -100705 111421 85941 -78925 -29480 97028 -1036 -126813
647 -126813 -7404 126566 24760 -83725 -2580 41163 -59814 -56213 81502 72778 -62588
658 -62588 -38245 67423 -18803 -127508 21912 179635 23860 -174490 -60982 116085
668 116085 35539 -79327 17677 89486 -31930 -95058 21256 60948 -33696 -21126 81818
679 81818 21709 -119148 -62330 89436 63417 -35697 -3956 27766 -64045 -72324 78189 106103
691 106103 -56535 -90399 58791 68462 -88426 -76802 105558 106545 -79219 -117379 17053
702 17053 62579 5541 19572 39702 -41406 -74335 28606 69372 -28687 -44354 66720 56715
$$ packed form
625a22419J61364M716p0461N9423L1600j19206k6062J39117R018j40951L1579
636d2282J66946o2598k09523M6752K12126k5480j64866M9445J26508r8064j25777
647a26813J19409J33970j01806j08485Q1145M3743j00977L601J37715q724j35366
658f2588K4343J05668q6226j08705J49420J57723j55775j98350J13508J77067
668A16085q0546j14866R7004P1809j21416o3128J16314L9692r4644J2570J02944
679H1818o0109j40857N6818J51766k6019r9114L1741L1722r1811q279J50513K7914
691A06103j62638l3864J49190R671j56888J1624J82360R87j85764l8160J34432
702A7053M5526n7038J4031K0130q1108l2929J02941M0766r8059j5667J11074j0005
$$ plain form
714 56715 -90966 -89964 66676 86223 -41318 -44858 57803 21239 -96086 -45233 90375
725 90375 61642 -55285 -44100 30266 3402 -37828 19970 51211 -19069 -47633 18004 25002
737 25002 -37377 -14547 58765 9724 -83037 -22909 87248 29012 -77799 -15884 82700 3915
749 3915 -101472 -14307 98539 30029 -73746 -25972 41623 -9135 -43253 32700 56677 -28247
761 -28247 -55238 16445 29995 -20285 679 43849 -17355 -75012 10879 80117 -10042 -75571
773 -75571 32032 92300 -40000 -116977 21836 120086 4526 -92985 -9281 59046 -8270
784 -8270 -41460 26693 32980 -32707 -15602 40983 -6639 -66314 13124 87453 -1590 -85329
796 -85329 -6776 60742 -9245 -40299 47801 49951 -76735 -79681 72216 96216 -47410 -80334
$$ packed form
714E6715j47681J002J56640J9547j27541l540J02661l6564j17325N0853J35608
725I0375k8733j16927J1185P4366k6864m1230N7798L1241p0280k8564O5637O998
737B5002o2379K2830P3312m9041r2761O0128J10157n8236j06811O1915R8584p8785
749C915j05387Q7165J12846o8510j03775M7774O7595n0758l4118P5953K3977q4924
761b8247k6991P1683J3550n0280K0964M3170o1204n7657Q5891O9238r0159o5529
773g5571J07603O0268j32300p6977J38813R8250j15560r7511Q3704O8327o7316
784h270l3190O8153O287o5687J7105N6585m7622n9675P9438P4329q9043q3739
796h5329P8553O7518o9987l1054Q8100K150j26686k946J51897K4000j43626l2924
$$ plain form
808 -80334 35063 49427 -50026 -40606 57988 47056 -41887 -34254 16739 -4409 -17183 42161
820 42161 41676 -46786 -49424 40755 31490 -60117 -23995 85071 36199 -94218 -55795 75878
832 75878 54576 -49608 -21178 57266 3102 -74181 -11598 72009 23492 -44170 -10584 26202
844 26202 -7954 -17448 22077 14340 -24365 2758 35693 -21149 -61197 20575 83511 -3294
856 -3294 -82258 -10922 70797 17937 -48460 -3936 43108 -3564 -44449 -3160 32933 6936
$$ packed form
808h0334J15397J4364r9453R420R8594j0932q8943P633N0993k1148j2774N9344
820D2161m85q8462k638R0179r265r1607L6122J09066m8872j30417L8423J31673
832G5878k1302j04184K8430P8444n4164p7283O2583Q3607m8517o7662L3586L6786
844B6202l4156r494L9525p737l8705K7123L2935n6842m0048Q1772O2936q6805
856c294p8964P1336Q1719n2860o6397M4524M7044m6672m0885M1289L6093k5997
$$ [...]
8191D18
##END NTUPLES=NMR FID
##END=
