##TITLE=1H_SA_28.128
 DMSO d6/CCl4, 8 sc, 
 20.8.2019
##JCAMPDX= 6.0         $$ Bruker NMR JCAMP-DX V2.0
##DATA TYPE= NMR FID
##DATA CLASS= NTUPLES
##ORIGIN= UXNMR, Bruker Analytische Messtechnik GmbH
##OWNER= root
$$ XWIN-NMR		Version 3.5
$$ Tue Aug 20 14:27:37 2019 Russian Standard Time (UT+4h)  she@DPX200
##.OBSERVE FREQUENCY= 200.13155
##.OBSERVE NUCLEUS= ^1H
##.DELAY= (6, 6)
##.ACQUISITION MODE= SIMULTANEOUS
##.ACQUISITION SCHEME= undefined
##.AVERAGES= 8
##.DIGITISER RES= 18
##SPECTROMETER/DATA SYSTEM= spect
##.PULSE SEQUENCE= zg30
##.SOLVENT NAME= DMSO
##.SHIFT REFERENCE= (INTERNAL, DMSO, 0, 15.7039)
##AUDIT TRAIL= $$ (NUMBER, WHEN, WHO, WHERE, WHAT)
$$ ##TITLE= Audit trail, XWIN-NMR		Version 3.5
$$ ##JCAMPDX= 5.01
$$ ##ORIGIN= Bruker BioSpin GmbH
$$ ##OWNER= she
$$ F:/spectra/data/she/nmr/H-F/1/audita.txt
$$ ##AUDIT TRAIL=  $$ (NUMBER, WHEN, WHO, WHERE, WHAT)
(   1,<2019-08-20 14:26:24.21 +0400>,<she>,<DPX200>,
      <created by zg, POWCHK disabled, PULCHK disabled
       configuration hash MD5:
       00 E9 B6 7A A2 85 ED C7 34 08 36 98 17 FE 4E 26
       data hash MD5: 16K
       D3 CF 71 85 53 26 FB 55 C6 83 D7 D2 08 46 45 27>)
$$ ##END=
$$ 
$$ hash MD5
$$ F8 FB BA 07 54 7A F5 67 00 D0 CB F5 74 59 30 67
##$RELAX= 
##$RELAX= 
##$RELAX= 
##$RELAX= 
##$RELAX= 
##$RELAX= 
$$ Bruker specific parameters
$$ --------------------------
##$DU= <F:/spectra>
##$EXPNO= 1
##$NAME= <H-F>
##$PROCNO= 1
##$TYPE= <nmr>
##$USER= <she>
##$AMP= (0..31)
100 100 100 100 100 100 100 100 100 100 100 100 100 100 100 100 100 100 
100 100 100 100 100 100 100 100 100 100 100 100 100 100 
##$AQSEQ= 0
##$AQ_mod= 1
##$AUNM= <au_zg>
##$AUTOPOS= <>
##$BF1= 200.13
##$BF2= 200.13
##$BF3= 200.13
##$BF4= 200.13
##$BF5= 200.13
##$BF6= 200.13
##$BF7= 200.13
##$BF8= 200.13
##$BYTORDA= 1
##$CFDGTYP= 0
##$CFRGTYP= 5
##$CHEMSTR= <none>
##$CNST= (0..31)
1 1 145 1 1 1 1 1 1 1 1 1 1 1 1 1 1 1 1 1 1 1 1 1 1 1 1 1 1 1 1 1 
##$CPDPRG= <>
##$CPDPRG1= <>
##$CPDPRG2= <>
##$CPDPRG3= <>
##$CPDPRG4= <mlev>
##$CPDPRG5= <mlev>
##$CPDPRG6= <mlev>
##$CPDPRG7= <mlev>
##$CPDPRG8= <mlev>
##$CPDPRGB= <>
##$CPDPRGT= <>
##$D= (0..31)
0 1.2 0 0 0 0 0 0 0 0 0 0.03 0 0 0 0 0 0 0 0 0 0 0 0 0 0 0 0 0 0 0 0 
##$DATE= 1566296783
##$DBL= (0..7)
120 120 120 120 120 120 120 120 
##$DBP= (0..7)
150 150 150 150 150 150 150 150 
##$DBP07= 0
##$DBPNAM0= <>
##$DBPNAM1= <>
##$DBPNAM2= <>
##$DBPNAM3= <>
##$DBPNAM4= <>
##$DBPNAM5= <>
##$DBPNAM6= <>
##$DBPNAM7= <>
##$DBPOAL= (0..7)
0.5 0.5 0.5 0.5 0.5 0.5 0.5 0.5 
##$DBPOFFS= (0..7)
0 0 0 0 0 0 0 0 
##$DE= 6
##$DECBNUC= <off>
##$DECIM= 24
##$DECNUC= <off>
##$DECSTAT= 4
##$DIGMOD= 1
##$DIGTYP= 9
##$DL= (0..7)
0 120 120 120 120 120 120 120 
##$DP= (0..7)
150 150 150 150 150 150 150 150 
##$DP07= 0
##$DPNAME0= <>
##$DPNAME1= <>
##$DPNAME2= <>
##$DPNAME3= <>
##$DPNAME4= <>
##$DPNAME5= <>
##$DPNAME6= <>
##$DPNAME7= <>
##$DPOAL= (0..7)
0.5 0.5 0.5 0.5 0.5 0.5 0.5 0.5 
##$DPOFFS= (0..7)
0 0 0 0 0 0 0 0 
##$DQDMODE= 0
##$DR= 18
##$DS= 0
##$DSLIST= <SSSSSSSSSSSSSSS>
$$ [...]
##$SUBNAM2= <"">
##$SUBNAM3= <"">
##$SUBNAM4= <"">
##$SUBNAM5= <"">
##$SUBNAM6= <"">
##$SUBNAM7= <"">
##$SUBNAM8= <"">
##$SUBNAM9= <"">
##$SW= 24.9336996594482
##$SWIBOX= (0..15)
0 0 2 0 0 0 0 0 0 0 0 0 0 0 0 0 
##$SW_h= 4990.01996007984
##$TD= 16384
##$TD0= 1
##$TE= 0
##$TE2= 300
##$TE3= 300
##$TEG= 300
##$TL= (0..7)
0 120 120 120 120 120 120 120 
##$TP= (0..7)
150 150 150 150 150 150 150 150 
##$TP07= 0
##$TPNAME0= <>
##$TPNAME1= <>
##$TPNAME2= <>
##$TPNAME3= <>
##$TPNAME4= <>
##$TPNAME5= <>
##$TPNAME6= <>
##$TPNAME7= <>
##$TPOAL= (0..7)
0.5 0.5 0.5 0.5 0.5 0.5 0.5 0.5 
##$TPOFFS= (0..7)
0 0 0 0 0 0 0 0 
##$TUNHIN= 0
##$TUNHOUT= 0
##$TUNXOUT= 0
##$USERA1= <user>
##$USERA2= <user>
##$USERA3= <user>
##$USERA4= <user>
##$USERA5= <user>
##$V9= 5
##$VALIST= <valist>
##$VCLIST= <CCCCCCCCCCCCCCC>
##$VD= 0
##$VDLIST= <DDDDDDDDDDDDDDD>
##$VPLIST= <PPPPPPPPPPPPPPP>
##$VTLIST= <TTTTTTTTTTTTTTT>
##$WBST= 1024
##$WBSW= 4
##$XGAIN= (0..3)
0 0 0 0 
##$XL= 0
##$YL= 0
##$YMAX_a= 633578
##$YMIN_a= -1150045
##$ZGOPTNS= <>
##$ZL1= 120
##$ZL2= 120
##$ZL3= 120
##$ZL4= 120
##$ABSF1= 10
##$ABSF2= 0
##$ABSG= 5
##$ABSL= 3
##$ALPHA= 0
##$AQORDER= 0
##$ASSFAC= 0
##$ASSFACI= 0
##$ASSFACX= 0
##$ASSWID= 0
##$AUNMP= <proc_1d>
##$AZFE= 0.1
##$AZFW= 0.1
##$BCFW= 1
##$BC_mod= 2
##$BYTORDP= 1
##$COROFFS= 0
##$CY= 11.3945322036743
##$DATMOD= 1
##$DC= 2
##$DFILT= <>
##$DTYPP= 0
##$F1P= 20.1720416913024
##$F2P= 0.152960286110954
##$FCOR= 0.5
##$FTSIZE= 0
##$FT_mod= 4
##$GAMMA= 1
##$GB= 0.15
##$INTBC= 1
##$INTSCL= 1
##$ISEN= 128
##$LB= 0.24
##$LEV0= 0
##$LPBIN= 0
##$MAXI= 10000
##$MC2= 0
##$MEAN= 0
##$ME_mod= 0
##$MI= 1.114404
##$NCOEF= 0
##$NC_proc= 0
##$NLEV= 6
##$NOISF1= 3.799351
##$NOISF2= 2.8
##$NSP= 1
##$NTH_PI= 0
##$NZP= 0
##$OFFSET= 15.70392
##$PC= 1
##$PHC0= -9214.617
##$PHC1= 14.40096
##$PH_mod= 1
##$PKNL= yes
##$PPARMOD= 0
##$PSCAL= 0
##$PSIGN= 0
##$REVERSE= no
##$SF= 200.130013532006
##$SI= 16384
##$SIGF1= 3
##$SIGF2= 2
##$SINO= 400
##$SIOLD= 16384
##$SREGLST= <1H.CDCl3>
##$SSB= 0
##$STSI= 0
##$STSR= 0
##$SW_p= 3612.71676300578
##$SYMM= 0
##$S_DEV= 0
##$TDeff= 0
##$TDoff= 0
##$TI= <>
##$TILT= no
##$TM1= 0
##$TM2= 0
##$TOPLEV= 0
##$USERP1= <user>
##$USERP2= <user>
##$USERP3= <user>
##$USERP4= <user>
##$USERP5= <user>
##$WDW= 1
##$XDIM= 8192
##$YMAX_p= 0
##$YMIN_p= 0
$$ End of Bruker specific parameters
$$ ---------------------------------
##NTUPLES= NMR FID
##VAR_NAME=  TIME,          FID/REAL,        FID/IMAG
##SYMBOL=    X,             R,               I
##VAR_TYPE=  INDEPENDENT,   DEPENDENT,       DEPENDENT
##VAR_FORM=  AFFN,          ASDF,            ASDF
##VAR_DIM=   8192,          8192,            8192
##UNITS=     SECONDS,       ARBITRARY UNITS, ARBITRARY UNITS
##FACTOR=    0.0002004,     1,               1
##FIRST=     0,             0,               0
##LAST=      1.6414764,     0,               0
##MIN=       0,             -1150045,        0
##MAX=       1.6414764,     633578,          0
$$ Real data points
##PAGE= N=1
##DATA TABLE= (X++(R..R)), XYDATA
0@%%%qK4l2L2m8P2q8J04j28J68k16K56l04L73m51N34o24P35q63J000j155J330
25G11j528J751j992K258k560K891l248L644m084M567n094N668o303P002p762Q597
41D518r523J0546j1677J2932j4334J5914j7702J9742k2099K4857k8136L2109l7039
54a9892M3358n1795O3694q1878J13444j83444N90236k05010j161155O36471N98386
65C42415j15894k53835L25658r7752m79962m7269M89916K840k87809J17766L02182
76B98256k70575l27857K00088K57371k24564p2891L45032L0789n10031r3735N20172
87A52055J97312l93609j28113K78172k2468l08722J16764L73282q4425l63111
97a82863L7502K50801o5089j51282J54574J26454j97429j24301J79196O0966j78526
$$ y = [0, 0, 0, 0, -8, 16, -16, 16, -32, 40, -48, 56, -72, 96, -120, 136, -168, 205, -246, 288, -336, 399, -464, 536, -619, 711, -817, 934, -1058, 1200, -1360, 1531, -1717, 1927, -2157, 2410, -2684, 2984, -3319, 3683, -4079, 4518, -5005, 5541, -6136, 6796, -7538, 8376, -9326, 10416, -11683, 13174, -14962, 17147, -19892, 23466, -28329, 35365, -46513, 66931, -116513, 473723, 268713, -892442, -255971, 342415, 226521, -27314, 298344, 200592, -279370, -326639, 163277, 166117, -121692, -3926, 298256, 27681, -300176, -100088, 157283, -67281, -140172, 204860, 235649, -274382, -368117, 152055, 349367, -44242, -172355, 105817, 83349, -225373, -108609, 264673, 180248, -182863, -145361, 105440, 40351, -110931, 43643, 170097, -27332, -151633, 27563, 88529, -89997]
108h9997K6632K35522o9706l01495M4986L02767k9508k59288O7522K46830j14759
119E9506k83531R8968K99116l5580k36323J1854J44957n3818j02059J02486J11826
130A17402q8727r3456N4101J8628p1148M7987J30691o1742j80342L0676J72250
141G6320k6615j54587M5935J56342n6492j67649L9149J53745k1620j12733L4458
152c3747Q0968o0428o8581Q2085P2637p5978n7377P1026L2741p5818j0173Q8736
164D6091K569q5941J0531P8279l5521q2091N5999R3738o0850r7451N9713Q9248
176G4314p0377q8342P6753R9581o1529r9774K9858O9808j5938l2901K2848J3860
188A8161k7005q082J4234j0104N771M9594K40q1508k6171Q9348M8083p5011n3825
$$ y = [-89997, -63365, 172157, 102451, -199044, -154058, 148709, 119201, -140087, -72565, 174265, 59506, -224025, -125057, 174059, 138479, -97844, -85990, 58967, 5149, -96910, 5576, 117402, 28675, -64781, -10680, 7948, -63200, -15213, 115478, 53736, -126606, -95930, 76320, 49705, -104882, -58947, 97395, 40903, -126746, -87597, 66148, 44528, -68205, -33747, 47221, -13207, -81788, 297, 72934, -3044, -60421, 10605, 43346, -32472, -42645, 46091, 48660, -37281, -26750, 51529, 16008, -66083, -10084, 83654, 22804, -74647, -14934, 74314, 3937, -84405, -7652, 91929, 30400, -69374, -39516, 30292, 14354, -18547, 4301, 18161, -8844, -16926, -2692, -12796, -7025, 42569, 42809, -38699, -64870, 24478, 72561, -2450, -56275]
201e6275N9103M5441m8626l4986M3002K7461l7679k2660K5792J5492j5280p729
213f944J409o735O290J9659p839k9872O297L5905O7l0329k17K2676p769j9927
227a7329J7817K8248j5536l4586L403K9111Q195j4546o646Q121M301j1909j5987
240a7343O626L0786J1207l6854l4469K3444M2379r355l8461N632L7201k362m0693
253b2262r821L7181K3822k1519l0639O29K4766J3446j3708j6701Q665K0659n277
266I241k5246O4K8123J0377k3264j7040J1851J4673l013q719M73K347P57P01j878
281e53l462K863N440l540o629K678L723o234l223J1646O891j2801q549J1686R740
296I676r644n688J4127Q218j7946j7168J1893K4200L202k0095j6880O687J9568
$$ y = [-56275, 2828, 48269, -357, -35343, 7659, 35120, -2559, -25219, 573, 16065, 785, -6944, -5535, -12270, -5980, 13679, 5840, -24032, -17735, 18170, 18237, -12092, -12309, 10367, 2598, -17329, 488, 28736, 13200, -21386, -17983, 11128, 19323, 4777, -1869, 6252, 10553, -1356, -17343, -10717, 20069, 31276, -5578, -40047, -16603, 25776, 16421, -22040, -16408, 20793, 18431, -22262, -32083, 5098, 28920, 7401, -23238, -22609, 2157, 15603, 1895, -14806, -6141, 14518, 9241, -16005, -15941, 12182, 22559, -705, -17745, -5894, 8779, 5766, -2953, -2480, -133, 624, 1325, -553, -4015, -1152, 4288, 748, -5881, -3203, 520, -5714, -8937, 2709, 9600, -3201, -11750, -64, 9676, 32, -5656, 8471, 16689, -1257, -18425, -6532, 17668, 20870, 775, -16105, -9418, 10150]
309A0150N425j5177j0284J1555J1531j3282j7288J1515K2699n965k4932k426K1187
322D708P523j4847q358J0652Q392n985q074M43M839L978k82n241o001M870J2230
337H847N17j3067l903J2052N616r606o474Q356O794o904q335K155M904P50J677
352C379J869n552p146M045R342j868j0400k2Q690J138q247l918M924N119K066
367C419j078m592l112M266M115n115m225Q889O771j2583j2792J1090J8239n567
381G725j8803O17J6884K877j3786n790Q110N150j888j447j844k688K135O367j84
396C435p913q80Q722L689p924n391N299N484j829m738J94K657J306m61j547j553
412a450J662L739j276n583q07N812K637n682n673L851P188J41p056m573M682P621
$$ y = [10150, 15575, 398, -9886, 1669, 13200, -82, -17370, -5855, 16844, 10879, -14053, -16479, 4708, 12231, -2616, -10974, -322, 8070, 2085, -5989, -5546, -707, 3271, 2989, -2252, -8253, -3383, 8847, 9364, -3703, -7606, 4446, 10062, 456, -6018, 2338, 9132, 2228, -6107, -3952, 952, 1702, 3379, 5248, -304, -7450, -3405, 5937, 4069, -6331, -6353, 2337, 3475, -4772, -8690, -3766, 1353, 3419, 2341, -2251, -5363, -1097, 3018, -2097, -6322, 2567, 9338, -3245, -16037, -4947, 13292, 7725, -11078, -10461, 6423, 9300, -4486, -10276, -2166, 2984, 1096, -351, -2195, -4883, -2748, 3619, 3435, -4478, -5358, 3364, 7053, -871, -6262, -963, 4521, 2692, -2046, -1852, 805, 2111, 1650, 103, -1450, 212, 3951, 2675, -2908, -3715, 2097, 4734, -948, -6621, -2770, 4418, 4559, -2497, -7070, -2388, 5233]
428E233l90p921l978O796P526m956r953J879J1724K377j0782n321J0187Q664p563
443C522j1850L368J2286K077j0023n621N690N237k550m080J562M269l89m495j231
458b228K077K049q6q03p57j764p88L001J615k249k414K582L412j619l652Q90K504
475A770n94j998J158O35j535K74J774k094l666L595P489k548r912n30J0312J592
491E722j0853m466J0760Q063q052j0165K944J0187J642o992l964M241N128k239
505A956o999n35O767M548m573n368K555N815j778o794R51Q905K315q511o199L966
521b979N375r79k437J060J926l128j753K985J473k777M15L609j389n898J18O405
537B026J037m173J15K035k813j972P053L273q701n826J0259O471j0476o984J0795
$$ y = [5233, 4843, -3078, -7056, -260, 7266, 2310, -7643, -5764, 5960, 8337, -2445, -7766, 2421, 11085, 3522, -8328, -4960, 7326, 9403, -620, -6241, -551, 4686, 2136, -1944, -382, 3887, 3498, -997, -2228, -151, 1898, 1812, 1009, 252, -1512, -2300, 701, 2316, 67, -2347, 235, 3647, 2028, -1624, -734, 1770, 1176, -822, 336, 971, -564, -290, 1484, -610, -4276, -681, 6808, 4260, -5652, -6182, 4130, 5722, -5131, -9597, 1163, 9226, 1174, -8991, -6047, 4140, 5782, -1210, -5174, -933, 4195, 1956, -5043, -5578, 1189, 5737, 1164, -4204, -1649, 4166, 2388, -4406, -3455, 5450, 7765, -746, -6945, -2979, 2396, 1417, -1020, 40, 1966, -1162, -2915, 70, 1543, -1234, -819, 2790, 1401, -4497, -4379, 2026, 3063, -1110, -995, 1040, -1773, -3745, 3308, 6581, -2120, -7946, 2313, 8784, -1692, -8676, 2119]
552B119O784j1087p008J0847O724j0184n322Q942N123p681l503L574P47n08N172
567D739j608j0727J27J4229K194j5528j176J6455Q81j8591j710J8831K838j6003
581e049k264J2872q58j0414L920Q941o025o553Q850M469j1713m479J1867L964
595G528j0382j677R779l311j1446P152J4653o842j6306M488J3837k575r763L134
609a731O928n879o115P197O401n312m994K367J584o58K655J04o057j151R085K020
625F444j0350n403J0375P211p699o782N766N970o079o558N412R694j991j0826
639d816m027P646P366j557n839l23K079J44n00J322j35j816K87K191k317k103
655b398L117J559m130j59P746o06j2444k147J3981N699j1588n936P715J491p538
$$ y = [2119, 8903, -2184, -9192, 1655, 8379, -1805, -7127, 1815, 6938, -743, -4246, -672, 75, -433, 4739, 3131, -7596, -7469, 6760, 8954, -6574, -7750, 8705, 9586, -9005, -10715, 8116, 10954, -5049, -7313, 5559, 4701, -5713, -1793, 7148, 1123, -5430, 3420, 7889, -3824, -8303, 3564, 7528, -2854, -4531, 5248, 1937, -9509, -2357, 12296, 5454, -10852, -6364, 7473, 4898, -4865, -1731, 5197, -682, -6797, 400, 6801, 1489, -3505, -1138, 446, -212, 2443, 2547, -3510, -4661, 4424, 6444, -3906, -9309, 1066, 8277, 578, -6204, -438, 5532, -547, -7105, -1693, 8001, 6010, -4816, -8843, -1197, 6169, 4612, -1227, -1550, 529, 673, 173, 1495, 1360, -456, -169, 2022, -295, -2398, 719, 2278, -1852, -2011, 5735, 5129, -7315, -9462, 4519, 10218, -1370, -7306, 409, 1900, -5638]
670e638L494J1018m444j3184J466J1282J72n093K171m42o625K232J0823k624j2831
685h223M462J3684n655j4706P288J4489r064j3797J1547J3903j2342j5491J0032
698c873J4017o002p240L763l65p122N875J0942o155j2200O456Q495q481n985J2940
713E065N591j6415o635J7505P757j5382p454J2032N110q605j252N438l627n095
727e967O735O202p439o110O025L079n233K514P561o703j2118N776J5392j982j3586
742e854o87Q621J73n346L466M986m701n925K737N467R10k482l220k464L259O255
758E195j331p757j260O667L077l610k666J192K9j098J159K337M49k162m284j387
774e450O375O980m718j1255J468J1896J981r794k135N536m05m124M504M355n783
$$ y = [-5638, -2144, 8874, 4430, -8754, -7288, 3994, 4166, -927, 1244, 802, -5823, -3591, 7232, 4608, -8223, -3761, 9923, 4268, -10438, -3150, 11339, 2275, -11522, 25, 13928, 1586, -13905, -3873, 10144, 4142, -3098, 665, 300, -6822, -947, 9995, 3840, -8360, -1904, 6591, -1890, -7875, 5065, 10656, -5759, -12394, 5111, 12868, -2514, -9968, 2064, 7174, -1431, -2683, 2755, -872, -5967, 768, 6970, -469, -6579, -554, 2525, -2708, -194, 7367, 664, -11454, -5678, 9714, 7732, -5854, -6541, 2080, 2253, -3093, 373, 5359, 658, -5267, -2530, 2937, 3847, 1365, -1855, -4319, -1060, 5195, 3864, -3893, -5153, 1514, 4591, 981, -1685, -493, -464, -1562, -403, 1934, 2383, 221, -4063, -5450, 925, 7905, 3187, -8068, -6600, 5296, 7277, -2517, -4652, 884, 479, -3645, 859, 5214, -569]
789e69o181N674N464k713k148J645m314l778Q952Q497j0515j1211R363J0895q492
804E69r129J0308P116j2349o013J3443N674j2806n513J0897L795p486m2N920n957
819a573n054R621O397j0881o983J0452L968j0253O24J2725l169j7841K523J9433
833I989Q51j6625k351J1573N57o912K977L941o617l022Q541K580q524j279P517
848C196j304p262N419Q134q556j0389Q839J3078p071j2681L610J0079k580n837
862c325L954K893n066k885M522L327k486j231l81j819P25M695N78n783j607N120
878A231K607m371k458L904J666l535j450L403K082l217l701J772N549P52n210
893i76m021L259N558m96m282j157J796l34M6J316P67j620j309j44P39J570J934
$$ y = [-569, -6750, -1076, 4388, 1675, -473, 1172, -3142, -6920, 2032, 10529, 14, -11197, -1834, 9061, 569, -8560, 1748, 8864, -3485, -9498, 3945, 9619, -3187, -8700, 2197, 5992, -1494, -1536, 4384, -1573, -6627, 2994, 9391, -1490, -8473, 1979, 5947, -4306, -3682, 9043, 5874, -11967, -9444, 9989, 10840, -5785, -8136, 3437, 3994, -2918, 59, 4000, -2617, -5639, 2902, 5482, -3042, -4321, 3196, 1892, -5370, 49, 8183, -373, -10762, -1923, 11155, 4084, -8597, -4987, 5092, 2512, -3325, 629, 3522, -1544, -4429, 93, 3420, 934, -297, -678, -2497, -1772, 2923, 3501, -2282, -3889, 1231, 3838, -533, -2991, 913, 2579, -956, -2406, 997, 3079, -138, -3839, -2067, 3482, 4234, -976, -4997, -1738, 3820, 3324, -958, -2115, -319, -653, -607, 709, 1476, -144, -1453, -1597, -858, 712, 2646]
910B646k393m601K050O625n00q293p11Q501J643p656j351O644J90o057K03P035
926C975n38o113m33M372J93j472J538j036l200J673M603k391m856K482N884l445
942A236n868L992N963m516o480M890O314l720n715K515L739j838j233J774n19
957E34k773J496K674j696j930K863R61m562r22O348J361o731k391O086K592m818
973i08k694L915K588l302j319J491R02r28J4L39l11N14P23k096j246L060K200
990B942k950l666L003M264k328l805J674L211j305k550Q19K408p53j247j094J111
1006b66J521j93j298j161J216J915o97k767K27L073J7k563o31K324N18k176q63
1023a804J925J713j222k063j11J802J012p19j813oK032l5j983L5K259M25k186
$$ y = [2646, 253, -4348, -2298, 4327, 3827, -4466, -5177, 3324, 4967, -2689, -4040, 2604, 2794, -3263, -3060, 3975, 3437, -2676, -3109, 1263, 1456, -16, 1522, 486, -2714, -1041, 3562, 1171, -3685, -1203, 4681, 1236, -4632, -640, 5323, 807, -5673, -783, 5531, 1811, -3904, -1389, 2350, 512, -721, 1053, 534, -2239, -743, 1931, 235, -1695, 1168, 2129, -2433, -3355, 2993, 4354, -2377, -4768, 1318, 3910, -908, -3602, 313, 2901, -401, -1720, -229, 673, -255, -241, 98, -213, 301, 1024, -1072, -2318, 742, 2942, -8, -3674, -671, 3593, 1265, -2540, -866, 2345, 1040, -1510, -691, 1717, 964, -283, -1377, -266, 1255, 1062, -236, -1397, -181, 1734, 1037, -1730, -1503, 1570, 1587, -976, -1607, 717, 1235, -941, -1804, 121, 1834, 612, -1451, -1562, 240, 1252, 533, -1280, -1286, 746, 711, -1272, -1237, 1022, 1447, -739]
1040g39j168K091J677j679j790J094K396r78k394l08K503J254j443j618J33K243
1056A274M7j864R2J186M30j400p54J188J489j112j513L43J264N28j042j103P92
1073a55J088q09j013J7K050%j707r92R18J707o12j623L64J225j68r97k83J048
1091E8P52r08j139J142J135m62j305o04J859J238j625j625Q81K059k36k194l97
1108a371K063Q37j825j185J683J419j284j492M22J576m15p63l11O99P17p75q83
1125h88P08J068M1q37j060Q01J096q55p47M87J177m31j652K12J280M27o35j321
1143a129R46Q10n13j124L68J578m57q32p67J065P49l53j080p4J131P28j178o64
1161g96O79P95r4j158j84J108M51j088m99P98J022r05o22O74Q19m77j335N60J029
$$ y = [-739, -1907, 184, 1861, 182, -1608, -514, 1882, 904, -1490, -1798, 705, 1959, 516, -1102, -969, 1274, 1321, -543, -451, 735, 1165, -235, -989, 199, 1688, 576, -937, -594, 670, 1198, 156, -947, -155, 933, 124, -889, -872, 1178, 1178, -529, -1521, -603, 1104, 492, -1131, -767, 458, 290, -707, -990, 58, 810, -98, -1237, -95, 1040, 578, -727, -1331, 528, 1766, 141, -1484, -603, 1456, 1220, -974, -1371, 692, 1529, -296, -1481, 202, 1621, 337, -1155, -733, 843, 428, -335, -646, 53, 770, -5, -888, -180, 888, 929, 92, -968, -167, 929, 74, -673, -186, 991, 560, -1092, -880, 400, 827, 192, -1129, -183, 627, 114, -1010, -642, 936, 479, -353, -1120, -55, 694, 341, -739, -813, 318, 1046, -132, -796, -117, 678, 584, -574, -758, 350, 801, -287, -786, 12, 1034, 129, -493, 181, 1000, 523, -812, -252, 777]
1180G77R6j557J61Q71L96p96l34M54K67J07k57o59L52P67l46r18N3J173R7j147
1200d43q78J494P17j332q01J616M35j083p95J335K25q89k00O74j05J09K74l83
1218c0o42N2J186J40j508N17J399q71j967Q57K655o23k311K96K059l23j898O27
1236c85J521p21q97K40K22j31N95O81j384q07J082J107j756m41J368Q95j610r77
1254a398J659Q81j604q11J549M85j303p20J135R22l96k70r31J61K89Q78k79k33
1272A4j09K02m65m74J338O20p13j284J43J132M31j156l73J010O96m65j592K34
1290h11J558L57j344j32J217k67j758J85K042N75j544p81L63j31K29J557n29k089
1308a303J24J932l63j536J543J576k052k669K524K985k914k834K721K981k642
$$ y = [777, 873, -684, -523, 348, 744, -52, -386, 68, 335, 442, 185, -474, -122, 645, 299, -619, -566, 607, 704, -443, -1321, 173, 890, -442, -1243, 373, 808, -275, -1070, 265, 490, -399, -599, 75, -30, 79, 353, -30, -672, -620, 566, 706, -802, -285, 1114, 243, -1724, -867, 1788, 1165, -1146, -850, 1209, 886, -1012, -385, 1136, 415, -482, -242, -20, -151, 444, 1125, -259, -1066, 16, 1123, -633, -1074, 294, 1189, -421, -1398, 261, 1142, -462, -1273, 276, 761, -542, -1262, -127, 795, 399, 129, -802, -641, -352, 526, 247, 14, -95, 107, -358, -832, 506, 1126, 413, -871, -728, 404, 835, -321, -694, 316, 1012, 547, -1045, -811, 747, 1104, -240, -372, 845, 578, -1180, -995, 1047, 1622, 78, -703, -340, -471, -242, 1315, 786, -1303, -1179, 753, 390, -1146, 397, 1973, -79, -2748, -224, 2761, -153, -2987, -266, 2715, 73]
1323G3k592K285J675k297O6K916j569l219J028L509r57k347K242Q58m035q40N636
1340B432J481n597j941M971J348m760Q9M450n21m374R45L910j611l163J893K827
1356B379k315j738L293p42l643J365N021q46n890N95M763j250l370L122K848m106
1372e14m039M343L976k857k835J493J188j564K18K406j566k794K384K722k610
1387d9k207K230J429k201l96L467l06m898n5M671J760l255j783O18K30Q69R41
1404A065J86j836q33J113L8M64J146j30k440p20K865J115k044j730J888J217p40
1421F24l02p29q76R27J638m16j344K36K58j514N30L566O25m948k554L934L068
1438B723j994j542J160m77k087J881K932j625k908J285J680j832q0K333r91l330
$$ y = [73, -2519, -234, 1441, -856, -790, 2126, 557, -2662, -1634, 1875, 918, -1429, 813, 1671, -2364, -3204, 2432, 3913, -1684, -3625, 1346, 2694, -2066, -1977, 2473, 1952, -2422, -1477, 2433, 822, -2341, -448, 2379, 64, -1674, 1619, 877, -2766, -1401, 3620, 2774, -3116, -2521, 2242, 992, -2378, 744, 3592, -514, -4553, -210, 3766, 909, -1926, -433, 755, -809, -591, 1815, 249, -2545, -161, 2561, -49, -2256, -26, 1403, -798, -1194, 2273, 1967, -2931, -2986, 1685, 3445, 190, -1593, -975, -745, 124, 1065, 1251, -585, -1418, -305, -267, 197, 1343, 1213, -1227, -1947, 918, 2033, -11, -1741, 147, 1364, 624, 322, -407, -1283, -356, 1282, 866, -478, -242, 16, -1498, -968, 2598, 3223, -1725, -4279, -345, 2723, 729, -813, 347, -130, -2217, -336, 2596, 971, -1937, -652, 1028, -804, -884, 1449, 458, -2872]
1454b872K043M287j816o009J527N990j149l831J793K152l484j937M636K900m190
1469D0k818K440R37j262K047J575l776l008L936L556l728k771L967J313m236m17
1485b205M518J69n171L6N085L55m230q28K390K23k31J830n60m108oM297J089l448
1503g95O7J842k311j613L553K866l272m132K462L521j521j700Q58O83j530J134
1519A12J247j255j278J090Q69j296L50J492j136k878J952M077j290m033P1K284
1535C78P56q32L29l08j326j94K178o5j112M77K1j870L1L767K05m435o30M225O70
1554B265k870j057K040J70j548J138J657k144j558J885R16r35L51N35j893j743
1570b791L057L496l456l364K291K830k248j464K526J194l668o72L551R32k669
$$ y = [-2872, -829, 3458, 1642, -4367, -2840, 3150, 2001, -1830, -37, 2115, -1369, -3306, 1330, 4230, 40, -2778, -338, 599, -663, 1384, 2959, -817, -3825, 111, 3667, -61, -2832, 1135, 2448, -1788, -2205, 2313, 2482, -2689, -2653, 2432, 2787, -1443, -2271, 119, 342, 111, 1941, 1381, -2727, -2733, 1564, 2653, -795, -728, 1114, -1197, -2810, 743, 3609, 337, -3795, -1333, 2188, 667, -1033, -175, 508, -1022, 112, 1359, 104, -1174, -84, 785, -511, -161, 1331, 195, -2683, -731, 3346, 2056, -1977, -1906, 378, 1134, 302, 631, 323, -1003, -1197, 981, 916, -196, 281, 302, -1568, -1537, 2230, 2435, -2000, -2630, 1595, 2265, -605, -1662, 378, 548, -1000, 138, 1795, -349, -1907, -22, 894, -41, 310, 845, -1048, -2791, 266, 3762, 306, -3058, -767, 2063, -185, -1649, 877, 2071, -1597, -2269, 1282, 2214, -455]
1585d55r34J693L0o20J290q9k547l02L472O01l617m34L161k43k798J319L234j979
1603G82l566J389L873j014k470J98Q37l44O0J372p55j656P61J758j120j427J870
1620E48O79k197q67L004J260l388j551K958J655j758j373P22K84p19J175K08p08
1637f8n84O12L27p91Q07Q48j214j679J382K301j252k051O19J748o18q49M32N63
1655E33o10l98M68K88j88j51J5q16J013J450j119k132O76K366o12j538k25J696
1673G16o65l98j35J145j18j285N74j6K47P65p82j173K59J731L39j999m71J632
1691C66O64j503l84J364K55j338K3J121K76j099l72O11l6K41J81q16l43O26J369
1710A206j282p22Q60J085j526r04J546J198j582q79J098O69q32l15L94K16j83
$$ y = [-455, -1389, 304, 334, -286, 1004, 915, -1632, -1934, 1538, 2139, -1478, -1912, 1249, 1006, -1792, -473, 2761, 782, -2784, -1395, 2478, 1464, -1006, -808, 29, -315, -255, 1117, 362, -1294, -533, 1225, 105, -1322, 548, 1227, -970, -1837, 1167, 2427, -961, -2512, 446, 2101, 343, -1030, -308, -24, -743, 432, 640, -68, -652, -40, 287, -504, 303, 1151, -63, -1742, -360, 1941, 689, -1362, -743, 1005, 387, -462, -30, 533, -77, -475, -7, 281, 93, -58, -43, -859, 154, 1604, 485, -1647, -971, 1395, 783, -755, -980, 716, 51, -347, -482, 663, 545, -740, -166, -182, 65, 830, 48, -1125, -866, 865, 1204, -795, -1266, 366, 1030, -473, -857, 507, 762, -576, -553, 568, 844, -255, -627, -16, -52, 189, 370, -446, -789, -163, 1206, -76, -798, 62, 1147, -379, -1283, 263, 1461, -121, -1000, 98, 767, -65, -380, 14, 230, 47]
1727D7K52r6n80r5R35o9q79J54P05p7j198L90J409k26j382k70J720K72j323o32
1747i43Q81M26n69o19Q82P9K98l84o06K01P70j5j002K80O03N85j178p88Q29R50
1767F80n08j016Q85Q40p82o56O45M42j35p44q3J04R59j71n77k3J59O48p72o69
1787g74M37Q51p0r93L27O94R2r66j36O37M83k38r16j3O77M5ko31L80O14j02r05
1809e09L06O53J14n78k19L14K93l28n74M00K59J35l1m40K97L41o69j50N76N29
1829G19k07r62j98P97R0m15J6L08L90n09j81J04J53ok78J7K89J10P5n37m33Q71
1851B13L2l50l68M68M02m11k89L13L81n79n79L87N04Q8l22k86K14L57j17m28K52
1872a18J87K80j02o53L77L89Q8j024J40R69P9j084M7Q53o8l32r6J17L41r3k06
$$ y = [47, 299, 203, -377, -472, 463, 394, -485, -331, 374, 297, -901, -511, 898, 672, -710, -980, 740, 1012, -311, -943, -62, 364, -205, -824, 58, 137, 435, 51, -555, -354, 416, 401, -601, -321, 282, 867, -311, -1099, -270, 680, 172, -844, 41, 881, 99, -557, 88, 530, 395, -349, -432, -328, 631, 460, -117, -140, 19, 667, -105, -774, -337, 514, 444, -549, -222, 472, 564, -402, -538, 99, 582, 344, -572, -585, 92, 137, 135, -496, -116, 498, 396, -509, -203, 450, 564, -14, -233, 81, 374, 46, -528, -128, 131, 266, 235, -205, 92, 433, -236, -386, 190, 719, 512, -450, -648, 149, 239, -176, -160, 148, 538, 29, -152, -48, 105, 99, -179, -162, 127, 237, 312, -225, -658, 213, 245, -105, -473, -5, 397, -14, -303, 10, 391, -188, -767, -380, 124, 212, -110, -396, -182, 175, 58, -370, -118, 69, 349, 247, -406, -29, 360, 448, -576, -436, 533, 612, -472, -425, 428, 360, 28, -68, 49, 390, 297, 91]
1893I1j05m8P0M36n97J87J67o0n57L15K87J03m45j52L90K15j08n21K96n1L28l66
1915a25l14M61K96k48n81M09K08K38n83o2L10L8j31j07p1R9J85j23L60n61M19
1936A17J15k36K8k6N84p58k09L84P31q07l45O12K62o01k85O26L52q79m46J024
1956B43J03m18m63L91K13j27K00q8j18o27J076J20j067j54J152j33r30J50J445
1975I68n62j028k95J742o68q39O99L57o35l17P04J34m46j63P03l05p47Q47M98
1994F47j182l86J432M83j153p54J062O18p33o91O39J77o65K35J115m61r75L59
2012b33M70j65Q5K72l69q13L11J137m34n09k89Q05p0m40J58N98o38l61L63O51
2032E29l25m33k17r4L75P98l61q85r4Q67K39m99JK72n16l80O44P44l31j024M24
$$ y = [91, -14, -62, 8, 444, -153, 34, 201, 141, -416, -101, 186, 289, -156, -308, 82, 297, 189, -332, -36, -87, 241, -125, -439, 22, 318, 70, -511, -102, 106, 344, -239, -301, 9, 47, -84, -191, -262, -163, 22, -101, 259, -302, 117, 232, -4, 24, -2, 582, -176, -385, -1, 730, -77, -422, 190, 452, -149, -434, 192, 544, -335, -781, 243, 346, -72, -535, -144, 69, -58, 142, 54, -64, -691, 385, 505, -562, -716, 436, 303, -627, -477, 968, 406, -622, -917, 825, 157, -682, 17, 374, -261, -578, 126, 260, -186, -349, 354, 49, -698, 149, 647, -535, -921, 511, 994, -159, -913, 149, 767, 34, -657, -18, 159, -506, -271, 844, 383, -592, -233, 237, 72, 157, 429, 60, -753, -442, 695, 261, -248, -537, 268, 198, -242, -84, 514, -124, -485, -122, 529, 204, -229, -446, -540, -165, 633, 272, -613, -707, 160, 399, -100, -99, 173, -343, -723, -79, 665, 334, -690, -266]
2053b66M25L2K61k48o68l5R36N50r96q63J287J89j152L69J133q01j372P04J899
2072A384r31q93Q4M45n29J88J163l01j231j59J660l36j294O03J042r49r08J329
2090C67J148k053j330K179J229j826q32J268L62j571J099J252j189j545Q96J517
2106I71p07p57J184m48j800P88K346l1k597m13K520j41j471M71J277j455j157
2123a420J718J142j492j061J390J05r48N51J335j684j276J882J858j604j953J043
2139d14R32o59k67J327J65k272R2J812M76j504q0L25l66K08J206j98j517m46J631
2158D51K43r64k53P52n84m57J361O02j147r38M61J104J30n41p00j16K40P20Q49
2177A213j338n18M61J68j15P21O05j208r46P79J309p73o78pN4J42N28L53r81j012
$$ y = [-266, 159, 191, 452, 204, -464, -499, 437, 987, -9, -872, 415, 604, -548, -179, 954, 153, -1219, -515, 1384, 453, -440, -356, 89, -440, -252, 911, 610, -621, -780, 880, 544, -750, -147, 895, -54, -962, 367, 1515, -538, -1868, 311, 1540, -286, -1118, 150, 512, -1059, 40, 1292, 103, -1442, -546, 971, 264, -493, 691, 243, -1557, -769, 1577, 1546, -1051, -1464, 1056, 915, -556, -85, 1192, -263, -1420, 298, 1440, -52, -1113, 277, 382, -566, -15, 1320, -364, -1640, 242, 2100, 496, -1457, -414, 518, -141, -408, 919, 1084, -1188, -1096, 716, 1192, -312, -392, -67, -433, -225, 981, 783, -734, -1180, 451, 694, -270, -523, 229, -355, -812, 549, 1151, 4, -934, -473, 631, 761, 220, -480, -596, -356, 364, 1213, -125, -643, -182, -14, -129, 592, 1197, -11, -957, -178, 1131, 358, -320, -327, -273, -131, 397, 750, -231, -1243]
2197a243J056J305p59n87M26q2j094L47K385p55k442q5K138J87j131p2P22p85
2215d69m11J215R82j735q58J420R1r83O47J164j348j417J901J858j902j766J399
2232b12J186j070q16J598q5j914N16J971n2j767m2J029n59o7J281l96j702m41
2250a542K707K97k029m43J646j36j368P53J201r02j591R05J659p53q85L43L46
2267B08r04O64J070j059j446O41K042q16j117O36M93j165m8J406M21j678o18J466
2285A96O92q88j29M06o24k11Q13O57q85m90P29j50k78N60L78p85j049Q81J500
2304A323j032j160N14M95m1J92J99o42l76P65J69m55L92J48n50r13N11J627n67
2323E99j470N26J038j61p61r9L46k98J19K88M01j110nQ01l48j95P52j6q44n14
$$ y = [-1243, -187, 1118, 359, -228, 198, 116, -978, -631, 1754, 999, -1443, -1528, 610, 797, -334, -406, 316, -469, -880, 335, 1317, -418, -1276, 144, 235, -748, -101, 1063, -285, -1702, 199, 2057, 155, -1611, -212, 974, -96, -912, 686, 601, -1313, -797, 1174, 1122, -645, -687, 342, -217, -284, 997, 601, -1101, -1542, 1165, 1462, -567, -1010, 636, 500, -868, -115, 1086, 184, -1407, -502, 1157, 404, -481, -138, 208, -696, -32, 1038, -21, -1467, -826, 1216, 400, -717, -81, 412, -753, -801, 605, 1026, -652, -1270, 196, 888, 0, -129, 277, -347, -558, 255, 912, 27, -463, 266, 116, -162, 398, 776, -9, -1058, -177, 1323, 291, -869, -355, 140, 99, 291, 490, -152, -528, 237, 406, -49, 343, 491, -59, -972, -461, 1166, 599, -871, -345, 693, 532, -229, -328, 18, -280, -161, 127, 528, -582, -587, 214, -134, -329, 423, 407, -437, -951]
2343i51J389M65j489m00J219J73n69j4P28l92j214N96J107j14j056L28M55l07
2361d6k20P71l18p97O68P52k20j651Q86Q11m77o71L62J051q44q65O16Q77l14n95
2381b24L40l71k00R22J79p86m86Q97N06j137j18J007j92o67P8O66L39q67k36K68
2401h2N54l99m4N6m53K47O72l4p65N9L86P1n48L66J17j10l50L98K45j36m24J40
2423c4OJ47k96J18K06j30J39j36K42%j32j23l38M57O1km67J7L77L39o37Q5K36
2446A35Jk25K35j79Q5R0k12j39j01N47n3m41r4P24k26o22j32Q10Nm44J61J98J00
2469B23m06M6n3J28k0L38l90j5K95L7j56j58J20L85n76l01N45L00j20m63N20N9
2491C38m24m06N78p5Pk52R1n5L40J26k27k59K21J69J99p65J74L95K13o15nO17
$$ y = [-951, 438, 903, -586, -986, 233, 406, -163, -177, 551, 159, -1055, -459, 648, 534, -522, -194, 261, -46, -266, 505, 187, -610, 58, 810, 590, -1061, -175, 636, 159, -512, -150, 901, 57, -808, -192, 685, 371, -224, 116, -255, -455, 467, 646, -140, -626, 271, 777, -360, -478, 529, 337, -330, -252, 414, 753, -114, -350, -82, 472, 73, 29, 85, -368, -121, 551, 517, -248, -189, 197, 268, -280, 86, 203, 93, -257, 141, 386, 250, -174, -34, -28, 119, -177, -59, 147, 17, 156, 20, 262, 262, 130, 7, -331, 126, 187, 185, -282, -265, 112, 451, -186, -101, 135, 136, -89, 146, -33, 52, 142, -70, -209, -310, 237, 184, -257, -351, 373, 147, -475, -607, 203, 208, -236, -75, 123, 223, -183, -137, -190, -62, -82, 256, -134, -149, 146, 183, 27, -131, -11, 374, -202, -503, 42, 342, 222, -241, 279, 338, -86, -492, 86, 11, 18, -234, -143, -198, 142, 268, 41, -218, 3, 172, 371, -394, -220, 175, 388, -227, -232, 385]
2513C85k64pm48L83O10m46l13j20L61N0q9j40l36O65n4l56j20K06K84k78m95J86
2535c36L02K71j82p9n3K65j07j0r3K26P0k14j38K59N2l72K03Q7j85k3o3rK60k97
2559a66P2J72O1P8l44l8K21K50m50l44M14K85q1j84k83L05N1j16j89J09N34l14
2581D3k11j20K36J11J3L5j98J26L83k55l39O1J29J90k27r0N14p3j58l17L23L86
2603E62o56k38J49O4J24J11k26k18L95L36m99K11m46O16n8l36K18j69p4j99L70
2624C7K71o55J8L38L58m88L1j21J32R8k54K34p8J77q1K01m46L13K81m31l97J56
2646c06O15K50o45k57L05J83o4j24L5J84j18Rl38MM66k66j17j18J18M81j81j42
2668b6l63O28l4l59j50J68L3J1J82K16j99j78M84k77k84K90K58o06Q2J98L0k95
$$ y = [385, 121, 114, -334, 49, 659, 213, -100, -220, 141, 191, 102, -38, -374, 291, 237, -119, -239, -33, 251, -27, -522, -336, -34, 237, 55, -24, -77, 188, 81, 71, -22, 204, 274, 60, -78, 181, 233, -139, 64, 151, -34, -57, -120, -129, 131, -166, -94, 78, 139, 217, -127, -165, 56, 306, -144, -488, -74, 211, 130, -54, -337, -32, 19, -97, -286, -177, 357, 43, -168, -288, -52, 59, 72, 107, -91, 35, 418, 163, -176, -115, 14, 204, -23, -113, 401, 328, 170, -147, 176, 562, -94, -332, -183, -119, 5, 116, -110, -328, 67, 403, -96, 115, -331, 285, 227, -109, 109, -60, -134, -333, 37, 308, -347, -329, 9, 367, -121, -90, -211, -79, 19, -235, -1, -79, 98, 17, 218, -228, 85, 366, -65, -462, -306, 309, 559, -86, -343, -38, 145, 81, -43, -8, 176, 58, 67, -271, -267, 199, -67, -184, -302, -184, 297, 116, -26, -389, 239, 205, -154, -304, -136, -103, -92, 90, 306, 107, -71, 413, 136, -148, 142, 400, -206, -124, 74, 104, -191]
2690a91J09J01m5m54M35P4k21m7K0O50n36Q4R7k44J63j8MK74k60j35Qj65L50O6
2714A19R9p43K06N87j16m76K91k9R8j4L9J97m79J31L33k03l7j41N22o01k4N79
2736C38j66n28k9N85K94o95M50k88o2l05K57M15l96l4J28M28n89J6K80J95p43
2757d49L24M69l97n05K69N31j91j28P3J56n91K02P20k3n87l91M72J47o58M48M04
2778B95q75J06Q07O09j200l00Q32j4k81j13P09l61p56K50P54o07k86M90k33k2
2798a96K29P44l80j038M79Q51m02n37K15M05r20Q4J011l50l68m9L43K16o08M59
2818A88J66n24j33N98K41o84k81N02J01l94L49K50n89j66O97N13r33o42R44j71
2838C2j97K2J046o93j117R56O46j30n90J48J75p04M2J236m07j149k82J130L87
$$ y = [-191, -82, 19, -26, -480, -45, 29, -192, -239, -219, 431, -105, -21, 76, -168, -5, -23, -19, 255, -5, -140, -132, -297, 53, 119, 218, -525, -319, 268, 152, -324, -33, -62, 36, 22, 61, 258, -221, -90, 243, 40, 3, -138, 384, -217, -241, 338, 172, -356, -385, 200, 494, -201, 249, -39, -101, -406, -149, 266, -130, -164, -36, 392, -197, -181, 99, 294, -449, -125, 344, -53, -558, -289, 242, 51, -77, -4, 152, -439, -237, 483, 460, -127, -518, -46, 101, -557, -109, 295, -580, -474, 333, 942, -258, -558, 274, 260, -21, -134, 575, 214, -542, -292, 462, -145, -431, 59, -174, -196, 33, 777, 397, -641, -162, 689, 287, -250, -35, 370, -550, -466, 545, 195, -173, -222, 121, 337, -271, 188, 354, -170, -303, 295, 536, -148, -429, 73, 174, -220, 129, 379, -210, -376, 321, 834, -99, -741, 203, 32, -165, -143, 903, 210, -907, 49, 695, 565, -25, 123, 298, -406, -364, 872, 465, -684, -966, 164, 551]
2857E51p93L51J33p13j88J074M04j341l40J351J66r43M1O72m40p81J030O57r97
2876a06r19Q28M58m47m6Q19n70q87N35J074m56p79K70N45n01j90Q65N2j261L21
2896c95J087j2j166K79N43n26k91J036K90j241n96J163O33j334L45N81k46o83
2914e33N45R29o88j144O53P77l08l76L04k09n85M39J080o18r03KJ214m73m21L49
2934C4R7q12L57R14q7q56o4N69%l08M51Q9q93r6R41L95j062j33M85J1k88N97L79
2957G20q63l91P01M26q47J12j11K27J9J38M53l77p99O48N48n86n17O77J37r92
2977f77N72Q58n61j082O13M50p8j58L84j77m69l83J204O1r14j88O83J29p65O92
2997A94M87p60r04J485R5p83l95P98Q3o93L21Q89p12q73N18J043n38o36Q19j66
$$ y = [551, -242, 109, 242, -471, -659, 415, 819, -522, -862, 489, 655, -288, -247, 425, -15, -796, 234, 891, -106, -1025, -197, 261, -186, -232, 587, 17, -870, -335, 739, 283, -496, -226, 319, -182, -372, 493, 545, -716, -395, 692, 680, -486, -207, 336, -190, -481, 555, 845, -396, -992, 171, 804, -530, -185, 396, 150, -533, 12, 941, 253, -891, -238, 539, 231, -145, 159, -50, -635, -196, 884, 266, -637, -635, 579, 106, -315, 34, 131, -681, -324, 590, 503, -353, -417, 152, 152, -156, 295, 384, -509, -605, 336, 731, -331, -464, 21, 32, -256, 341, 720, -143, -534, 167, 593, -254, -142, -253, -26, -7, 131, 584, 207, -592, 56, 604, 18, -499, 178, 315, -677, -105, 753, 192, -890, -277, 173, 95, -63, 321, 144, -325, -708, 496, 557, -357, -545, 138, 267, -498, 194, 681, -79, -983, 502, 597, -186, -581, 217, 300, -393, -72, 817, 105, -768, -250, 793, 255, -381, 438, 272]
3017B72q20M11J024k29j208J1J301m41p32L13L70n37l24N99P72r56m43R77K38
3036E98q01L12ol59m69R17J34l16p18P35Q82r45j05J20L72p93J00R33m22q59M10
3057b80K14j04L2K94R1n92OP22J58q58L58O7Pn36N12K39k74m53O70P9l92k82L37
3080A5J28l2N4J90n68j03O45J83n09k01P17l36n60J70M34j9n51J44N06l29k80
3101c02L65J44j14n4J38pl96L89j83j81J66J30J74m54j56M04K28o68j46O84k6
3122A35l84J79L92k68j13J51j13K11j94L13n79lM77N7j36p63Q12L94o55k46L87
3143E4J68j09l43J25L32m08K23k22N40m19K5m2j5K83k49J60k83N1O13k16m26Q2
3165g6L69N9l00J97j30j02N4k24j03K13l5n0O8k92K33L42l97L0K68rj94r3J36
$$ y = [272, -548, -137, 887, 658, -550, -539, 762, 321, -411, -98, 272, -265, -589, 10, 782, -174, -617, 360, 598, -203, 109, 103, -256, -725, 192, 326, 10, -708, 27, 909, -36, -141, -21, 351, -442, -342, 591, 169, -690, -280, -66, -170, -138, 156, 247, -345, -339, 383, 541, -317, 41, 108, 115, -421, 91, 330, 56, -397, 273, 352, -40, -322, 15, 143, 111, 165, 355, -213, -316, 329, 512, 3, -198, 519, 183, -377, -207, 227, 208, -343, -199, 307, -22, -302, 63, 207, 93, 39, 177, 170, -226, 163, -20, -201, -35, 95, 269, -185, -341, 63, 291, -377, -523, 161, 135, -249, -70, 322, 54, -59, 92, -21, 190, -4, 309, -270, -273, 204, 261, 125, -638, 174, 568, -87, -333, 54, 222, 113, -230, -105, 227, -181, 42, -180, 360, -59, -34, -76, -91, 192, -57, 103, -180, -129, 484, 268, -158, -76, 293, 352, 52, 249, 119, 17, 71, -153, -256, -43, -78, -128, -60, -352, -119, 223, -174, -144, 124, 115, -79, -172, -36]
3188c6J12k05r8L46J7j49o3J77k42K86N9j42k70J55M28k97J89j3k84qo6J89r0
3211eJ81k16L20r7k56q3J5J45R2%O5N6r2l63L28j95J8L21n40j09K35L60j86K04
3235A98j39n7K26n41J71J28J47j08k08j02M57m3k73J64J16K8J26o18J84K04J55
3256B15j96j41J50K06o06O6L87j3m44L65J13j43J46k92J17Q0j32L4L95n44K69
3277C2L28j57l48J30m7J69k75J02K79j45N0q5J40M6j81j41J36k2K3J75m62J48
3299a05j1J08k4k19L8L08j74J04N7O6j05l8J96k78j87L9J87K67j38p4n0n3J5J12
3323D1k16J15j02J84n6j40P0L63l68K01k89J91l8q6k42L49m8k7K14m54L90J69
3345B21j37J20j95m5j43m8N46j34k75K74j54L24k76j39q3J35K24n68M14p5K4J86
$$ y = [-36, 76, -129, -227, 119, 136, -13, -76, 101, -141, 145, 204, 62, -208, -53, 375, 78, 267, 254, -30, -38, -104, 85, -5, 176, -40, 280, 183, -73, -156, -141, 4, 96, 96, 161, 217, 125, -238, 90, -105, -87, 234, -306, -415, -180, 180, -6, 198, 59, 2, 228, -313, -142, -14, 133, 25, -183, -285, 172, 129, -144, 20, 136, 164, 290, -328, -144, 60, 215, 19, -122, 28, 234, -372, -306, 81, 68, -376, -11, 102, -41, 105, -187, -70, 10, -122, -88, 307, -237, 32, 360, 203, -145, -15, -62, 107, -168, -66, 213, 68, 118, 33, 173, 219, 38, -103, 33, 11, 34, 209, -253, -105, -116, -8, -32, -251, -213, 95, -79, 25, 82, 148, 43, 5, 201, -77, -264, -225, -38, 229, 91, 17, -33, -86, -71, 41, -175, -60, -162, 22, -34, -174, -104, 259, -109, 92, -197, -6, -44, -130, -372, -23, -71, -98, 116, -338, 52, 221, 84, 204, 9, -36, -179, -227, 319, 185, -90, 184, 30, 354, 78, -61, -144, -9, 215, -353, 61, -14, 10, 196]
3367A96l79l39M28J30m2M3j9K47j70K10l05p2qj5K03q7o9l5J85N3n19K43K21m4
3391E6M1j18r5J40O0m6K21l43Q4j28K89k81OL29k56j13J93R2m71K85L3L2l75J71
3415a94P39l62l72L86j91j80K5R9K50m01j02K62L34k05J21k65J13L8O9j67j84
3436a87j0L99K8l39P4j27L85j2m5k09K45n33N27L3l05j61O17m12j73Q5M82k82
3458H0l57L73O4l30O0n3L95l67k55N78J75n04L0K59j34k40L58m8l53K46J9Q8j82
3481i8J30j54K24m69K64L04n29q2L30K05L9m69N07k84m46K78O07k61l23K22K79
3502B74k53j55K56J89p13J88N29J7n52%L04o7O9j41N12p61n3N65L29q63J60L88
3524B22Q4n99M22K88o50j11L89M70l93m29L91q8l31M09L46l93p20P16L38j84n38
$$ y = [196, -183, -522, -94, 36, -6, 37, 18, 265, 95, 305, 0, -72, -80, -95, 108, 21, -48, -83, 102, 155, -364, -121, 100, 56, 97, -21, -116, 24, 84, 38, 259, -84, 0, -128, 161, -120, -114, 215, -41, -154, 39, 131, -340, -55, -22, 10, -365, -194, 545, 183, -189, 197, 6, -174, -149, -50, 200, -201, -303, -41, 293, 88, 209, -56, 57, 95, 164, -3, -187, -197, 202, 230, -109, -35, -162, 223, 211, 166, -43, 202, -331, 196, 229, -76, -237, 380, -32, -205, -120, 362, 80, -277, 96, 160, -170, -110, -163, 232, -135, -390, 188, 363, -141, -111, 148, 14, -226, 132, 84, -269, -23, -4, 84, -98, 32, -122, 102, -367, -103, 201, -328, -410, -80, 125, 164, -305, 202, -82, -528, -250, 357, 96, -227, -5, 274, 21, -134, 122, 311, -402, -214, 315, 332, -220, -220, 84, 17, 86, -55, 457, -304, -357, 208, 537, -326, -166, 222, 306, -293, 129, 417, -233, -344, 45, 515, 122, -307, 84, -4, -335, 74, 420, 27, -693, 23, 361, 177, -361]
3545c61M30j67k61L59M63p8p40J42M95o1l60J98J37n42K30O22J34p16j89N50r5
3566A90m31K56M57m30k43N27K89n14m67M58L34k13k13J70n1m57K23P14m47o05
3586d53M39K55n16rM68j76o13L61M95J35n08l7L08J8o77O71L05q18j28P00J20
3607C40k07l20K60k83j47Q12K2n11o53P94K04m67Q9j58l2j76P77L95p31m78L60
3628a10K32J07j13j63J11n08N6P12j70m16K6N94n19L01Q4J5m98QO30j74m94K1
3650b68N17j89k79O85j65n44j65L77L72k49m65M50J65m90O6Q74p81m54P05j52
3670A0J00n19M83k06j22J43O20m02o34M52J71J92o5jm5k55l3M22k3o34L36L03
3692B93k76l7K57K24l58m25P35P4l48l81J91L14o57J74O41k04r48Q90J54j14m05
$$ y = [-361, 69, -98, -359, 0, 463, 385, -355, -213, 282, 221, -139, 59, 196, -346, -116, 506, 640, -76, -265, 285, 190, -241, 15, 472, 42, -201, 326, 615, 101, -366, 92, 426, 213, 0, 170, 119, -338, -115, 599, 152, -453, -14, 241, -275, -284, 184, 8, -605, -244, 251, 386, -122, -159, 149, 167, -510, 161, 466, -352, -480, 220, 340, 133, -187, 73, -210, -357, 455, 477, -34, -687, 107, 311, -156, -67, -225, -257, -433, 344, 739, 8, -470, -110, 122, 229, 116, -47, 64, -444, -388, 324, 154, -262, -236, 358, -161, 140, 224, 239, -259, -251, 379, 205, -289, -268, 249, 60, -219, 466, 301, -243, -408, -31, 341, 92, -373, 77, 242, -248, -182, 692, -89, -543, 162, 10, 110, -409, 74, -132, -254, -111, 509, 107, -527, -75, 96, 288, 223, 222, 177, -78, -111, 311, 288, -346, -10, 293, 17, -20, 237, 461, 103, -322, 413, 487, 139, -242, -51, 263, -394, -220, 421, 217, -731, 159, 313, 199, -206]
3713b06K73K03n30J60L08J63q33J75O46m21K02k88M35n42K23L85q1l39n2K19K32
3734C32l02J4M67o44M8J72K67m86k5J38J72m72K22J23R4m07M58J0P3o01l9Q37
3756D51m44qL24k61l41K09j21K57m69M05L21j23m83O65j25p16J73M49L64n33j86
3777a92l1O2j87M38J51l50j61K18J39k1l19J41J39l00J26N64k92m60L38J67j0
3798A60l21M71l02k04P1L22m6m3jm2N3k09M44k03m51P8L17K29o34K73O5Ql70L31
3822dL76n31M7L41pk45j35J27m0j05M91l59n8m7J02K09k2l96J60L67n06J11L42
3845B18k82K02j02K23k95K13N4k97m2J69J80j61k10J07K5J41m67M31L3k67j65
3866b92K98m%q5J00J25j56m1J9K08l74K84K31j4k28K84l52k5R1j73M8J54Q8k70
$$ y = [-206, 67, 270, -260, -100, 208, 371, -462, -287, 359, -62, 140, -148, 287, -255, -32, 353, 272, -67, -119, 100, 332, 30, 44, 511, -133, -85, 87, 354, -132, -157, -19, 153, -319, -97, 26, 120, -287, 171, 181, 254, -347, -386, 451, 7, -1, 323, 62, -279, -70, -191, 66, -403, 2, 323, 200, -283, 382, 257, -459, -286, 163, 527, -6, -192, -223, -161, -348, 90, 241, -109, -270, -52, 87, 66, -253, -112, 27, -273, -147, 417, 125, -335, 3, 170, 160, -161, 310, 8, -196, -125, 197, 151, 108, 107, 65, 118, -91, 353, 150, -301, -223, 94, 323, -311, -38, 27, 35, -335, -4, 372, -159, -112, 229, 222, -23, -158, -31, -71, -176, 315, -44, -102, -149, -47, 162, 140, -256, -96, 271, -235, -124, 218, -64, 138, 36, 259, -36, 177, 231, -66, -108, 61, 241, 80, -130, -23, 2, 143, -324, 107, 140, -127, -292, 6, 2, 2, -83, 17, 142, -14, -55, -36, 172, -202, 82, 313, 299, 71, 355, 3, -22, 69, -104, -56, 98, 186, -84]
3890h4K16l90M07k12j50J55J9K4j74J49j9k88L57J76r5j59P6K0J37J8j92J35O2
3913A88r5m4J38l4k16j85K12j59L76j25k26m2L10j6k04J8r4L04j71k0K18o1k4
3936D8l9J7j15K13m0l23k2K21j25J59K82m36J01q5P9l1L37j28l31L81K46l41k80
3959b12J20L55l40J04r6j94N8J58J77q7k74J84K3J41j54J49M7p5J52j40m7j00
3981e1o5l6j6J88j31RL99j41k45q8K55N0r2J78p5m0j35P7k18J78L88k08m02L97
4005A76l4J75j25j30M2m64M52r8j09o7O9R1J5R8o4o8Q0p0J58j17l5k36N88m60
4029a33K70j44L56j29j73k64J01K14r1M0K7lk78K56K0O0O0k89L8J8M9J23J41m27
4053a58J41J20r5J94l32P0m3L19j45nj36J35j39o4N7J18J49l28J63J88n16J50
$$ y = [-84, 132, -258, 149, -63, -213, -58, -39, -15, -189, -40, -59, -347, 10, 186, 91, -68, 8, 28, 165, 183, -9, 126, 188, 93, 49, 187, 153, -63, -248, -36, -195, 181, 56, -170, -212, 98, 82, -122, -104, -198, 106, -65, -85, 133, 72, 48, 9, 26, -89, 124, 84, -239, -261, -40, -165, -6, 276, -160, -59, -144, -65, -96, 241, 113, -218, 163, 409, 68, -212, -92, 263, -77, 27, -69, -263, -205, -47, 130, 43, -231, -47, -24, 117, -37, 112, 159, 84, 236, 96, 49, -51, -116, -152, -168, 20, -111, -102, 297, 156, -89, -177, 78, 128, 36, 214, 139, 99, -36, 41, -177, 1, 389, 181, -221, 176, 142, 317, 192, 62, 104, -360, 92, -6, -115, -182, -113, -22, -7, 91, 27, -41, 39, -31, 127, 10, -25, -261, 327, -133, 137, -7, 349, 220, 47, -217, -116, 98, 7, 47, 74, 71, -207, 49, 69, 129, 189, -100, -62, -44, 5, 128, 269, -158, -17, 103, 8, 202, -130, -60, -103, 216, 71, 66, -70, 65, -74, -138, -81, 37, 186, -142, 21, 209, -307, -157]
4075a57J01kJ24l06mM05l3k51L10L4l46j5l5J90kl3M54o30j01J70N46p80J05L82
4099A26m0j96J70R0O8j90J89j47n5J3O5J43k30O2K22l47q9J7L42j76l6N5J01l84
4123b27J47J52j64O9l32M31j33j25J77J79k36K8P7j40k83K74L06k26L20k50J75
4144B19j52k73L8O8N22m86k6N0nK64K0r7j60n6M06m7k31J49j4n15L38J25J4l22
4168a71K16M6k67J05O2j11j79N1J55L22m16K19O9l22j25K60N61m24m15N61p0q9
4190C8j58J41N4j34l15N54j8l07M3M25r2n62N19k32l74L79N85l74k40Q8p6M17
4212C61l38j2P6m62L99J86m8l79M91m7j63n1j34R3jl19M50J54m89L00O8j57m9
4235g1NM05k84l97M31K64l99L6k63P77l66l35O17l28k76j8J79J78j99j0j30k7
$$ y = [-157, -56, -58, 66, -240, -244, 161, 128, -123, 187, 221, -125, -140, -175, 15, 13, -20, 434, -196, -297, -127, 419, -361, -256, 126, 86, -110, 60, 150, 218, 28, 217, 70, 15, 28, 93, 236, 6, 68, 290, -57, -146, -129, 213, 37, 1, 56, 157, -227, -80, 72, -92, -23, -355, 76, -57, -182, -5, 174, -62, -34, 43, -97, -380, -106, 200, -26, 294, 44, 219, 67, -206, -168, -100, 422, -64, -90, -40, -45, 219, 239, 142, -18, -74, 332, 285, 54, 203, 189, -326, 12, 137, 151, -171, 45, 91, -176, -71, -9, -120, -299, -248, -93, 229, -187, 32, 101, -221, -346, -86, 475, 51, -364, 197, 127, 38, -120, 21, 75, -59, -374, 180, 162, -145, -102, 323, 231, -331, 188, -44, -418, -39, 546, 172, -68, 20, -56, 361, 23, 11, 87, -375, 24, 210, 162, -217, 274, 227, 64, 13, -121, -28, -29, -348, 102, 256, -233, 67, 135, -22, -71, -66, 339, 55, -342, 89, 353, -46, -10, -273, 504, 138, -197, 420, 92, -184, -202, -23, 155, -44, -54, -184, -211]
4257b11J63M68l76q5K7L68l11Ok5Mj03K22j77M52p16L4N9J58Q1J11J21j88l07
4280b25M66j11j5k70J77K46k78m0J43J10m56J40N03j92m06K69j19p4J27n6J21
4301F0l58j25O55j08q13N49K32J59n20N50j85k74j56L76Q0k29m6N8K9k14N82M1
4323C43j08o01J51M55m66L0L71j06j64j9N06l95m39L87M42j13n79O93k35l65j80
4344c92N31Qm51J06K07L1j40K87J11r5n30J26N56l28o2QJ24p7J28k02J5k87N03
4367A77j95o7J54K5l35nL56N01l41n31MM31R6l59K39m0j74L5K82k56k8q5L56k73
4391c3Q0j36J24l45J78J57L39l63l02M42R3m15K16K2m6j19k67O02n16R1J09K53
4413A64n44N56O2m41j4L16J01n20P6Q0L72j91r5J90k4m51r1L73L04m59J86k7j08
$$ y = [-211, -48, 420, 44, -41, -14, 354, 43, 49, 24, 28, -75, 147, -30, 422, -294, -260, -201, -43, 38, 149, 270, 82, -225, 241, 130, 115, -155, 22, 268, -10, -50, 93, 203, -253, -113, 390, 198, -208, 61, -58, -132, -5, -61, 60, -298, -423, 232, 124, -689, -140, 92, 251, -269, 281, 96, -178, -334, 42, 122, -107, -153, -95, -66, -280, 302, 343, 235, -366, -215, 240, -226, -196, 175, 69, -95, -114, 392, -3, -442, -55, 387, 274, -305, 388, 153, -212, -392, 139, 147, -304, -198, 9, 40, -100, 187, 298, 203, -327, -201, 355, 27, -35, -27, 97, 20, 148, -54, -39, -326, 177, -18, -85, 69, 94, -241, -246, 110, 611, 270, -261, -257, 174, 270, -89, 150, 110, -64, -29, 253, -3, -31, -116, 240, -33, 47, -89, 35, -310, -132, 25, 364, 1, -301, 141, 234, -181, 35, 57, 11, -108, -375, 227, -289, -198, -89, 164, -380, 176, 238, -203, -217, 99, 200, -320, -244, -164, 208, 17, -78, 112, 88, -363, -454, -81, 223, -236, -50, -77, -185]
4436a85M57k57M44l31p03K75M77k96N6K24j74k12K14M42j08l08K44l35J0L29k10
4457E3j34q1L94k23K47j75k14n8K08j54N92n04l84J96M08K15n26K1O06n72q2K83
4479A16K8j29l78N71R2k62j21J27l04O4K67m2R6k35o2O50m17j38J76p7K8j18j5
4502h3J52j36J54j01j23lR4Pj78J08L87k54l67J27J63J33j63Q5M70l62l28L07
4524H9k04O9j55J75J30j00l5M9j43JJ9L87o20L70r3j19K92k49J40K69k75j21K12
4547H8o3k11J7M00j91m0K88l35r0P7L90n68J80Q4L0K17k71O0M2r1m4J49p7j24
4571h3lM33k98k03J09L6J00j81J79j93J85l0K2PO8j23J08p8k21K28r6k7p4J83
4595D8P4j08j23K3J15K03m38K24l7o6o1J92p2j01J96j96K66k17l3Rk0m8K45k13
$$ y = [-185, 272, 15, 459, 128, -575, -300, 177, -119, -63, 161, -13, -225, -11, 431, 323, 15, 259, -76, -66, 263, 53, -81, -162, 232, 9, 256, 81, -133, -191, 17, -137, 455, -49, -433, -237, 171, 386, -140, -119, 487, -85, -167, 116, 144, 15, -363, 208, 300, 38, -83, 44, -260, -196, 71, 29, 125, -110, -172, 478, 61, -77, 99, 22, 50, -68, -83, 69, -67, 87, -14, -137, -140, -46, -39, -217, -109, 278, 24, -343, -216, -53, 80, -83, 2, 472, 110, -218, 89, -115, -46, -201, -26, 104, 4, -31, 18, -125, -124, -105, 282, -338, 32, -61, -180, 112, -137, 3, 272, -3, -124, 88, 25, -186, -169, 231, 40, 0, 288, -47, -137, -60, 330, -238, -58, 26, 56, 273, 2, 62, 104, 13, -31, 118, 41, -83, -86, 347, 49, -154, -45, -9, 91, -90, 89, -104, 81, 51, 73, 80, 148, 25, 133, 55, -166, 62, -34, -61, -135, 48, 122, 14, -109, -86, 29, 232, -206, 18, -19, -85, -146, 46, -26, -127, 69, -127, 139, -78, -111, -102, -122, -170, 75, -138]
4619a38m3J63J0k03J96k10J95k06K32p0q3k4K9M42j87k85j40N54p7m7k24J94j47
4642f9L0J04l05L30l4R7q9k39J08P3j49j75N25k24j80p3J86P5P0j23N8l8m1K81
4666A98J03k60k14L13Q2l94j48K58M41l66l2P7l02L95P1m23J32J29n1J02j55q7
4688a31J62K27m68K11j32J94j61N0j66R0j38L89j58N4J81l55J56r1J58K72j91
4709A53k95K10p7l6K5J57j40K50o21J38J59N5J16m10L00l29L67K08l19noJ16J14
4732A30j25K21l54K67J41Mk20k38R7P9J24m23M01N1p1K25m48J30j40J13J47n3
4754E8J29j04k41M6J39L6j01j0J23J10k09L46j72j67j5q1K69j63J39J45k33K8
4776G2j63j09K37p4J4N2j09K1j16J90Q4q4J33M6m88J93K88J1j45M7q1j63J85L8
$$ y = [-138, -181, -18, -8, -211, -15, -225, -30, -236, -4, -74, -157, -181, -152, 290, 103, -182, -322, 232, 155, 108, -116, 78, -69, -39, 65, -240, 90, 56, 153, 64, -175, -67, 6, -143, -318, 207, -17, -197, -270, -84, -9, 61, -62, -4, -42, -83, 198, 301, 41, -173, 140, 222, -172, -320, -62, 379, 13, -19, 58, -244, 151, 222, -201, -69, 60, 9, 111, -44, -131, 31, 258, -210, 1, -131, 63, -98, -48, -214, -124, -262, 127, -31, 23, 204, -151, 5, -86, 72, 344, 153, -142, 68, -9, -45, -20, 137, -3, 247, -374, -236, -77, -22, 94, -316, -16, -345, 22, 230, -89, -94, -100, 16, 130, 5, 226, -128, 139, 280, 284, 64, -174, -77, 2, 126, -297, 104, 155, 84, 309, -139, -9, -149, -36, 111, 58, 187, 83, -158, -112, 27, 63, -38, -48, 75, 185, -24, 322, 150, -17, -32, -113, 156, -7, 132, 277, 44, 72, -91, -200, 37, -37, -23, 29, -80, -59, -175, 15, 99, 15, 148, 194, -294, -101, 187, 198, 53, 100, 19, -144, 41, 79]
4800G9j18J08K57m86J90j48P1J73Q3J30l96R0J46j36N1J01k15j95J37J26J39j68
4822A9J06l14J64j52L11k03p4k15M89k30J03K65p6m04K52o8R6k82K29K24k06j82
4844a48N66k28J77j91M5j0j04p0M9j09J24k93O29n55m1M45j94j73J72l62N50m25
4866a46N07n15J85k36P7L79m81N43m66O68q43J40N18q1n23L46j26j64K09k0K10
4887A81l69K45L14k65o4l9j67K10J12l75J80Q5j3j25R8n5L46l2l42J16q5K34j03
4910H7j49K65l04J57j57L12l9m54j00M26o4m5q3J61J33k95K80j81j32J44K57j91
4932B8j88lL57l83j69J51J10K25l27L56J11p7n87O63j15n41N06J05Q3l52n4O70
4954E69n76K92m07jk27K24K29j35j07o9L9P7l9J19L33o46M8K77M27n90P4K60l70
$$ y = [79, -39, 69, 326, -160, 30, -118, -47, 126, 209, 339, -57, 33, 179, 43, 94, 195, -20, -215, -78, 48, 187, 19, 125, -189, -25, -177, 134, -69, -143, -358, 131, -99, 4, 269, 193, -211, 41, -27, 69, -213, 16, 240, 34, -148, 418, 190, 367, 176, 221, 211, 107, 37, 86, -23, 101, -192, 437, -118, -159, 286, 92, -81, 91, -271, 279, -146, 361, -154, 31, -205, -128, 251, -230, 313, -153, 515, -328, -188, 330, 249, -274, 72, -54, -218, -9, -29, 181, -188, 57, 371, 106, 42, 3, -164, 46, 158, -217, -37, 48, 35, -90, 8, -47, 299, 267, -75, 41, -44, 190, 87, -62, 203, -101, 56, -101, 211, 172, -282, -382, 44, -20, -65, -148, 13, 146, -149, 131, -50, -182, -38, 219, 28, -160, -163, 194, -189, -358, -207, -97, 128, -199, 157, 268, 191, -396, 267, 152, -389, 117, 222, 305, -47, -101, 569, -7, 285, -122, -123, -350, -126, 103, -32, -139, -208, -169, -92, -131, -12, 321, -325, -277, 0, 427, -163, -89, 171, -199]
4977a99j15j0K55pK04O6m6k53j75P67l82l8j39L13k50l39J31M71j17j68K03k79
4999a07k10J65L29m25N03j14n1K09j74M1p7l63P7m4J89O5J51n8m06Q1J21O59o92
5022a31p1J61l4k8K17l0k44j27j4N29k9o51K09K86J59k02Q9r0o3k09K83L2j63
5045a21k2J26p5K1o7K17k6k32K14r3L6j09J30J85p0L5R1j07m34L32L32l33M8L3
5069A11l57J2K05J54J44m04K21q4j35q5k7J75r0J01L41j10j63Q7j12J11p8j97
5091a80M62l67rJ12N2k9j74L91Q0M4m20j61L43k00O2mk8k84P32l88n7p7J93p7
5115A6n0K9M4r0k59J68L7J06j40M4M60k96m36L77J51j2m3k55K30m2N1K14o47L41
5139bL48m05Q8K3J05O6n16N64k62o2K04o9r3J11l33M70j71k32j5N42k46k29j8
$$ y = [-199, -314, -324, -69, -76, 128, 194, 148, -105, -280, 487, 105, 67, -72, 241, -9, -348, -217, 254, 137, -31, 172, -107, -317, -152, 177, -248, 255, 141, 90, 299, 125, 166, 89, -274, -197, -241, -52, 13, 164, 106, -300, -219, -98, 561, -131, -202, -41, -75, -103, 114, 84, -160, -287, -301, 228, 199, -452, -243, 43, 202, 0, 89, -1, -64, -273, 10, 42, -121, -143, -17, -92, -71, -138, 79, 53, -179, 35, -58, -22, -131, -1, 184, 114, 149, 240, 133, -301, 31, 363, 30, 78, 111, -246, -234, -29, 125, 269, -135, 86, 2, -133, -218, -245, -70, -160, -59, 282, 172, 9, 96, -16, 95, 17, -180, 282, -85, -94, 18, 70, 41, -133, 258, 338, 382, -38, -199, 144, -56, 6, 2, -26, -310, 422, 34, -23, -100, 93, 16, -34, -5, 39, -51, -310, -142, -105, 1, -139, -95, 365, 69, -367, 10, 161, 149, 106, -149, 81, 39, 90, 304, -343, -2, 346, -59, 29, 52, 157, 223, -293, 271, 9, -53, 151, 82, -11, 100, -233, 237, 66, -166, -181, 361, 115, -114, -132]
5162a32K28n3m45M62J91k59J63Pp5l00M38l64K16k23O51l12l97mJ85m0J28j19
5184e4J76J8l88J50K33k61k5j7K61j92O6J9O1j81O6p7l6J87l4r1k09L14j18N98
5208D66p22L24pM4l15RM24j09J3L17m80J33l89J76L77m07J76p8k7J13NQ3J70l09
5232a3M26n80J21J38m5r5N4K9L7k22j43J54J10m2N4j12J00j54MJ26M7p1q6L41
5256A78j19j47Q6m49N16j36J83K1q4j26L7j57J11j22J85L44l28k70L56l03K79
5277E5K1R1J3k65J18m9q9K36N9l87l5K14j02J83j7k36K23k06J57J01R3j14%j1
5301E3P8j90L20l39j18K96k16L01l53O6L58m25K95J61l14j04o7R9Q5O3j94Q7J12
5324E4j56J89ll64K06p5K35k44PJ50%l27K27k1QN0O4J8n0J14p8nk01n0J24J46
$$ y = [-132, 96, 43, -402, 60, 251, -8, 155, 162, 87, -213, 225, -139, 77, -146, 505, 193, -204, -208, -23, -63, 65, -54, 122, 140, -248, -98, 135, -126, -151, -168, 93, -99, -33, -14, 47, -134, -68, -145, -181, 6, -28, -119, -328, -14, -132, 466, -256, 68, 61, 105, -210, -201, 223, 114, 127, 444, -36, 97, -292, -116, 261, -146, 30, -48, -75, 38, 43, 126, 296, -13, 413, -167, -46, 92, 47, -48, 6, 35, 72, -150, -293, -139, -29, -71, -17, -129, -29, -183, -179, -53, -6, -77, -163, 178, 59, -88, -2, -451, 65, -71, 112, 133, 49, -77, -40, -197, -86, -208, -23, 321, -7, -277, 79, -224, 55, 76, 167, 180, -85, 33, -16, -105, 131, 190, -197, -232, -18, -120, 63, 46, -190, 33, -173, -16, 85, 178, 64, 64, 53, 131, -59, 261, -78, -196, 100, -116, 185, -168, -102, 256, -169, 126, 287, -27, -131, -198, -99, -14, 49, -145, -58, 54, -102, 87, 84, -280, -74, -149, 86, -158, -151, -1, -1, -328, -101, -122, -114, -64, 0, 18, -32, 82, 4, -1, -202, -252, -128, 18]
5350A8J05k35P5j78L3J8J09q9L90k74L89r8k86j05J85J37k20P5J93j1j27R1n1
5373A44J59m19K45k01K40l81K45k98J15K97K6r0k4Pp9J55j2k22r6K67k93Q7K50
5396A22k88J85k13K42n9K94k24j55L00j3j23J13m39J69N0M4p0J8j21N98o25R7
5418i8n4L99k34l8R7p8M2k31O8R2k8r9R2J23P1k12K2J32q4J32j40K64l56K78o4
5443I6kk30K43l7n2kJ32N3j58j46J49Q0k8k21J60j37R9K8J80j24m56M01m2j74
5467a88M89k90k7j14J74J64j90j11j21L60j93K85k70J76rMP0J8k52J97l31K3J25
5490a1m3J76k84j40L54J75j77qj74K59m31M32m4J1j81K96n8k15j33L29k38q3L45
5513A57N6l87k5N30k33O4k64P8j47k8K66P1m18K95P2j12J11M02p06M23j26j40
$$ y = [18, 123, -112, -37, -215, -182, -164, -55, -144, 246, -28, 361, 263, -23, -128, 57, 194, -26, 49, 242, 231, 104, 195, 144, 303, -116, 129, -72, 168, -213, 32, -266, -151, 146, 172, 82, 58, 65, -14, 141, 129, -93, -189, 78, -215, -128, 122, -166, 19, -194, 48, -11, 283, 59, -96, 204, 191, 68, 181, -258, -89, -39, 5, -65, -47, -168, 430, -195, -98, -152, 247, 13, -25, 72, -6, 36, -195, -127, -35, -63, -162, -70, 53, 124, -88, -66, 66, -18, 114, -26, 238, -118, 160, 96, 94, -136, 107, 70, 18, 16, 148, 201, 43, -103, 46, 126, 98, -123, 37, -100, -1, 27, 207, 83, -373, 28, -14, -188, 301, 11, -16, -130, 44, 208, 18, -93, -214, 146, -47, 238, -32, 144, 135, 139, 209, 227, -25, 172, -159, -136, -11, -54, 122, -162, -302, 52, 227, 50, 42, -132, 127, -304, 128, 84, 95, -86, 210, 152, -63, -196, 133, -105, -188, 157, 213, -174, -199, 331, 98, 162, -102, -24, -171, -199, 67, 138, -280, 15, 87, -25, 86, 488, -218, 205, 79, -61]
5535f1K19j25M1m0M90n09k34L04kj53p5J55K8j78L10k08R5m3J91j23J68n49O68
5558C69l76l29J27L15j29OK5K43k78k72J21J34J16J0L4l00M37j80q9L8k61M25
5580A86r4k51J21P5J04j38J1j42K65k64J23LP9O1MQJ1j85R1l56L32j87L75k14
5604A8j43K52k27J56l3r8K18N0l74K10n9J76j67J33K13k17J94j40l28J35j73L87
5626A83j63j8l4J52j79M1K70k42j19J58l21J99J41k99K29k19J01K32m31J49R6
5647g4N1K06l16J39K42k49j33K33k21nj53N26J10o62M24j05J95o91M64k3J00l8
5669B0Q7r2rK09m32J72J02n6P8n8j59J98%r7J50j45L76l85n42Q42l35k28J98K58
5693A52n9k25N1J08k10K57p0J52l67J14J44k16K02K14l84K9k02L06M3p8k93L78
$$ y = [-61, 158, 33, 74, 34, 524, 15, -219, 85, 83, -70, -145, 10, 38, -140, 170, -38, 57, 14, 205, 82, 250, -299, 369, -7, -336, -209, 106, -23, -17, 8, 251, -27, -299, -178, -44, 72, 82, 116, -184, 253, 73, -16, 22, -239, 186, 92, -159, -38, 37, 141, 3, 14, -128, 137, -127, -4, -1, 78, 139, 143, 151, 162, -23, 68, -288, 44, -143, 232, 18, -125, 127, -100, 56, 23, -75, 143, 193, -181, 29, -30, 146, -21, 112, 325, 108, 302, 162, -166, -31, -204, 183, 20, 2, -32, 120, -59, -18, 252, 10, -109, 49, -272, -73, 68, -231, -2, -221, -120, 112, -319, -170, -74, -23, 183, -133, 6, 248, -1, -134, 99, -122, -127, -280, 246, 356, -306, 118, 13, 208, -483, -19, -42, 58, 20, 107, 15, 6, 215, -217, -45, 57, 1, 79, 21, -138, 60, 60, -37, 113, -32, 344, -41, -583, 259, -76, -304, -106, 152, 93, -132, -81, 27, -183, 74, 4, 156, -211, -97, 47, -169, 33, 247, -137, -108, -310, -4, 39, -39, -332, 46]
5715D6R8j34j33K29j83K43l93J64J05J77n9k9j67j36R1K38j7j52pN3J11j81J81
5738A45j93k00N15q2m10J32L94M4m57K56k88J83k04J15J39L1l93K47Q2k83Q1L78
5760B32j89k68M1L97k23Q1j31R3l15O48l84J6J2k61J78q3J55j77P8N8j69M51j90
5783E0l31J50o3K98l75j10M38%m0k01K28M4j43p8L08k29k53L14q5J22j64K64j90
5806d6M1J3j53k7O5O2J04j11k1M85j19m42oL34l15J46J51R1l12L3Q7J9J23k61
5830e9j29J62n09O63Mk83K82k77m7oJ68j6M03k30L4K5p1j13P0m04K10Q5J91J06
5854B59j17Q2P8k82j42R7Nrj41M93r6j25n6L5K41j16m4K3q9l13J2L14m49N04j5
5879A49rj1k97M59k05q6R2J4j89j93J1M82r0m87L05J90j95j67M50k19q8k01M11
$$ y = [46, 144, 10, -123, 106, -77, 166, -227, -63, 42, 219, 160, 131, -36, -172, -81, 157, 140, -12, -19, 34, 145, -36, 145, -48, -248, 267, 185, -225, -93, 301, 345, -112, 144, -144, 39, -165, -50, 89, 120, -273, -26, 56, -227, -146, 232, 43, -225, -184, 213, -10, 71, -60, 33, -282, 366, -18, -2, 10, -251, -73, -156, -1, -178, -100, -42, -211, 240, 50, -281, -131, -194, 104, -271, -381, 57, 57, 17, -184, 44, 88, -55, -133, 175, -54, -307, 7, -78, 44, -120, 144, -46, -5, 8, -145, -172, -107, -45, 59, -52, -73, 412, 293, -149, -155, 179, -136, 10, 161, 252, -60, -27, 60, 79, 202, -59, -188, -26, -535, 128, 132, -151, 131, -146, -193, -199, -31, -47, 356, 126, 160, 185, 114, 1, 71, -333, -123, -38, 153, 259, 142, 224, 302, 20, -122, -25, -20, -29, -170, 323, 227, 102, 46, 81, 322, 206, 162, 185, 96, -217, -205, 109, -340, 164, 149, 140, 129, -168, 291, 86, 0, 92, 106, -83, -276, -265, 217, 127, -360, -55, 135, -60, -227, 223, 4, -84, -285, 126]
5902A26k50QJ89j43Q6q9M1j2J00k46K64Q6l41J40K27k80r4M02l19J75J72j88o9
5925a5k03J29n2J22M9m4J46J87k11l85K00P9J57j20P5j12k6l1M7O0n6J00l0K44
5949C10l57J19k27K55j95R8k61K10K97k21l97L48K20j99j8n7k4p9r4N73m78J4
5971a63K17j7o9K5O5j11J26l2m2R9K8l14J45K07Q5j74J4r0j33O1j95N06l22J43
5995E9o5k72N19j87N9q0j44l6J11J37l14N40l24j08J16k91J81N0j1K24k6n3l29
6018b44K37l52N24k80J7R3J09N5l37Q8O4k12M16k73K7P1q9J79J6J5n9k68K72k06
6042a37K6P6j37L72k76R7j57K67K00j30nj9r4j7j10m5l8J98o0J6M22m04n6j07
6066a18k89K68j34L44l18n2M61k08J67K2n7o0m8N5J69P9Qj61l18K19q4J49n5n5
$$ y = [126, -124, -116, 73, -70, 16, -73, -32, -44, 56, -190, 74, 160, -181, -41, 186, -94, -188, 214, -105, 70, 242, 54, -15, -218, -89, -141, -19, 30, -14, 132, 319, 108, -277, -77, 2, 159, 39, 114, 2, -24, -55, -8, 52, -4, 96, 66, 310, -47, 72, -155, 100, -95, 3, -258, -48, 249, 28, -369, -21, 199, 0, -18, -75, -99, -178, -272, 301, -177, -163, 54, 37, -32, -7, 58, -53, 73, 41, -1, 98, 126, -188, -43, 164, 249, 75, 89, -1, -134, -73, -268, 238, -84, 59, -6, -278, 241, 54, 113, 33, -111, -147, -36, 101, -213, 327, 3, -105, 11, -280, -99, -49, -60, 164, 138, 85, -244, -7, -359, 165, -115, -98, -5, 104, 159, -178, -90, -26, -238, 178, -95, -68, 3, -86, 93, 109, 124, 65, -203, 69, -137, -111, -35, -172, 200, -76, 21, -136, 131, 331, 201, 196, 177, 83, 66, -44, -89, -127, 71, 11, 27, 449, 45, -11, -118, -407, -139, -273, 71, -247, -299, 162, -46, 121, 143, 86, 26, -22, 33, 202, 281, 289, 128, -190, 29, -55, 94, 39, -16]
6090a6J86j38j66K43j51J10j64M5o0J14J29j82L41j66l2j81K67o2k59l1K91R4
6112B12j16k62K55k27L21q0j55J65j49L87n0k54m4o1J95L3k19P7o3Q1l44K87K3
6135A2j02K69O2l5l82K33L3l32R5k20J94R1J44P2J18Rk22k88K31j5K12p9M6J85
6159C31j72K18m52M34k05k66Q5J73k47l21L92J34K9k01k59L16n2J4j84L30r5j89
6181a87J69K1k6O7j44J10r3R5N2rl27L01o6j76K37J56j02j29M37j09k80O8j1j51
6205i7J92k86L53k05k8J30j04k69nL21O8j14J88k42K66k82K48j04N1j30J0L09
6227B70j55l17L2K97j91J08L7m8m5K59k32j00o5q8K0J85r2K58o0j18j39m5N52
6250C23l54J42j79J4k67J48J25j15J23J71j11L0k16K38N2r0J7J1j39N9M0nr8J74
$$ y = [-16, 170, 32, -134, 109, -42, 68, -96, -51, -111, 3, 132, -50, 291, 125, 93, -88, 179, 117, -142, -173, 118, 212, 96, -166, 89, -138, 183, 103, -52, 113, -36, 351, 301, 47, 3, -58, 137, 170, -49, 28, -35, 46, -298, -11, 12, -90, 179, 241, 206, -176, 57, 90, -242, -147, -367, -173, -82, 62, 134, 252, 261, 39, -249, -18, -33, 179, 100, 146, 331, 159, 377, -75, 359, 154, -112, -27, 146, -101, -422, -30, 104, 133, -68, -327, -11, -63, -49, -233, 97, 2, -187, -18, 3, -23, 44, -100, 10, -83, 12, 64, 55, -272, 29, -37, -213, 24, 180, 78, -51, 386, 277, -3, 65, 54, -97, 95, -191, 162, -43, -71, 59, -45, -314, -319, 2, 70, -44, 144, -98, 168, -114, 134, 30, 81, -49, -39, 270, 115, -202, -170, 127, -64, 44, 81, 33, -12, 247, 15, -85, -150, -238, -218, -33, -125, 133, 73, -45, -184, -229, 323, -31, 111, -68, -54, -321, -173, -48, -163, -40, 131, 20, 50, -166, 72, 124, 34, 51, 62, -77, -18, 22, 17, -81, 93]
6274I3j13l4k9K09k58M8J62j01l79J07K10J36J08k74j41K88k99K42l5J98l33P6
6296a19J7j3m1P7J91J29l16kK57j96j72Q9K50l02K39R2M5l14J6K03q8q9K9J35
6320A17j24j03J10M38l80j37K48j13l73K94K98j88j19p6J28l40K75K20j5j62j49
6341a51M60j70l03K22o9J69l3l3l80L52k8K2Q8m91J31J95pL5L60k69k54k9L01
6364A18O7l59J85p7kl2J89n0P0r4J5M7j10j40K73J59l64j51J24M94k66j31oj9
6388f0J57o5N3Q4j92n8o0K61j06k16R8J04l0J11P0j66m0L6j76J82k56M21m55K98
6412eK59q1j70m9L05l19rK41k1k10K9j31J41J3R2k83L41m13J47K21Q6m65N21p9
6436A61k33l04L61M68m29J80r4j2j09R2N4L6l79J89p4J93k63K04R5k55M5J96Q4
$$ y = [93, -20, -54, -83, 126, -132, -84, 78, -23, -402, -295, -85, 51, 159, -115, -256, 32, -267, -25, -60, 138, -195, -119, -102, -115, -156, -79, 112, 241, -75, -77, 180, -16, -188, -99, 151, -151, 88, 180, 225, -89, -73, 130, 42, -47, -18, 117, -7, -110, 0, 438, 58, -79, 169, 56, -317, -23, 275, 87, -32, -108, 20, -320, -45, 175, 160, -2, -151, 309, 139, -164, 58, -11, 158, 125, 92, -288, 64, 36, 58, 146, -345, -214, -19, -26, 9, 369, 100, -154, -183, 118, 185, -174, 11, -66, -68, -100, 89, 39, 109, 15, 30, 77, -33, -173, 100, 259, -105, -256, -132, 362, 96, -35, -41, -60, 97, 32, 85, 169, -23, -81, -141, 120, 14, -202, -104, 0, -30, 81, 151, -15, -55, -19, -195, -13, -269, 152, -303, -5, 254, 173, 3, -46, 259, -60, -69, 172, 151, -59, -30, -161, -20, -7, 85, -198, 143, -270, -123, 98, 184, -281, 240, 161, -72, -376, -15, 453, 24, 204, 110, 98, -11, 81, 135, 171, -208, -19, -93, 100, -163, 41, 136, -119, -74, 122, 206]
6459B06j65k03R9J43q9K62j36k51K69K08m7l65k87J77L39j69k33L03K17m29L05
6480A54j96j05L67n45L72m7L20M6l73j22j50M12j11J45q0J09j61k70N7K92k22
6501a08J8K1L43k69j91M20j47j34J5J59l35K19j9k06O9M59l60jmK15k63J76k58
6524a81L31j39K58m34lM2N1L80k64K29j81M8K03l90p1M8J79p8j32L05k79J34n3
6547CLj98K39J16P7m52K29K11j32k95P1L08k77q7K22j6l8J63k72K49l23Q4Q9L55
6571C29n00K26k18J57l46M55j32J84nj87q7J98j43MK13j48j38q8M34mp0j2j18
6594DP7K19j44J63k43j43K86k81K50k34j73Q4J83Q3m6k07J19K55O3n22J29K52
6616A74m41M66j02j9j48j73P2j23K00J75k19J63j00K51j48P8k43L04j48j52j40
$$ y = [206, 41, -162, -63, 80, -9, 253, 117, -134, 135, 343, 296, -69, -356, -179, 160, -9, -242, 61, 278, -151, 154, -42, -147, 220, -325, 47, 0, 320, 366, -7, -129, -279, 133, 22, 167, 87, 196, 35, -235, -178, 114, -108, -90, -69, 274, 5, -186, 234, 87, -47, -32, 127, -208, 11, -8, -214, -145, 314, -46, -47, -51, 164, -99, 77, -181, 150, 11, 269, -165, -168, -126, -75, 305, 41, 270, 89, 137, 340, -50, -121, -73, 106, 28, -104, 201, -78, 56, 3, 6, -192, 47, 163, 240, -212, 17, 228, 96, -199, -128, 180, -97, -184, 38, 22, -16, 147, -125, 124, -199, -115, -26, 329, -171, 55, -163, -6, -352, 103, -29, 155, 150, -37, -124, 74, -69, -65, 148, 0, -138, -226, 208, 204, 134, 122, 4, 81, 300, 156, 319, 76, -67, 219, -62, 188, -46, -219, -135, 48, 131, 85, -122, -3, 252, 315, -207, -78, 174, -267, 199, 97, 78, -70, -243, -171, -294, -94, 81, -138, 25, -75, 176, 28, 106, -137, 167, 19, -133, -273]
6637b73K32m8r5M22j22L1m31L28J55n0k63J85l34J77J44J1J6r3l38L74J15L0j73
6660@Q2J84m18M12k79K7J71K0j09J41j56L3j59k6J41j06k2N86p91M94m86K46j47
6683a62J93K5N1K04k74J74k46J53k45j35N60j86l72M18j63O1J35j1k30p0o2J12
6705g0PM56m49k05L72J43j38l06K63k18j40J05J75JJ49m54M56j15N8j47K04J57
6727C04m53K14j60J03m2j83L89k49o8O7J38n1J8L10k75j30K5k95L99j7k59M75
6749B60k03k59K20J43l57L65j94j23p7L03K7j76k32J50j17M87p7k39L08o8k18
6770g7j27L06k06L28l51k05L82J4J97k29k18q3J92l5o5r7L17q9J43J51k07k34
6792a93K0J36J1j35J64r6Q3J41k60m6J21j4N1k76M48j22M2k37O7J49n6Q3j64J39
$$ y = [-273, -41, -89, -184, 238, 116, 147, -284, 44, 199, 149, -114, 71, -263, -86, 58, 69, 85, -8, -346, 28, 143, 173, 0, 82, 266, -152, 260, -19, 8, 179, 199, 90, 231, 75, 108, -51, -77, 64, -42, -64, 522, -269, 225, -261, -15, -162, 31, 56, 107, 311, 37, 211, -35, 118, -127, -262, 298, 112, -260, 158, -5, 56, 191, 180, -50, -120, -182, -70, -63, 393, -56, -261, 111, 254, 116, -190, 73, -145, -285, -180, -5, -4, 145, -309, 147, 32, 90, -57, 147, 304, -149, 65, -95, 8, -34, -217, 172, -77, -145, -78, 60, 9, 27, 337, 62, -68, -43, -338, 61, 44, -215, 260, 57, -202, 18, 161, -196, 169, -25, -148, -225, 78, 105, -71, -303, -153, -270, 217, 140, -99, 209, 141, -77, -204, 102, -104, 224, -127, -332, 50, 64, 261, 32, -186, -269, -77, -112, -177, -274, 43, -46, 97, 248, 41, -193, -173, -37, -26, -161, 3, -93, -10, 131, -129, -175, -54, -68, -17, -293, 155, 33, 75, -162, -95, 54, -2, 81, -83, 56]
6816E6J93l10j34K85j8R4j40j63K75j75l65j5N73k13J46j61K72j40j90K53l88
6837b65L8J48J16k00O6J49k86N13j16k86R6j76L60m82J89J35l9L15j86k87K66
6858F8J80l09L90k56l09M05k12P1K27n06J80J67N2j94L13m86J48l9n6L9J57k8
6880BO6Q8j49j51M50m06Q5m9j24K63R3j56j46K53O9j89j79N17n13J89L38k25k25
6903i9J55qj63J69Oj36J74J8j1k92L87j00k67p9M48k50K1L2j6KJ14Q9k40K9P6
6928E9j09j34q7N88l67m70M62J37J38l65K85K8m2k5R6k2k43j37J94K66m68K41
6950B5k53K24M1j30J01K3o5Jo7j1J25L40j54k15J98j77K05j84J92J04J5m42K45
6973A41k82L31l00L70m89R2Q7JJ85q6o6O9l16K20L03l35K28k10M76q9m60O4O1
$$ y = [56, 249, -61, -195, 90, 72, 166, 26, -137, 138, -37, -402, -417, 156, -57, 89, -72, 200, 60, -130, 123, -265, -227, -79, 37, -163, -97, 52, -234, 279, 163, -123, -27, -203, 157, -325, -136, -1, -40, 275, 89, -198, 68, 248, -61, 329, 73, -236, 169, -43, 28, 255, -251, -71, 96, 148, -46, 267, -219, -71, -110, -166, -127, 30, 2, 68, 156, 7, -144, 306, -100, -15, -64, -188, 75, 168, 12, -134, 119, 188, -1, -180, 337, -176, 13, 351, 126, -99, 56, 48, -115, 54, 60, -76, 98, 116, 105, -187, 200, 100, -167, -246, 202, -48, -27, 5, -11, -9, 105, 194, -46, -17, 59, -50, -184, -271, 317, -50, -520, -58, 79, 217, -148, 137, 165, 123, 98, 194, 172, -71, -208, -14, 252, -216, 25, -228, -4, 37, -93, 8, 31, -34, -33, -100, -111, 14, 354, 200, -15, 183, 6, 211, 27, 219, 323, 338, -104, 141, -141, 190, -110, 260, -229, -137, -50, -49, 136, 50, -16, 53, -263, -43, 260, -75, 153, -57, 419, 330, -130, -66, -5]
6996eP1M7l35O3o6J46M8J90l95J11J78j5k11L90m05K62m30K86K3J9L02J21k32
7019A63j1r9J80l01j7mj4O8K46k05Mj07o2J22K4J73l79M44l80K28j38K82n8m13
7043b54K98K30r2j87l2L24k71J04o6j62O1j38J21p8L35j55k59J86p4K76k6k97
7065a56J60K91j47p7P4j89p0L94k15m5l2M2j1p5N8J44k40q0J71j45K71L6q9k3
7089D7N0j6j00m1J07k73L46l49J80J60j22J22k65J89j26J26k86L56K90n30q8O4
7111a59P3K41j38K84m95N7K15J27l25L04pL3k91L07j0j62j92o1L66K7m38K04J21
7134H1k74M36l39J32k21L44l4k37J36k00K38j72OM35l94m9K5k10K13j05K06O5
7156H2rk0K2k92J78JK1p2n0J95p5L79m37O5R8Qj00J65o9j04J40j13j17Q2J90j38
$$ y = [-5, 66, 113, -222, -159, -225, -79, -31, 159, -236, -125, 53, 38, -173, 217, -188, 74, -356, -70, -47, -28, 274, 395, 163, 152, 53, 233, -68, -85, -89, -103, -35, 211, 6, 10, -97, -159, -37, -13, 160, -219, 225, -155, 73, -65, 217, 159, -254, 44, 274, 182, -5, -37, 287, 16, 120, 54, -108, -47, -185, -64, -142, 193, 38, -221, -35, -109, 167, 141, -156, 4, 295, 148, 71, 145, -44, -114, 280, 65, 20, -12, 30, 19, -56, 2, 146, -94, -174, -3, -148, 123, 159, 70, 47, 97, 81, -19, -60, 47, -226, 120, -229, -49, 111, -11, 111, -154, 35, -91, 35, -251, 105, 395, -135, -223, -159, -86, 155, 17, 301, -194, -137, 78, 205, -120, 184, 177, 210, -81, 226, 216, 54, -138, -199, 167, 194, -244, -40, 81, -193, 243, -96, 36, -185, 159, 125, -112, 24, -176, 62, -110, -104, 331, -63, -112, -87, -297, -84, -189, 17, 82, 73, 53, 75, -217, -39, -38, -17, -89, -139, 56, -19, 360, -77, -12, 86, 94, -6, 159, 90, -14, 126, 13, -104, -22, 168, 30]
7182C0R1k15J73j22R7p5J83j38m98N12l82M44k79J29Q8K44m91L20j40m9k1J45
7204D6j2lP7j62J99j40q6R1L45m70l6K53k87J24LL32j74k96K59k08K51j11R8j97
7228a04P5k58M35n4k24K85j40l9R5K7k24K24L27m55J56j89K0j62J65j5J31j91
7250a15M6K39j50k0l0J98J34Rj84j69l6j1L08Mj54K28l48K61p0m4r9P8k98M94
7274B71k18J48j2l25K14k04k6J02J75j00r2O1k14J73L39o4n81J97J32J3m7J1Q7
7297D0k5j0q0O45m38j6k87rm1R8J01J6O8j76J8K27k49K8J55J82k31j69Oj62J4
7322b95L12j56L1nJ55j30K88k52N4j15K57j77k03J01j25M32K93o55R4O5j12l6
7344a79J82J97M6k17p8l7J86j28P0j20J20j57j04L91j6j99o0L49m24O6L43m14
$$ y = [30, 121, -94, 79, -43, 54, -21, 162, 24, -474, 38, -344, 100, -179, -50, 38, 282, -209, 111, -29, -78, -99, 46, 34, 31, 108, -54, 145, 5, -81, 10, 355, -115, -151, 102, -185, -61, -58, 274, 100, -196, 63, -145, 106, -5, 93, -104, -29, -287, 148, 94, -130, 155, 15, -24, 71, 98, -126, 98, 425, -30, 126, -63, -43, -205, -40, -55, 76, -115, -69, 170, 20, 0, -30, 168, 302, 311, 127, -42, -78, -89, 219, 223, 69, 297, -51, 210, 140, 96, -3, 75, -223, 271, 53, 201, 189, -136, 78, -126, -152, -50, 125, 25, -67, -6, -220, -47, 292, 228, -353, -156, -24, -11, -58, -47, 40, 15, 5, -75, 570, 132, 116, -171, -180, -221, -123, -22, -6, 62, -114, -96, 131, -118, -90, 65, 247, 16, -153, -147, -309, -295, 17, -139, -108, -113, 42, -88, 200, -52, 2, -113, 144, -33, -236, -135, -260, 172, 465, -190, -96, -31, -143, -179, 3, 200, 246, 29, -49, -86, 100, -28, 42, -78, 42, -115, -219, 172, 156, -43, -103, 246, -178, -112, 231, -183]
7366a83j21K46j3Q1J7k83J35R9J5M9m22J10J77L25j30l78J37J63L6k99K04L48
7388C13k49J9K36k40J16k92K65n2Q7J85k96Q7k37J05p4j57M75l23k80L40J31J34
7410B93k42q5r5L13k55J31P1k64M4Q8j28L01j09m39M11n8j38R0j26J78j34L98
7432B45m9k09L7j1J32K16o04K54p8k31pK2K95p9K75n28L59N4j81m9p3K23j55N09
7456C67k08J40j1l61J9L4nj6K5K5K44j07l16L8j09N51j10l33K55l67QJ59P8j56
7480a56L39J45m12K37l11K39j62J56r1Q6j98j3K49jl32R3K8M06j39n9k30M01R1
7503C66q6k43J85k64N5J31k40K97ql46J64L39m74o5L85k47P9R0l87J16K14l1k5
7526EJ72j12m4r9L6j00P3l06K83P1N4jq5K62j75o3L14l20L91o16J27l3L24j20
$$ y = [-183, -304, -58, -71, 10, 27, -256, -121, -22, -7, 42, -380, -270, -93, 232, 102, -276, -139, 24, 60, -239, -35, 313, 64, 83, 319, 79, 195, -97, 168, 116, 203, 388, 92, 179, -58, 47, -27, -184, 291, -32, -312, 28, 159, 293, 51, -34, -129, 184, -71, 60, 131, -133, -89, -1, -129, 172, 63, -376, 35, -23, -161, -71, -197, -19, -153, 245, 196, -13, 24, 13, 145, 361, -243, 11, -67, -298, -305, -283, 12, -67, 208, -320, 39, 93, -88, -137, -210, 13, -142, 367, 159, 299, 288, -73, -54, -20, -25, -41, -16, 9, 253, 146, -170, -132, -241, 310, 200, -133, 122, -245, -237, -78, 0, -156, 183, 328, -84, 153, -158, 81, -81, 75, -16, 70, -128, -141, 108, 107, -225, -132, -104, 302, 163, 104, -126, 275, 366, 280, 37, 222, -42, 13, 144, -96, 201, 193, -153, 11, 350, -124, -189, 196, -51, 28, 118, -269, -153, 61, 30, 5, 177, 65, 21, -78, -42, -142, -69, -375, -92, -21, 33, 32, -53, 209, 34, -29, 285, -35, 356, -260, -133, -166, 158, 38]
7550C8J00Ml55O87l41k62J2K76l63L50k78L4k1m7M52m36L22k65K38k89K43K20
7572C19l74j1L12n02K17q4L35o3j0k11j96K74J31p8j30L53k89j31L77j44j81j68
7594b54L20n9J34j67k47L12P4j09Qm6j36q8M65q5J74j58o3j32J49l53n2K89k28
7617b52M98k70K6p1J24j96R9j18J57k22K43J00k10j49M93p6j07Jl0jj21J93q6
7640B5L8J17k59J68j4r6l84K43o3L2K20j22L6J4L5O8O2j89J7J19J29k73J34l35
7664b78L22j60j65L57m47O5K68J17k00L46j50K5J44n05M48l64r6K28L8l9L06l56
7686i6K20l82L11R2m63O07k15j1J7J02k64K30k16j68M92l56m8Q3N1l28L18L85
7708C61l60j34p3K94m6Q9K3j10p4L42O3k11m16K30J15l42L15K56p9l08K29j02
$$ y = [38, 138, 142, -213, 474, 133, -129, -117, 159, -204, 146, -132, -98, -119, -166, 286, -150, 172, -93, 145, -144, 99, 319, -55, -66, 246, -256, -39, -123, 212, 149, 139, -72, -268, 6, 137, 59, -71, 282, -7, -138, 239, 95, -86, -254, 66, 7, 141, -26, -273, 39, 113, 4, 12, -34, -170, -258, 207, 122, 296, 138, 75, -57, 92, -261, -313, -24, -252, 246, -24, 2, -69, 55, -141, -42, -160, -3, -225, 18, 118, -92, -241, 252, 176, 69, 70, 40, 39, -82, 111, 25, 63, 180, -79, 89, 75, -21, -405, -162, -225, -193, 27, -95, -59, -45, -10, 58, 120, -69, -52, 67, 196, -77, 57, -278, 44, -116, -281, 76, -371, -306, -38, 79, -121, 225, 75, 100, 244, -261, 187, -177, -273, -45, -7, -46, 260, -96, 124, -258, 53, 145, -318, 289, 74, 63, 80, 182, -82, 148, -68, -236, 256, -100, -148, -65, -14, -342, -24, 361, 1, -133, -206, 88, 42, 131, 154, 44, -30, 312, 375, 164, -252, -22, 93, -249, 66, 322, 243, -65, 164, 62]
7730F2j24M06j26j33j35k8Oj82J21K24M1nm10K94k45L07l2j28J39l79K87K83l01
7753e8N6M2j89K28j12j14K00K81P0l70j67L1k7J8L06L4k02J35k21K36p7p9L0n8
7777gr8n6J82k19J59J47j03k6M1J92o4oJ4j90J00o0q8k4K05p48O23J12l6P8l66
7802b38L98m16J59L42j83k13J52J59j47m0J08j45L44k21M5nk41K20j5j35J25Q2
7824A35%J8n1j74N6o5kL5l15L15K17Nk82J05J13j75K01j42K53k73j63O15k97p2
7848E7Q3j79r6P5j60L25Jk07K52m44K81J24J27n0k85M53n78K23l81P08k06N5q4
7871I4k79J57j35L33l90M13j99K27L27q46J86J27P3K4l03K54m2O7j6r6J30l40
7893b34M3L20l9K06j94m2k2j87K73l27K91K54o43J67K61k83J58O4j42J33n8NJ78
$$ y = [62, -62, 344, 218, 85, -50, -78, -72, -254, -133, 91, 132, 127, -283, 11, -234, 73, 41, -87, 52, -327, -40, 243, -58, -2, 40, -149, 79, -33, -147, 53, 334, 404, 34, -133, -102, -129, -111, 195, 229, 27, 162, -59, 177, 100, 21, 51, -7, -105, -161, 21, -198, -39, 108, 5, -21, 20, 212, 148, 142, 156, -34, 66, 6, -82, -106, 99, -649, -26, 86, 50, 128, -238, 160, -256, -97, 245, 62, -151, 1, 160, 13, -27, 81, -64, 280, 59, 104, 99, -142, 78, 63, -72, 53, 135, 135, 153, 102, -72, -16, -81, -83, -48, -363, -48, 169, 174, -108, -3, 110, -65, 136, -6, 247, -26, -189, 426, 129, 57, 140, -39, -135, -60, -220, 105, 106, -101, 151, -293, -12, 112, 239, 189, -96, 357, -221, 2, -379, 329, 123, 178, 94, -185, -28, -163, 170, -220, 193, -6, 221, 548, -298, -112, 15, 88, 112, -191, 63, 21, 88, 72, -24, 106, -234, -191, 129, 90, 296, 102, 60, 38, -149, 124, -203, 88, 342, -301, -134, 127, -156, 2, 66, -76, 57, -1, 4, 182]
7916A82j57L83l69rj32K98j90j23K34k1l68L89lO5j57j19L28m36P9J83ll68K39
7939g5Qj2m8K7M17r7j36J41j33k95K03P2r1Qm6R3k6K70k54j03J67J7M2l33K49
7964F5q5l4K48k65J92k9k86L34k70M32l01k41L31k26K07J16p4L7l44R9j95N36
7986B47l96K42M4M1k61K14l27K45R4m7L88m88K48k17M1k15J71j2P4J04j99K90
8008B81n45K56j53n6j26N22q5l39J89R6k5p9J20k3Q3j0j54lJ0N4L7j56j2J72K34
8033B88k80J4K01n0k96J02N5J37o07M74J0j71K87k23K60J28k15j38n3M2J22o5
8055B2nj51j87R1K77p3j71K04J32j15p8L17m86L92q4k24PK07J27j1l12K25l55
8078b51K84J94k19M2K2m06L58k40K68q6L7j60l1J93j72r7K48%J76q7l77L06K75
$$ y = [182, 25, 408, 39, 30, -102, 196, 6, -117, 117, 96, -272, 117, 114, 179, 22, -97, 231, -205, -126, 57, 54, -314, -75, -67, -79, -127, -100, 317, 220, 84, 225, 92, -203, 0, 72, -19, -11, -57, 36, 10, 280, 26, -77, 90, 107, 149, -184, 65, -20, -54, 194, -71, 121, 92, -194, 140, -130, 302, 1, -240, 91, -135, 72, 188, 114, 151, -193, -94, -289, 247, -149, 93, 137, 178, -83, 131, -196, 49, 143, 96, 484, -4, 244, 27, 68, -147, 24, 12, 86, 190, -9, 281, -264, -8, -161, -217, -343, 179, 94, -245, -56, 40, 15, -64, 56, 33, 116, 106, -48, -51, -41, 13, 50, -106, -118, 54, 288, 8, 22, 223, 173, -123, -21, 34, 171, -436, 38, 48, -123, 164, -59, 201, 329, 114, -24, -77, -35, 87, 22, 17, -134, -321, -230, 47, -26, -197, 7, 139, 24, -54, 263, -223, 169, 85, -139, -132, 75, 202, 191, -121, 104, -251, 33, 227, 8, 50, 72, -334, 24, -216, 52, -34, 3, -157, -188, 5, -167, -264, -16, -16, 160, 73, -304, 2, 277]
8101B77k69j33K80l21L39l4j56RR9K13k49O7m51L72k7PK40m77J81j35K50k6J81
8124B37j50k54L90k40K9L6n6J7M7M6j03oJ33P6l30J31p2K32j51k2R3m50L17l2
8148h2J50O6j20j48J00j45Qn4L32k01L9o3r7M70ml98K17j68J13JP4rj83L81l28
8173d9K8l8O3K3P4k85J76N05m24j05K31k0m08J01r6O2K72k5
$$ y = [277, 8, -125, 155, -166, 173, 139, -17, -8, 91, 304, 55, 122, -329, 43, 16, 23, 263, -214, -33, -168, 82, 56, 237, 87, -167, 223, -17, 12, 48, -8, 9, 56, 102, -1, -7, 126, 202, -128, 3, -69, 163, 12, -10, 83, -367, -50, -82, 68, 134, 14, -134, -34, -179, -171, -225, 107, -94, -55, -118, -215, 255, 251, -147, 70, -98, 15, 16, 90, 81, -102, 279, -49, -21, -59, 4, 27, 101, -184, -8, 497, 73, -32, 199, 179, -229, -128, -224, -162, 110, 85]
8191H5
$$ Imaginary data points
##PAGE= N=2
##DATA TABLE= (X++(I..I)), XYDATA
0@%%%Qj6QqK4l2L8m6N6p2Q8j04J28j59J86k16K53k96L44l98M60n31O10o91P80
28D14q86J003j125J261j415J583j765J963k182K424k687K975l295L650m040M473
44B351m958N503o119O820p630Q577r695J1045j2715J4839j7640K1511k7237L6575
58B1227n4320R9521m21807p94666Q92941Q90682k84160m88507J84599J0613l97985
69c41862J9731N03075J0838l79886O1816L21609j89185l06376K28945L00147k11176
80A7676j59409K69752L3773m44408n0728N38542J65990m62861j78651L22787O1231
91A13694k71581R2234L39701j24341l97872N1882L21649k5243j87020J01982J14962
102A30047j94765j23864K08357J13804j72874l0963J84522o2163k61958P7759
$$ y = [0, 0, 0, 0, 8, -8, 0, -8, 16, -16, 22, -24, 32, -40, 48, -56, 72, -87, 99, -117, 136, -160, 184, -214, 246, -285, 325, -366, 414, -472, 531, -594, 667, -748, 835, -930, 1033, -1149, 1275, -1412, 1563, -1732, 1918, -2122, 2351, -2607, 2896, -3223, 3597, -4033, 4544, -5151, 5894, -6821, 8018, -9622, 11889, -15348, 21227, -33093, 66428, -355379, -1150045, -257104, 633578, 349418, -139089, 45510, 56123, -341862, -322131, 180944, 191782, -188104, -126288, 195321, 6136, -300240, -71295, 228852, 17676, -141733, 128019, 161792, -282616, -333344, 205198, 371188, -91673, -270324, 52463, 113694, -157887, -65653, 274048, 149707, -248165, -196283, 125366, 100123, -86897, 15085, 130047, -64718, -188582, 19775, 133579, -39295, -70258, 114264, 52101, -209857, -132098]
112a32098L17541l9546k96172L5787K52774q0411k51201J14249K88110p7156k75822
123a43945K4804J98316k7306j25495P2163J02065r5726j00701P2696N4886o2811
134c1054J6484J03038n5304j58168M2641J74741k7329j57935M2267J56278n7321
145D8338j69062M9147J71154j9189j31570J9636Q4935n1879o6258Q4884P7813
156I7949q4751p9635O1406M6716o0827q002Q5142m900j03101m307Q7797q026o8291
169d2830M5288P6093p2338r9565O7883J04785n9589r1723O4965Q6732p0960r6001
181h7260N2342Q9772k3178n5443J4720K0978k6066r842K4695L271j060K7956q367
194B2518p1148j1709R3591M5199q0323n7321N7692M3108n2516l2132N4588L3612
$$ y = [-132098, 185443, 145897, -150275, -114488, 138286, 57875, -193326, -79077, 209033, 131877, -143945, -119141, 79175, 51869, -73626, -1463, 100602, 4876, -95825, -23129, 31757, -31054, -14570, 88468, 33164, -125004, -82363, 92378, 65049, -92886, -50619, 105659, 48338, -120724, -71577, 99577, 80388, -51182, -31546, 53389, 1510, -64748, 20136, 97949, 13198, -66437, -5031, 41685, -19142, -27144, 57998, 53098, -50003, -54310, 33487, 25461, -42830, 2458, 78551, 6213, -93352, -25469, 79316, 19727, -71996, -7031, 79701, 8741, -87260, -34918, 54854, 31676, -23767, -9047, 11931, -14135, -23977, 718, 3989, 2929, 30885, 22518, -48630, -60339, 33252, 78451, -1872, -59193, -1501, 41607, -10909, -43041, 11547, 45159]
206D5159m7051l4871K6445K4141r483l367O578q832p170J0501j013j4995J3626
219c32K9812j2104m0475R16L4440M871j9158P342J5775k2453k9983J4521L5907
232A9079J426k6142j0845J1324P598o751q562R561K3470J861l4953k3878K9273
245g539L8603j6217l8729R072L7729o127m2343l245M2984K1212k8758l1352O189
258a8521K6198Q572j5806j2797J0062J5117j0316k1979O828L1047N845k8915j7783
271b2448J6902J7937m638j0679m92K337j212P21J181k96J881K565m304n424N477
286d92O636n247n752O859M767j0622n680J2105P331j2009p114J3923Q599j6050
300b746j4411J3156K0562l256k1646j0160J1401J6294j235j5787m971J5655J0363
$$ y = [45159, -1892, -36763, -10318, 13823, 4340, 973, 7551, -1281, -8451, 2050, 1037, -13958, -332, 29480, 17376, -23099, -22183, 12257, 17128, -2030, 5312, 21087, -1366, -31349, -16828, 19079, 20505, -5637, -16482, -5158, 2440, -4311, -12873, -3312, 20158, 22019, -12934, -36812, -7539, 31064, 14847, -23882, -14810, 22919, 16792, -25551, -28796, 14188, 35400, 6642, -24710, -18521, 7677, 16249, 443, -12354, -2292, 12825, 2509, -19470, -12642, 18405, 24250, -4665, -22448, -5546, 12391, 7753, -2926, -3418, -1081, -2293, -1572, -391, -687, 1194, 3759, -545, -5969, -492, 6144, 897, -4855, 2004, 6771, -3851, -9531, 2574, 9905, -2104, -9218, 4705, 13304, -2746, -17157, -4001, 16561, 13305, -8341, -18501, -7100, 9194, 7959, -7828, -12799, 2856, 13219]
313A3219j4643j6706J3068K3342o371k4161j705K0030M174j6317m227J4814P498
326A2015j0819j0563M299Q913M564k115p375n564M625R772j190j1626k106J1959
340D789M430j0261n633J0113O658q097q027M131O013j699l181O01k722k978N870
355GQ223n113j1385J165J1645K162q888m725L682L554J38j18j401j300K341K061
371B048m011k024R317N737j2337j2255J0665J7095o956j7806L407J7677Q40j5313
385c916l092J0907N891n491m807L02j73K102L310k142q324P98J0215K850q905
400d75o550N259N393j881l498R99K316j588k555j035J372L828L070k787o091j04
416d327O134K832n062m372M018N716k751p385k123O016O664j699p524j734P083
$$ y = [13219, -1424, -18130, -5062, 18280, 11909, -12252, -13957, 6073, 10247, -6070, -10297, 4517, 12015, 1196, -9367, -5068, 3845, 8409, 6294, -1081, -6645, -2020, 7752, 6562, -5064, -7170, 4789, 9219, -1042, -6675, 3438, 10096, 1999, -6028, -1897, 4116, 2417, -764, -163, -2885, -5863, 7, 8230, 3117, -8268, -7103, 4542, 6704, -2184, -6909, -3227, 327, 465, 347, -1054, -2354, -13, 2048, -1963, -3987, 5330, 11067, -1270, -13525, -2860, 14235, 7279, -10527, -7120, 10557, 11397, -3916, -7008, 3899, 9790, 4299, -508, -206, -379, 1723, 5033, 2891, -5433, -4635, 5580, 8430, -475, -7025, -1766, 3627, 1746, -1752, -753, 1563, -25, -2580, -3615, -2243, 1585, 4655, 1868, -4223, -4327, 1807, 4639, -423, -4795, -777, 4939, 2188, -5197, -7320, -1304, 5360, 3661, -3863, -5597, 1486]
431A486M941n808q230L983J1395M9j2826m405J0928Q100p542r498M440J1477o95
446G795j1246l406Q407N462m518n813J605M927m74m280j496L352K351q90q26q40
462A10j736n66J768J711j685j870J111J860k595k692K856M598o36l543o65P68
478a206n7O33K259j646l708K425N498k136p643J906J0443P3j1162k907J0918O267
494I957r879r692N748J0313r08q628k847O469N264l095o316l6O131K718n408m611
510d820L616N075k460o738J875R090J720q631n145N093N789k284l787J698J689
525A780k985j716K873K006k274n63K849j574m771R93O323K30o142r42L768r47
541a092j313M363K079q775m051J1400O865j0264p830R832O575j0402o051J2139
$$ y = [1486, 6427, 619, -7611, -3628, 7767, 7816, -5010, -9415, 1513, 9613, 2071, -7427, -2987, 8490, 7795, -3451, -6857, 1550, 7012, 2494, -3319, -1714, 3213, 2739, -1541, -3037, 315, 2666, 1776, 950, 110, -1626, -2192, -424, 1287, -398, -2268, -1157, 703, -1892, -4584, -1728, 2870, 2234, -1309, -1974, -1206, -1263, -630, 1629, -17, -3725, -1300, 4198, 2062, -5581, -3675, 6768, 6841, -4321, -7228, 3690, 9957, 78, -9614, -3866, 6447, 5539, -3089, -5936, 533, 5797, 2702, -3614, -3650, 2481, 5199, -209, -4820, -1204, 3871, 1411, -5327, -3452, 5638, 7358, -1273, -6418, -1325, 4464, 2180, -1607, 91, 1780, -1205, -2921, -48, 1958, -316, -879, 1970, 396, -4375, -3382, 2941, 3171, -2971, -3913, -145, -1092, -2405, 1958, 4037, -4738, -8789, 2611, 9476, -788, -8618, 1214, 7789, -2613, -8664, 3475]
555C475O170j1039p239R958N702p648l596N588J631k115J390p00p620J281J2722
570G960N40j5612k193J6372J326j7380j97J9158K039j8178l097J4150Q87j0780
584e005K528R282n279q367P789O281r713m637J1979L968j2292l140J0493j043
598B844j0181N456J2478p138j6022O481J5287l097j2405K586Q237m976n772O375
612A53O170o225n907M062L931j267J95K87m020j77P853J351j0545m333J0906O631
628I065q609p316O677N775n864n834O342Q607m183j1196k133R949O335m781o763
643c929j21M179M86j365R25P03j992K25J769j354k039K143J906l072r51N921q54
660B580r707r8J3182M233j3332o591R721M177p024Q27Q609m370j2331L398J3029
$$ y = [3475, 9645, -1394, -8633, 1325, 7027, -621, -4217, 1371, 3002, 887, 2277, 1577, -6043, -4762, 7960, 8500, -7112, -9305, 7067, 8393, -8987, -9184, 9974, 12013, -6165, -9262, 4888, 5775, -5005, -2477, 6805, 1526, -6841, 948, 7229, -2484, -7121, 4858, 8826, -3466, -6606, 3887, 2844, -7337, -1881, 10597, 3459, -12563, -6082, 9205, 6108, -6297, -3711, 4526, -450, -6222, 153, 6323, 98, -5809, -1747, 2184, 917, 1112, 1399, -2621, -2798, 5055, 6406, -4139, -8472, 2434, 9065, 456, -6860, -183, 5592, -272, -6106, 236, 8843, 4660, -6536, -8669, 1280, 7615, 2834, -3929, -4050, 129, 615, -750, 175, 878, -1114, -889, 880, -474, -2513, -370, 1536, -1536, -2487, 3434, 2580, -7127, -7225, 5957, 10190, -3142, -9733, -12, 4165, -2859, -2032, 6577, 2207, -10124, -6726, 6303]
675F303J83q751J27K617m296J386R576k418j2293L119J3153n116j4053P037J5097
690A1671q271j4170J0061J3385j1865j4372J1992J5081q632j1914M052L129l834
703c687M557Q589o936j2688N866J0899o150o839J0525N109j5884o722J7473Q067
717A2179j5901p603J3687O015j0513l348P761r64n003N121M986p902o226P324
731c87N156m830r01O142m920j0443O936J4961m262j4874r9J1133N21p003K136
746g34N041m138n471L725N828o27m129k270L63L443M192k685p439J48P720K254
762E221n134l188K141J474p41R23J760j193k398k319K90N403L991n565r765L663
778e437J2167L23j0974k388P426J205m332K156M277n982n533O602O250m072l947
$$ y = [6303, 6486, -2265, -2138, 479, -3817, -2431, 7145, 4727, -7566, -4447, 8706, 3590, -10463, -3426, 11671, 3400, -10770, -709, 12676, 811, -13561, -1569, 13512, 4880, -7034, -2982, 147, -3687, 870, 9459, 2523, -10165, -4299, 6600, 450, -6389, 4136, 9245, -6639, -13361, 4112, 12179, -3722, -11325, 2362, 8377, -2136, -5484, 2277, 1313, -3690, 1431, 6417, -1485, -7711, -387, 4769, -61, -962, 5180, 260, -10183, -3247, 11714, 7452, -7422, -7521, 3612, 4133, -2870, -734, 4307, 169, -5302, -1577, 4251, 3624, -505, -2775, -2412, 1031, 5223, 2538, -4901, -4753, 2967, 5221, 87, -3101, -960, 514, -227, 696, 2456, 1263, -1135, -3454, -3164, 2239, 6230, 665, -9100, -5437, 6730, 7053, -3921, -6309, 1117, 2322, -2010, 146, 4423, -1559, -7092, -490, 5760, 1688, -2259]
793b259J932j242k260P174N971j0268r955R874J1369q999r595R041P830j1155
807b542o355J2737O368j3433o313J1994M942q999j843O290l013m956P570N551
821G998j0716o544J1078O142j0140k480J0896j883j5344L553J9239r59j9084k159
835a0403J4256J827q408J423N156n400l759P628L060q692j539Q126l46p903L380
850a594P547o150q870R210J1383r082j3163N741J2006k787p451K820L539m752
864a603k563N240L944l767k452N29o67Q65L528J38n257j904N538K039m546k467
880c405M507J698l494j570L069J823l390k846K496M854q67n789k425M645N069
895D375j462n258o08L098N70j028P14J035k194j306J180J045N75P59k081k635
$$ y = [-2259, -327, -1569, -3829, 3345, 9316, -952, -10907, -1033, 10336, 1337, -8258, 783, 8613, -2542, -8897, 3840, 10208, -3225, -9538, 2456, 7398, -1601, -3444, 2846, -167, -5123, 2447, 7998, -2718, -9262, 1816, 7958, -2182, -4662, 6234, 4351, -10993, -7440, 11799, 10840, -8244, -10403, 3853, 5680, -2728, -1305, 3851, -1549, -5308, 2320, 5380, -3312, -4851, 3275, 2929, -4974, -1594, 5953, -197, -9067, 143, 11526, 2444, -10719, -4978, 7028, 4241, -3210, -390, 3149, -1603, -4166, 1074, 5018, 1251, -1201, -672, -1339, -474, 3054, 3192, -2065, -3969, 1569, 3608, -938, -3405, 1102, 2800, -694, -2264, 805, 2628, -762, -3608, -1112, 3742, 2875, -2914, -5339, -694, 4375, 2913, -2345, -2953, 145, 715, -313, 401, 1436, -758, -2064, -884, 161, 736, 1495, -586, -3221]
911c221J834O044j724p392k55Q392J491q171j635O705J234o222M97O355p66o409
927c243k02N830P08l295P63j53k231J081M048j641m767J841N628l205n920M109
943f49N557m308n916M453O110m142o180L376M556j596k773J426r0j640J223K595
959B002j478k605J941J787l480j039N819J143o747k079O288L020n741k355M601
974A077K346l713k041K327J279j099j00M46p71K63N23j075o78K764J389l431l034
991c528L294L710k609l469J745L412j663l206J645K640n92k435O3J061P50j32
1007F86j092j186J486J909j168k973R78L127M2k992p49K423O84k355r38K652J329
1024A863j827j703N39J636Q51j128j450K75J849o6j609r1J945M43k583o03J983
$$ y = [-3221, -1387, 4657, 2933, -4459, -4714, 3678, 5169, -3002, -4637, 2068, 3302, -2920, -2423, 3932, 3166, -3243, -3445, 2385, 3093, -202, 561, 408, -1823, -742, 3306, 1665, -3102, -1261, 4367, 1162, -4758, -649, 4908, 600, -5316, -863, 5247, 1105, -5075, -1699, 2857, 1261, -1512, -86, -176, -1816, -593, 2002, 524, -2081, -140, 1647, -1833, -2872, 2947, 4090, -2657, -4736, 1552, 4572, -1169, -3524, 1077, 3423, -290, -2331, -4, 1275, 176, 76, 522, -249, 14, 537, -538, -1216, 1548, 2937, -494, -3528, -234, 3476, 867, -2602, -857, 2555, 892, -2314, -669, 1971, 1379, -1056, -993, 68, 818, 686, -406, -1592, -106, 1803, 635, -2338, -1360, 1767, 1809, -1183, -1932, 491, 1175, -1180, -2118, 534, 1863, 36, -1667, -1128, 508, 1359, 231, -1219, -944, 905, 839, -770, -861, 1084, 1527, -1056, -1659, 324]
1041C24J576j661j860J436K311j152k502L17K166J212k331j287Q21J996k60j840
1057g34r9J419M20j477o50J281J005j298j009K91J454L46j563m91J022Q76l96
1074C97j570M42J619J89j795n40J058J019p19j265M22J609k63j203l24J322N36
1091I34r34q34P43J079o33j476K1K030N13j237j701J388J440l98j724L8J989M20
1109A658k088j179J626J755j149j582M59J171m45p79l95J710J14j340m39O57R01
1126F55l54j523L86J199N75j069j134J088R93m45j366j47J512N03j443m91J060
1143aP97q10o66M09J150o40n78l24Q17M29l73o17k51J238K56r75o84O53P15Jj188
1164f42M62O78J52j024m09J228M27p20j050R72R65o70j178L35J655n58j628K64
$$ y = [324, 1900, 239, -1621, -185, 2126, 974, -1528, -1211, 955, 2167, -164, -1451, -630, 1366, 1106, -734, -833, 586, 1006, -471, -1121, 160, 1165, -133, -1142, -851, 603, 949, -614, -1105, -83, 793, 397, -1173, -731, 888, 1077, -718, -1258, -200, 819, 100, -1165, -743, 866, 603, -600, -924, 398, 934, 0, -834, -91, 988, 355, -1121, -1100, 930, 1443, 206, -1495, -107, 1333, 935, -789, -751, 1238, 1658, -430, -1609, 17, 1772, 623, -959, -500, 671, 226, -553, -948, 762, 876, -464, -903, -246, 655, 301, -1222, -836, 363, 938, -131, -1265, -177, 816, 371, -995, -1142, 370, 873, -570, -1061, -1, 796, -14, -680, -271, 879, 239, -339, -663, 154, 583, 210, -407, -658, 580, 836, -139, -823, -170, 545, 546, -642, -180, 498, 650, -374, -783, 445, 872, 152, -898, 74, 1039, 369, -809, -474, 1181, 623, -1005, -741]
1182g41J261j09q86j36N55R8j32l0k04K35N05L6j178J46J106m93q69k79J711L78
1202I74j374p04J308J095j555q18J141N04r27j92R15m4l15J98J19q39K1J194K33
1221I34j261q8J307n82j877J128K224r46k639N29K510m01j713O13J306o03j458
1238a017M89O05O6N4K88q75p66J331P92j307n79J275P53j856j097K366O70j341
1256a49r48J515L27j592o53J908P98j031m31l72J15J61J407m82p27q4J41p6k68
1275d41P91O45p48j052J72J198N12j122q34J102N23o92j148K94J714K39j563n50
1293i60J279K44j855P25J946j72k040m85O63M70L22P78k85j953j94K214k14j516
1311a033Q72J506j544k382K559K810k427l306K811K807k449k800K085K316j918
$$ y = [-741, 520, 411, -475, -611, -56, 42, -90, -120, -324, -89, 416, 452, -726, -580, 526, 33, -836, -1115, 596, 974, -400, -1104, 204, 1299, -256, -1074, 67, 571, -356, -548, 367, 323, 8, 206, 325, -514, -493, 701, 934, -327, -415, 892, 310, -1567, -439, 1785, 839, -1800, -1271, 1239, 838, -875, -262, 1044, 441, -1017, -528, 77, 143, 197, 485, -390, -1156, 175, 967, -340, -919, 356, 1109, -747, -1844, 522, 1192, -149, -1097, 418, 745, -847, -1500, 408, 1206, 175, -256, -628, -513, -352, 1055, 573, -154, -238, -97, -173, -441, 350, 995, 247, -805, -633, 565, 1077, -45, -879, 223, 746, 54, -1094, -800, 914, 1153, -410, -960, 319, 563, -1292, -567, 1379, 1207, -833, -1318, -655, -185, 137, 915, 630, -1323, -1517, 697, 483, -1033, -161, 1345, -199, -2581, -22, 2788, 361, -2945, -134, 2673, 224, -2576, -491, 1825, -93]
1326i3j138K859p66l340J062L706q29l149J426J629k603r70M894R99n363k677
1342d353O134J329m704k71M098k78m553J042M501j767l679K039K978k083k473
1357b040K521R44l636J031M773j461n824Q78N471j136l998K498K954m165k923
1372d113M440L951l630l717K139K266j578l03K286j648k185K214K373k513k279
1387b297K112K283k538n46K424k56l934K70M879J040m158j948J911J309J68K50
1403I69J31j759m20P18R93k02L65r9k476L00K584R36k818j362K520J100j052j140
1421g12m8J11Q67J195o90j930O9R71o07L98K705l97m320j644M553L066l008k435
1439a856J349P97j531J088K764j985k749J403K225j426q42J662k26k655J386L925
$$ y = [-93, -1231, 1628, 862, -2478, -1416, 2290, 1461, -1688, -262, 1367, -1236, -2206, 2688, 3687, -1676, -4353, 1781, 3110, -1594, -1865, 2233, 1955, -2598, -1556, 2945, 1178, -2501, -462, 2516, 433, -2040, 481, 1425, -2211, -1180, 3593, 2132, -3692, -2814, 2657, 1521, -2477, 21, 2975, -1190, -4113, 327, 4278, 648, -3069, -930, 1336, -242, -545, 1741, 93, -2092, 122, 2495, -18, -2297, -185, 2098, -440, -986, 1438, 1182, -2752, -2482, 2397, 3437, -721, -2669, -758, 551, 719, 969, 1100, -659, -1079, -361, 632, 430, 795, 696, -1780, -1480, 1104, 2040, -778, -2140, 380, 1480, 428, -712, -760, -649, 218, 1413, 723, -1207, -1138, -167, -774, -376, 2329, 1932, -2388, -4032, 521, 3587, 579, -1856, -507, 290, -1241, -153, 2611, 626, -2123, -720, 1505, 79, -763, 899, 673, -1982, -596, 3329]
1455C329k373n298J972O343j321m889O35L461k181k292M425J854m363l265L556
1470d07K166j429O4J484l273k143M363K650l410l448L603K536m086j299M512M53
1486B336m668j65N218k48m982k44L665L79j150O81m91l088R42M117N37l794r28
1503a883K530p14j862L133K579m239l650L654L601k026k486J110N77j018P85J223
1519A314j381j534J779J344j699l57J762j096k239J520L893j957m159M52L920
1534A562L7j701k10K58q40RJ625J13j074j54L95r21J7K777j39m048k50L914Q11
1553B181l157j323K577J059k221P06J180j195j563J691J288o26o51J86j096j002
1569a966K938K211l043l342K521L130k226j973K273J282l553k88L391J316l695
$$ y = [3329, 956, -4342, -2370, 3973, 2652, -2237, -1602, 1859, -322, -2614, 1811, 3665, -698, -3963, -407, 1759, 330, 394, 1878, -1395, -3538, 825, 3475, 65, -3383, 220, 2756, -1330, -2629, 1883, 2336, -2332, -2497, 2721, 2473, -2509, -2753, 912, 1291, 141, 822, 331, -2757, -1815, 2302, 2839, -955, -1883, 647, -67, -1929, 1204, 3783, -456, -4106, -452, 3149, 1123, -1363, -253, 324, -694, 91, 1314, -67, -1601, 178, 1522, -177, -534, 1228, 132, -2107, -587, 3306, 1349, -2810, -2358, 1562, 1599, -102, -312, -54, -894, -885, 740, 853, -221, -375, 20, -901, -884, 1893, 1754, -2294, -2544, 1370, 2181, -976, -2299, 278, 1337, -884, -178, 1002, -193, -1756, -65, 1223, 597, -54, 132, -964, -1966, 972, 3183, 140, -3202, -681, 2449, 223, -1750, 523, 1805, -1748, -2036, 1355, 2671, -1024]
1584a024r14K500M46j394P07M07k091J3L429R9l806o80L537O0k483O28K789j801
1602D22l210J749L294l42l477K34J888n74l08J194p46j517R62J919j396j327J360
1619A25J367k129j089K817J028l101j477K965J844k292j666J530M54m40J35J006
1635A077j137o56P12M50n24J71J106j376j420J632K120j443k626J009J934o93
1651C36j098N06P51q42m53P89J95k09q7M6j50M33Q12j058j684R51K224l18k273
1670a129K46J149J35r45L41P14l57r52NJ239m6Nl00q00N97R17K51j693o85J962
1690F54N54j889m43J555N60j285n56J675J80j632K64P29p4J00pr39L4P34J002
1709A216j474p32J247P55j288q14J416J119j864j041J856N57q05j164N90O10j03
$$ y = [-1024, -1938, 562, 1008, -386, 321, 728, -1363, -1350, 2079, 2178, -1628, -2308, 1229, 1289, -1194, -566, 2223, 422, -2788, -1039, 2255, 1913, -1564, -1330, 558, -16, -324, 870, 124, -1393, -431, 1488, 92, -1235, 125, 1492, -637, -1726, 1091, 2119, -982, -2459, 506, 2350, 58, -1608, -78, 376, -64, 71, 1077, -60, -716, -4, 446, -78, 93, 1199, -177, -1597, 35, 2155, 712, -1914, -905, 1029, 336, -762, -256, 495, -347, -800, -11, 184, -25, -112, -66, -216, 217, 1029, -29, -1713, -762, 1462, 1144, -1129, -883, 266, 401, -544, -203, 511, 154, -798, -793, 446, 400, 405, 105, -695, -98, 819, 1070, -623, -1308, 654, 1208, -681, -1124, 431, 991, -294, -850, 825, 1005, -627, -363, 366, 292, 392, 385, -554, -520, 214, 1216, -258, -990, 257, 1012, -276, -1090, 326, 1445, -419, -1460, 396, 953, 148, -1016, -426, 184, 81]
1726H1O0j20j72j26M17M62j188j70J202Q2j556K97J740j46j795n5J654L31j408
1745d10m31R53O09p63j7K13Q2q8l78j15K73L52L26q36k98O40O39j303j40R51N85
1766H44q67j103J144O96o55o70M68N15Q1l76o85N96N37l73m23l37O50P21q35o96
1786g68N81O83m63l89n4P79J05j052J75N13L61l70m86PN91N2m33j97N62O82p85
1807I4n90K38P10j96n74n6P02K32m38k51J65N05q5p53n7M16M94o29m69M04O20
1828D82l34l29p8M73J83q15n27J147K90m13m33K07K42K48n82m2K76J43O9n22J64
1849a51l4N21l76j73M2O12m85l71M18L83l15n69M70M52j18r44M84J71L14J08p98
1870c59K72j10P80k14q91N54K78j59n98K27Q14k04p66j68P49L39p17l08O80K92
$$ y = [81, 141, 21, -151, -277, 140, 602, -586, -756, 446, 528, -1028, -731, 1009, 863, -932, -987, 667, 998, -410, -841, 112, 721, -42, -59, 154, 236, 148, -230, -345, -72, 280, 606, -230, -528, 112, 751, -552, -692, 259, 844, -23, -1126, 18, 714, 59, -611, -143, 372, 453, 77, -608, -12, 525, 152, -271, -608, 42, 763, -72, -768, -187, 496, 33, -356, -410, 369, 474, -578, -403, 110, 471, 101, -385, -378, 213, 265, -168, -365, 197, 879, 94, -496, -258, 452, 256, -318, -374, 328, 560, 122, -129, 36, 541, 456, -297, -354, 62, 556, -73, -542, -138, 482, 148, -181, -259, 214, 397, -418, -945, 202, 492, 79, -354, -147, 95, 343, -239, -281, -5, 138, 207, -315, -151, -185, 336, -40, -213, -171, 441, -44, -415, 3, 386, 71, -498, -28, 424, 306, -638, -154, 17, 331, 439, -359, -87, -197, 583, 369, -522, 32, 310, 151, -447, -220, 594, 390, -376, -544, 205, 544, -173, -481, 199, 491]
1890D91o12j9k19O68k18O2k45m7J62K10o29J49O19l99o9j09K67K10j46m76J87
1911a63M41m28O9j45N04J4j47l03M4P20k83l15j90L32Q1k15r5k17M34l76J52l57
1933d43O08k54K73j50J15r3L45o36k04O67L84n81n22M85N63n93n91P76K44m61
1953f8o92R78J60n78q0L90J40n50K82K69n70j86P75L16j366k9J332N7j121l9J373
1974G93j99j499O95Q75k3j437M48O94l56n98J050O5j146M26O64qp66J54J052r04
1994b0m86O38P32j078o94J185N98o17p82M15K79k31j2N51o7q83K36M30L9j59M56
2015E30n48o87K88J150k40p45j74N84j00n48L33N53n51k14N64M02p50n25J71M53
2035e4K05O55n13r16r8J031P10p08j94m25L23n60M37O44o16o34Q41M26k84o7m8
$$ y = [491, -121, -140, -359, 309, 91, 153, -92, -139, 23, 233, -396, -247, 372, -27, -96, -205, 62, 272, 126, -350, -163, 278, -150, -81, -226, 278, 292, 145, -158, -114, 606, 323, 8, -182, 150, 231, 16, -79, -296, 138, -238, -86, -443, 165, -89, 184, 34, 149, 56, 401, -235, -439, 228, 612, 31, -491, -6, 557, -36, -627, 149, 393, -68, -760, 218, 378, -200, -280, 110, 250, -300, -18, 251, -319, -505, 270, 586, -780, -809, 523, 580, -541, -580, 793, 594, -905, -210, 665, 642, -795, -347, 347, -9, -607, 443, 508, -638, -212, 452, 444, -322, -168, 884, -20, -506, 132, 864, -214, -908, 277, 875, 258, -524, -109, 170, -61, -73, 478, 411, -472, -236, 194, 233, 74, 530, -18, -705, -417, 733, 493, -252, -426, 158, 58, -490, -157, 396, -155, -369, 195, 597, -153, -678, -507, -54, 151, 806, 293, -623, -721, 310, 1020, 312, 118, -307, 16, -544, -107, 537, -79, -713, 128, 554, 270, 203, 155]
2056A55k18l98J090K79j178o30J061P83j082l36J194l57j208O53J381k8j978L41
2074d76O51M7l95Q09n18j314K16K159m08j605L29J094p77j179J836R99j783j097
2092a412J942Q20j312j239J365K32j037M74J309j006j372Q60J691q90r39O57M2
2109A85j328Q29J911m51k501k19K556J96j927R3J633j348q27J523J225j407j455
2126a312J240J028j126J72M40n31q55J010J872j769j916J138J552j082l34J051
2142E78K89j986K11J863J64j691j96R61j82l7M42Q9j353j16J779k25j009j45O34
2161G0j08o05R01N60j035q29Q25J218j25j371R6j19M27P59L27j295m50O17K20
2180H3j89N34l3n81j212J349J432o18j565N7Q10K22J20N2p94m68J045O64o53r37
$$ y = [155, -63, -461, 629, 908, -270, -900, 161, 944, -138, -474, 720, 363, -845, -192, 1189, 1161, -817, -476, 175, 222, -173, 636, 118, -1196, -980, 1179, 771, -834, -505, 589, -188, -1367, 469, 1468, -315, -1412, 530, 1350, 38, -1201, 164, 396, -641, -167, 1142, 136, -1236, -376, 1315, 425, -514, 143, 185, -1143, -314, 1597, 1146, -1355, -1574, 982, 1178, -749, -656, 977, -371, -1198, 325, 1550, 143, -1312, -72, 956, -170, 2, 442, -89, -944, 66, 1938, 169, -1747, -609, 943, -139, -473, 578, 867, -1119, -908, 955, 1119, -572, -768, 193, 11, -26, 416, 505, -848, -964, 815, 590, -419, -564, 70, -38, -643, 258, 818, -217, -1046, -221, 997, 872, -499, -403, -522, -95, 664, 991, -304, -754, -137, 83, -106, 428, 395, -186, -1398, -49, 1383, 765, -800, -743, 67, 289, 409, 461, -333, -801, 244, 908, 255, -682]
2200f82O30J08p71M24J374k95k071L1K140K69j393l69Q26n14l09J406M64j696
2218d28q14J733M92j149k32J026j359p84J662J519j731k006J821J798j450j013
2234i15J353lj391P6K027k98j823r8J351M2o50J199q6j783k17K226M41k210p50
2253a509K335j33j663N66J297n55j783J073J684q59j284M88N02m73N37P48q44
2270A27j702J172J559l88j569N30Q19r03m50J731L22k216k44J497O43p17o20j0
2288d19K89m40Q95M33j208j05N15K22l40JQ30j140p11J379J217j401r28M85J016
2307E90k61k04L78o06m39Q54L47m93m52L24Q5p27M34J205o03j607P21J441k14
2326G73j380J02N26K08n72O76k80m68J58O98n59m13P25R7r07r7J295N48j472q48
$$ y = [-682, -52, 56, -715, -291, 1083, 788, -1283, -1252, 888, 1157, -236, -605, 221, -293, -602, 804, 1268, -428, -1242, 491, 983, -166, -398, 628, -731, -1515, 147, 1666, -65, -2071, -250, 1548, 98, -915, 438, 435, -956, -880, 1147, 849, -974, -1072, 279, 321, -329, 870, 784, -999, -1216, 1010, 1451, -759, -1509, 826, 693, -970, -404, 893, 338, -1445, -372, 1312, 453, -831, -343, 159, -314, 223, 971, 127, -1575, -403, 1156, 768, -801, -271, 548, -355, -805, 926, 1248, -968, -1212, 285, 928, 211, -409, -419, -130, -570, 325, 758, -450, -555, -40, 182, -158, -157, 673, -467, -1178, 201, 1418, 17, -911, -426, 590, 329, 125, 503, -103, -542, 312, 659, 166, -286, 38, 123, -604, -170, 1035, 432, -1175, -454, 987, 773, -607, -505, 21, 229, -343, 333, 53, -415, -257, 441, -118, -531, 194, 291, -616, -713, 582, 1130, -342, -1190]
2346a190J385M53r04l5Q19l27r15N62J163n29j088N90K68n13L85M8N9r19L93J320
2366A025o72j241Q14N93n29q45N69J000j000n08Q43L02l3n88L14J7l21N96j51
2385A85p51j62R72L47q84l19R39J0p63K08O79n7p06k48P95J09o15qJ90k23M75
2406A73J12k8n18J55L82j9p33L99l3M7n36P76K30m73m0J03K64p5k52J53m0K60
2428C07l88O1r6K92n2J40o43P35M8p29k94P33J10j90k66K3M49j78J44l38J97o6
2450aJ50R7r55P47M3j53n87L99P54l04n01j43P20K44m87j41J76r7K96l35K48l27
2472a57K4O53n24l51O01%l39J3J94L92p33j71N24L62p28Q4M53k72r7k3oL77k69
2495Gl75M32L5j10K4K12o22O29l8l42j25K03M44k81m77Q8P46k12q11J84L89J36
$$ y = [-1190, 195, 648, -256, -291, 528, 201, -714, -152, 1011, 482, -606, -16, 252, -261, 124, 172, 231, -688, -295, 1025, 353, -888, -74, 519, -10, -855, -286, 714, -286, -794, 49, 351, 318, -270, 44, 61, -260, 336, 185, -566, -728, 244, 591, -293, -612, 327, 337, -426, -218, 461, 404, -302, -550, 245, 354, -261, -269, -79, -302, 173, 285, 257, -261, -106, 276, 257, -476, -77, -110, -63, -599, 177, 407, -66, -106, -3, 261, 186, -66, 87, 47, 307, -81, -20, -116, 176, 124, 264, -379, 356, 404, -325, -619, 114, 224, 34, -232, -209, 240, 62, 206, -132, 65, -1, 149, 246, -709, 38, 81, -72, -659, -260, 494, 190, -311, -454, 266, 510, 23, -118, 58, -39, 257, -78, 170, -157, -133, 520, -4, -355, 246, 246, -93, -80, 114, 506, -227, -398, 126, 488, -240, -156, 297, 25, -72, -95, -101, 276, 7, -368, 64, 99, -11, 13, 225, -397, 232, 194, -148, -273, -70, 374, 93, -384, -296, 450, 238, -573, -389, 0, 136]
2517A36j62k56r2O86j43l72MJ22K53k54K1r1o3L34q0n7K2L07R2l09k75L46m9k07
2541h7J8j11M74m79P1J87M7K21o21N5K59K00r9o2k33M75m7k88k32J29J56k2k14
2564b03J28o7N9k26M4L22J53n10j36M05J18k33RK17P8K37m21r6J18J53j69K7j51
2587a44q3M92k58m05M65M76n27N5Q1K40k72k10o3J84J93l48J95L4Kj89J80k92
2609a94n5nL66j94j28N3p2M06p35M67L97j24m18M95k0o01K35K12J79J8k74o5J83
2632A26l65J08L2rM3k76M15l46L60K19l20k62j04L97J45o03N81K40k73j76n03
2653e71O64P6l87J5M92n10oJ90J86k06J90J68n6l96L7P40m53j95N1n6j63N4J03
2676c3M05p61L96q3K08R9l0k0m16o9L09P5j65p5J10J63P1j11l5k39k19M64L06
$$ y = [136, -26, -282, -374, 312, 169, -203, -199, -77, 176, -78, -57, -148, -211, 123, 43, -14, 8, 315, 407, 98, -177, 169, 120, -87, -69, -180, 294, -185, -114, 73, 120, 341, -280, -225, 34, 234, 135, 73, -160, 315, 268, -20, -252, -123, 33, 11, -203, -75, -142, -83, -309, -265, 57, 210, -300, -436, -31, 87, -146, -137, 80, 158, 395, -26, -122, -4, 149, -20, 7, -144, -227, 265, 7, -398, 67, 543, 16, 71, 152, 392, 120, -90, -153, 31, 224, -124, 71, 105, 107, -82, 98, -194, -249, -254, 112, -82, -210, -157, -229, 177, -558, -91, 306, 182, -236, 259, 239, -362, -127, 85, 264, 282, 8, -57, 126, -239, -131, -99, -108, -65, -341, 74, -272, 88, 307, -13, -275, -379, 18, 163, -440, 141, 381, 108, -68, -571, 93, 169, -218, -203, 289, -221, -227, -37, 149, -57, 133, 301, 245, -151, -114, 626, 173, -22, 29, -27, -190, -136, -33, 372, -389, 7, -76, 132, 231, 201, 181, -235, -304, 5, 80, -85, -160, -50, 113, 184, 73, 38, -201, -420, 44, 350]
2699C50m25l29K92L80k45p7L4K3l56M27j73m96P77R2k72m81O65J30j70o45O57
2720A58l88M37N5r9o0l64L10K19k07l53L85M04r33R9P83k15m91k63N46L9j16j03
2742a57j5J98k60L07L60o64j86M32P65o57l77M45Qo69M24L79o7o45K68J39N7o09
2764e24O74J6n02m68J292L30j325O9P94k21j10p5J23o46K04Q69K23j004q6P01
2784C34k45l92L37K56M1j001O77P32l87q75N68j47k89P15N8k13o75K78Q23l65
2804B30m27k72O58k21k28O64j2p61k34P96J97m11j21O33o64m79R74K32p23k43
2824d12L90N06l28r7K59m76k72O79O81q90o81R56j61m19J32O43o71n84P71N52
2844E78l70o09QL94l66M00M73j95n38l75J201j27r53J66P01o81l2O89l4r46k20
$$ y = [350, -75, -404, -112, 268, 23, -54, -20, 3, -353, 74, -99, -595, 182, 274, 2, -479, 186, 316, 146, -499, 158, -230, 207, 262, 163, 103, -261, 49, 268, 61, -292, 93, 497, -436, -337, 446, 231, -260, -523, 23, 62, -54, -157, -172, 26, -234, 73, 433, -231, -417, 15, 780, 123, -254, 191, 199, -470, -46, 333, 266, -379, -111, 28, 85, -524, 150, 166, -336, -804, 488, 818, -507, -438, 356, 135, 25, -50, 73, -573, -369, 500, 723, -281, -367, 334, 89, -303, 34, 290, 331, -670, 7, 739, 352, -523, 45, -102, -391, 324, 382, 169, -506, -228, 595, 230, -197, -469, 189, -32, -260, 404, 392, -369, -603, 193, 390, -21, -142, 491, -173, -652, 322, 554, -169, -412, -22, 484, 156, 59, 318, -158, -430, 249, 930, 40, -641, 315, 154, -265, -133, 510, -161, -745, 26, 578, 208, -401, -393, 1, -365, 35, 508, 313, -225, -600, 601, 474, -479, -313, 388, -293, -325, 364, 330, -616, -836]
2865h36J186J49p68K71M33n20k05M35O23r27m78N08P71o56n65Q04j48q42N39J165
$$ y = [-836, 350, 499, -269, 2, 435, -85, -290, 145, 768, -159, -637, -129, 642, -14, -579, 225, 77, -765, -226, 939]
$$ [...]
8191I9
##END NTUPLES=NMR FID
##END=
