##TITLE=1H_SA_28.127
 DMSO d6/CCl4, 72 sc, 
 20.8.2019
##JCAMPDX= 6.0         $$ Bruker NMR JCAMP-DX V2.0
##DATA TYPE= NMR FID
##DATA CLASS= NTUPLES
##ORIGIN= UXNMR, Bruker Analytische Messtechnik GmbH
##OWNER= root
$$ XWIN-NMR		Version 3.5
$$ Tue Aug 20 14:20:56 2019 Russian Standard Time (UT+4h)  she@DPX200
##.OBSERVE FREQUENCY= 200.13155
##.OBSERVE NUCLEUS= ^1H
##.DELAY= (6, 6)
##.ACQUISITION MODE= SIMULTANEOUS
##.ACQUISITION SCHEME= undefined
##.AVERAGES= 72
##.DIGITISER RES= 18
##SPECTROMETER/DATA SYSTEM= spect
##.PULSE SEQUENCE= zg30
##.SOLVENT NAME= DMSO
##.SHIFT REFERENCE= (INTERNAL, DMSO, 0, 15.7039)
##AUDIT TRAIL= $$ (NUMBER, WHEN, WHO, WHERE, WHAT)
$$ ##TITLE= Audit trail, XWIN-NMR		Version 3.5
$$ ##JCAMPDX= 5.01
$$ ##ORIGIN= Bruker BioSpin GmbH
$$ ##OWNER= she
$$ F:/spectra/data/she/nmr/H-F/1/audita.txt
$$ ##AUDIT TRAIL=  $$ (NUMBER, WHEN, WHO, WHERE, WHAT)
(   1,<2019-08-20 14:19:43.67 +0400>,<she>,<DPX200>,
      <continue with go, POWCHK disabled, PULCHK disabled
       configuration hash MD5:
       00 E9 B6 7A A2 85 ED C7 34 08 36 98 17 FE 4E 26
       data hash MD5: 16K
       76 15 DA FA 7C C4 24 9E D9 14 0C CC 70 B8 4B F9>)
$$ ##END=
$$ 
$$ hash MD5
$$ 03 49 AD 5C 2F 0B 8E 5D B4 58 90 51 64 26 F9 03
##$RELAX= 
##$RELAX= 
##$RELAX= 
##$RELAX= 
##$RELAX= 
##$RELAX= 
$$ Bruker specific parameters
$$ --------------------------
##$DU= <F:/spectra>
##$EXPNO= 1
##$NAME= <H-F>
##$PROCNO= 1
##$TYPE= <nmr>
##$USER= <she>
##$AMP= (0..31)
100 100 100 100 100 100 100 100 100 100 100 100 100 100 100 100 100 100 
100 100 100 100 100 100 100 100 100 100 100 100 100 100 
##$AQSEQ= 0
##$AQ_mod= 1
##$AUNM= <au_zg>
##$AUTOPOS= <>
##$BF1= 200.13
##$BF2= 200.13
##$BF3= 200.13
##$BF4= 200.13
##$BF5= 200.13
##$BF6= 200.13
##$BF7= 200.13
##$BF8= 200.13
##$BYTORDA= 1
##$CFDGTYP= 0
##$CFRGTYP= 5
##$CHEMSTR= <none>
##$CNST= (0..31)
1 1 145 1 1 1 1 1 1 1 1 1 1 1 1 1 1 1 1 1 1 1 1 1 1 1 1 1 1 1 1 1 
##$CPDPRG= <>
##$CPDPRG1= <>
##$CPDPRG2= <>
##$CPDPRG3= <>
##$CPDPRG4= <mlev>
##$CPDPRG5= <mlev>
##$CPDPRG6= <mlev>
##$CPDPRG7= <mlev>
##$CPDPRG8= <mlev>
##$CPDPRGB= <>
##$CPDPRGT= <>
##$D= (0..31)
0 1.2 0 0 0 0 0 0 0 0 0 0.03 0 0 0 0 0 0 0 0 0 0 0 0 0 0 0 0 0 0 0 0 
##$DATE= 1566296166
##$DBL= (0..7)
120 120 120 120 120 120 120 120 
##$DBP= (0..7)
150 150 150 150 150 150 150 150 
##$DBP07= 0
##$DBPNAM0= <>
##$DBPNAM1= <>
##$DBPNAM2= <>
##$DBPNAM3= <>
##$DBPNAM4= <>
##$DBPNAM5= <>
##$DBPNAM6= <>
##$DBPNAM7= <>
##$DBPOAL= (0..7)
0.5 0.5 0.5 0.5 0.5 0.5 0.5 0.5 
##$DBPOFFS= (0..7)
0 0 0 0 0 0 0 0 
##$DE= 6
##$DECBNUC= <off>
##$DECIM= 24
##$DECNUC= <off>
##$DECSTAT= 4
##$DIGMOD= 1
##$DIGTYP= 9
##$DL= (0..7)
0 120 120 120 120 120 120 120 
##$DP= (0..7)
150 150 150 150 150 150 150 150 
##$DP07= 0
##$DPNAME0= <>
##$DPNAME1= <>
##$DPNAME2= <>
##$DPNAME3= <>
##$DPNAME4= <>
##$DPNAME5= <>
##$DPNAME6= <>
##$DPNAME7= <>
##$DPOAL= (0..7)
0.5 0.5 0.5 0.5 0.5 0.5 0.5 0.5 
##$DPOFFS= (0..7)
0 0 0 0 0 0 0 0 
##$DQDMODE= 0
##$DR= 18
##$DS= 0
##$DSLIST= <SSSSSSSSSSSSSSS>
$$ [...]
##$SUBNAM2= <"">
##$SUBNAM3= <"">
##$SUBNAM4= <"">
##$SUBNAM5= <"">
##$SUBNAM6= <"">
##$SUBNAM7= <"">
##$SUBNAM8= <"">
##$SUBNAM9= <"">
##$SW= 24.9336996594482
##$SWIBOX= (0..15)
0 0 2 0 0 0 0 0 0 0 0 0 0 0 0 0 
##$SW_h= 4990.01996007984
##$TD= 16384
##$TD0= 1
##$TE= 0
##$TE2= 300
##$TE3= 300
##$TEG= 300
##$TL= (0..7)
0 120 120 120 120 120 120 120 
##$TP= (0..7)
150 150 150 150 150 150 150 150 
##$TP07= 0
##$TPNAME0= <>
##$TPNAME1= <>
##$TPNAME2= <>
##$TPNAME3= <>
##$TPNAME4= <>
##$TPNAME5= <>
##$TPNAME6= <>
##$TPNAME7= <>
##$TPOAL= (0..7)
0.5 0.5 0.5 0.5 0.5 0.5 0.5 0.5 
##$TPOFFS= (0..7)
0 0 0 0 0 0 0 0 
##$TUNHIN= 0
##$TUNHOUT= 0
##$TUNXOUT= 0
##$USERA1= <user>
##$USERA2= <user>
##$USERA3= <user>
##$USERA4= <user>
##$USERA5= <user>
##$V9= 5
##$VALIST= <valist>
##$VCLIST= <CCCCCCCCCCCCCCC>
##$VD= 0
##$VDLIST= <DDDDDDDDDDDDDDD>
##$VPLIST= <PPPPPPPPPPPPPPP>
##$VTLIST= <TTTTTTTTTTTTTTT>
##$WBST= 1024
##$WBSW= 4
##$XGAIN= (0..3)
0 0 0 0 
##$XL= 0
##$YL= 0
##$YMAX_a= 1696246
##$YMIN_a= -4072735
##$ZGOPTNS= <>
##$ZL1= 120
##$ZL2= 120
##$ZL3= 120
##$ZL4= 120
##$ABSF1= 10
##$ABSF2= 0
##$ABSG= 5
##$ABSL= 3
##$ALPHA= 0
##$AQORDER= 0
##$ASSFAC= 0
##$ASSFACI= 0
##$ASSFACX= 0
##$ASSWID= 0
##$AUNMP= <proc_1d>
##$AZFE= 0.1
##$AZFW= 0.1
##$BCFW= 1
##$BC_mod= 2
##$BYTORDP= 1
##$COROFFS= 0
##$CY= 11.3945322036743
##$DATMOD= 1
##$DC= 2
##$DFILT= <>
##$DTYPP= 0
##$F1P= 20.1720416913024
##$F2P= 0.152960286110954
##$FCOR= 0.5
##$FTSIZE= 0
##$FT_mod= 4
##$GAMMA= 1
##$GB= 0.15
##$INTBC= 1
##$INTSCL= 1
##$ISEN= 128
##$LB= 0.24
##$LEV0= 0
##$LPBIN= 0
##$MAXI= 10000
##$MC2= 0
##$MEAN= 0
##$ME_mod= 0
##$MI= 1.114404
##$NCOEF= 0
##$NC_proc= 0
##$NLEV= 6
##$NOISF1= 3.799351
##$NOISF2= 2.8
##$NSP= 1
##$NTH_PI= 0
##$NZP= 0
##$OFFSET= 15.70392
##$PC= 1
##$PHC0= -9223.568
##$PHC1= 28.20096
##$PH_mod= 1
##$PKNL= yes
##$PPARMOD= 0
##$PSCAL= 0
##$PSIGN= 0
##$REVERSE= no
##$SF= 200.130013532006
##$SI= 16384
##$SIGF1= 3
##$SIGF2= 2
##$SINO= 400
##$SIOLD= 16384
##$SREGLST= <1H.CDCl3>
##$SSB= 0
##$STSI= 0
##$STSR= 0
##$SW_p= 3612.71676300578
##$SYMM= 0
##$S_DEV= 0
##$TDeff= 0
##$TDoff= 0
##$TI= <>
##$TILT= no
##$TM1= 0
##$TM2= 0
##$TOPLEV= 0
##$USERP1= <user>
##$USERP2= <user>
##$USERP3= <user>
##$USERP4= <user>
##$USERP5= <user>
##$WDW= 1
##$XDIM= 8192
##$YMAX_p= 0
##$YMIN_p= 0
$$ End of Bruker specific parameters
$$ ---------------------------------
##NTUPLES= NMR FID
##VAR_NAME=  TIME,          FID/REAL,        FID/IMAG
##SYMBOL=    X,             R,               I
##VAR_TYPE=  INDEPENDENT,   DEPENDENT,       DEPENDENT
##VAR_FORM=  AFFN,          ASDF,            ASDF
##VAR_DIM=   8192,          8192,            8192
##UNITS=     SECONDS,       ARBITRARY UNITS, ARBITRARY UNITS
##FACTOR=    0.0002004,     1,               1
##FIRST=     0,             0,               0
##LAST=      1.6414764,     0,               0
##MIN=       0,             -4072735,        0
##MAX=       1.6414764,     1696246,         0
$$ Real data points
##PAGE= N=1
##DATA TABLE= (X++(R..R)), XYDATA
$$ [...]
$$ plain form
2658 -2703 365 1588 1553 -943 -586 921 1386 607 -234 -1524 -909 878 2879 -497 -1756 -881 2154
2675 2154 1725 -1450 -3161 672 968 -571 -1688 -1493 882 2114 -249 -2187 -1324 2214 1951 -1646
2691 -1646 -3251 -515 3116 2716 -1289 -3009 2138 2711 136 -2522 -1022 1248 2928 -1782 -3479
2706 -3479 -896 2976 1823 -1413 -2497 44 3449 1729 -3098 -2410 1970 3244 -1611 -2569 -600
2721 -600 1415 646 -615 -1054 -716 1298 439 -841 -918 -1355 1003 590 -1162 -1768 380 993 -253 -1663
2739 -1663 -1208 688 2053 -217 -1952 -770 -351 1105 574 -2186 -1994 1738 2571 -157 -2817 -932
2755 -932 2588 2065 -2372 -2818 40 2456 -574 -2431 -1556 1459 3038 88 -2070 -1407 1839 2322
2771 2322 -1623 -2601 -595 4034 1628 -1496 -3241 984 3767 -205 -2350 -1474 1899 2227 -1467 -2207
$$ packed form
2658b703L068J223l5k496L57J507M65p79q41j290O15J787K001l376j259Q75L035
2675B154m29l175j711L833K96j539j117J95K375J232k363j938Q63L538k63l597
2691a646j605K736L631m00m005j720N147N73k575k658J500K270J680m710j697
2706c479K583L872j153l236j084K541L405j720m827O88M380J274m855r58J969
2721f00K015p69j261m39L38K014q59j280p7m37K358m13j752o06K148O13j246j410
2739a663M55J896J365k270j735J182M19J456n31k760J92L732Q33k728k660J885
2755i32L520n23m437m46K858K416l030j857Q75L015J579k950k158O63L246M83
2771B322l945r78K006M629k406l124j745M225K783l972k145Q76L373L28l694p40
$$ plain form
2787 -2207 885 1909 1499 -814 -2662 247 1187 659 -1372 -1522 1027 1625 -420 -1462 -585 398 109
2804 109 -744 -1196 -320 412 2005 1720 -1970 -1930 -387 1902 -716 -2200 -55 1602 1097 -1563 -1719
2821 -1719 422 1967 368 -633 -1797 203 2141 1153 -2430 -1550 1640 2015 -348 -2962 -993 3353
2837 3353 1696 -2377 -1980 1075 2516 -68 -1113 -1353 1305 1655 -1190 -720 -133 1806 1922 -2028
2853 -2028 -2050 -997 1525 774 -386 -1548 -14 1414 -806 -1739 -150 663 435 737 -1612 -632 1227
2870 1227 573 327 -747 -264 1130 1102 -581 -471 1029 2225 777 -1088 -1466 1411 2069 552 -522
2887 -522 -1401 -1257 1622 1502 -1265 -2041 289 1651 971 -2454 -552 2286 1560 -1243 -1720 256 1191
2904 1191 508 -1840 -850 -489 1158 341 -2267 -753 2080 3384 5 -2977 -1098 2301 1315 -1899
$$ packed form
2787b207L092J024m10k313j848K909R40n28k031j50K549N98k045j042Q77R83k89
2804A09q53m52Q76P32J593k85l690M0J543K289k618j484K145J657n05k660j56
2821a719K141J545j599j001j164K000J938r88l583Q80L190L75k363k614J969M346
2837C353j657m073L97L055J441k584j045k40K658L50k845M70N87J939J16l950
2853b028k2J053K522p51j160j162J534J428k220r33J589Q13k28L02k349R80J859
2870A227o54k46j074M83J394k8j683J10J500J196j448j865l78K877O58j517j074
2887e22q79J44K879j20k767p76K330J362o80l425J902K838p26k803m77J976R35
2904A191o83k348R90L61J647q17k608J514K833J304l379k982J879L399r86l214
$$ plain form
2920 -1899 -2118 475 1678 -138 -1903 -281 249 565 70 -936 -343 1375 2238 -762 -1962 -402
2936 -402 798 226 -1629 -1388 1465 416 -1086 -884 -271 388 -515 91 -917 -793 0 605 576 -1941
2954 -1941 -707 1220 874 456 -1952 -543 1298 503 -327 -1554 -461 1469 761 -409 -1684 163
2970 163 1798 963 -2964 -898 899 2968 -209 -2692 -994 2101 1682 -1211 -1710 1265 820 864 -643
2987 -643 -574 352 1890 44 -2152 -195 724 1625 -149 -3056 225 916 1199 -1386 -621 296 658 -785
3005 -785 -944 -933 938 965 834 -141 -1532 238 1319 -223 -1209 -1705 706 410 -472 -489 348 543 467
3024 467 -58 -1325 -545 701 1093 -928 -1000 -204 1028 1312 -1470 -408 82 1630 -342 -681 -819 922
3042 922 391 -931 -975 -888 1155 1342 -665 -1700 135 873 759 -1219 -1237 677 1565 -405 -1949 -166
$$ packed form
2920a899k19K593J203j816j765J622N30L16m95j006N93J718Q63l000j200J560
2936d02J200n72j855K41K853j049j502K02O13O59r03O06j008J24P93O05k9k517
2954a941J234J927l46m18k408J409J841p95q30j227J093J930p08j170j275J847
2970A63J635q35l927K066J797K069l177k483J698L095m19k893m99K975m45M4j507
2987f43O9R26J538j846k196J957R19R01j774k907L281O91K83k585P65R17L62j443
3005g85j59J1J871K7j31r75j391J770J081j542r86m96K411k96q82j7Q37J95p6
3024D67n25j267P80J246L92k021p2P96J232K84k782J062M90J548j972l39j38J741
3042I22n31j322m4Q7K043J87k007j035J835P38j14j978j8J914Q88j970j544J783
$$ plain form
3060 -166 1645 272 -1067 -875 346 1377 4 -1300 -420 -141 1175 545 -1005 -891 370 892 -1128
3077 -1128 -1319 -247 497 -51 -10 -1141 -814 706 531 160 -452 -139 708 1424 -584 -962 -167 416 108
3096 108 -635 -1302 1229 443 -69 -958 -874 954 677 889 -1252 -508 325 1172 -834 -943 156 844 920
3115 920 -964 -1530 841 920 -117 -173 -149 908 828 -716 -498 319 701 1370 -236 -60 1578 1323 47
3134 47 -1441 -418 884 575 479 -427 -615 -116 787 -307 -154 -393 198 245 112 -657 -453 1206 579
3153 579 11 -509 213 1422 -160 -1066 -449 225 540 -862 89 -367 688 619 -344 -942 86 541 -30
3172 -30 -809 -1967 572 331 -641 -789 -398 455 254 1205 -450 -579 830 964 414 -318 -102 531 335
3191 335 -501 -915 568 654 -221 -943 -1137 952 731 206 -1013 -572 32 568 -123 -1208 143 784 1238
$$ packed form
3060a66J811j373j339J92J221J031j373j304Q80K79J316o30j550J14J261N22k020
3077a128j91J072P44n48M1j131L27J520j75l71o12L13Q47P16k008l78P95N83l08
3096A08p43o67K531p86n12q89Q4J828k77K12k141P44Q33Q47k006j09J099O88P6
3115I20j884n66K371P9j037n6K4J057q0j544K18Q17L82O69j606J76J638k55j276
3134D7j488J023J302l09r6r06j88M99R03j094J53k39N91M7j33p69K04J659o27
3153E79n68n20P22J209j582r06O17O74L15j402R51m56J055o9r63n98J028M55n71
3172c0p79j158K539k41r72j48L91Q53k01R51j655j29J409J34n50p32K16O33j96
3191C35q36m14J483Q6q75p22j94K089k21n25j219M41O04N36o91j085J351O41M54
$$ plain form
3210 1238 -853 -261 621 364 438 -265 -822 -26 405 339 -489 -52 -226 793 470 -483 -837 283 1290
3229 1290 136 -846 450 1188 -43 -377 61 -128 -261 -54 633 -570 302 297 -101 -76 -869 758 837
3248 837 -752 -1044 -608 729 1085 -1210 -297 409 1170 924 514 -921 -392 666 -304 -846 -1092 223
3266 223 206 162 368 -463 -122 643 -539 84 292 287 180 -156 -449 -1111 656 704 -713 -780 -606 763 891
3287 891 -823 -76 479 1348 -411 -1152 38 1212 -425 -848 292 -290 16 302 330 -821 534 573
3305 573 534 426 123 837 78 178 -623 1018 621 1058 -942 -506 -497 223 -285 604 680 -101 -257 309 -267
3326 -267 129 -59 -62 -104 7 761 -244 -499 304 47 -898 -293 -349 468 -95 -1031 3 91 902 -652 -999
3347 -999 -677 -107 -258 -1150 -215 1002 239 -459 -810 -140 198 -255 -742 520 -6 1243 -360 -1058 -753
$$ packed form
3210A238k091N92Q82k57P4p03n57P96M31o6q28M37j74J019l23r53l54J120J007
3229A290j154r82J296P38j231l34M38j89j33K07O87j203Q72nl98K5p93J627P9
3248H37j589k92M36J337L56k295R13P06P61k46m10j435N29J058r70n42k46J315
3266B23j7m4K06q31L41P65j182O23K08nj07l36k93o62J767M8j417o7J74J369J28
3287H91j714P47N55Q69j759p41J190J174j637m23J140n82L06K86K8j151J355L9
3305E73l9j08l03P14p59J00q01J641l97M37k000M36RP20n08Q89P6p81j56N66n76
3326b67L96j88lm2J11P54j005k55Q03k57r45O05n6Q17n63r36J034Q8Q11j554l47
3347i99L22N70j51q92R35J217p63o98l51O70L38m53m87J262n26J249j603o98L05
$$ plain form
3366 -753 694 -11 121 -665 300 1116 67 -1140 358 1595 -353 -1089 -1487 434 813 -1006 -310
3383 -310 949 662 113 -49 -306 -431 866 -654 -108 -342 -115 414 -244 -530 243 290 -945 -596 465
3402 465 8 441 281 -354 454 149 -1150 -309 492 771 -1183 -1745 483 36 -213 -567 -63 929 588
3421 588 -535 -133 694 247 207 -581 -348 273 -118 -1151 -548 15 745 -68 -947 829 1442 79 -65
3440 -65 332 728 129 -301 436 101 -119 -407 -335 -376 -914 603 250 -810 -676 760 156 -147 336 -297
3460 -297 954 -784 60 -222 19 -479 -91 505 383 -294 18 -600 433 466 391 -503 -716 173 1290
3479 1290 259 -583 -447 568 -166 -1905 -280 555 404 -885 -467 712 297 -392 -1874 673 -513
3496 -513 -415 -556 -603 -317 65 424 -514 680 -56 872 -742 22 -306 97 -328 -1308 588 1210 -106
$$ packed form
3366g53J447p05J32p86R65Q16j049j207J498J237j948p36l98J921L79j819O96
3383c10J259k87n49j62k57j25J297j520N46k34K27N29o58k86P73M7j235L49J061
3402D65m57M33j60o35Q08l05j299Q41Q01K79j954n62K228m47k49l54N04R92l41
3421E88j123M02Q27m47m0p88K33O21l91j033O03N63P30q13q79J776O13j363j44
3440f5L97L96n99m30P37l35k20k88P2m1n38J517l53j060J34J436o04l03M83o33
3460b97J251j738Q44k82K41m98L88N96j22o77L12o18J033L3p5q94k13Q89J117
3479A290j031q42J36J015p34j739J625Q35j51j289M18J179m15o89j482K547j186
3496e13R8j41m7K86L82L59r38J194p36R28j614P64l28M03m25r80J896O22j316
$$ plain form
3515 -106 180 -1027 588 1191 -49 -232 299 914 509 -226 846 -289 319 -894 -606 586 669 -184
3533 -184 -550 269 -52 -39 -701 -957 -136 545 567 -635 308 684 621 -950 1348 -295 516 133 -553 -59
3553 -59 519 -113 -218 594 917 -153 -262 207 -603 1475 261 358 131 457 391 -22 -479 496 1149 -103
3573 -103 -1379 -1175 864 -244 -1327 136 -562 814 -292 -901 593 349 -253 -84 -716 200 -246
3590 -246 291 -114 -103 413 334 311 -462 -767 1775 484 -1196 245 596 321 -1267 142 1062 -238 -266
3609 -266 160 82 457 120 243 5 -258 386 374 -108 -22 1426 198 -214 -39 161 868 -342 -472 56
3629 56 492 -200 -404 -698 1030 633 -235 26 715 788 328 615 268 641 28 -152 -283 -186 387 -51 -692
3650 -692 -436 188 715 -1119 -111 -270 610 -52 2 -76 160 611 -560 109 725 -417 347 -931 167
$$ packed form
3515a06K86j207J615O03j240j83N31O15m05p35J072j135O08j213K88J192Q3q53
3533a84l66Q19l21J3o62k56Q21O81K2j202R43L76o3j571K298j643Q11l83o86M94
3553e9N78o32j05Q12L23j070j09M69q10K078j214R7k27L26o6m13m57R75O53j252
3573a03j276K04K039j108j083J463o98J376j106o09J494k44o02J69o32R16m46
3590b46N37m05J1N16p9k3p73l05K542j291j680J441L51k75j588J409R20j300k8
3609b66M26p8L75l37J23k38k63O44j2m82Q6J448j228m12J75K00P07j210j30N28
3629E6M36o92k04k94J728l97q68K61O89P3m60K87l47L73o13j80j31R7N73m38o41
3650f92K56O24N27j834J008j59Q80o62N4p8K36M51j171O69O16j142P64j278J098
$$ plain form
3669 167 1407 -370 -343 -304 401 450 474 -376 33 45 2 -791 -75 1872 -102 -694 -1581 438 -322 173
3689 173 429 -500 165 149 -390 -1655 1588 -281 -1511 715 -179 -1 -759 -524 -759 24 2 -418 -206
3708 -206 441 62 -127 30 -53 434 -139 -430 -349 160 573 -213 -1143 -287 506 563 -545 -334 -45 1062
3728 1062 -620 31 -218 759 109 -347 -571 426 118 -269 -129 295 158 1079 -784 -978 611 866 -15
3747 -15 -223 425 203 -1020 -812 -110 947 -284 -594 392 -150 655 -525 344 1400 777 -277 120
3765 120 -1255 -438 431 218 -747 552 1338 -164 -326 31 29 -40 -250 -919 870 -35 -535 98 -56 281
3785 281 139 59 -495 -77 -142 37 -285 -191 -54 131 -883 -312 -331 476 393 -999 -331 245 668 -297 92
3806 92 344 -353 -306 500 -138 -252 589 -896 88 512 401 243 -128 -448 371 -232 -546 -465 -21 300 -333
$$ packed form
3669A67J240j777K7L9P05M9K4q50M09J2m3p93P16J947j974n92q87K019p60M95
3689A73K56r29O65j6n39j265L243j869j230K226q94J78p58K35k35P83k2m20K12
3708b06O47l79j89J57q3M87n73k91Q1N09M13p86r30Q56P93N7j108K11K89J107
3728A062j682O51k49R77o50m56k24R97l08l87J40M24j37R21j863j94J589K55q81
3747a5k08O48k22j223K08P02J057j231l10R86n42Q05j180Q69J056o23j054L97
3765A20j375Q17Q69k13r65J299P86j502j62L57ko9k10o69J789r05n00O33j54L37
3785B81j42q0n54M18o5J79l22R4J37J85j014N71j9Q07q3j392O68N76M23r65L89
3806I2K52o97M7Q06o38j14Q41j485R84M24j11j58l71l20Q19o03l14Q1M44L21o33
$$ plain form
3827 -333 527 800 348 -243 464 -181 40 522 192 -501 -669 -75 -156 -981 -24 202 564 35 -236 524
3847 524 102 -590 -966 309 121 -880 -308 504 562 1190 -86 66 -265 423 242 -20 -462 378 -413
3866 -413 -185 -692 -865 -118 279 -1817 -294 -325 168 -522 695 -435 623 -402 -945 -120 410 219
3884 219 -114 66 -905 -492 458 133 168 69 -84 115 -478 1047 -95 215 -60 1248 972 -488 -74
3903 -74 89 -86 298 -106 270 1020 713 412 -523 117 20 216 635 -192 394 927 -810 -441 -111 1077
3923 1077 -352 -405 643 485 -385 -88 -120 274 671 -93 -20 85 759 610 -429 -195 -93 6 -459 30
3943 30 -1084 443 914 33 -224 943 -278 990 -147 -89 -3 441 -92 3 -80 -104 1276 -37 -520
3962 -520 -866 240 -579 185 750 300 -365 -363 -1366 649 228 -346 -342 451 -273 -291 -280 -433 -1173 -180 612
$$ packed form
3827c33Q60K73m52n91P07o45K21M82l30o93j68N94q1q25R57K26L62n29k71P60
3847E24m22o92l76J275j88j001N72Q12N8O28j276J52l31O88j81k62m42Q40p91
3866d13K28n07j73P47L97k096J523l1M93o90J217j130J058j025n43Q25N30j91
3884B19l33J80r71M13R50l25L5r9j53J99n93J525j142L10k75J308k76j460M14
3903g4J63j75L84m04L76P50l07l01r35O40r7J96M19q27N86N33j737L69L30J188
3923A077j429n3J048j58q70K97l2L94L97p64P3J05O74j49j039K34J02R9m65M89
3943C0j114J527M71q81k57J167j221J268j137N8Q6M44n33R5q3k4J380j313m83
3962e20l46J106q19P64N65m50o65Kj003K015m21n74MP93p24j8J1j53p40R93P92
$$ plain form
3983 612 449 12 1176 525 942 343 484 513 43 172 159 -1105 -285 -136 232 174 -495 503 -301 219
4003 219 -647 -220 -641 176 -730 -546 -178 -264 844 35 1205 -33 7 478 -747 606 -70 -551 303
4022 303 -1003 9 600 14 -62 624 346 168 728 91 366 -1052 39 31 113 -248 638 453 11 -39
4042 -39 192 -91 -151 -95 387 -102 261 288 -207 539 223 -271 279 571 -477 -14 271 234 22 -256 -716
4063 -716 -139 -280 -7 -105 -693 -208 -301 436 -1126 -747 213 182 -170 -736 -377 780 -414 -1511 -204
4082 -204 910 221 674 -853 148 -233 -236 49 775 -229 -127 -363 -427 725 607 173 -531 -299 643
4101 643 279 209 -262 388 212 -610 -901 -84 932 -637 -514 -274 326 -789 -308 57 1110 564 60
4120 60 131 278 146 -398 -147 -99 -102 306 -39 564 879 943 -596 -57 -714 -206 987 363 -518 -270 1108
$$ packed form
3983F12j63m37J164o51M17n99J41K9m70J29j3j264Q20J49L68n8o69R98q04N20
4003B19q66M27m21Q17r06J84L68q6J108q09J170j238M0M71j225J353o76m81Q54
4022C03j306J012N91n86p6O86k78j78N60o37K75j418J091qQ2l61Q86j85m42n0
4042c9K31k83o0N6M82m89L63K7m95P46l16m94N50K92j048M63K85l7k12k78m60
4063g16N77j41K73r8n88M85r3P37j562L79R60l1l52n66L59J157j194j097J307
4082b04J114o89M53j527J001l81lK85P26j004J02k36o4J152j18m34p04K32R42
4101F43l64p0m71O50j76q22k91Q17J016j569J23K40O00j115M81L65J053n46n04
4120F0P1J47j32n44K51M8lM08l45O03L15O4j539N39o57N08J193o24q81K48J378
$$ plain form
4141 1108 -819 -287 252 -385 242 469 -2 -37 522 -274 402 390 343 -521 -144 456 360 228 -942 -143
4161 -143 812 -217 131 129 -666 200 327 490 -988 -462 660 420 -1029 -574 -179 -320 -459 -1816 355
4180 355 746 -103 505 380 -132 -64 746 -812 325 566 -238 -633 532 -385 363 740 -144 -193 27 -295
4200 -295 646 -122 -737 -123 -382 338 437 397 442 -431 -180 569 1417 273 32 -11 252 -182 -92 205 298 -340
4222 -340 -385 -459 426 769 -353 207 -179 -35 135 -303 393 -12 327 -116 -296 -96 -1 -667 80 -539 787
4243 787 366 416 55 -256 -17 40 -472 -180 649 41 -610 -671 -138 775 807 -652 -25 438 679 475 874
4264 874 -627 757 150 -717 41 574 -574 -741 -599 -388 97 166 21 343 592 238 -26 -319 170
4283 170 -329 -679 66 -195 -164 384 -908 -488 499 153 -277 -116 -431 -291 320 -327 437 122 817 -222
$$ packed form
4141A108j927N32N39o37O27K27m71l5N59p96O76j2m7q64L77O00r6j32j170P99
4161a43R55j029L48kp95Q66J27J63j478N26J122k40j449M55L95j41j39j357K171
4180C55L91q49O08j25n12O8Q10j558J137K41q04l95J165r17P48L77q84m9K20l22
4200b95R41p68o15O14k59P20R9m0M5q73K51P49Q48j144k41m3K63m34R0K97R3o38
4222c40m5p4Q85L43j122N60l86J44J70m38O96m05L39m43j80K00R5o66P47o19J326
4243G87m21N0l61l11K39N7n12K92Q29o08o51o1N33R13L2j459O27M63K41k04L99
4264H74j501J384o07q67P58N33j148j67J42K11M85O9j45L22K49l54k64k93M89
4283A70m99l50P45k61L1N48j292M20R87l46m30J61l15J40O11o47P64l15O95j039
$$ plain form
4303 -222 -587 -875 -382 356 -259 -287 -288 737 605 -577 140 290 -53 -1072 211 -8 -150 -573 -274 461
4323 461 -181 -786 121 214 805 337 -645 455 -1700 -296 -555 -203 -67 292 2 275 469 433 678 -522
4343 -522 -644 -309 -270 -791 -517 279 755 407 -328 -535 -212 202 149 240 -276 -158 0 -5 -205 1031 1157
4364 1157 -281 -851 -787 -147 -585 -711 254 533 11 199 -805 339 240 357 -108 190 -55 725 -227
4383 -227 30 -227 18 -732 -712 492 487 1210 -514 -829 -360 -683 -21 365 -884 -303 206 -267 -220 744
4403 744 1183 860 -59 -672 714 37 -346 -450 146 641 -332 -324 -445 -538 -262 -676 921 207 891 65
4423 65 -402 427 698 1272 210 -396 -562 209 -364 -165 -100 -467 -703 -650 183 -424 -530 -274 -242 -18 -409
4444 -409 764 -698 891 881 123 -776 108 437 118 -191 122 -234 163 253 -942 1035 -263 419 -283
$$ packed form
4303b22l65k88M93P38o15k8jJ025j32j182P17J50l43j019J283k19j42m23K99P35
4323D61o42o05R07R3N91m68r82J100k155J404k59L52J36L59k90K73J94l6K45j200
4343e22j22L35L9n21K74P96M76l48p35k07L23M14n3R1n16J18J58nk00J236J26
4364A157j438n70O4O40m38j26R65K79n22J88j004J144r9J17m65K98k45P80r52
4383b27K57k57K45p50K0J204nP23j724l15M69l23O62L86j249N81N09m73M7R64
4403G44M39l23r19o13J386o77l83j04N96M95r73Qj21r3K76m14J597p14O84q26
4423F5m67Q29K71N74j062o06j66P71n73J99O5l67k36N3Q33o07j06K56L2K24l91
4444d09J173j462J589j0p58q99Q84L29l19l09L13l56L97R0j195J977j298O82p02
$$ plain form
4463 -283 -862 -444 -172 -226 736 -100 143 -85 -608 -1078 -38 737 -122 -246 -246 545 -354 -286 -117 280 -102
4484 -102 51 -70 350 -447 1032 -587 848 -105 566 503 374 -7 269 367 -138 479 480 290 -40 -252
4504 -252 -136 6 354 -821 21 555 568 -290 27 396 -348 257 -512 475 -316 -861 -267 -294 273 651
4524 651 -303 442 -35 -60 180 447 -203 645 -20 29 -52 273 -382 307 329 334 -122 -748 -218 382 213 9
4546 9 574 -984 844 780 728 415 735 -1211 61 435 -42 253 279 -330 -581 32 208 -265 -413 -423 -123
4567 -123 745 353 184 -339 -196 88 101 -590 267 425 -519 -619 505 -139 264 83 998 -110 583 -160
4587 -160 -736 -151 308 211 -477 584 -133 -840 137 -444 -218 606 220 -242 1173 -429 -607 119 210 78
4607 78 -251 275 -536 421 -436 594 -545 -1208 249 -615 269 -1246 422 -245 -914 416 -26 172
$$ packed form
4463b83n79M18K72n4R62q36K43k28n23m70J040P75q59j24%P91q99O8J69L97l82
4484a02J53j21M20p97J479j619J435r53O71o3j29l81K76R8n05O17Jj90l30k12
4504b52J16J42L48j175Q42N34J3q58L17L69p44O05p69R87p91n45N94k7N67L78
4524F51r54P45m77k5K40K67o50Q48o65M9q1L25o55O89K2Nm56o26N30O00j69k04
4546IN65j558J828o4n2l13L20j946J272L74m77K95K6o09k51O13J76m73j48j0L00
4567a23Q68l92j69n23J43K84J3o91Q57J58r44j00J124o44M03j81R15j108O93p43
4587a60n76N85M59r7o88J061p17p07R77n81K26Q24l86m62J415j602j78P26R1j32
4607G8l29N26q11R57q57J030j139o63J457q64Q84j515J668o67o69J330m42J98
$$ plain form
4625 172 -406 -177 -316 63 56 239 -619 73 -256 -38 310 -558 16 -427 -63 143 949 -829 452 77
4645 77 387 255 5 156 -224 261 247 -258 319 -307 -415 -723 -152 239 494 337 -600 544 -122 268
4665 268 -120 -543 439 97 -238 265 -560 481 1013 -99 25 251 546 -148 536 57 317 480 1053
4684 1053 -394 169 -1067 198 -284 103 -468 -701 -53 -398 327 -483 1131 33 -558 156 -1170 -416
4702 -416 542 -101 426 489 -1106 108 229 -595 394 -850 -249 181 -117 -362 -612 -468 -105 89 -73
4721 -73 644 -207 -934 667 301 123 91 28 241 -120 8 -101 701 -197 -574 285 279 -933 -48 485 76
4742 76 44 745 -838 508 -256 -171 -758 473 291 -915 -26 -539 -52 -131 423 -734 -78 473 107 64
4762 64 265 -554 439 -58 300 -361 417 -291 126 388 -156 567 542 654 395 -364 149 445 221 -186 -680
$$ packed form
4625A72n78K29j39L79pJ83q58O92l29K18L48q68N74m43L64K06Q06j778J281l75
4645G7L10j32k50J51l80M85j4n05N77o26j08l08N71L91K55j57r37J144o66L90
4665B68l88m23R82l42l35N03q25J041N32j112J24K26K95o94O84m79K60J63N73
4684A053j447N63j236J265m82L87n71k33O48l45P25q10J614j098n91P14j326P54
4702d16R58o43N27O3j595J214J21q24R89j244O01M30k98k45k50J44L63J94j62
4721g3P17q51p27J601l66j78l2o3K13l61J28j09Q02q98l77Q59oj212Q85N33m09
4742G6l2P01j583J346p64Q5n87J231j82j206Q89n13M87p9N54j157O56N51l66m3
4762F4K01q19R93m97L58o61P78p08M17K62n44P23k5J12k59p59N13K96k24m07m94
$$ plain form
4783 -680 -476 294 -351 205 201 -95 -491 -77 -239 -503 514 -575 -566 -971 -422 590 229 -327 -507 -557 -128
4804 -128 227 -178 310 155 282 -66 200 159 -276 -555 -292 47 15 -427 -483 -538 382 331 -254 -244 34 303
4826 303 -361 544 -836 1051 950 538 -511 -262 -176 -559 282 -409 10 -340 219 97 693 943 -84
4845 -84 -376 54 19 -321 787 -592 28 -193 651 348 -53 -691 -498 -613 741 917 -47 64 452 405
4865 405 -399 -461 -216 273 29 228 -404 483 -565 576 56 613 -84 453 375 185 120 955 92 -444
4885 -444 555 411 -723 -400 -397 47 269 -137 -362 386 260 362 -645 94 -1033 -1019 -749 -186 75 -498
4905 -498 350 417 -1018 81 306 -675 278 196 519 -180 -662 -43 665 -443 -76 -691 -112 -353 -9 -29
4925 -29 -339 150 979 329 -94 -593 -83 -206 655 -240 47 104 -78 -427 -474 -80 477 812 247 61 -396
$$ packed form
4783f80K04P70o45N56mk96l96M14j62k64J017j089Rm05N49J012l61n56j80n0M29
4804a28L55m05M88j55J27l48K66m1m35k79K63L39l2m42n6n5R20n1n85J0K78K69
4826C03o64R05j380J887j01m12j049K49Q6l83Q41o91M19l50N59j22N96K50j027
4845h4k92M30l5l40J108j379O20k21Q44l03m01o38J93j15J354J76r64J11L88m7
4865D05q04o2K45M89k44J99o32Q87j048J141n20N57o97N37p8j90o5Q35q63n36
4885d44R99j44j134L23LM44K22m06k25P48j26J02j007P39j127J4K70N63K61n73
4905d98Q48O7j435J099K25r81R53q2L23o99m82O19P08j108L67o15N79k41L44k0
4925b9l10M89Q29o50m23m99N10j23Q61q95K87N7j82l49m7L94N57L35n65j86m57
$$ plain form
4946 -396 -292 301 -109 -242 490 -201 -443 230 1008 -591 -24 -278 -678 -324 -639 -909 504 524 -95 232
4966 232 610 -398 260 904 -209 -339 -10 -22 117 208 -142 147 240 142 -113 -172 456 414 231 -42 -64 11
4988 11 937 760 -18 -128 499 408 -214 -525 -527 235 75 -131 -444 263 -133 -2 -274 454 -137 -39 385 646
5010 646 -24 -8 303 341 -352 -164 -512 625 455 132 -181 130 41 259 121 117 -972 -146 201 -581 -600
5031 -600 -370 38 -221 -327 -100 12 -57 -243 -438 -201 -527 -217 166 206 1041 -213 -228 -453 -650 364
5051 364 451 252 381 374 -82 -419 -179 170 -1124 952 -36 -359 642 -140 181 -64 -88 -202 -657 -64
5071 -64 -535 -751 574 680 -501 -79 -395 -457 945 41 69 159 -511 975 -158 -89 202 256 427 645
5091 645 -614 -53 361 408 -72 30 -717 535 268 -724 -132 -1 -780 710 -760 1013 -486 1200
$$ packed form
4946c96J04N93m10j33P32o91k42O73P78j599N67k54m00L54l15k70J413K0o19L27
4966B32L78j008O58O44j113j30L29j2J39R1l50K89R3r8k55n9O28m2j83k73k2P5
4988A1R26j77p78j10O27r1o22l11kP62j60k06l13P07l96J31k72P28n91R8M24K61
5010F46o70J6L11L8o93J88l48J137j70l23l13L11q9K18j38mj089Q26L47p82j9
5031f00K30M08k59j06K27J12o9j86j95K37l26L10L83M0Q35j254j5k25j97J014
5051C64Q7j99J29pm56l37K40L49j294K076r88l23J001p82L21k45k4j14m55N93
5071f4m71k16J325J06j181M22l16o2J402r04K8R0o70J486j133O9K91N4J71K18
5091F45j259N61M14M7m80J02p47J252k67r92N92J31p79J490j470J773j499J686
$$ plain form
5109 1200 -98 -986 312 -630 -50 -840 178 -1272 -170 -447 266 -125 235 -526 314 -1284 -108
5126 -108 -380 7 1142 250 -518 850 -48 -156 -389 338 1065 202 175 -225 -842 446 206 -573 -632 951
5146 951 -689 326 -669 -191 1107 286 83 -68 -641 352 137 248 225 -376 181 569 648 96 578 706
5166 706 -1110 154 163 -322 460 643 485 738 307 377 -562 -139 148 941 722 -101 21 100 640 665 -244
5187 -244 270 145 353 614 -125 361 253 -76 -121 20 -134 -112 0 -55 -704 -223 -189 -610 -533 33 -106 677
5209 677 472 -730 -761 53 1128 -540 -118 479 856 3 126 119 434 881 -667 -767 -360 117 246 361
5229 361 -617 570 357 223 12 -63 831 271 409 114 122 -409 -349 -446 -363 362 508 839 824 -742 -420 90
5251 90 610 -54 171 135 -173 331 405 -242 342 164 -704 -622 -222 -30 -61 -1156 120 99 90 -700 260 -302
$$ packed form
5109A200j298q88J298r42N80p90J018j450J102k77P13l91L60p61Q40j598J176
5126a08k72L87J135q92p68J368q98j08k33P27P27q63k7m00o17J288k40p79n9J583
5146I51j640J015r95M78J298q21k03j51n73R93k15J11k3o01N57L88P9n52M82J28
5166G06j816J264Rm85P82J83j58K53m31P0r39M23K87P93k19q23J22P9N40K5r09
5187b44N14j25K08K61p39M86j08l29m5J41j54K2J12n5o49M81L4m21P7N66j39P83
5209F77k05j202l1Q14J075j668M22N97L77q53J23pL15M47j548j00M07M77J29J15
5229C61r78J187k13j34k11p5Q94n60J38k95Qn31O0r7Q3P25J46L31j5j566L22N10
5251I0N20o64K25l6l08N04P4o47N84j78q68Q2M00J92l1j095J276k1rp90R60n62
$$ plain form
5273 -302 -390 317 177 -290 931 472 135 -669 -426 -492 -68 -138 -640 912 674 -453 30 22 -649 181 -681
5294 -681 -271 241 188 -74 350 -216 -258 -137 -334 452 -122 -137 -181 -148 -332 434 -697 -236 -246 -477 437 -662
5316 -662 767 366 61 -486 -44 776 -157 -664 316 -495 -180 -439 -181 -407 -809 -122 207 79 253 -88
5336 -88 69 214 -168 119 117 195 -166 -360 102 904 20 -848 -826 -292 970 -84 -426 -801 243 322 585
5357 585 -576 379 -215 -153 159 -41 61 511 765 316 -239 -150 663 -74 558 -310 -161 -1100 -1053 210
5377 210 452 -232 -83 -17 -609 -461 752 -319 -289 -224 -445 241 -32 63 924 -562 -260 20 -245 -438
5397 -438 -20 484 -26 -445 601 -421 624 178 413 -483 -286 441 437 93 -465 380 -370 -94 -289 -175
5417 -175 -755 563 -167 317 6 369 342 504 637 -415 857 -582 230 -193 536 -202 168 29 -474
$$ packed form
5273c02q8P07j40m67J221m59l37q04K43o6M24p0n02J552k38j127M83qo71Q30q62
5294f81M10N12n3k62M24n66m2J21j97P86n74j5m4L3j84P66j131M61j0k31R14j099
5316f62J429m01l05n47M42Q20r33n07R80q11L15k59K58k26m02O87L29j28J74l41
5336h8J57J45l82K87kP8l61j94M62Q02q84q68K2N34J262j054l42l75J044P9K63
5357E85j161R55n94O2L12k00J02M50K54m49n55Q9Q13p37O32q68J49r39M7J263
5377B10K42o84J49O6n92J48J213j071L0O5k21O86k73R5Q61j486L02K80k65j93
5397d38M18N04n10m19J046j022J045m46K35q96J97P27ml44n58Q45p50K76j95J14
5417a75n80J318p30M84l11L63k7J62J33j052J272j439Q12m23P29p38L70j39n03
$$ plain form
5436 -474 -223 -75 91 -822 87 138 305 87 -655 162 -272 -225 20 268 -274 162 78 117 485 -478 372
5457 372 -596 96 43 -581 662 407 -212 -309 -520 -420 57 261 84 -22 164 283 312 837 704 -174 204
5478 204 728 -202 -321 -342 -21 -311 437 59 -213 -93 185 -116 -558 446 -764 -268 730 166 -1001
5497 -1001 772 340 39 20 -329 -257 -290 94 -147 -36 -839 -226 547 -826 546 -128 175 49 -878 -95
5517 -95 117 505 -140 230 620 43 -425 -90 -500 -233 301 319 119 118 398 571 653 -48 -28 346 -1040 859
5539 859 -360 871 428 -172 -226 287 -575 73 97 187 -225 55 52 58 -89 -416 -132 -21 -583 -403 730
5560 730 304 150 -121 -614 1128 -671 587 822 99 653 370 -684 361 261 -572 125 340 160
5578 160 860 1044 -772 -184 137 376 22 -279 409 -22 -435 -490 592 -549 -184 -119 630 253 -304 480
$$ packed form
5436d74K51J48J66r13R09N1J67k18p42Q17m34M7K45K48n42M36q4L9L68r63Q50
5457C72r68O92n3o24J243k55o19r7k11J00M77K04j77j06J86J19K9N25j33q78L78
5478B04N24r30j19k1L21k90P48l78k72J20K78l01m42J004j210M96R98n64j167
5497a001J773m32l01j9l49P2l3L84k41J11q03O13P73j373J372o74L03j26r27P83
5517i5K12L88o45L70L90n77m68L35m10K67N34J8k00jK80J73Q2p01K0L74j386J899
5539H59j219J231m43o00n4N13q62O48K4R0m12K80lOj47l27K84J11n62J80J133
5560G30m26j54k71m93J742j799J258K35p23N54k83j054J045j00q33O97K15j80
5578A60P00J84j816N88L21K39l54l01O88m31m13n5J082j141L65O5P49l77n57P84
$$ plain form
5598 480 -351 -403 59 -642 519 80 38 236 -848 603 369 487 -306 641 -718 309 517 79 -317
5617 -317 -414 146 -841 414 495 168 169 38 821 122 220 -158 -76 237 -410 -101 -539 443 -1124 -367 -76
5638 -76 -215 243 -454 993 516 683 -413 623 -432 -224 720 295 643 761 -13 -250 69 455 -709
5657 -709 -277 -385 493 1073 139 96 -36 -1382 491 -436 -830 733 -608 -297 651 253 -166 66 19
5676 19 -182 -557 355 1032 106 96 912 -243 291 577 347 -803 -885 -483 272 87 -525 -179 580 1042
5696 1042 535 -9 -166 -272 -569 -626 -234 811 -42 -202 1062 -994 15 132 762 -442 -209 460
5714 460 1032 307 468 -1186 -11 270 -662 -996 -383 519 545 -527 -173 -366 90 -615 783 475 30
5733 30 -314 -176 -163 -599 -619 -429 -514 -674 13 -201 544 36 86 77 -336 194 -632 -472 156 760 -137 -191 211
$$ packed form
5598D80q31n2M62p01J161m39m2J98j084J451k34J18p93R47j359J027K08m38l96
5617c17r7N60r87J255Q1l27Jj31P83o99R8l78Q2L13o47L09m38R82j567P57K91
5638g6j39M58o97J447m77J67j096J036j055K08R44m25L48J18p74k37L19L86j164
5657g09M32j08Q78N80r34m3j32j346J873r27l94J563j341L11R48l98m19K32m7
5676A9k01l75R12O77r26j0Q16j155N34K86k30j150q2M02P55j85o12L46P59M62
5696A042n07n44j57j06k97n7L92J045q53j60J264k056J009J17O30j204K33O69
5714D60N72p25J61j654J175K81r32l34O13R02K6j072L54j93M56p05J398l08m45
5733C0l44J38J3m36k0J90q5j60O87k14P45n08N0rm13N30q26J60O28O04q97n4M02
$$ plain form
5756 211 -49 -22 -350 409 316 18 445 -346 -92 305 -265 -167 -698 -580 89 110 -60 336 -38 149 -720
5777 -720 -753 -581 478 532 600 756 -301 -805 -247 327 514 115 163 830 -509 -1113 -215 337 327 38 -182
5798 -182 133 -487 -554 -469 74 -362 396 361 310 24 -333 -18 -46 -302 -321 -9 -272 -856 -170 -409 265 -593
5820 -593 -40 -61 109 -51 349 438 127 -81 -1068 -375 -44 512 29 -133 459 715 475 490 -465 -223 332
5841 332 12 638 565 -331 -725 141 668 -288 -1067 20 443 -473 -21 -89 125 -278 752 19 859 322
5861 322 -562 1009 336 -898 24 110 171 -371 465 88 854 443 -360 228 -871 948 27 -439 -71
5880 -71 -132 482 133 711 310 448 409 324 1502 -456 -252 387 54 -219 -421 3 295 92 45 840 542
5901 542 446 -997 -458 317 -102 -324 816 -368 393 248 73 163 -370 -2 -35 -45 -399 252 -145 -273
$$ packed form
5756B11k60K7l28P59r3k98M27p91K54L97n70R8n31J18O69K1j70L96l74J87q69
5777g20l3J72J059N4O8J56j057n04N58N74J87l99M8O67j339o04Q98N52j0k89k20
5798a82L15o20o7Q5N43m36P58l5n1k86l57L15k8k56j9L12k63n84O86k39O74q58
5820e93N53k1J70j60M00Q9l11k08r87O93L31N56m83j62N92K56k40J5r55K42N55
5841C32l20O26p3q96l94Q66N27r56p79J087M23r16M52o8K14m03J030p33Q40n37
5861C22q84J571o73j234R22Q6O1n42Q36l77P66m11q03N88j099J819r21m66L68
5880g1o1O14l49N78m01J38l9q5J178j958K04O39l33k73k02M24K92k03m7P95k98
5901E42r6j443N39P75m19k22J140j184P61j45j75R0n33L68l3j0l54O51l97j28
$$ plain form
5921 -273 -171 -417 -626 159 152 -227 371 -125 -60 109 -211 73 644 -535 225 138 -134 647 -381 -12 -156
5942 -156 383 -514 525 3 -40 276 146 -384 280 668 -176 762 -375 423 -642 476 -161 -977 -261
5961 -261 478 1 196 -105 -71 -480 73 133 -291 148 109 -504 -144 23 180 -1382 -754 289 -503 660
5981 660 -302 -101 -230 -135 66 51 -46 -310 -138 -426 -803 68 -275 -317 -260 -861 -301 -277 -120 -399 -118 -294
6003 -294 307 460 -113 -335 -94 -99 675 263 -21 -210 221 -784 -561 293 -9 -538 -364 1028 -372 -841
6023 -841 -787 209 -1327 -368 231 235 112 795 -149 57 86 -859 100 747 -80 -855 844 18 687 636 -582
6044 -582 -874 192 545 268 -306 627 774 -93 -1154 -828 -509 281 491 -109 179 927 -892 -399 371
6063 371 -453 24 514 -339 -347 -165 2 -190 -245 61 -303 410 204 -397 -264 -50 -338 -848 862 119 -22
$$ packed form
5921b73J02k46k09P85pl79N98m96O5J69l20K84N71j179P60q7k72P81j028L69j44
5942a56N39q97J039n22m3L16j30n30O64L88q44R38j137P98j065J118o37q16P16
5961b61P39m77J95l01L4m09N53O0m24M39l9o13L60J67J57j562O28J043p92J163
5981F60r62K01j29R5K01j5r7k64J72k88l77Q71l43m2N7o01N60K4J57k79K81j76
6003b94O01J53n73k22K41nP74m12k84j89M31j005K23Q54l02n29J74J392j400m69
6023h41N4R96j536R59N99Mj23O83r44K06K9r45R59O47q27p75J699q26O69n1j218
6044e82k92J066L53k77n74R33J47q67j061L26L19P90K10o00K88P48j819M93P70
6063C71q24M77M90q53qJ82J67j92n5L06l64P13k06o01J33K14k88n10J710p43j41
$$ plain form
6084 -22 156 58 -81 45 -113 331 -197 -304 309 163 435 9 46 -256 401 -501 -252 328 293 801 220
6105 220 -625 129 630 179 651 117 -446 -460 399 -273 674 269 -327 -836 -638 -570 134 759 -45 -100 -814
6126 -814 -833 296 344 -130 -417 1050 -338 140 687 223 271 715 138 -211 724 745 215 351 -357 494
6146 494 450 69 -628 -138 221 -472 -680 222 -236 -10 180 -758 182 -393 -348 231 588 -91 8 -273 -43
6167 -43 649 -482 -1126 77 -22 48 799 5 72 499 221 258 97 -686 -1212 879 -802 56 -265 350
6187 350 -716 604 98 -139 -439 157 522 -476 186 108 474 -1094 965 -746 -632 624 1194 -383
6205 -383 -811 -747 -1328 -1184 -697 643 94 -230 95 73 178 178 356 -939 -1053 -752 -146 242 -690 287 1267
6226 1267 339 233 637 121 -202 342 -368 -18 102 456 225 211 -127 592 -415 -46 465 1091 1048 -445
$$ packed form
6084b2J78r8j39J26j58M44n28j07O13j46K72m26L7l02O57r02K49N80l5N08n81
6105B20q45P54N01m51M72n34n63j4Q59o72R47m05n96n09J98O8P04O25q04n5p14
6126h14j9J129M8m74k87J467j388M78N47m64M8M44n77l49R35K1n30J36p08Q51
6146D94m4l81o97M90L59o93k08R02m58K26J90r38R40n75M5N79L57o79R9k81K30
6167d3O92j131o44J203r9P0P51p94O7M27k78L7j61p83n26K091j681Q58l21O15
6187C50j066J320n06k37l00N96L65r98O62p8L66j568K059j711J14J256N70j577
6205c83m28O4n81J44M87J340n49l24L25k2J05%J78j295j14L01O06L88r32R77R80
6226A267r28j06M04n16l23N44p10L50J20L54k31j4l38P19j007L69N11O26m3j493
$$ plain form
6246 -445 697 -324 -356 375 125 1098 157 -625 -647 -917 522 -57 -250 354 952 679 483 -218 -269 -699
6266 -699 -554 -70 132 -1366 -259 -253 232 118 -42 20 114 88 -468 663 -205 167 -235 -449 62 690 563
6287 563 213 -487 -110 857 -583 456 662 -787 -1052 -196 -168 -426 89 60 192 173 776 309 -410 395
6307 395 48 -294 557 71 -683 -616 909 -262 -429 18 627 -123 642 -1642 364 138 1173 -244
6325 -244 -125 375 534 69 -20 81 -688 161 611 92 -65 275 -601 -485 398 1064 36 -224 -152 -460
6345 -460 205 -768 -695 -977 760 -393 178 -102 286 278 0 504 151 147 918 214 -576 -489 302 328 82 347
6367 347 361 148 597 516 -1173 146 170 -270 -665 110 -347 -419 175 -898 256 140 -312 -377 2 82 -329
6388 -329 326 363 125 227 -839 10 105 -83 -228 252 1053 488 -206 -68 469 -596 434 -613 -203
$$ packed form
6246d45J142j021l2P31k50R73r41p82k2k70J439n79j93O04N98k73j96p01n1m30
6266f99J45M84K02j498J107OM85j14j60O2R4k6n56J131q68L72m02k14N11O28j27
6287E63l50p00L77R67j440J039K06j449k65Q56K8k58N15k9J32j9O03m67p19Q05
6307C95l47l42Q51m86p54O7J525j171j67M47O09p50P65k284K006k26J035j417
6325b44J19N00J59m65q9J01p69Q49M50n19j57L40q76J16Q83O66j028k60P2l08
6345d60O65r73P3k82J737j153N71k80L88qk78N04l53mP71p04p90Q7P91K6k46K65
6367C47J4k13M49q1j689J319K4m40l95P75m57p2N94j073J154j16m52o5L79Q0m11
6388c29O55L7k38J02j066Q49R5j88j45M80Q01n65o94J38N37j065J030j047M10
$$ plain form
6407 -203 -62 -117 -23 31 881 252 -79 -21 -250 -409 -457 13 -411 86 -238 388 231 -453 -300 975 550
6428 550 -1576 153 364 -361 173 -95 -313 -676 -182 -584 -84 -595 -433 -181 580 -59 42 -508 1067
6447 1067 227 -337 -523 253 -335 -153 95 672 379 387 741 -47 320 -35 -253 -605 -449 -265 119 -167
6467 -167 -223 519 910 436 490 250 268 524 49 -335 212 609 822 143 350 189 -244 905 -462 488
6487 488 159 515 306 348 475 -132 -464 -442 -395 -42 -475 706 371 299 428 204 -707 260 664 -236 -825
6508 -825 363 609 -55 91 -27 -406 -403 -692 -76 76 -408 472 881 -3 -576 -21 297 -886 81 238
6528 238 215 390 188 -436 207 -507 1194 538 736 -534 413 19 610 0 563 363 -388 639 -122
6547 -122 58 -364 -343 116 85 250 80 -90 -339 251 -952 512 -574 -893 160 755 47 -827 236
$$ packed form
6407b03J41n5R4N4Q50o29l31N8k29j59m8M70m24M97l24O26j57o84J53J275m25
6428E50k126J729K11p25N34k68k18l63M94m02N00n11J62K52P61o39J01n50J575
6447A067q40n64j86P76n88J82K48N77k93QL54p88L67l55k18l52J56J84L84k86
6467a67n6P42L91m74N4k40J8K56m75l84N47L97K13o79K07j61m33J149j367R50
6487D88l29L56k09M2J27o07l32K2M7L53m33J181l35p2J29k24r11R67M04r00n89
6508h25J188K46o64J46j18l79Lk89O16J52m84Q80M09q84n73N55L18j183R67J57
6528B38k3J75k02o24O43p14J701o56J98j270R47l94N91o10N63k00p51J027p61
6547a22J80m22K1M59l1J65j70j70k49N90j203J464j086l19J053N95p08q74J063
$$ plain form
6566 236 -738 100 1314 723 -877 -261 -426 876 -416 -97 1099 -153 -279 671 -50 -171 -644 -437
6584 -437 132 238 11 104 312 -104 -133 226 -651 1012 278 -579 1 -473 823 201 601 -32 135 963
6604 963 521 -2 -901 -287 -118 -67 51 -114 202 600 -415 135 53 -697 -493 -282 -67 -132 436 432 -364
6625 -364 465 516 519 -442 -68 -146 -170 328 -488 -425 322 501 -529 -342 776 -340 -521 391 -717 -173 41
6646 41 -562 -646 640 972 -20 -579 -613 220 12 -355 -521 804 180 514 1025 277 106 225 1253 -304
6666 -304 -66 -60 436 396 -45 992 259 896 190 -254 996 75 -517 269 -615 -26 -501 -1196 -145 1038
6686 1038 119 -175 204 188 -31 -624 -393 -125 -275 274 451 25 -470 -619 453 764 -333 -4 502
6705 502 241 377 -503 457 -349 -649 -249 -660 -613 456 -161 65 -87 212 94 -764 -647 816 192 -72
$$ packed form
6566B36r74Q38J214n91j600O16j65J302j292L19J196j252j26R50p21j21m73K07
6584d37N69J06k27R3K08m16k9L59q77J663p34q57N80m74J296o22M00o33J67Q28
6604I63m42n23q99O14J69N1J18j65L16L98j015N50q2p50K04K11K15o5N68mp96
6625c64Q29N1Lr61L74p8k4M98q16O3P47J79j030J87J118j116j81R12j108N44K14
6646D1o03q4J286L32r92n59l4Q33k08l67j66J325o24L34N11p48j71J19J028j557
6666c04K38OM96m0m41J037p33O37p06m44J250r21n92P86q84N89m75o95J051J183
6686A038r19k94L79j6k19n93K31K68j50N49J77m26m95j49J072L11j097L29N06
6705E02k61J36q80R60q06l00M00m11M7J069o17K26j52K99j18q58J17J463o24k64
$$ plain form
6725 -72 -451 -265 -453 113 -379 141 410 -113 -635 302 -51 -964 97 -365 -812 -427 820 187 -594 -1290
6745 -1290 485 240 -308 -80 -714 352 173 -468 -542 726 604 392 530 -311 358 -580 513 271 63
6764 63 -633 -928 -577 524 -300 -658 768 507 481 -313 1351 187 -138 197 120 239 904 177 -1125
6783 -1125 60 -315 -310 788 20 -257 -570 -43 -635 -621 353 -83 100 -468 125 199 248 282 484 -571 309
6804 309 -199 -625 -90 -673 -564 138 296 -834 -470 -33 -39 426 -187 -849 -303 -746 -614 -426 588 445
6824 445 -243 951 -294 827 -274 -415 -51 -99 702 -713 395 155 -80 -1189 525 -799 623
6841 623 -638 -196 -386 -915 155 339 175 416 -244 342 -777 -206 164 -159 73 18 445 63 -329
6860 -329 -984 -101 642 860 -127 -767 264 -106 -236 428 -44 413 48 236 -106 48 -89 -138 45 -838
$$ packed form
6725g2l79J86j88N66m92N20K69n23n22R37l53r13J061m62m47L85J247o33p81o96
6745a290J775k45n48K28o34J066j79o41p4J268j22k12J38q41O69r38J093k42k08
6764F3o96k95L51J101q24l58J426k61k6p94J664j164l25L35p7J19O65p27j302
6783a125J185l75NJ098p68k77l13N27n92J4R74m36J83n68N93P4M9L4K02j055Q80
6804C09n08m26N35n83J09P02J58j130L64M37oM65o13o62N46m43J32J88J014j43
6824D45o88J194j245J121j101j41L64m8Q01j415J108k40k35j109J714j324J422
6841F23j261M42j90n29J070J84j64K41o60N86j119N71L70l23K32n5M27l82l92
6860c29o55Q83P43K18r87o40J031l70j30O64m72M57l65J88l42J54j37m9J83q83
$$ plain form
6880 -838 349 1210 868 -156 101 26 -333 -607 -75 771 531 -537 55 553 315 -137 680 190 -9
6899 -9 508 -502 -14 296 -174 568 -952 -1015 303 -698 -87 -252 413 -572 100 -620 -928 66 272 -439
6919 -439 -125 163 90 532 -44 292 -609 202 176 298 -322 765 160 874 26 78 -471 -128 -454 -753 418
6940 418 -319 797 -638 78 37 624 -274 129 209 -82 852 33 1061 682 462 316 555 102 -223 -107
6960 -107 -933 1222 -268 570 593 -64 645 487 653 -592 -128 -337 602 948 210 -698 109 -293 -208 -214
6980 -214 589 43 -1054 -521 18 -221 152 147 -78 -249 -1016 334 456 -173 158 148 554 837 937 396
7000 396 809 537 -386 -401 -147 861 153 -991 2 23 133 694 -45 -243 -450 84 -429 294 425 -146
7020 -146 -866 -682 -539 -550 -297 -218 1298 -298 -1324 -358 40 -27 -119 102 -86 467 153 1102 -521 525
$$ packed form
6880h38J187Q61l42j024K57p5l59k74N32Q46k40j068N92M98k38m52Q17m90j99
6899iN17j010M88L10m70P42j520o3J318j001O11j65O65r85O72p20l08R94K06p11
6919d39L14K88p3M42n76L36r01Q11k6J22o20J087o05P14q48N2n49L43l26k99J171
6940D18p37J116j435P16m1N87q98M03Q0k91R34q19J028l79k20j46K39m53l25J16
6960a07q26K155j490Q38K3o57P09j58J66j245M64k09R39L46p38r08Q07m02Q5o
6980b14Q03n46j097N33N39k39L73nk25j71p67J350J22o29L31j0M06K83J00n41
7000C96M13k72r23j5K54J008p08j144R93K1J10N61p39j98k07N34n13P23J31n71
7020a46p20J84J43j1K53P9J516j596j026R66L98o7r2K21j88N53l14R49j623J046
$$ plain form
7040 525 -924 1064 -76 642 413 658 -210 -556 -702 44 576 -99 -223 -969 59 178 941 98 -469
7059 -469 350 -87 32 -917 64 -43 -166 544 -172 -337 -99 264 -177 97 -691 775 -186 -713 -274 572
7079 572 247 425 329 -61 344 947 389 380 779 -427 -84 303 -137 389 21 847 -14 -689 33 185 130
7100 130 -104 -825 -573 401 -228 421 1001 253 363 527 299 106 -351 -998 -625 313 24 779 483 -186
7120 -186 633 -935 349 587 276 803 -309 -173 8 159 1020 -223 -745 -290 -711 757 945 -420
7138 -420 214 94 118 -215 533 -316 -552 164 -636 383 -265 267 -128 537 -330 216 -4 -196 299 898
7158 898 -365 -485 -405 372 262 -155 223 43 -83 408 -1201 -470 152 387 -608 743 400 519 182
7177 182 -451 -517 644 -580 -659 -298 -697 624 -70 201 663 -183 -79 -126 -614 -1230 -475 81 407 25
$$ packed form
7040E25j449J988j140P18k29K45q68l46j46P46N32o75j24p46J028J19P63q43n67
7059d69Q19m37J19r49R81j07j23P10p16j65K38L63m41K74p88J466r61n27M39Q46
7079E72l25J78r6l90M05O03n58rL99j206L43L87m40N26l68Q26q61o75P22J52n5
7100A30k34p21K52R74o29O49N80p48J10J64k28j93m57o47L73R38k89P55k96o69
7120a86Q19j568J284K38l11N27j112J36J81J51Q61j243n22M55m21J468J88j365
7138d20O34j20K4l33P48q49k36P16q00J019o48N32l95O65q67N46k20j92M95N99
7158H98j263j20Q0P77j10m17L78j80j26M91j609P31O22K35r95J351l43J19l37
7177A82o33o6J161j224p9L61l99J321o94K71M62q46J04m7m88o16P55N56L26l82
$$ plain form
7197 25 -135 289 490 293 48 445 -110 103 1227 -429 -265 149 425 31 27 35 426 1070 394 323 42
7218 42 59 68 -955 -721 -461 469 70 170 329 139 -354 -340 598 119 96 -47 461 -816 -287 -320 -31 -362
7240 -362 -755 -547 344 99 -957 -194 304 822 334 -201 -52 -200 -693 72 985 -483 -158 -306 357
7259 357 238 -331 -252 -384 1091 -227 123 -105 152 -469 69 510 -284 -1 -73 550 -206 -408 -265 127
7279 127 -176 329 -673 -119 235 -475 367 636 388 -137 1010 452 -27 -359 17 -445 -1004 725 -213
7298 -213 800 -269 676 290 10 -108 392 -216 -729 -71 381 -776 220 -636 -34 -794 680 -296 -117
7317 -117 384 964 340 52 -439 -462 -129 4 321 -188 650 -576 256 254 419 -199 287 -278 752 -231
7337 -231 -196 -34 -165 -34 97 -671 846 -14 118 222 918 10 -373 669 -582 259 -60 94 158 -214
$$ packed form
7197B5j60M24K01j97k45L97n55K13J124j656J64M14K76l94mQL91O44o76p1k81
7218D2J7Rj023K34K60R30l99J00J59j90m93J4R38m79k3j43N08j277N29l3K89l31
7240c62l93K08Q91k45j056P63M98N18m88n35J49j48m93P65R13j468L25j48O63
7259C57j19n69P9j32J475j318L50k28K57o21N38M41p94K83p2O23p56k02J43L92
7279A27l03N05j002N54L54p10Q42K69k48n25J147n58m79l32L76m62n59J729r38
7298b13J013j069R45l86k80j18N00o08n13O58M52j157R96q56O02p60J474r76J79
7317a17N01N80o24k88m91k3L33J33L17n09Q38j226Q32kJ65o18M86n65J030r83
7337b31L5J62j31J31J31p68J517q60J32J04O96r08l83J042j251Q41l19J54O4l72
$$ plain form
7357 -214 538 -475 408 8 890 -1518 -339 -231 61 -796 583 248 131 -29 -485 -103 15 -86 131
7376 131 806 111 -403 -318 88 -504 201 -497 -845 524 316 -974 776 2 -165 -24 429 -386 -425 332
7396 332 324 -1244 1 -30 -297 -600 -980 -364 277 -104 215 -369 136 760 -108 274 209 -587 622 -2
7416 -2 -31 582 -18 -411 -1009 100 -211 959 -79 -234 23 -351 636 -54 652 908 246 -191 -237 535
7436 535 236 166 60 -208 -1221 -503 895 -790 -368 -35 503 203 27 -178 55 411 -65 -162 562 125
7456 125 76 69 -356 364 -157 -153 -41 180 -759 722 433 957 -164 -43 -657 77 1049 -616 810 257
7476 257 104 -123 -81 -509 211 12 -34 244 83 458 -452 -175 -728 80 595 -489 152 -58 -228 494
7496 494 842 -689 -23 -123 272 -37 -2 427 362 865 822 137 47 -661 -12 697 607 -367 300 -795 -178
$$ packed form
7357b14P52j013Q83m00Q82k408J179J08K92q57J379l35j17j60m56L82J18j01K17
7376A31O75o95n14Q5M06n92P05o98l48J369k08j290J750p74j67J41M53q15l9P57
7396C32qj568J245l1k67l03l80O16O41l81L19n84N05O24q68L82o5p96J209o24
7416bk9O13o00l93n98J109l11J170j038j55K57l74R87o90P06K56o62m37m6P72
7436E35k99p0j06k68j013P18J398j685M22L33N38l00j76k05K33L56m76r7P24m37
7456A25m9pm25P20n21MJ12K21r39J481k89N24j121J21o14P34R72j665J426n53
7476B57j53k27M2m28P20j99m6K78j61L75r10K77n53Q08N15j084O41k10j70P22
7496D94L48j531O66j00L95l09L5M29o5N03m3o85r0p08O49P09r0r74O67j095O17
$$ plain form
7517 -178 -336 -843 497 385 73 -440 -25 -813 568 327 -60 158 -473 -50 703 81 -268 8 -330
7536 -330 357 89 -130 -54 -482 31 765 -240 -132 240 499 -107 -153 80 572 62 -277 -68 571 200
7556 200 659 361 211 -44 519 -886 -851 -287 39 44 -239 -195 97 880 19 433 -87 -764 346 -94 224
7577 224 200 11 -402 -580 -6 208 -296 -358 80 450 -925 387 230 117 -464 510 174 -375 -260 21
7597 21 -104 -698 -411 -927 323 128 -175 -417 -111 -882 289 -267 -519 949 226 462 79 -166 -267
7616 -267 724 669 -107 -15 571 709 -188 -303 -634 -11 275 -133 435 -609 508 182 -95 630 -406 -256
7636 -256 331 63 -820 325 643 589 -70 -268 -187 276 -453 -665 327 299 -409 -735 -204 198 -30 -269 -456
7657 -456 -25 503 71 354 620 -3 -670 515 504 184 -429 320 -543 1005 680 355 -353 112 332 -329
$$ packed form
7517a78j58n07J340j12l12n13M15p88J381k41l87K18o31M23P53o22l49K76l38
7536c30O87k68k19P6m28N13P34j005J08L72K59o06m6K33M92n10l39K09O39l71
7556B00M59k98j50k55N63j405L5N64L26Nk83M4K92P83q61M14n20o77J110m40L18
7577B24k4j89m13j78N74K14n04o2M38L70j375J312j57j13n81R74l36n49J15K81
7597B1j25n94K87n16J250j95l03k42L06p71J171n56k52J468p23K36l83k45j01
7616b67R91n5p76R2N86J38q97j15l31O23K86m08N68j044J117l26k77P25j036J50
7636b56N87k68q83J145L18n4o59j98Q1M63p29k12R92k8p08l26N31M02k28k39j87
7657d56M31N28m32K83K66o23o67J185j1l20o13P49q63J548l25l25p08M65K20o61
$$ plain form
7677 -329 -786 135 -128 483 -229 197 -81 307 280 -942 235 -248 -307 -650 -550 -726 -94 193 304 -644
7697 -644 559 90 -319 77 18 348 -193 401 898 -263 278 -52 -183 -499 404 67 -827 254 -158
7716 -158 504 56 -325 -100 97 -500 24 -460 1088 -648 477 -1123 283 -678 -725 -121 -373 -150 -185
7735 -185 -246 -20 -927 -765 750 639 75 -959 91 438 -604 339 131 -44 286 -41 349 -445 742
7754 742 -231 -239 -68 106 -84 -577 382 721 -1 19 787 -207 712 -44 -375 -160 55 -986 261 228 -996
7775 -996 590 418 -154 -584 -864 630 -363 -720 -897 -311 -327 -123 781 -141 33 116 -415 -438 -261 -392
7795 -392 576 66 -88 37 190 -727 924 -183 -128 -93 -471 -208 -711 353 -393 318 14 -444 323 358
7815 358 425 234 -16 -1247 614 -197 105 237 461 -241 -457 -909 381 -46 -14 23 -327 -714 358 323
$$ packed form
7677c29m57R21k63O11p12M26k78L88k7j222J177m83n9l43J00j76O32K87J11r48
7697f44J203m69m09L96n9L30n41N94M97j161N41l30j31l16R03l37q94J081m12
7716a58O62m48l81K25J97n97N24m84J548j736J125j600J406r61m7O04k52K23l5
7735a85o1K26r07J62J515j11n64j034J050L47j042R43k08j75L30l27L90p94J187
7754G42r73qJ71J74j90m93R59L39p22K0P68r94R19p56l31K15K15j041J247l3j224
7775i96J586j72n72m30k80J494r93l57j77N86j6K04R04r22J74Q3n31k3J77j31
7795c92R68n10j54J25J53r17J651j107N5L5l78K63n03J064p46P11l04m58P67L5
7815C58O7j91k50j231J861q11L02J32K24p02k16m52J290m27L2L7l50l87J072l5
$$ plain form
7835 323 33 19 141 387 572 -530 -421 495 74 491 33 664 21 -100 512 422 325 195 16 460 -614
7856 -614 181 -430 -81 -531 84 -159 334 -184 -583 75 -440 -171 301 -219 74 1246 -84 -154 325 -630
7876 -630 286 74 -29 29 -406 -421 -463 -488 -725 -1013 179 -112 -34 -736 240 38 620 -593 -847 1415 308
7897 308 338 554 98 1149 1018 -833 -748 -489 567 50 110 -545 -468 -314 727 -345 -601 -44 -287 39
7917 39 84 547 -68 -429 77 828 630 -29 -189 262 510 350 45 -447 196 -307 13 733 767 168 36
7938 36 -443 216 -742 -901 37 251 272 -158 129 -56 -382 -339 -556 -188 380 250 410 -274 -319 415 -91
7959 -91 19 -277 1021 -938 -353 244 173 -436 -792 -489 -724 -45 640 461 -1 -472 -310 51 -206 -74
7979 -74 -613 211 -286 250 -541 745 -468 -367 559 350 444 -369 380 -1221 614 135 303 -16 -855
$$ packed form
7835C23k90j4J22K46J85j102J09R16m21M17m58O31o43j21O12r0r7j30j79M44j074
7856f14P95o11L49m50O15k43M93n18l99O58n15K69M72n20K93J172j330p0M79r55
7876f30R16k12j03N8m35j5m2k5k37k88J192k91P8p02R76k02N82j213k54K262j107
7897C08L0K16m56J051j31j851Q5K59J056n17O0o55P7J54J041j072k56N57k43L26
7917C9M5M63o15l61N06P51j98o59j60M51K48j60l05m92O43n03L20P20L4n99j32
7938C6m79O59r58j59R38K14K1m30K87j85l26M3k17L68N68j30J60o84m5P34n06
7959i1J10k96J298j959N85N97p1o09l56L03k35O79O85j79m62m71J62L61k57J32
7979g4n39Q24m97N36p91J286j213J01R26k09R4q13P49j601J835m79J68l19q39
$$ plain form
7998 -855 1093 -200 571 159 -445 -184 531 -246 -51 289 920 135 -224 -513 303 -195 -188 -224 -477 -205
8018 -205 -291 372 -140 -38 33 -46 231 902 -238 452 151 -412 554 -592 -121 -467 336 -520 687 530
8038 530 167 495 313 416 -257 -40 654 1253 452 93 755 53 361 -165 -190 455 -189 920 -186 678
8058 678 15 -773 541 1115 406 393 157 -691 104 -605 293 -22 -357 -307 269 446 22 463 -136 291
8078 291 406 -316 -416 -773 -234 -676 609 256 -75 239 -267 1029 -804 33 -160 561 -251 -14 -354
8097 -354 101 460 1402 340 -125 -721 193 -300 -1117 172 -325 1343 -567 -51 -354 709 372 -100
8115 -100 -690 73 194 -1039 -400 40 235 -538 100 -1013 -186 -617 -776 221 -44 510 -460 640 222
8134 222 -373 653 176 -430 -296 -106 -59 664 -657 32 -20 -81 626 309 -582 171 -49 209 232 143 222
$$ packed form
7998h55J948j293P71m12o04K61P15p77J95L40O31p85l59k89Q16m98Pl6k53K72
8018b05q6O63n12J02P1p9K77O71j140O90l01n63R66j146M71l46Q03q56J207j57
8038E30l63L28j82J03o73K17O94N99q01l59O62p02L08n26k5O45o44J109j106Q64
8058F78o63p88J314N74p09j3k36q48P95p09Q98l15l35N0N76J77m24M41n99M27
8078B91J15p22j00l57N39m42J285l53l31L14n06J296j833Q37j93P21q12K37l40
8097c54M55L59R42j062m65n96R14m93q17J289m97J668j910N16l03J063l37m72
8115a00n90P63J21j233O39M40J95p73O38j113Q27m31j59R97k65N54r70J100m18
8134B22n95J026m77o06J34J90M7P23j321O89n2o1P07l17q91P53k20K58K3q9P9
$$ plain form
8155 222 -177 549 -310 159 149 -501 -380 -569 -482 422 10 667 493 69 -354 -183 -643 -540 182 621 -436
8176 -436 -1088 381 -108 -19 216 40 178 -280 -463 264 229 -432 -103 -443 4
$$ packed form
8155B22l99P26q59M69j0o50J21j89Q7R04m12O57j74m24m23J71m60J03P22M39j057
8176d36o52J469m89Q9K35j76J38m58j83P27l5o61L29l40M47
8191D
$$ Imaginary data points
##PAGE= N=2
##DATA TABLE= (X++(I..I)), XYDATA
$$ plain form
0 0 0 0 0 0 0 0 -72 72 -72 72 -72 144 -144 144 -216 265 -288 360 -432 504 -577 673 -783 901 -1035
25 -1035 1181 -1338 1521 -1735 1948 -2176 2446 -2743 3068 -3417 3802 -4231 4697 -5203 5755
40 5755 -6384 7063 -7819 8657 -9597 10664 -11860 13226 -14821 16675 -18891 21579
52 21579 -24921 29210 -34934 42973 -55128 75567 -116321 228920 -1162242 -4072735 -1252699
63 -1252699 1622144 1292913 -122989 115183 33275 -1048589 -1147381 225089 574378 -167553
73 -167553 -146695 398144 -280196 -1058175 -267186 769576 237297 -398073 182907 388114
83 388114 -726657 -945127 532110 1172363 -95278 -836833 -37994 322739 -344503 -210071
93 -210071 712123 476430 -653022 -597314 339799 291524 -354336 -61561 495340 -1069
$$ packed form
0@%%%%%%p2J44j44J44j44K16k88K88l60M81n53O48p92R36j081J250j456J684j936
25a035K216k519K859l256L683m124M622n189N811o485P219q033Q928r900J0958
40E755j2139J3447j4882J6476j8254K0261k2524K5086k8047L1496l5566M0470
52B1579m6500N4131o4144P7907r8101J30695j91888L45241j391162k910493K820036
63a252699K874843l29231j415902K38172q1908j081864r8792J372470L49289p41931
73a67553K0858N44839o78340p77979P90989J036762n32279o35370N80980K05207
83C88114j114771k18470J477237O40253j267641p41555P98839L60733o67242J34432
93b10071R22194k35693j129452N5708R37113m8275o45860K92775N56901m96409
$$ plain form
103 -1069 -626925 -188453 318684 -22704 -183084 317052 197258 -635489 -526149 505728
113 505728 534263 -431047 -434611 439572 272013 -688012 -446272 675567 605889 -456317
123 -456317 -561625 237893 328373 -237113 -206961 239687 163169 -154887 -94765 -45577 -248236
134 -248236 -69672 423407 231371 -489934 -442199 293383 341541 -297915 -302435 301876 253519
145 253519 -374928 -351067 263126 334152 -114143 -159960 122368 54943 -130133 88576 287385
156 287385 9078 -197021 88813 257201 -64856 -207518 156272 327059 -9965 -197676
166 -197676 34512 126704 -53003 -3141 217111 60300 -261106 -105754 252097 95579
176 95579 -283969 -113741 312954 172585 -305308 -280636 153833 235507 -61848 -157589 9731
$$ packed form
103a069o25856M38472N07137l41388j60380N00136j19794q32747J09340J031877
113E05728K8535r65310l564Q74183j67559r60025K41740J121839o9678j062206
123d56317j05308P99518R0480n65486L0152M46648p6518l18056O0122M9188k02659
134b48236J78564M93079j92036p21305M7735P35582M8158o39456m520O04311m8357
145B53519o28447K3861O14193P1026m48295m5817K82328o7425j85076K18709J98809
156B87385k78307k06099K85834J68388l22057j42662L63790J70787l37024j87711
166a97676K32188R2192j79707M9862K20252j56811l21406J55352L57851j56518
176I5579l79548J70228M26695j40369m77893K4672M34469Q1674k97355r5741J67320
$$ plain form
187 9731 52921 -61565 -87403 -16151 48930 111482 86415 -112661 -209370 53588 304338
198 304338 78292 -271397 -132570 241400 176607 -186633 -186456 136672 186493 -70052 -147819
209 -147819 25177 93208 -5271 -43308 -7329 -16634 -13153 42999 8325 -100011 -48080 129740
221 129740 112823 -102498 -145918 51472 145844 20489 -63617 -4547 13544 -38650 -6151
232 -6151 60567 5032 -72767 2488 93085 -10664 -143762 -43071 144756 96858 -114373
243 -114373 -154977 10383 93222 -18360 -116816 -45511 77139 59138 -84266 -148524 -21506
254 -21506 136033 85057 -119716 -169941 23668 157762 17340 -161291 -76968 126832 115103
265 115103 -76870 -123964 39276 137789 32774 -86081 -48422 53308 65779 -2780 -51296
$$ packed form
187I731M3190j14486k5838P1252O5081O2552k5067j99076r6709K62958K50750
198C04338k26046l49689J38827L73970o4793l63240J77L23128M9821k56545p7767
209a47819J72996O8031r8479l8037L5979r305L481N6152l4674j08336N1931J77820
221A29740j6917k15321m3420J97390R4372j25355q4106N9070J8091n2194L2499
232f151O6718n5535p7799P5255R0597j03749j33098J00691J87827m7898k11231
243a14373m0604J65360Q2839j11582r8456P1305J22650j8001j43404o4258J27018
254b1506J57539n0976k04773n0225J93609J34094j40422j78631Q4323K03800j1729
265A15103j91973m7094J63240R8513j05015j18855L7659J01730J2471o8559m8516
$$ plain form
276 -51296 -31782 31765 63235 7113 -73307 -50983 60821 90242 -22147 -103710 -34899 59967
288 59967 30733 -43798 -34771 15629 7214 -27128 -17035 7777 15706 29527 35215 -21061 -76549
301 -76549 -13495 99211 75294 -61107 -86924 31594 92184 3170 -72852 -12901 76317
312 76317 62715 -31458 -79777 -23824 66681 65743 -33523 -87346 -2368 83525 15887 -93040
324 -93040 -41072 91560 73807 -70162 -98990 21672 86362 11794 -62628 -39715 20506
335 20506 47483 26397 -23899 -45758 8739 81029 44931 -59215 -55493 54023 86174 -10943
347 -10943 -66677 -1628 58738 23897 -24050 -12411 20410 24340 7409 -18109 -31818 2086
359 2086 50152 27351 -51565 -65098 17059 60544 1149 -51093 -11381 46467 33738 -24642
$$ packed form
276e1296J9514O3547L1470n6122q0420K2324J11804K9421j12389q1563O8811R4866
288E9967k9234p4531R027N0400q415l4342J0093K4812P929J3821N688n6276n5488
301g6549O3054J12706k3917j36401k5817J18518O0590q9014p6022N9951Q9218
312G6317j3602r4173m8319N5953R0505r38r9266n3823Q4978Q5893o7638j08927
324i3040N1968J32632j7753j43969k8828J20662O4690p4568p4422K2913O0221
335B0506K6977k1086n0296k1859N4497P2290l6098j04146L722J09516L2151r7117
347a0943n5734O5049O0366l4841m7947J1639L2821L930j6931k5518j3709L3904
359B086M8066k2801p8916j3533Q2157M3485n9395n2242L9712N7848j2729n8380
$$ plain form
371 -24642 -47487 -10498 45619 50596 -21150 -77724 -21469 77809 57801 -61080 -81732 40411
383 40411 100676 1671 -90402 -34067 57927 41572 -31113 -39323 5380 24945 6663 -14092
395 -14092 -18105 -637 27850 27519 -15805 -39664 214 44478 15605 -44227 -33572 32768 51753
408 51753 -3683 -48371 -18683 40012 46473 -3320 -38933 -12069 33938 34139 -12320 -37730 -6474
421 -6474 32766 27138 -12511 -29037 -937 27961 13759 -26272 -27427 18175 42661 -7210 -66500
434 -66500 -30718 56175 60684 -36354 -82785 3549 86476 32328 -71831 -62621 43407 75739
446 75739 -4718 -63625 -22169 40870 28644 -24359 -30136 16297 43053 10995 -33540 -28661
458 -28661 19105 40116 5949 -30342 -17843 20260 21576 -10174 -22765 2152 25740 16818
$$ packed form
371b4642k2845L6989N6117M977p1746n6574N6255R9278k0008j18881k0652J22143
383D0411O0265r9005r2073N6335R1994j6355p2685q210M4703J9565j8282k0755
395a4092m013J7468K8487l31m3324k3859L9878M4264k8873n9832J0655O6340J8985
408E1753n5436m4688K9688N8695O461m9793l5613K6864M6007K01m6459k5410L1256
421f474L9240n628l9649j6526K8100K8898j4202m0031j155M5602K4486m9871n9290
434f6500L5782Q6893M509r7038m6431Q6334Q2927n4148j04159R210J06028L2332
446G5739q0457n8907M1456O3039j2226n3003n777M6433K6756l2058m4535M879
458b8661M7766K1011l4167l6291J2499L8103J316l1750j2591K4917K3588q922
$$ plain form
470 16818 -7045 -16202 -2810 15071 15356 -4276 -17828 -3587 17354 12892 -9851 -19866 -2270
483 -2270 18572 21837 4315 -20021 -17618 15538 27375 -13179 -46651 -2501 57482 24873 -59638
496 -59638 -52336 45520 71677 -17867 -77085 -11473 63916 32972 -41987 -49217 5345 33892
508 33892 8456 -21895 -13425 19458 26416 -15239 -45444 -2562 59393 34552 -49809 -56028 26237
521 26237 57284 -10468 -52270 2086 51338 15707 -32140 -21637 8547 13451 11730 8693 -13486
534 -13486 -24482 2913 26884 74 -26691 750 26578 -1176 -22664 7885 24670 -15289
546 -15289 -30633 14564 32039 -11070 -26981 14359 20076 -26734 -22087 39668 36018 -37466 -45100
559 -45100 29770 48905 -15278 -44402 3667 35720 10240 -16230 -12669 -955 16566 27344
$$ packed form
470A6818k3863r157J3392J7881K85j9632j3552J4241K0941m462k2743j0015J7596
483b270K0842L265j7522k4336K403L3156J1837m0554l3472M4150N9983l2609q4511
496e9638P302R7856K6157q9544n9218O5612P5389l0944p4959p230N4562K8547
508C3892k5436l0351Q470L2883O958m1655l0205M2882O1955k4841q4361o219Q2265
521B6237L1047o7752m1802N4356M9252l5631m7847J0503L0184M904j721l037k2179
534a3486j0996K7395K3971k6810k6765K7441K5828k7754k1488L0549J6785l9959
546a5289j5344M5197J7475m3109j5911M1340N717m6810M647O1755l650p3484p634
559d5100P4870J9135o4183k9124M8069L2053k5480k6470L561J1714J7521J0778
$$ plain form
571 27344 -3672 -41678 -5442 61887 31094 -63657 -51743 49615 59477 -33820 -51393 31572
583 31572 51974 -23747 -46183 15564 37524 -1876 -9892 9957 -7436 -25996 10317 31120
595 31120 -14219 -31075 27577 40381 -33732 -49754 34130 59670 -23540 -53468 22502 45522
607 45522 -27231 -44891 26393 42087 -18658 -25901 25981 17069 -32923 -12983 41299 17845
619 17845 -34756 -17939 23208 4560 -21277 7653 21672 -13683 -21146 17590 13476 -27744
631 -27744 -5506 46482 10320 -66003 -28878 63838 40730 -51914 -36828 45571 29931 -49185
643 -49185 -33824 46793 43750 -20584 -29586 -257 -6796 -7506 30345 28876 -29229 -37089 22774
656 22774 28194 -32369 -26473 48134 42049 -46160 -57687 22495 41526 -19444 -26759 28641 21055
$$ packed form
571B7344l1016l8006L6236O7329l0793r4751J1914J01358R862r3297j7573Q2965
583C1572K0402p5721k2436O1747K1960l9400q016J9849j7393j8560L6313K0803
595C1120m5339j6856N8652J2804p4113j6022Q3884K5540q3210k9928P5970K3020
607D5522p2753j7660P1284J5694o0745p243N1882q912m9992J9940N4282k3454
619A7845n2601J6817M1147j8648k5837K8930J4019l5355p463L8736m114m1220
631b7744K2238N1988l6162p6323L7125R2716k3108r2644J5086Q2399j5640p9116
643d9185J5361Q0617l043o4334r002K9329o539p10L7851j469n8105p860N9863
656B2774N420o0563N896P4607o085q8209j1527Q0182J9031o0970p315N5400p586
$$ plain form
669 21055 -37209 -30856 25473 25988 -11136 -7312 12122 -13158 -26404 11200 29604 -9056 -23148
682 -23148 12173 15656 -25204 -17062 36170 26788 -31754 -26377 24640 10930 -36140 -5074 51993
695 51993 12886 -58503 -32896 41139 30513 -25284 -14935 26066 4226 -31585 -10354 19865
707 19865 4527 -7233 14178 6693 -32955 -22654 31993 30797 -20548 -20287 23347 8239 -41612
720 -41612 -17783 46456 32047 -33733 -38367 15028 24161 -7532 -10153 11269 5651 -9233 -3665
733 -3665 1017 -10190 746 23360 4525 -32782 -15687 31657 19686 -26245 -15203 30093
745 30093 14869 -30632 -15693 29478 16513 -24154 -10617 22984 4635 -28795 -6013 29695
757 29695 11308 -20097 -8328 10160 -3017 -10132 10620 12381 -13069 -11868 13190 7192 -19651
$$ packed form
669B1055n8264O353N6329N15l7124L824J9434k5280j3246L7604J8404l8660j4092
682b3148L5321L483m0860Q142N3232r382n8542N377N1017j3710m7070L1066N7067
695E1993l9107p1389K5607P4035j0626n5797J0349M1001k1840l5811K1231L0219
707A9865j5338j1760K1411p485l9648J0301N4647j196n1345K61M3634j5108m9851
720d1612K3829O4239j4409o5780m634N3395R133l1693k621K1422n618j4884N568
733c665M682j1207J0936K2614j8835l7307J7095M7344j1971m5931J1042M5296
745C0093j5224m5501J4939M5171j2965m0667J3537L3601j8349l3430K2782L5708
757B9695j8387l1405J1769J8488j3177p115K0752J761k5450J201K5058n998k6843
$$ plain form
770 -19651 -7297 21866 7245 -22758 -3923 27031 3102 -31288 -6926 35243 16529 -27256
782 -27256 -19401 15130 16200 -4027 -2355 5806 870 -2873 1365 -4005 -7954 11766 21857 -9031
796 -9031 -31308 -1663 29325 4050 -27811 -346 32241 3141 -34363 -11831 25291 11149
808 11149 -16025 -4512 13068 -3527 -16548 1095 18288 7346 -5000 -2156 -7529 -12398 9216
821 9216 25736 2201 -24145 -8676 14006 -1719 -14959 10713 28835 -4913 -31304 -4248
833 -4248 22319 2040 -16107 6530 20291 -7034 -26397 -2984 16302 8248 -1280 -987 -6470
846 -6470 -11844 4380 16287 -705 -10582 6231 9508 -19101 -22170 18727 35333 -5851 -30025
859 -30025 -2335 18650 -4192 -15918 12199 24996 -6283 -25820 -5756 12365 4573 -1846
$$ packed form
770a9651J2354K9163j4621l0003J8835L0954k3929l4390K4362M2169j8714m3785
782b7256P855L4531J070k0227J672Q161m936l743M238n370l949J9720J0091l0888
796i031k2277K9645L0988k5275l1861K7465L2587k9100l7504K2532L7122j4142
808A1149k7174J1513J7580j6595j3021J7643J7193j0942j2346K844n373m869K1614
821I216J6520k3535k6346J5469K2682j5725j3240K5672J8122l3748k6391K7056
833d248K6567k0279j8147K2637J3761k7325j9363K3413J9286q054r528K93n483
846f470n374J6224J1907j6992r877J6813L277k8609l069M0897J6606m1184k4174
859c0025K7690K0985k2842j1726K8117J2797l1279j9537K0064J8121p792o419
$$ plain form
871 -1846 4470 1434 -7692 -3309 2231 -6030 -1578 17444 11192 -22959 -25956 14356 27107 -5261
885 -5261 -18729 6415 13740 -15371 -19076 13166 23876 -3722 -14895 2260 5076 -9318 -4565
898 -4565 12677 8567 -7147 -3504 1590 -6831 -3902 16206 13555 -17560 -19385 12576 16859 -12491
912 -12491 -14450 17040 16243 -18960 -21033 14628 20704 -9456 -13044 11162 9645 -15364 -13528 10457
926 10457 12390 -2797 -3890 824 -4535 -2771 10367 5952 -11205 -5844 16603 7042 -19584 -12262
940 -12262 17330 14904 -12651 -11063 13451 5647 -17187 -7361 20982 13651 -14668 -15087 4860
953 4860 8327 -2315 -582 3474 -2537 -3509 5990 2957 -9594 -4264 13202 6046 -12963 -9924
967 -9924 9925 6782 -10860 -3343 13432 1973 -18498 -7456 19932 13367 -14221 -14102 5316
$$ packed form
871a846O316l036r126M383N540q261M452J9022o252l4151k997M0312J2751l2368
885e261j3468K5144P325k9111l705L2242J0710k7598j1173J7155K816j4394M753
898d565J7242m110j5714L643N094q421K929K0108k651l1115j825L1961M283k9350
912a2491j959L1490p97l5203k073L5661O076l0160l588K4206j517k5009J836K3985
926A0457J933j5187j093M714n359J764J3138m415j7157N361K2447r561k6626P322
940a2262K9592k426k7555J588K4514p804k2834R826K8343p331k8319m19J9947
953D860L467j0642J733M056o011r72R499l033j2551N330J7466p156j9009L039
967i924J9849l143j7642P517J6775j1459k0471J1042K7388o565k7588J19J9418
$$ plain form
980 5316 8673 -4173 -6137 4150 3573 -3605 -4252 -966 997 4139 6399 -1553 -9021 -362 9733
995 9733 471 -11449 -650 14733 4558 -14981 -7430 12233 7932 -10425 -7979 11625 9850
1008 9850 -9211 -10565 4150 8094 50 -4206 -628 337 -109 263 -88 -1240 2964 6202 -2481
1023 -2481 -9008 -128 11338 2152 -11368 -3793 9775 4664 -11140 -3901 11544 5834 -12088
1036 -12088 -9451 7194 9986 -2714 -6522 378 1885 -1396 -1879 2787 3326 1772 -948 -5280 -3592
1051 -3592 3087 7792 -1503 -7132 1091 6786 -1440 -8103 1851 10987 1373 -10426 -2088 8949
1065 8949 5187 -6867 -6711 3784 6081 -1705 -4022 682 3028 1246 -2219 -2602 1796 5017 1797
1080 1797 -6488 -4810 6976 7928 -4963 -9361 2741 10166 595 -9581 -2786 7560 4005 -5588
$$ packed form
980E316L357j2846j964J0287n77p178o47L286J963L142K260p952p468Q659J0095
995I733r262j1920J0799J5383j0175j9539P551J9663m301j8357K446J9604j775
1008I850j9061j354J4715L944q044m256L578R65m46L72l51j152M204L238q683
1023b481o527Q880J1466r186j3520P575J3568n111j5804P239J5445n710j7922
1036a2088K637J6645K792j2700l808O900J507l281m83M666N39j554k720m332J688
1051c592O679M705r295n629Q223N695q226o663R954R136r614j1799Q338J1037
1065H949l762j2054J56J0495K297p786k317M704K346j782l465l83M398L221l220
1080A797q285J678J1786R52j2891m398J2102P425r571j0176O795J0346l555r593
$$ plain form
1094 -5588 -3310 3476 2461 -4303 -3943 1966 2593 -1733 -3592 1388 5743 2378 -6860 -7261 3418
1109 3418 10399 3826 -8704 -7884 3587 7151 -1241 -5694 767 5363 -1787 -7050 884 7568 2521
1124 2521 -6931 -5457 3981 6099 -655 -4880 -1413 3985 3508 -2030 -3399 3104 5573 -542 -7651
1139 -7651 -2217 6905 5825 -5570 -6930 3219 7719 -1735 -6808 131 8049 2250 -6692 -2908
1153 -2908 3646 3632 -3994 -3928 2283 4028 -1105 -4915 -538 4112 3146 -3999 -4376 3565 6904 -1263
1169 -1263 -7748 -1951 6974 4298 -5107 -4910 2978 5397 -3455 -5302 1811 5872 7 -5065 -1745
1184 -1745 4581 2795 -4131 -3550 3178 5590 636 -4895 -3350 2651 4685 -1436 -6174 -1022 7356
1199 7356 5174 -6899 -6434 3381 6561 -1611 -4535 1874 3950 -2025 -5245 689 6594 146 -3870
$$ packed form
1094e588K278O786j015o764L60N909O27m326j859M980M355l365r238m01J0679
1109C418O981o573j2530Q20J1471L564q392m453O461M596p150n263P934O684n047
1124B521r452J474R438K118o754m225L467N398m77n538j369O503K469o115p109
1139g651N434R122j080j1395j360J0149M500r454n073O939P918n799q942L784
1153b908O554j4p626O6O211J745n133l810M377M650r66p145l77P941L339q167
1169a263o485N797Q925k676r405J97P888K419q852j847P113M061n865n072L320
1184a745O326j786o926N81O728K412m954n531J545O001K034o121m738N152Q378
1199G356k182j2073M65R815L180q172k924O409K076n975l220N934N905o448m016
$$ plain form
1214 -3870 -3064 2347 1428 -1412 -1740 311 1419 1520 -2215 -4213 516 5824 1769 -6010 -4523 3931
1230 3931 3984 -4753 -3112 5884 3260 -7947 -6698 5598 8361 -2911 -7512 1831 4890 -289 -3982
1245 -3982 397 3831 2557 546 -2628 -5561 904 6695 3296 -6030 -4447 4121 2169 -5467 -2485
1260 -2485 7717 4772 -7487 -6081 5876 6321 -5539 -4886 5460 5707 -3013 -7368 -1288 4035
1274 4035 3653 2742 -1835 -7121 -2862 6019 3884 -3055 -3410 4358 444 -7392 -1124 8856 3691 -6229
1290 -6229 -2555 6102 1321 -8187 -1599 9502 3590 -7551 -5817 2801 2645 -1458 274 3192 -934
1305 -934 -3508 659 738 -2083 2631 6766 -442 -8969 -2309 7898 3070 -6013 -275 8327 -1182
1320 -1182 -9565 -310 11961 2936 -7829 -3777 5703 1480 -3921 -112 2567 333 -258 2447 -1981
$$ packed form
1214c870Q06N411r19k840l28K051J108J01l735j998M729N308m055p779J487Q454
1230C931N3q737J641Q996k624j1207J249J2296K763j1272m601R343L059n179l693
1245c982M379L434j274k011l174k933O465N791l399r326J583Q568j952p636K982
1260b485J0202k945j2259J406J1957M45j1860O53J0346K47q720m355O080N323
1274D035l82r11m577n286M259Q881k135o939l55P768l914p836O268R980n165r920
1290f229L674Q657m781r508O588J1101n912j1141J734Q618j56m103J732K918m126
1305i34k574M167P9k821M714M135p208q527O660J0207m828r083N738Q602r509
1320a182q383R255J2271r025j0765M052R480m223n401L809K679k234n91K705m428
$$ plain form
1335 -1981 -7267 38 9443 3118 -7483 -3605 6780 185 -6164 3660 10148 -1849 -12170 -1607
1349 -1607 9775 2474 -7397 -1121 6160 -923 -6349 1236 3511 -3609 -1726 5350 2132 -6100 -3117
1364 -3117 5797 1511 -3779 872 5051 -4871 -8420 4244 10591 -2925 -9965 3133 9209 -3689
1378 -3689 -9919 2888 9028 -1772 -5744 1858 2547 -2960 -1430 5697 2405 -4174 -1777 3338 -2157
1393 -2157 -5710 5702 9912 -4419 -10393 1112 8586 -2217 -5655 5804 6667 -6434 -9034 4204
1407 4204 8773 -1254 -3818 2955 886 -6545 -1799 8064 2290 -5784 -954 4347 -2915 -5734 1783
1422 1783 6376 -898 -3316 2545 1115 -7416 -2837 9764 6440 -7266 -9633 3438 5867 -3074
1436 -3074 -3197 5252 2786 -5953 -3117 4627 2041 -3786 -708 3454 -1262 -4361 682 3382 -1190
$$ packed form
1335a981n286P305R405o325j0601L878J0385o595o349R824O488j1997j0321J0563
1349a607J1382p301r871O276P281p083n426P585K275p120J883P076l218q232K983
1364c117Q914m286n290M651M179r922l549J2664O347j3516p040J3098O076j2898
1378c689o230J2807O140j0800l972P602O89n507J530P127l292o579K397N115n495
1393b157l553J1412M210j4331n974J1505P474j0803l438J1459Q63j3101k600J3238
1407D204M569j0027k564O773k069p431M746R863n774q074M830N301p262k819P517
1422A783M593p274k418N861j430q531M579J2601l324j3706k367J3071K429q941
1436c074j23Q449k466q739K836P744k586n827L078M162m716l099N043K700m572
$$ plain form
1451 -1190 -575 4668 2433 -7409 -4380 6869 5426 -3994 -4341 4413 1638 -6524 -3877 7884 7321
1466 7321 -2474 -6126 -968 1001 140 2700 2268 -3789 -4688 1474 3312 -2320 -3467 3205 3569 -3552
1482 -3552 -4724 1869 3137 -1573 -1429 3796 1529 -5874 -3641 5152 4517 -2929 -3920 1856 2379 -3102
1498 -3102 -2079 4595 2548 -3511 -2538 2393 1653 -536 -1579 431 -965 414 3629 1140 -5449
1513 -5449 -2174 5533 3902 -4576 -4881 3725 3242 -3659 -2405 5157 4355 -4491 -5290 1685 4754 -101
1529 -101 -1924 2355 -723 -3984 -1011 4170 -668 -1920 935 2407 -3744 -3758 4224 3026 -2913 -2608
1545 -2608 3991 3220 -7313 -4408 7881 7001 -4455 -6189 2724 2992 -2941 -939 3857 1254 -4005
1560 -4005 -588 3440 968 -2162 1293 1933 -1964 -1530 1976 978 -5174 -847 7338 1668 -8081 -3889
$$ packed form
1451a190O15N243k235r842L029J1249j443r420l47Q754k775q162K647J1761n63
1466G321r795l652N158J969q61K560m32o057q99O162J838n632j147O672L64p121
1482c552j172O593J268m710J44N225k267p403K233Q793o35p446r91N776N23n481
1498c102J023O674k047o059R73M931p40k189j043K010j396J379L215k489o589
1513e449L275P707j631q478l05Q606m83o901J254P562q02q846p99O975L069m855
1529a01j823M279l078l261K973N181m838j252K855J472o151j4P982j198n939L05
1545b608O599p71j0533K905J2289q80j1456j734Q913K68n933K002M796k603n259
1560d005L417M028k472l130L455O40l897M34L506r98o152M327Q185n670r749M192
$$ plain form
1576 -3889 7508 4129 -5543 -2914 6728 2526 -6757 -3371 5211 3081 -3766 -1455 1974 -1002 -3481
1591 -3481 1986 3910 -978 -2088 902 -344 -4620 1026 7783 1405 -7509 -4342 6113 3867 -4848
1606 -4848 -2237 6221 2666 -5881 -3356 3319 2748 -1934 -4 2501 -2577 -4037 149 4572 758
1621 758 -1532 -377 -2062 -1675 2471 4981 -1353 -6857 1198 6674 873 -7491 -1302 8085 1779
1636 1779 -5880 -2313 4001 1172 -3977 -267 4422 804 -4139 -640 3209 816 -1401 -854 -1288
1651 -1288 -1289 621 2410 -1607 -3269 2437 5185 -2602 -7038 461 7515 1355 -4625 -1387 4055 1574
1667 1574 -4522 -1562 1854 1601 -1012 -272 -50 -1438 244 1980 294 -1663 469 1773 -1879 -1954
1683 -1954 2104 2827 -4193 -4093 2781 5956 -1354 -6189 658 5349 -977 -4594 463 4291 1563
$$ packed form
1576c889J1397l379r672K629R642m202r283L386Q582k130o847K311L429k976k479
1591c481N467J924m888j110K990j246m276N646O757o378q914L167J0455k246q715
1606d848K611Q458l555q547K525O675n71m682J930K505n078j460M186M423l814
1621G58k290J155j685L87M146K510o334n504Q055N476n801q364O189R387o306
1636A779p659L567O314k829n149L710M689l618m943L499L849k393k217N47m34
1651a288jJ910J789m017j662N706K748p787m436P499P054o160n980L238N442k481
1667A574o096K960L416k53k613P40K22j388J682J736j686j957K132J304l652p5
1683a954M058P23p020J00O874L175p310m835O847M691o326l617N057L828k728
$$ plain form
1698 1563 -3380 144 1900 1163 -1873 -1490 616 1321 574 -220 -2471 -525 3273 1706 -3638 -2198
1714 -2198 4183 3138 -3153 -4508 1595 5594 -1472 -3721 460 3334 -913 -3121 539 3700 1001
1729 1001 -2448 -1912 1174 2012 1592 159 -937 -54 2416 129 -3151 -710 3943 1971 -4022 -4273
1745 -4273 3926 5486 -2870 -5020 733 5551 74 -4756 -743 3465 1671 -1886 -1770 526 615 -1098
1761 -1098 -1212 472 1236 98 -854 -2489 887 3921 2256 -4047 -1987 3430 2795 -2357 -3549 2515
1777 2515 4379 -2257 -3644 2474 2646 -1634 -2655 -289 1809 -32 -1873 -1352 712 1889 -109
1792 -109 -1257 -2208 407 3669 647 -3399 -74 4719 724 -4741 -1952 4292 3224 -3517 -2704 1703
1808 1703 3387 -1161 -2529 360 1708 1269 -1061 -780 872 1625 102 -2112 -712 1970 1510 -2377
$$ packed form
1698A563m943L524J756p37l036L83K106P05p47p94k251J946L798j567n344J440
1714b198O381j045o291j355O103L999p066k249M181K874m247k208L660L161k699
1729A001l449N36L086Q38m20j433j096Q83K470k287l280K441M653j972n993k51
1745d273Q199J560q356k150N753M818n477m830M013M208j794l557J16K296Q9j713
1761a098j14J684P64j138r52j635L376L034j665o303K060N417o35n152j192O064
1777B515J864o636j387O118J72m280j021K366K098j841j841N21K064J177j998
1792a09j148r51K615L262l022m046L325M793l995n465K789O244j068o741Q13M407
1808A703J684m548j368K889J348m39k330K81J652P53j523k214J400K682m60l887
$$ plain form
1824 -2377 -1855 2002 4599 -587 -4025 -530 4274 1023 -4012 -1171 3901 2217 -3271 -1967 1818
1839 1818 1301 -851 -2373 -38 1864 349 -1745 -1241 206 2444 236 -1762 -1964 2084 3783 -418
1855 -418 -2866 977 3028 -1238 -4294 -1155 3665 1127 -2927 -2538 2186 2813 -958 -1682 640 2690
1871 2690 472 -1439 8 1102 455 -480 -1317 166 1924 79 -2416 -2036 2282 3837 -1486 -4113
1887 -4113 -105 3940 942 -3957 -960 2268 1955 -1942 -2338 1791 3135 -1574 -1454 -40 1115 -653
1903 -653 -1445 -295 2329 910 -561 -2160 -476 233 1927 -934 -2206 647 1611 -1131 -2432 1207
1919 1207 3876 -272 -3864 -1803 3227 2295 -1749 -1872 1622 2230 -1085 -874 1680 1550 -104 -1210
1935 -1210 -512 969 1415 -89 -1403 -782 1515 2153 -1879 -2420 530 3153 -420 -2618 -470 2434
$$ packed form
1824b377N22L857K597n186l438L495M804l251n035K841N072j684n488J304L785
1839A818n17k152j522K335J902j515k094N04J447K238k208j998k02M048J699m201
1855d18k448L843K051m266l056L139M820k538m054L89M724O27l771p24K322K050
1871B690k218j911J447J094o47r35q37J483J758j845k495L80M318J555n323k627
1887d113M008M045k998m899K997L228l13l897l96M129J344m709J20J414J155j768
1903f53p92J150K624j419j471j599J684P09J694k861j272K853R64k742j301L639
1919A207K669m148l592K061N030r32m044j23L494O08l315K11K554j30j654j106
1935a210O98J481M46j504j314O21K297O38m032n41K950K623l573k198K148K904
$$ plain form
1951 2434 -485 -2985 -913 4112 2047 -2816 -2558 -51 2021 145 -1579 -640 -161 427 -523 -604 294
1968 294 1117 891 -2075 -1671 842 2661 -1052 -1857 1656 2916 -1867 -4893 424 5137 923 -4438
1984 -4438 -2911 2470 1579 -1125 -700 1092 1147 -2157 -1173 -317 229 1834 1743 -1121 -2590 86 2193
2001 2193 -1190 -945 1682 1958 -2377 -3641 1814 4757 969 -3399 -118 2264 259 -3582 145
2016 145 3141 1563 -1719 -1946 269 441 606 674 -34 -761 -919 266 -1849 -496 3028 2518 -3641
2033 -3641 -3588 990 3316 -2465 -2842 2456 3974 -1586 -5057 -60 4766 1662 -2051 477 477 -573
2049 -573 -1399 289 2101 1797 326 -1542 -2730 -1139 4195 3781 -2622 -2938 1307 2133 -1869 -1545 3671
2066 3671 3659 -3092 -5067 233 3496 -885 -2080 453 1375 -1132 -1245 -10 1539 -297 519 929
$$ packed form
1951B434k919k500K072N025k065m863K58K507K072j876j724R39M79N88r50q1Q98
1968B94Q23k26k966M04K513J819l713q05L513J260m783l026N317M713m214n361
1984d438J527N381q91k704M25J792N5l304R84Q56N46J605r1k864j469K676K107
2001B193l383K45K627K76m335j264N455K943l788m368L281K382k005l841L727
2016A45K996j578l282k27K215J72J65O8p08p27j58J185k115J353L524n10o159
2033c641N3M578K326n781l77N298J518n560l471M997M826l104l713K528%j050
2049e73q26J688J812l04j471j868j188J591N334m14o403l16M245Q26m002L24N216
2066C671j2o751j975N300L263m381j195K533R22k507j13J235J549j836Q16M10
$$ plain form
2082 929 -2444 -1983 1461 2197 -677 -1459 1446 666 -4414 -1028 5739 3016 -3346 -3086 3735 1942
2098 1942 -3360 -2386 3622 3421 -2045 -3394 -434 2457 607 50 -135 -319 -606 1333 14 -2118
2114 -2118 820 4358 -209 -4599 -2617 4376 1970 -2694 -2110 3391 1916 -4813 -3112 3616 3596 -1629
2130 -1629 -3129 122 760 -452 -604 1339 -1007 -93 489 -490 -2240 352 3003 1617 -2783 -1094
2146 -1094 1732 -407 -2015 709 4223 -465 -4607 -964 4116 1501 -2763 17 3179 236 -2944
2161 -2944 -1933 1880 1549 918 475 -483 -1407 395 1267 -669 -745 1865 3258 -3087 -5317 1353 6497
2178 6497 746 -4343 -4 3692 -597 -5161 -226 5876 2508 -2823 -3358 -188 1368 2277 1429 -693
2194 -693 -2425 1097 1334 -819 -1898 1479 3958 -1517 -3545 -96 2318 -495 -1756 2178 1936 -2448
$$ packed form
2082I29l373M61L444P36k874p82K905p80n080L386O767k723o362K60O821j793
2098A942n302R74O008k01n466j349K960K891j850n57j85j84k87J939j319k132
2114b118K938L538m567m390J982O993k406m664N84N501j475o729J701O728k0n225
2130a629j500L251O38j212j52J943k346R14N82r79j750K592K651j386m400J689
2146a094K826k139j608K724L514m688m142L643N080k615m264K780L162k943l180
2161b944J011L813l31o31m43r58r24J802Q72j936p6K610J393o345k230O670N144
2178F497n751n089M339L696m289m564M935O102l368n331n35L170J556R09q48k122
2194f93j732L522K37k153j079L377K479n475k028L449K414k813j261L934k42m384
$$ plain form
2210 -2448 -3702 1290 3471 -360 -1882 331 94 -2032 -315 1793 2117 138 -590 -1317 -1529 -645
2226 -645 2944 1562 -1776 -2341 1341 326 -3089 -690 5445 3644 -3883 -4839 1274 3897 254 -2744
2242 -2744 435 2490 -208 -2484 -2327 1111 3395 2231 -2005 -5195 -602 4067 1345 -2277 -1522
2257 -1522 2812 634 -3743 -2065 4076 4060 -1888 -3301 -747 1481 -794 891 1079 394 -489 -1073
2273 -1073 -165 15 848 1164 1133 -1277 -1425 82 866 1272 1235 137 -1795 -1245 140 2247 128 -2494
2291 -2494 -206 2301 -343 -2919 -1598 3097 3444 -1972 -3826 -307 2830 897 -1517 -1303 1328
2306 1328 1628 -1270 -2723 -1013 2447 2032 -2175 -4006 -123 3299 959 -2912 -1541 3513 2280
2321 2280 -2873 -3134 1103 3239 1237 -1676 -1620 759 1365 4 -855 -648 -120 1075 -794 -1309 -506
$$ packed form
2210b448j254M992K181l831j522K213k37k126J717K108L24j979p28p27k12Q84
2226f45L589j382l338n65L682j015l415K399O135j801p527r56O113K623l643k998
2242b744L179K055k698k276J57L438K284j164m236l190M593M669k722l622P55
2257a522M334k178m377J678O141j6n948j413K554K228k275J685J88o85q83n84
2273a073R08J80Q33L16l1k410j48J507P84M06l7j098j932N50J385K107k119k622
2291b494K288K507k644k576J321M695L47n416j854L519L137j933k414K14K631
2306A328L00k898j453J710L460m15m207j831L883L422k340l871J371N054j233
2321B280n153k61M237K136k002k913N6K379O06j361q59K07N28J195j869n15Q03
$$ plain form
2338 -506 2871 741 -971 -2003 -431 664 216 921 454 -454 -367 919 407 -1088 -554 1496 2405
2355 2405 -659 -2001 -1112 2447 1982 -1749 -1457 590 980 1048 -1565 -2196 572 3333 -110 -3411 -2245
2372 -2245 2168 2241 -1648 -2162 -209 3626 1370 -3085 -1819 2710 3391 -1250 -3344 -2227 2982 2701
2388 2701 -113 -1932 -724 882 1006 -2430 -1844 725 2368 497 -1976 -360 1967 674 -2004
2403 -2004 -1043 330 650 126 325 -1603 -803 804 2277 -61 -2253 -33 2656 1375 -2220 -1497
2419 -1497 453 2869 757 -2371 -1935 251 2559 235 -2274 -1452 1596 2103 199 -3101 -1143 2359
2435 2359 2625 -3081 -2371 700 3245 66 -2523 -1819 1907 3357 480 -2330 -1988 1821 2472 -211
2451 -211 -2919 -727 2717 2133 -2620 -2899 1165 3074 -424 -2037 -1262 1380 840 -311 -1465 -1257
$$ packed form
2338e06L377k130j712j032J572J095m48P05m67r08Q7J286n12j495N34K050R09
2355B405l064j342Q89L559m65l731K92K047L90O8k613o31K768K761l443l301J166
2372b245M413P3l889n14J953L835k256m455J266M529O81m641k094J117N209k81
2388B701k814j819J208J606J24l436N86K569J643j871k473J616K327j293k678
2403b004R61J373L20n24J99j928Q00J607J473k338k192K220K689j281l595P23
2419a497J950K416k112l128M36K186K308k324k509Q22L048N07j904l300J958L502
2435B359K66n706P10L071K545l179k589P04L726J450k877k810L42L809O51k683
2451b11k708K192L444n84m753k79M064J909l498j613P75K642n40j151j154K08
$$ plain form
2467 -1257 1568 2351 653 -1553 -911 482 1594 -456 -1844 -680 1339 1268 -846 -2020 -424 1075
2483 1075 1245 -1164 -1782 525 2478 945 -2787 -1226 1630 2088 -1023 -3066 -327 2200 2027 -2533
2499 -2533 -1872 -376 3210 1154 -3162 -1929 1941 2471 366 -2792 -717 2074 2428 -2267 -3451 -431
2515 -431 3036 1920 -2324 -2519 732 2759 215 -2850 -299 279 820 -987 -1275 -384 665 1295 -661
2532 -661 -1430 -1495 271 1652 -503 -3069 -641 2112 1891 -1409 -2129 -384 2679 1397 -2155 -2344 -449
2549 -449 2488 1691 -2350 -2304 2267 3752 -221 -3769 -1212 2253 1529 -2415 -3907 -56 2593 1324
2565 1324 -2001 -2193 -53 2439 1085 -4257 -2307 1586 2384 -838 -3062 -1102 2999 1354 -2319
2580 -2319 -2475 2179 2766 265 -1604 -1245 810 1364 787 -1616 -473 794 2328 -291 -596 -467 2045
$$ packed form
2467a257K825P83j698k206O42J393J112k050j388J164K019p1k114j174J596J499
2483A075J70k409o18K307J953j533l732J561K856M58l111k043K739K527j73m560
2499b533O61J496L586k056m316J233L870N30k105l158K075K791L54m695j184L020
2515d31L467j116m244j95L251K027k544l065K551N78N41j807k88Q91J049O30j956
2532f61p69o5J766J381k155k566K428K753k21l300p20J745L063j282l552j89J895
2549d49K937p97m041M6M571J485l973l548K557L465p24l944j492L851K649j269
2565A324l325j92K140K492j354n342J950L893P98l222k224J960M101j645l673
2580b319j56M654N87k501j869L59K055N54n77k403J143J267J534k619l05J29K512
$$ plain form
2597 2045 1801 -1430 -1562 -863 1625 1351 -1223 -1805 -588 736 1420 -1804 -1964 -30 2664 1469 -2776
2614 -2776 -2821 940 4368 39 -2421 -1730 1335 1325 -301 -3357 231 2569 670 -2194 -2452 973
2630 973 3712 1330 -3335 -1759 2640 3268 209 -3797 31 3428 2716 -1677 -2813 670 2508 121
2646 121 -1048 -2364 541 2188 292 -1923 -977 1856 1514 -375 -2972 74 2657 1206 -2241 -1717
2662 -1717 613 586 310 -455 -1316 -1308 1508 860 -1043 -2531 -942 2149 1702 -1035 -2179 765 2682
2679 2682 -720 -2209 -577 1728 873 -592 -1992 -978 2188 1096 -1665 -3343 138 3371 1748
2694 1748 -3775 -2658 1442 3314 146 -2727 -565 2598 1234 -1931 -1645 -384 2383 1833 -1445
2709 -1445 -2240 321 3416 582 -2827 -2258 1974 2869 -1461 -3091 160 2517 747 -2927 -1718 667
$$ packed form
2597B045k44l231j32O99K488k74k574n82J217J324O84l224j60J934K694j195m245
2614b776m5L761L428m329k460O91L065j0j626l056L588K338j899k864k58L425
2630I73K739k382m665J576M399O28l059m006L828L397p12m393j136L483J838k387
2646A21j169j316K905J647j896k215R46K833l42j889k597L046K583j451l447N24
2662a717K330k7k76p65q61QK816o48j903j488J589L091m47k737j144K944J917
2679B682l402j489J632K305q55j465j400J014L166j092k761j678L481L233j623
2694A748n523J117M100J872l168k873K162L163j364l165K86J261K767n50l278
2709a445p95K561L095k834l409N69M232Q95m330j630L251K357j770l674J209K385
$$ plain form
2725 667 1570 38 -418 -967 474 1558 177 -1720 -1869 376 1582 845 -2498 -1024 897 2032
2741 2032 35 -1412 -819 380 1119 -1049 -1505 -746 1028 1462 -448 -2527 -182 3505 2277 -2100
2757 -2100 -2790 2518 2210 -145 -2151 -1271 1936 2078 -411 -2038 -358 2498 1861 -1440 -3249 154
2773 154 3273 370 -3314 -2874 1777 2789 -902 -2569 -113 3282 33 -1717 -1431 -200 2088 541
2789 541 -1519 -1756 1057 1131 -157 -1402 -667 1740 1016 -398 -1206 158 1796 1992 -1432 -439 -549
2806 -549 1130 1309 -209 -1920 -1222 1386 1622 -457 -1618 -296 2112 504 -1207 -908 1295 1642
2822 1642 -222 -2229 -920 795 1555 -217 -2424 -1459 2584 1703 -1238 -1780 -713 2967 1489 -2313
2838 -2313 -3291 1318 2909 189 -2925 -1482 1777 1604 -1038 -2135 193 2585 1310 -604 -2635
$$ packed form
2725F67R03j532m56n49J441J084j381j897j49K245J206p37l343J474J921J135
2741B032j997j447N93J199P39k168m56P59J774M34j910k079K345L687j228m377
2757b100o90N308l08k355k006Q80L207J42k489j627J680K856o37l301j809L403
2773A54L119k903l684M40M651J012l691j667K456L395l249j750K86J231K288j547
2789E41k060k37K813P4j288j245P35K407p24j414q08J364J638J96l424R93j10
2806e49J679J79j518j711O98K608K36k079j161J322K408j608j711K99K203L47
2822A642j864k007J309J715P60j772k207R65M043q81k941n42J067L680j478l802
2838b313r78M609J591k720l114J443L259j73k642j097K328K392j275j914k031
$$ plain form
2853 -2635 -18 1929 201 -2603 -1840 560 2485 -453 -2038 974 1447 578 -879 -650 -654 1561 965
2870 965 31 -395 -962 1168 510 -1046 -905 -60 1224 540 -2444 -1647 1270 2305 802 -966 -980 -938
2888 -938 2244 926 -676 -1234 159 2103 -162 -2733 -973 3078 1114 -1229 -2105 1285 2304 612
2904 612 -1415 -1630 1067 1577 -466 -1678 -595 1516 2296 -301 -3471 129 2665 1691 -2218 -2145 857
2921 857 1258 -394 -1276 77 1962 682 -537 -1417 -225 1530 1367 -461 -1162 -504 2007 910 -1632
2938 -1632 -709 1501 1764 -555 -1629 -552 183 485 -233 -408 -954 -550 693 503 -998 -1048 1196 1513
2956 1513 -1177 -1411 -92 1954 1676 -751 -1305 -368 544 -103 -446 -843 661 1915 517 -2100 -669
2973 -669 2591 2536 -1351 -2770 -753 2382 -210 -1361 -504 528 1195 543 -1296 -284 600 1037 570
$$ packed form
2853b635K617J947j728k804P63K400J925k938j585L012M73q69j457K29mK215n96
2870I65r34m26n67K130o58j556J41Q45J284o84k984P97K917J035j503j768j4M2
2888i38L182j318j602n58J393J944k265k571J760M051j964k343q76L390J019j692
2904F12k027k15K697N10k043j212J083K111P80k597l170L600K536r74l909P3L002
2921H57M01j652q82J353J885j280j219q80J192J755j63j828p01O58K511j097k542
2938a632R23K210K63k319j074J077P35L02p18j75n46M04J243j90j501n0K244L17
2956A513k690k34J319K046k78k427n54R37R12o47l43l97J504J254j398k617J431
2973f69L260n5l887j419K017L135k592j151Q57J032O67o52j839J012Q84M37m67
$$ plain form
2990 570 -1736 -266 1750 1925 -489 -1894 53 770 339 -1509 -577 1117 958 -1249 -1093 -972 1220
3007 1220 651 170 -1117 -1597 148 486 -1 -1989 13 234 1415 134 -1814 403 708 234 -85
3024 -85 -907 -55 1081 880 -587 -1213 295 1304 13 -1599 -761 446 664 -58 -585 -124 1415 898
3042 898 125 -1575 -825 2191 1264 -607 -953 -285 837 328 -1683 -1221 188 1371 -741 -956 -542
3059 -542 1206 1109 -1243 -2478 419 609 -205 -712 -994 821 569 -518 -1024 375 1050 197 -941 -1768
3077 -1768 -387 1348 -374 -1033 97 492 -4 171 -1339 -119 -70 670 428 -1316 -719 -108 643 -270
3095 -270 -677 -943 163 352 -193 -656 36 496 65 -1041 -1045 82 1601 1027 -802 -1514 -394 803
3113 803 236 -1067 -999 243 675 -698 -1370 -357 277 835 -98 -1398 -1081 164 1297 -899 -1080 753
$$ packed form
2990E70k306J470K016J75k414j405J947P17m31j848R32J694j59k207J56J21K192
3007A220n69m81j287m80J745L38m87j988K002K21J181j281j948K217L05m74l19
3024h5q22Q52J136k01j467o26J508J009j291j612Q38J207K18p22n27M61J539n17
3042H98p73j700P50L016r27j871l46O68J122n09k011M62J409J183k112k15M14
3059e42J748r7k352j235K897J90q14n07k82J815k52j087n06J399O75q53j138q27
3077a768J381J735j722o59J130L95m96J75j510J220M9P40k42j744N97O11P51r13
3095b70m07k66J106J89n45m63O92M60m31j106mJ127J519n74j829p12J120J197
3113H03n67j303O8J242M32j373o72J013O34N58r33j300L17J245J133k196j81J833
$$ plain form
3131 753 433 202 -777 -784 338 1003 -73 -1132 -804 920 -490 -768 -690 -624 1071 -925 -581 -16 622
3150 622 1370 445 420 840 289 -46 790 -526 -979 828 68 -350 -1288 -322 679 617 -247 -791 191 262
3170 262 121 -761 -929 60 343 226 -997 -694 -108 808 -267 -800 -1086 1005 537 472 -925 -389 1036
3189 1036 261 -665 -669 992 219 -604 -345 -41 930 1048 -775 -1139 173 -330 84 249 -913 -336 388
3208 388 683 607 -1345 63 625 -642 -167 -993 -62 696 84 -694 -694 -810 605 402 -902 -190 275
3227 275 367 18 -78 -40 156 660 841 -221 691 -241 -656 -5 84 516 847 633 251 145 177 63 221
3248 221 -810 -326 -119 642 -229 -1441 -54 35 -675 -9 865 49 485 543 -1043 -1036 1505 289 188
3267 188 -1415 538 395 389 -58 -1319 295 938 368 -550 -297 288 355 493 -851 -399 -130 268 -183
$$ packed form
3131G53l20k31r79pJ122O65j076j059L28J724j410k78P8O6J695j996L44N65O38
3150F22P48r25k5M20n51l35Q36j316m53J807p60m18r38R66J001o2q64n44R82P1
3170B62j41q82j68R89K83j17j223L03N86R16j075n33k86K091m68o5j397N36J425
3189A036p75r26mJ661p73q23K59L04R71J18j823l64J312n03M14J65j162N77P24
3208C88K95p6j952J408N62j267M75q26R31P58o12p78%j16J415k03j304P12M65
3227B75R2l49r6L8J96N04J81j062R12r32m15O51Q9M32L31k14l82j06L2j14J58
3248B21j031M84K07P61q71j212J387Q9p10O66Q74q16M36N8j586PK541j216j01
3267A88j603J953j43om47j261J614O43n70r18K53N85O7J38j344M52K69L98m51
$$ plain form
3286 -183 -1332 -640 798 -505 -407 -115 -162 759 283 -706 -103 413 238 413 47 -84 482 295 -600 243
3306 243 -355 -243 1314 347 -1194 95 728 -149 -979 -1389 443 31 -171 -891 -732 21 -218 -469 -427
3325 -427 30 698 -178 -933 -290 -380 336 -394 -712 410 -72 287 -77 723 -495 -311 -177 793 256 -1644
3345 -1644 155 146 947 21 -381 518 153 -1088 -494 138 965 421 -435 109 -204 484 855 -94 -283 348
3365 348 622 677 -1159 -786 496 -259 -576 -1067 -63 1331 -546 -210 -160 -230 18 485 -365 -442 19 968
3385 968 -448 -569 705 557 419 -393 406 -292 1178 -486 53 384 298 941 -323 62 7 -647 -128
3404 -128 226 -551 28 515 1033 233 296 -295 -1714 235 857 239 -285 -566 186 437 -627 -442 768
3423 768 488 -440 -703 7 641 601 -342 -398 321 -487 -645 -536 275 619 -1 -590 -1050 441 308 180
$$ packed form
3286a83j149O92J438j303R8K92m7R21m76r89O03N16j75J75l66j31N66j87q95Q43
3306B43n98J12J557r67j541J289O33q77q30m10J832m12k02p20J59P53k39k51M2
3325d27M57O68q76p55O43r0P16p30l18J122m82L59l64Q00j218J84J34R70n37j900
3345a644J799rQ01r26m02Q99l65j241N94O32Q27n44q56N44l13O88L71r49j89O31
3365C48K74N5j836L73J282p55l17m91J004J394j877L36N0p0K48M67q50p7M61R49
3385I68j416j21J274j48j38q12P99o98J470j664N39L31q6O43j264L85n5o54N19
3404a28L54p77N79M87N18q00O3n91j419J949O22o18n24k81P52K51j064J85J210
3423G68k80r28k63P10O34m0r43n6P19q08j58J09Q11L44o20n89m60J491j33j28
$$ plain form
3443 180 27 -134 426 210 49 835 31 227 -1035 -887 -910 260 514 -859 471 666 865 -38 -774
3462 -774 -420 -696 581 275 -32 -856 -227 -152 -314 642 633 -341 -542 76 143 351 223 -396 -252 -222 -227 -730
3484 -730 152 404 -2 -1368 -896 1575 591 512 -477 371 771 -198 -614 10 854 571 -232 -105 946
3503 946 -35 -279 -564 -203 1154 459 -808 -1392 761 1919 -233 458 -1193 520 298 -898 294
3520 294 859 -331 -350 -837 197 661 -100 -46 151 578 -17 -376 91 118 807 387 320 -414 277 1496
3540 1496 17 -893 -362 274 103 -232 -472 462 -128 -960 243 -198 727 -222 -459 333 1335 -119
3558 -119 -174 -657 387 406 1020 -562 -641 178 992 -284 -465 144 898 584 -1042 -680 866 111 -515
3577 -515 -1144 1006 1312 -1207 -395 -161 1444 -306 -780 -1049 129 -258 -38 881 -101 1174 318 -477
$$ packed form
3443A80j53j61N60k16j61P86q04J96j262J48k3J170K54j373J330J95J99r03p36
3462g74L54k76J277l06l07q24O29P5j62R56rr74k01O18O7K08j28o19J44L0nn03
3484g30Q82K52m06j366M72K471r84p9r89Q48M00r69m16O24Q44k83q03J27J051
3503I46r81k44k85L61J357o95j267n84K153J158k152O91j651J713k22j196J192
3520B94N65j190j9m87J034M64p61N4J97M27n95l59M67K7O89m20o7p34O91J219
3540A496j479r10N31O36j71l35k40R34n90q32J203m41R25r49k37P92J002j454
3558a19n5m83J044J9O14j582p9Q19Q14j276j81O09P54l14j626L62J546p55o26
3577e15o29K150L06k519Q12K34J605j750m74k69J178l87K20R19r82J275q56p95
$$ plain form
3595 -477 -804 497 975 -310 -263 287 12 -41 -354 332 1736 252 -901 -1149 -159 44 -892 -865 -284
3614 -284 -209 144 -452 -383 801 1104 -94 -1863 -892 607 964 -148 -531 292 794 533 -979 55
3632 55 194 -259 -263 152 -226 218 -73 8 -979 -96 -5 -915 -288 518 607 981 -1162 683 989 -24 -449
3653 -449 354 425 82 -179 -1285 370 -18 115 -858 -201 689 -445 -920 -67 824 90 108 -694 194 -469
3673 -469 419 -240 996 -188 871 -671 -591 445 211 771 727 -244 199 303 287 285 -533 504 384 -750
3693 -750 1156 455 1020 -331 -434 688 -502 250 366 -70 834 654 -237 450 267 -80 614 -161 -1481
3712 -1481 147 -379 -489 -746 -390 620 -446 -1314 -1110 767 114 -1169 406 435 -71 500 -320 448
3730 448 1090 286 124 -420 -214 85 -288 -721 743 785 -116 -383 291 495 1038 -782 -759 351 346 -82
$$ packed form
3595d77l27J301M78j285M7N50k75n3l13O86J404j484j153k48R90K03r36K7N81
3614b84P5L53n96O9J184L03j198j769R71J499L57j112l83Q23N02k61j512J034
3632E5J39m53mM15l78M44k91Q1r87Q83R1r10O27Q06Q9L74k143J845L06j013m25
3653d49Q03P1l43k61j106J655l88J33r73O57Q90j134m75Q53Q91p34J8q02Q88o63
3673d69Q88o59J236j184J059j542Q0J036k34N60m4r71M43J04j6kq18J037j20j134
3693g50J906p01N65j351j03J122j190P52J16m36R04j80q91O87j83l47O94p75j320
3712a481J628n26j10k57L56J010j066q68K04J877o53j283J575K9n06N71q20P68
3730D48O42q04j62n44K06K99l73m33J464M2r01k67O74K04N43j820K3J110nm28
$$ plain form
3750 -82 -498 346 162 -342 519 -356 -929 578 -163 416 632 702 61 -727 -151 765 1154 -278 -1238 -309
3770 -309 1080 440 -837 -256 298 618 7 -774 -697 152 554 19 132 -270 779 -472 88 168 502
3789 502 220 -334 1397 -378 701 666 -56 -197 519 494 544 576 1239 224 -803 604 -491 -250 126
3808 126 -531 -54 723 284 -363 -55 788 1119 130 -379 -363 173 484 -1119 -452 -98 -39 -91 203 731 46
3829 46 -155 253 -865 435 -289 217 -115 -395 -716 -186 199 -487 -369 -415 369 -971 -134 -372 109 71
3849 71 495 139 -408 -302 -770 -283 1442 -345 -21 45 190 628 -10 452 228 -220 -751 342 552 431
3869 431 -234 -195 -157 765 702 113 -85 -633 204 585 44 441 1019 205 -221 -390 -31 793 -276 -101 -564
3890 -564 -77 430 420 238 -338 18 7 -737 67 649 626 -302 321 273 793 273 -503 -452 -374 317 -525 -1074
$$ packed form
3750h2m16Q44j84n04Q61q75n73J507p41N79K16P0o41p88N76R16L89j432r60R29
3770c09J389o40j277N81N54L20o11p81P7Q49M02n35J13m02J049j251N60Q0L34
3789E02k82n54J731j775J079l5p22j41P16k5N0L2O63j015j027J407j095K41L76
3808A26o57M77P77m39o47L08Q43L31r89n09J6N36L11j603O67L54N9n2K94N28o85
3829D6k01M08j118J300p24N06l32k80l21N30L85o86J18m6P84j340Q37k38M81l8
3849G1M24l56n47J06m68M87J725j787L24O6J45M38o38M62k24m48n31J093K10j21
3869D31o65L9L8R22o3n89j98n48Q37L81n41L97N78q14m26j69L59Q24j069J75m63
3890e64M87N07j0j82n76L56j1p44Q04N82k3r28O23m8N20n20p76N1P8O91q42n49
$$ plain form
3912 -1074 462 -3 326 425 38 911 -392 143 191 210 83 -301 -290 339 1306 -489 68 1270 333 1128
3932 1128 -2 -1061 353 365 -51 -713 -171 126 -554 -197 103 740 -680 -946 -1157 -48 -320 -21
3950 -21 -541 -524 37 -63 -828 -648 -750 1002 -51 188 514 680 -77 -333 -477 -9 739 353 -862 476
3970 476 336 -120 -196 -234 -558 -405 578 -570 -335 830 998 -34 -684 1193 582 435 -411 277 -107
3989 -107 -206 -181 -106 -884 -275 69 72 986 28 171 18 -1131 995 -194 -187 -126 -526 122 51 -170 -320 -580
4011 -580 -361 -42 604 1107 489 -585 -27 517 407 -337 -489 -538 412 239 -88 357 1015 -462 684
4030 684 641 -111 -476 199 -607 767 527 198 217 -1261 -1069 65 -165 -488 -242 -397 -30 223 -657 -221
4050 -221 346 -100 -526 570 -260 -440 11 -193 607 -251 632 354 392 -94 -682 -305 496 146 -420 -444
$$ packed form
3912a074J536m65L29R9l87Q73j303N35M8J9j27l84J1O29R67j795N57J202r37P95
3932A128j130j059J414J2m16o62N42K97o80L57L00O37j420k66k11J109k72K99
3950b1n20J7N61j00p65J80j02J752j053K39L26J66p57k56j44M68P48l86j215J338
3970D76j40m56p6l8l24J53R83j148K35J165J68j032o50J877o11j47q46O88l84
3989a07r9K5P5p78O09L44LR14r58J43j53j149K126j189PO1m00O48p1k21j50k60
4011e80K19L19O46N03o18j074N58N44j10p44j52m9R50j73l27M45O58j477J146
4030F84m3p52l65O75q06J374k40l29J9j478J92J134k30l23K46j55L67K53q80M36
4050b21N67m46m26J096q30j80M51k04Q00q58Q83k78L8m86n88L77Q01l50n66k4
$$ plain form
4070 -444 -296 -841 1051 138 -439 54 332 575 747 -1236 386 283 726 -388 -541 398 -305 330 408
4089 408 -174 -152 -313 -422 86 488 359 -451 -559 110 1173 -16 -509 293 78 -395 -672 122 258 362
4109 362 -71 724 -452 -493 -236 -1515 -267 755 66 -115 -706 -89 1335 16 -600 22 82 -175 331
4128 331 -423 201 137 -29 -181 -485 571 371 163 263 -129 -285 96 400 -572 680 -749 -222 430
4147 430 601 -11 370 -1514 -706 -375 -252 73 -200 245 -1133 334 -364 131 328 -87 129 -103 -659
4166 -659 -367 -12 -766 -518 -7 -815 -547 -207 -185 -497 -376 590 951 -61 -141 -725 123 290 -56 -142 379
4187 379 200 -244 -1280 -195 156 -102 -442 231 31 463 -161 72 -78 -270 -585 299 419 -536 636
4206 636 98 176 295 720 523 -680 414 56 28 -86 -71 -729 -163 -368 -234 -18 -234 349 73 -60
$$ packed form
4070d44J48n45J892r13n77M93K78K43J72j983J622j03M43j114j53R39p03O35P8
4089D08n82K2j61j09N08M02j29q10j08O69J063j189m93Q02k15m73k77P94J36J04
4109C62m33P95j176m1K57j279J248J022o89j81n91O17J424j319o16O22O0k57N06
4128C31p54O24o4j66j52l04J056k00k08J00l92j56L81L04r72J252j429N27O52
4147D30J71o12L81j884Q08L31J23L25k73M45j378J467o98M95J97m15K16k32n56
4166f59K92L55p54K48N11q08K68L40K2l12J21R66L61j012q0n84Q48J67l46q6N21
4187C79j79m44j036J085L51k58l40O73k00M32o24K33j50j92l15Q84J20r55J172
4206F36n38P8J19M25j97j203J094l58k8j14J5o58N66k05J34K16k16N83k76j33
$$ plain form
4226 -60 -529 530 -528 215 -1274 498 -328 -505 -5 -906 389 -562 249 -177 -862 -259 1249 534
4244 534 -466 154 815 -355 82 201 -301 457 -338 309 -137 -567 281 -75 -580 290 -504 305 -113
4263 -113 380 511 -346 3 -105 87 535 46 37 244 -409 -110 -364 -864 89 -530 -576 764 549 107 245
4284 245 -235 1086 193 480 -945 109 675 528 644 -640 -886 -52 558 -300 931 -733 556 -160
4302 -160 -558 406 -290 -198 -24 31 520 376 -593 -183 -347 312 62 792 879 -699 -316 466 291 906 809
4323 809 -354 86 -283 20 161 159 269 110 784 -452 -88 -641 239 -219 -167 448 141 108 -504 292 -473
4344 -473 151 552 -108 -39 -621 -103 -269 218 470 413 -595 -300 -150 -129 55 -77 -54 433 473 -597 -155
4365 -155 -1295 973 -8 -527 102 -567 -413 -637 610 222 -71 294 -342 -183 262 -44 -44 -977 842
$$ packed form
4226f0m69J059j058P43j489J772q26j77N00r01J295r51Q11m26o85O03J508p15
4244E34j000O20O61j170M37J19n02P58p95O47m46m30Q48l56n05Q70p94Q09m18
4263a13M93J31q57L49j08J92M48m89rK07o53K99k54n00R53o19m6J340k15m42J38
4284B45m80J321q93K87j425J054N66j47J16j284k46Q34O10q58J231j664J289p16
4302a60l98R64o96R2J74N5M89j44r69M10j64O59k50P30Q7j578L83P82j75O15r7
4323H09j163M40l69L03J41kJ10j59O74j236L64n53Q80m58N2O15l07l3o12P96p65
4344d73O24M01o60O9n82N18j66M87K52n7j008K95J50K1J84j32K3M87M0j070M42
4365a55j140K268r81n19O29o69J54k24J247l88k93L65o36J59M45l06%r33J819
$$ plain form
4384 842 -334 293 326 404 0 883 -1324 465 -90 365 108 783 -48 222 319 -101 -876 775 408 -345
4404 -345 -69 197 -232 186 177 -352 269 -51 -335 -176 -531 17 474 -277 521 4 -189 193 614 584 -572
4425 -572 568 -304 -750 478 121 -359 607 961 -321 -108 307 -294 220 141 19 -757 -190 -359 258
4444 258 -782 -464 -271 -223 -1038 417 0 -291 -277 -70 -622 155 -227 -661 -45 493 389 -232 -406 -420
4464 -420 -146 341 -757 -135 -180 -673 -530 -212 -131 866 702 -674 75 30 533 149 -240 -92 -545 -433
4484 -433 276 99 721 -465 -164 543 217 -361 122 25 36 14 303 -269 -531 -511 515 67 -120 780 302
4505 302 -527 -154 305 -584 351 564 -693 -1286 1415 -622 203 -112 311 805 -638 878 146 605
4523 605 95 -445 -626 -149 -436 -535 74 -120 -55 54 -357 435 -286 -342 174 134 -295 -279 93 -96 900 409
$$ packed form
4384H42j176O27L3P8m04Q83k207J789n55M55k57O75q31K70R7m20p75J651l67p53
4404c45K76K66m29M18rn29O21l20k84J59l55N48M57p51P98n17j93L82M21l0j156
4425e72J140q72m46J228l57m80R66L54j282K13M15o01N14p9j22p76N67j69O17
4444B58j040L18J93M8q15J455m17k91J4K07n52P77l82m34O16N38j04o21j74j4
4464d20K74M87j098O22m5m93J43L18Q1R97j64j376P49m5N03l84l89J48m53J12
4484d33P09j77O22j186L01P07l26n78M83r7J1k2K89n72k62K0J026m48j87R00m78
4505C02q29L73M59q89R35K13j257n93K701k037Q25l15M23M94j443J516p32M59
4523F05n10n40j81M77k87r9O09j94O5J09m11P92p21n6N16m0m29J6L72j89R96m91
$$ plain form
4545 409 -93 121 -574 -176 -134 -619 -462 -431 -679 -516 212 410 -162 89 -474 -28 -107 346 -145 -389 -254
4566 -254 389 260 164 -258 94 110 385 11 -539 717 558 -1082 -502 495 638 -249 -172 91 -390 434
4586 434 -516 -269 -216 -515 -529 -249 -442 283 -49 442 621 -225 -790 -613 -37 664 -252 -365 189 30 294
4607 294 -92 -162 -317 232 -1030 -398 -617 -751 712 -590 414 499 -148 298 -80 -562 -883 663 -131
4626 -131 11 -224 13 -599 45 -27 705 531 788 212 -1003 356 276 -438 23 796 198 460 -658 -247
4646 -247 334 -12 -388 146 -750 1939 -428 662 199 -359 311 -22 373 -884 621 1361 -412 -58
4664 -58 499 -263 -437 -448 217 342 -21 981 385 -494 -87 -28 -702 -654 -399 -104 -164 218 -420 644 -734
4685 -734 409 -571 -164 -85 332 32 337 275 -568 262 -93 68 249 -1043 -21 -123 -623 -146 1159
$$ packed form
4545D09n02K14o95L98M2m85J57L1k48J63P28J98n72K51n63M46p9M53m91k44J35
4566b54O43j29r6m22L52J6K75l74n50J256j59j640N80R97J43q87P7K63m81Q24
4586D34r50K47N3k99j4K80j93P25l32M91J79q46n65J77N76P01r16j13N54j59K64
4607B94l86p0j55N49j262O32k19j34J463j302J004Q5o47M46l78m82l21J546p94
4626a31J42k35K37o12O44p2P32j74K57n76j215J359q0p14M61P73n98K62j118M11
4646b47N81l46l76N34q96K689k367J090m63n58O70l33L95j257J505P40j773L54
4664e8N57p62j74j1O65J25l63J002n96q79M07N9o74M8K55K95o0L82o38J064j378
4685g34J143r80M07P9M17l00L05o2q43Q30l55J61J81j292J022j02n00M77J305
$$ [...]
8191d17
##END NTUPLES=NMR FID
##END=
