##TITLE=1H_SA_28.121
 DMSO, 8 sc, 
 24.7.2019
##JCAMPDX= 6.0         $$ Bruker NMR JCAMP-DX V2.0
##DATA TYPE= NMR FID
##DATA CLASS= NTUPLES
##ORIGIN= UXNMR, Bruker Analytische Messtechnik GmbH
##OWNER= root
$$ XWIN-NMR		Version 3.5
$$ Wed Jul 24 15:44:05 2019 Russian Standard Time (UT+4h)  she@DPX200
##.OBSERVE FREQUENCY= 200.13155
##.OBSERVE NUCLEUS= ^1H
##.DELAY= (6, 6)
##.ACQUISITION MODE= SIMULTANEOUS
##.ACQUISITION SCHEME= undefined
##.AVERAGES= 8
##.DIGITISER RES= 18
##SPECTROMETER/DATA SYSTEM= spect
##.PULSE SEQUENCE= zg30
##.SOLVENT NAME= DMSO
##.SHIFT REFERENCE= (INTERNAL, DMSO, 0, 15.7039)
##AUDIT TRAIL= $$ (NUMBER, WHEN, WHO, WHERE, WHAT)
$$ ##TITLE= Audit trail, XWIN-NMR		Version 3.5
$$ ##JCAMPDX= 5.01
$$ ##ORIGIN= Bruker BioSpin GmbH
$$ ##OWNER= she
$$ F:/spectra/data/she/nmr/H-F/1/audita.txt
$$ ##AUDIT TRAIL=  $$ (NUMBER, WHEN, WHO, WHERE, WHAT)
(   1,<2019-07-24 15:42:53.82 +0400>,<she>,<DPX200>,
      <created by zg, POWCHK disabled, PULCHK disabled
       configuration hash MD5:
       00 E9 B6 7A A2 85 ED C7 34 08 36 98 17 FE 4E 26
       data hash MD5: 16K
       F1 A7 08 7B 6B F4 EA 96 52 26 FA DD AB 8D 23 E1>)
$$ ##END=
$$ 
$$ hash MD5
$$ 53 18 62 B0 78 0C A3 6B 6D 35 23 39 EC CD 5E FA
##$RELAX= 
##$RELAX= 
##$RELAX= 
##$RELAX= 
##$RELAX= 
##$RELAX= 
$$ Bruker specific parameters
$$ --------------------------
##$DU= <F:/spectra>
##$EXPNO= 1
##$NAME= <H-F>
##$PROCNO= 1
##$TYPE= <nmr>
##$USER= <she>
##$AMP= (0..31)
100 100 100 100 100 100 100 100 100 100 100 100 100 100 100 100 100 100 
100 100 100 100 100 100 100 100 100 100 100 100 100 100 
##$AQSEQ= 0
##$AQ_mod= 1
##$AUNM= <au_zg>
##$AUTOPOS= <>
##$BF1= 200.13
##$BF2= 200.13
##$BF3= 200.13
##$BF4= 200.13
##$BF5= 200.13
##$BF6= 200.13
##$BF7= 200.13
##$BF8= 200.13
##$BYTORDA= 1
##$CFDGTYP= 0
##$CFRGTYP= 5
##$CHEMSTR= <none>
##$CNST= (0..31)
1 1 145 1 1 1 1 1 1 1 1 1 1 1 1 1 1 1 1 1 1 1 1 1 1 1 1 1 1 1 1 1 
##$CPDPRG= <>
##$CPDPRG1= <>
##$CPDPRG2= <>
##$CPDPRG3= <>
##$CPDPRG4= <mlev>
##$CPDPRG5= <mlev>
##$CPDPRG6= <mlev>
##$CPDPRG7= <mlev>
##$CPDPRG8= <mlev>
##$CPDPRGB= <>
##$CPDPRGT= <>
##$D= (0..31)
0 1.2 0 0 0 0 0 0 0 0 0 0.03 0 0 0 0 0 0 0 0 0 0 0 0 0 0 0 0 0 0 0 0 
##$DATE= 1563968573
##$DBL= (0..7)
120 120 120 120 120 120 120 120 
##$DBP= (0..7)
150 150 150 150 150 150 150 150 
##$DBP07= 0
##$DBPNAM0= <>
##$DBPNAM1= <>
##$DBPNAM2= <>
##$DBPNAM3= <>
##$DBPNAM4= <>
##$DBPNAM5= <>
##$DBPNAM6= <>
##$DBPNAM7= <>
##$DBPOAL= (0..7)
0.5 0.5 0.5 0.5 0.5 0.5 0.5 0.5 
##$DBPOFFS= (0..7)
0 0 0 0 0 0 0 0 
##$DE= 6
##$DECBNUC= <off>
##$DECIM= 24
##$DECNUC= <off>
##$DECSTAT= 4
##$DIGMOD= 1
##$DIGTYP= 9
##$DL= (0..7)
0 120 120 120 120 120 120 120 
##$DP= (0..7)
150 150 150 150 150 150 150 150 
##$DP07= 0
##$DPNAME0= <>
##$DPNAME1= <>
##$DPNAME2= <>
##$DPNAME3= <>
##$DPNAME4= <>
##$DPNAME5= <>
##$DPNAME6= <>
##$DPNAME7= <>
##$DPOAL= (0..7)
0.5 0.5 0.5 0.5 0.5 0.5 0.5 0.5 
##$DPOFFS= (0..7)
0 0 0 0 0 0 0 0 
##$DQDMODE= 0
##$DR= 18
##$DS= 0
##$DSLIST= <SSSSSSSSSSSSSSS>
##$DSPFIRM= 0
$$ [...]
##$SUBNAM2= <"">
##$SUBNAM3= <"">
##$SUBNAM4= <"">
##$SUBNAM5= <"">
##$SUBNAM6= <"">
##$SUBNAM7= <"">
##$SUBNAM8= <"">
##$SUBNAM9= <"">
##$SW= 24.9336996594482
##$SWIBOX= (0..15)
0 0 2 0 0 0 0 0 0 0 0 0 0 0 0 0 
##$SW_h= 4990.01996007984
##$TD= 16384
##$TD0= 1
##$TE= 0
##$TE2= 300
##$TE3= 300
##$TEG= 300
##$TL= (0..7)
0 120 120 120 120 120 120 120 
##$TP= (0..7)
150 150 150 150 150 150 150 150 
##$TP07= 0
##$TPNAME0= <>
##$TPNAME1= <>
##$TPNAME2= <>
##$TPNAME3= <>
##$TPNAME4= <>
##$TPNAME5= <>
##$TPNAME6= <>
##$TPNAME7= <>
##$TPOAL= (0..7)
0.5 0.5 0.5 0.5 0.5 0.5 0.5 0.5 
##$TPOFFS= (0..7)
0 0 0 0 0 0 0 0 
##$TUNHIN= 0
##$TUNHOUT= 0
##$TUNXOUT= 0
##$USERA1= <user>
##$USERA2= <user>
##$USERA3= <user>
##$USERA4= <user>
##$USERA5= <user>
##$V9= 5
##$VALIST= <valist>
##$VCLIST= <CCCCCCCCCCCCCCC>
##$VD= 0
##$VDLIST= <DDDDDDDDDDDDDDD>
##$VPLIST= <PPPPPPPPPPPPPPP>
##$VTLIST= <TTTTTTTTTTTTTTT>
##$WBST= 1024
##$WBSW= 4
##$XGAIN= (0..3)
0 0 0 0 
##$XL= 0
##$YL= 0
##$YMAX_a= 225512
##$YMIN_a= -144010
##$ZGOPTNS= <>
##$ZL1= 120
##$ZL2= 120
##$ZL3= 120
##$ZL4= 120
##$ABSF1= 10
##$ABSF2= 0
##$ABSG= 5
##$ABSL= 3
##$ALPHA= 0
##$AQORDER= 0
##$ASSFAC= 0
##$ASSFACI= 0
##$ASSFACX= 0
##$ASSWID= 0
##$AUNMP= <proc_1d>
##$AZFE= 0.1
##$AZFW= 0.1
##$BCFW= 1
##$BC_mod= 2
##$BYTORDP= 1
##$COROFFS= 0
##$CY= 11.3945322036743
##$DATMOD= 1
##$DC= 2
##$DFILT= <>
##$DTYPP= 0
##$F1P= 18.9103706918063
##$F2P= -1.10871071338519
##$FCOR= 0.5
##$FTSIZE= 0
##$FT_mod= 4
##$GAMMA= 1
##$GB= 0.15
##$INTBC= 1
##$INTSCL= 1
##$ISEN= 128
##$LB= 0.24
##$LEV0= 0
##$LPBIN= 0
##$MAXI= 10000
##$MC2= 0
##$MEAN= 0
##$ME_mod= 0
##$MI= 1.114404
##$NCOEF= 0
##$NC_proc= 0
##$NLEV= 6
##$NOISF1= 3.799351
##$NOISF2= 2.8
##$NSP= 1
##$NTH_PI= 0
##$NZP= 0
##$OFFSET= 15.70392
##$PC= 1
##$PHC0= -9018.133
##$PHC1= 8.800961
##$PH_mod= 1
##$PKNL= yes
##$PPARMOD= 0
##$PSCAL= 0
##$PSIGN= 0
##$REVERSE= no
##$SF= 200.130013532006
##$SI= 16384
##$SIGF1= 3
##$SIGF2= 2
##$SINO= 400
##$SIOLD= 16384
##$SREGLST= <1H.CDCl3>
##$SSB= 0
##$STSI= 0
##$STSR= 0
##$SW_p= 3612.71676300578
##$SYMM= 0
##$S_DEV= 0
##$TDeff= 0
##$TDoff= 0
##$TI= <>
##$TILT= no
##$TM1= 0
##$TM2= 0
##$TOPLEV= 0
##$USERP1= <user>
##$USERP2= <user>
##$USERP3= <user>
##$USERP4= <user>
##$USERP5= <user>
##$WDW= 1
##$XDIM= 8192
##$YMAX_p= 0
##$YMIN_p= 0
$$ End of Bruker specific parameters
$$ ---------------------------------
##NTUPLES= NMR FID
##VAR_NAME=  TIME,          FID/REAL,        FID/IMAG
##SYMBOL=    X,             R,               I
##VAR_TYPE=  INDEPENDENT,   DEPENDENT,       DEPENDENT
##VAR_FORM=  AFFN,          ASDF,            ASDF
##VAR_DIM=   8192,          8192,            8192
##UNITS=     SECONDS,       ARBITRARY UNITS, ARBITRARY UNITS
##FACTOR=    0.0002004,     1,               1
##FIRST=     0,             0,               0
##LAST=      1.6414764,     0,               0
##MIN=       0,             -144010,         0
##MAX=       1.6414764,     225512,          0
$$ Real data points
##PAGE= N=1
##DATA TABLE= (X++(R..R)), XYDATA
0@%%%%%%qJ6j6J6k4L2m0M8n6P2q8J04j21J45j72J97k29K68l09L53m02M58n21N88
30C11o62P48q41R40j050J171j302J449j610J784j977K188k422K681k970L295l659
47a926M071m542N085n721O479p400Q546j0019J1994j4795J9110k6708M4006j53104
61a24924j9086K57304q0537j32886K232J23056n75m4175j830L4986j5531M169
73B203K2516m594m0720J8197M4071q011m9366P703L6243n965l4013R619K1311
86A9194j2765k1160J5571J3113j6788j1695J9937Q276k1393j1524J9729J3385
98A3880j1540r957P106L524o853j188Q430L447n630n974r43K292L970K629k775
113D18m969l59L907J667l730k885M723Q043j888j2433k655J5326J0051j3449j3297
$$ y = [0, 0, 0, 0, 0, 0, 0, -8, 8, -8, 8, -16, 16, -24, 24, -32, 40, -48, 56, -65, 80, -92, 105, -124, 144, -165, 188, -214, 244, -277, 311, -351, 397, -444, 496, -554, 617, -685, 764, -846, 938, -1039, 1149, -1273, 1408, -1562, 1733, -1926, 2145, -2397, 2688, -3033, 3446, -3954, 4592, -5427, 6567, -8228, 10882, -15826, 28180, -124924, -144010, 113294, 32757, -100129, -97897, 25159, 24584, -19591, -21421, 13565, -1966, 2203, 24719, 20125, -20595, -2398, 41673, 33662, -15704, -8001, 28242, 22277, -11736, -2117, 19194, 6429, -14731, 840, 13953, -2835, -14530, 5407, 13683, -7710, -19234, 495, 13880, 2340, -7617, -511, 3013, -3840, -5028, 3402, 6849, 1219, -4755, -5698, -3406, 564, 3193, 418, -4551, -4910, -1003, 664, -3066, -5951, -1228, 6815, 4927, -7506, -10161, 5165, 15216, 1767, -11530]
128a1530J2185J5816j0929j7165J0245J9405p452k0136L401J6394k419j1993L175
141a003O835p856p078Q983N423j1025n489J0452K524j3420k789J4583M854j2448
155g454m194J0742L343p880m02P836J054k637L633J76q908J412J8063N705k1753
170a264j4763J8265K1092j1831k5141J192K2449P607j7405j6334O148J8827N379
183A4221j7381j7344Q907K3952K253k4486j2626J9264J8855j0757j9260M459J6291
196F348j08j1790q02Q230J91n095K211M224l760m312M970N137m141n241M122N198
212E382m119n337K525N347o94l980o48J540J245J624R42l044k521L695M651l683
228B925p071K521Q147p89r332j704R290M110r159o705P518Q369n303j0213J941
$$ y = [-11530, 655, 16471, 5542, -11623, -1378, 18027, 10575, -9561, -6160, 10234, 7815, -4178, -1003, 5832, -2024, -9102, -119, 5304, -5721, -11210, -758, 1766, -11654, -14443, 140, 4994, -7454, -11648, -906, 2437, -5443, -5845, 1991, 3045, 408, 4041, 4217, -4691, -3279, 14784, 20489, -1264, -16027, 2238, 23330, 11499, -13642, -12450, 9999, 17606, 201, -16133, -9985, 8842, 14221, -3160, -20504, -11597, 12355, 14608, -9878, -22504, -3240, 15615, 4858, -14402, -9943, 6348, 6240, -5550, -6352, 1878, 2069, -3026, -815, 3409, -351, -4663, 307, 5444, 1303, -3938, 184, 5382, 1263, -4074, -1549, 3798, 3104, -876, -1524, 16, 1261, 2885, 3827, 783, -1738, 1957, 6608, 2925, -4146, -1625, 6522, 5733, -3599, -5303, 3987, 8097, -1062, -7767, -249, 8120, 2817, -7396, -5455]
243e455J0021M19r283k750P701M605m613n342K484N485J189l400l029J115N391
258D538K805m977n884K560P086L05o473k083L818J447k013m82n88l043nN735R6
275B842r404l038J0844O368j0736r070R915J2437o730j4012K752J4251K789j0671
289a463o668N349P965P04n959n363J998P935K634q517o808O842J0201l941j2862
304g953P68J3856L601j3822q319J1419J2046p254j3894K542J3306J715j1004m521
318g514P543N285l662m024J442J224j237R31K200j747l822J626M641o64n536r57
334d271N239L484k372m154j075L098M060K51n609l817M765P330k085q815j270
349e241Q113L873n874m538L156L905k573l307K001K944j833l339M99L554R33l067
$$ y = [-5455, 4566, 4985, -4298, -7048, 653, 5258, 645, -4697, -2213, 3272, 4461, 1061, -1968, -853, 4538, 7343, 2366, -3518, -958, 6128, 6433, -40, -2123, 1695, 3142, 1129, 647, 59, -2984, -2989, 2746, 2842, -6562, -9600, 1244, 7612, -3124, -12194, -2279, 10158, 3428, -10584, -7832, 6419, 9208, -1463, -8131, -2782, 5183, 5887, -72, -5435, -3437, 4498, 7132, -1385, -8193, -1351, 8850, 4909, -7953, -7185, 6671, 10272, -3550, -11869, -450, 11596, 4342, -9552, -7010, 6296, 8011, -2993, -7514, 29, 5314, 1652, -2372, -930, 294, -943, -12, 2188, 441, -3381, -1755, 2886, 2222, -3314, -4271, 968, 4452, 2080, -2074, -3149, -51, 4009, 4260, -1349, -5166, -401, 6929, 4844, -3971, -5241, 2872, 6745, 871, -3667, -511, 3394, 821, -2486, -485, 2459, 626, -2713, -2214, 1340, 2273, -794]
365g94l232J291M482J390m436m244L201O272p21o943j815P004M586n381o313L184
381b469P046o0o019j854L652K875p18j766j447j052K129M273k32o645l564O215
397C64O448m314q812O02Q985K497p810n313M942P428j494p148k206N639M988l255
413A541o962n2P039L569n689o265L490P327l60o839j362O439K832n145m073L781
429g29M883j898n535j26N148K910l475m846P61N318K287m103m472K114M675n57
445B355m492p55L239M62k188O00K370j840l667K219N271j219o442K16P054J585
461D768o784l204N989M776l718n468R35M591J841k173l188r28K671L325j134m405
477b106o49M803J688m395k258M367K216n093k506N454L547n747n002M718O272
$$ y = [-794, -4026, -2735, 1747, 3137, -1299, -5543, -2342, 3930, 3209, -3734, -5549, 1455, 6041, 660, -5653, -2469, 4577, 4517, -1502, -3356, 296, 3171, 2453, 687, -760, -1812, 317, 4590, 4358, -2287, -5851, 364, 6812, 2498, -6314, -5712, 3273, 5770, -2040, -7353, -2411, 5017, 3523, -3625, -5831, -192, 4796, 1541, -5421, -5473, 1566, 5135, -554, -6819, -3329, 3998, 3638, -3201, -4563, 1876, 4708, -437, -4510, -729, 4154, 2256, -3279, -3405, 1743, 4653, 1178, -3668, -2907, 2411, 4698, 595, -3877, -1763, 2912, 2355, -2137, -2892, 347, 809, -1379, -779, 1591, -249, -3916, -1697, 3574, 2355, -4087, -3871, 3183, 4768, -2016, -5220, 769, 5545, 1827, -3641, -2706, 1885, 3726, 1553, -1635, -2563, 108, 3433, 2299, -2106, -2755, 2048, 3736, -659, -2917, 1450, 3666, -1427, -3933, 1521, 5068, -679, -5681, -963, 5309]
492E309l416o532J346N812L77m363j294K061R12k10K95r79j950J206L545k98m583
509b762j116M580K811k698l516L36L013J993l06l072k527K513N545r9p756k982
525f043P342O030n938q104L217Q267j042p884o18O683J697n250k502L597K356
540A808j950j329Q17J32n46J203J251j822j447K262K288k506k353K953K710k824
556F47l464L513L849l560m683L188N421k863n794J814N645j273n680N28M952j52
572B088m745l00L989R18k719j277J569J700k16r86j104M83K136L00k908j007L479
589A400K197m030l258M245M867l833o265K088O969k11o538j517N124K107l784
604d39k311L045K334k046k370J089K294J35k097j180P20K066O98k230k115R75
$$ y = [5309, 1893, -4639, -3293, 2519, 2896, -1467, -2761, -700, 212, 2, 297, -682, -2632, -1426, 2119, 1821, -2762, -3878, 702, 3513, 815, -2701, -2365, 648, 2641, 2335, -737, -3264, -751, 4794, 4695, -3061, -6043, 1299, 7329, 1391, -6713, -3496, 4771, 3729, -4155, -4773, 1910, 3607, -1643, -4145, -548, 1808, -142, -1471, -654, -522, -1068, 135, 1386, -436, -1883, 379, 2667, 161, -2192, 761, 3471, 647, -2817, 696, 4545, 985, -3698, -510, 4911, 2048, -3746, -1932, 3713, 2440, -3240, -2712, 2240, 2088, -2657, -2957, 1032, 1950, -769, -2046, -477, 1223, 1007, 21, -1083, -600, 1536, 1836, -1072, -2079, 1400, 3597, -433, -3691, 554, 5421, 1588, -4677, -2589, 4380, 4169, -2369, -3886, 1238, 3345, -439, -2750, 295, 2629, 583, -1787, -698, 1596, 1731, -366, -1546, -826, 1240, 1938, -292, -2407, -1432]
620a432L211K80l318j666K626K579j617l163J78K258J128q79j010p90o1K018K004
637B346j966l395J039M967Q39n647l014N211N279l152o497M02N793J849l716l128
653b790J184K875O05j728j974M06K523O71k788j816L151K459k951l449K783M107
669C268j829m211J293M040p99l536J221L194j196l358R70L580n10l433p06K476
685D64J261q33j754j218J074K797L14m129j749M432L445l956m974L369N707k134
701B116n618J072N581n1m983p4M219Q74l579j052K821J364j968j826J046J757
717A699K04j507k159K57L123J658l589l688K433M797q08n268m26M517J263m074
733a568j632L320K091k399k426J311K013m93j315L03N20k60O8L41l05o18O44J009
$$ y = [-1432, 1779, 2059, -1259, -2925, -299, 2280, 663, -2500, -2322, -64, 1064, 185, -825, -1615, -1676, 342, 2346, 380, -3015, -1976, 2991, 3830, -1817, -4831, 380, 5659, 2507, -3990, -3588, 2205, 4054, 338, -2790, -1606, 1269, 1874, 146, -1828, -1422, 1101, 1772, -1016, -2832, 319, 2778, -173, -3622, -839, 3268, 1439, -2772, -1479, 2561, 1762, -1774, -553, 2641, 1445, -1913, -943, 2637, 2127, -1306, -2012, 464, 1725, 892, -862, -2080, -1006, 1791, 2105, -2024, -3773, 659, 4104, 148, -4826, -1457, 4250, 2116, -3502, -2430, 3151, 3100, -1883, -1957, 2262, 3136, -443, -1495, 1326, 2690, 722, -1104, -58, 1699, 1903, 396, -1763, -1506, 1617, 3275, -314, -4002, -1569, 3228, 2420, -2848, -3274, 1243, 2506, -1568, -3200, 120, 2211, -188, -2614, -1303, 710, 217, -1098, -795, -275, -535, -467, -126, -431, -1049, -405, 604]
751F04k95j283q5J281O49r21n55Q28N72k71o26N12P03j60j20k61o04N5J457M30
771A910k650j529K345K794k501l820J642L965n14m139m79L337Q72k287j225J365
787i14O78n01m4M72l13l0M18L1k7O99k34q71P23J865l49l096q4M045J809m012
807B65l207K889M215q86m235j319L168K298j766l226j00L310J548l122k715J826
823a057L352j135l364O64L023n70k914K64K696K2k735r3K362K21k067o43J763
840b11J196p19j276o67R37K042O53k344j820K172L051j218l584N26L514O56l002
857i4j114J851J204r87n87L23j63q35M30J047o35j474k32J279N02j222j311P06
875a312J449K39j736q90R88J587p4j139n15N11K82N25L86l34r16K78J029K9k21
$$ y = [604, 309, -974, -1059, 222, 871, -50, -605, 223, 795, 524, -102, 410, 1113, 953, 833, 572, -32, 23, 1480, 1910, -740, -2269, 76, 2870, 369, -3451, -1809, 2156, 1642, -2497, -2976, 361, 1233, -1054, -2279, -914, -236, -737, -781, -309, -622, -652, -234, -203, -230, 469, 235, -636, 87, 1952, 1603, -1493, -1577, 2468, 4277, 265, -2942, -53, 4162, 3276, -959, -2278, 890, 3188, 1422, -1804, -1904, 1406, 2954, -168, -2883, -1057, 2295, 1160, -2204, -1540, 1483, 913, -2001, -1737, 959, 981, -1754, -1847, 515, 736, -1331, -1974, -211, 985, 266, -1010, -1677, -740, 1302, 1955, -389, -2209, -37, 3014, 1796, -1788, -1262, 2252, 2908, -94, -1208, 643, 1847, 860, 273, 596, 433, -402, 28, 1075, 440, -1034, -1266, 13, 515, -707, -2018, -1312, 137, 376, -1360, -2250, -1262, 325, 251, -888, -1403, -892, -610, -85, 301, -33, -949, -671, 358, 387, 166]
894A66K76j68o78P49J483o41k251M91K992n4l481n53L368P78l082r06K604M48
912A541k793m33K830M00k758r02J889Q49r52o30J41N9N54Q06j249j706J741L003
930B390j430m216R46N041J85m965j183M637K042l405k279K444J831j347j134J089
946F46N87j022L4P67j18p19J77L31p07k7P55l37j288M09J436p99k001M60K529
965A113j53k993q95L008J710k103k243O26K530Q26j616j761M60K346J101j522
981D34k116N81K189N03j294r41O54N30K1j11N1k52j64J76M03o7o94j82O99K78
1001F98q22j011Q26J507o07k123j77J908N79j339p58Q14M49p55j43J097k48r83
1019a088J99J365j19j123qR20M71n49j14J70k5M67N32p71q11J148J305j369j973
$$ y = [166, 442, 274, -404, 345, 1828, 1187, -1064, -573, 2419, 2365, -1116, -1669, 1699, 2477, -605, -1511, 1093, 1541, -1252, -1685, 1145, 1545, -1213, -2115, -226, 623, -329, -959, -818, -759, -205, 601, -648, -2354, -613, 2390, 960, -3256, -2310, 2731, 2916, -2049, -3232, 1405, 3447, 42, -2237, 207, 2038, 691, -443, 646, 1233, 211, 245, 1012, 894, 175, 352, 683, -24, -51, 704, 367, -921, -512, 924, 125, -1876, -1416, 1113, 960, -2033, -2928, 80, 1790, -313, -2556, -1930, 600, 1426, -190, -1951, -1491, 855, 1956, 434, -1682, -1101, 1088, 1591, 297, -644, 10, 540, 561, 450, 501, 249, 85, 261, 664, 597, -97, -279, 420, 698, -124, -1135, -309, 1198, 591, -1532, -1709, 199, 778, -561, -1319, -505, -56, -811, -954, 143, -105, -1088, -889, 476, 357, -766, -774, 146, 617, 68, -46, 124, 99, 566, 1098, 327, -484, 664, 1969, 600, -1373]
1038a373J390K484j377k902O07L383k43l339m60K914N41k324r68J855P41j219
1054b90q05N14N80K48j24q49o32J056J560q64k109N78K600j53k478k27K716M57
1072A778k289p92K295P58j951o56J591P91j649j029J546J259r53j749J13J500
1088E63N75q10j109j64J137P89n22j444l24J560Q37j321j363P82J721k15j756
1105a064l92J440Q90q40r47L30P70j50j27M46j61q08J99J266L21j301q85J014
1123AJ360k82j570k74R03O90q3q82o51M24Q22M83j144r28O01J094l5j052l30L05
1143e48P08K40L1q93n59J052J105l89j864l01K210J084j666j863Q93K110O1j699
1161b88p28R83J171l66r46l41P69L56r3n51k98M78r1j81j80L64q1m92K22P39M2
$$ y = [-1373, 17, 2501, 1124, -1778, -1171, 2212, 1969, -1370, -1830, 1084, 1625, -699, -1667, 188, 929, -290, -1095, -581, -1, 247, 123, -726, -1358, -302, 1258, 394, -1715, -1137, 1463, 1310, -1168, -1395, 1321, 1778, -511, -1303, 992, 1750, -201, -857, 734, 1525, -124, -1153, 393, 1652, 699, -1050, -937, 563, 1138, 328, -781, -945, 192, 981, 459, -985, -1309, 251, 1088, -233, -1596, -814, 907, 692, -1064, -1456, -16, 874, 34, -913, -583, 187, 37, -90, 356, 195, -613, -414, 852, 1173, -128, -1013, 1, 1361, 1079, -491, -765, 138, 828, 745, -137, -788, -364, 458, 941, -203, -1131, -530, 564, 529, -523, -853, -548, 160, 400, 431, -462, -1021, 31, 1136, 747, -1117, -1418, 792, 1876, 210, -1653, -760, 1350, 1411, -288, -1016, -33, 1138, 772, -174, -515, 254, 610, 517, -34, -332, 146, 55, -126, -306, 58, -23, -515, -293, 446, 488]
1182D88j051o70J123J441r36j571K31J666L62j523n92J344R55p65j302K95J244
1199G39L04q53j036O06J107J6j173n75Q39P92n91r38N53P30m28q47K90R22j79
1218B78q28j63Q31K46m45k53l25K61N15J68o32l61M18N39k89m38L71J27k50j01
1238c31Q66O2r51j05J140N52j146r30Q07J240l59j186j96P21N48J3q02p01N05
1257b53Q08J30q15o94K23Q93K43n56r15jP41J100p31j508L2J642R96j313j443
1276a421O72J654K77j114r26M88J365K72j187p92N20J425k03j267o6Q99L24q74
1294D6k32Q65j11j099P1J186Q5j664l94J519R32j217j679O74J763J31j402j079
1312a605N86J682M07j474j339J100K149n12k321l39K115J388j550j777Q65J795
$$ y = [488, -563, -1233, -110, 1331, 395, -1176, -945, 721, 1083, -440, -1032, 312, 1267, 502, -800, -505, 739, 1043, 190, -846, -240, 867, 883, -290, -865, -26, 766, 175, -763, -210, 520, 92, -755, -465, 457, 278, -550, -713, 118, 364, -81, -334, -659, -398, 117, 285, -347, -708, -290, 249, -40, -478, -107, 20, -230, -331, 535, 597, -354, -459, 681, 1233, 87, -843, -36, 1204, 845, -341, -537, 184, 732, 745, -57, -758, -253, 555, 685, -130, -824, -601, 292, 535, -21, -936, -937, -196, 904, 173, -1335, -1303, 339, 1335, 22, -1421, -749, 905, 1182, 68, -858, -370, 995, 1267, 80, -712, -192, 1233, 1030, -237, -303, 596, 920, 46, -186, 679, 568, -531, -460, 726, 811, -853, -1247, 272, 1204, -13, -1692, -1018, 745, 876, -526, -1605, -1019, 663, 1070, -404, -1743, -643, 1506, 994, -1327, -1666, 449, 1837, 287, -1490, -625, 1170]
1328A170l16j353k6J132J47q61j54Q26O0o39k72O20K52n04m52J94N49p9n91k54
1348e51K21L35K7m29j87J98M37Nq48j39R34M77j078o75R98J036o48j086N25J102
1368F54k02j012L87Q49j3n47j46M06n5L9L13j95q48K37J088j9j354j63J258K87
1388I64j247o56Q80O10m30m05%j76R3N30K96j033p23J353Q69j138j296J255J412
1407A158p61j415L84J182j2r29K52O16k59n37L47O88l73p57L75N66Ro43l06L70
1427d5O15L02n84r74l59J433J120j176k030Q96K056j27k139p82K018J278j535
1444c3j482R71J175m08p83J75M27k21k13N23n3n33M77N15m85q15O24R59n48o97
1464d25N88M19j016l40J389N23j356r20J358R38j301q97R40R37q26o03L58M24
$$ y = [1170, 854, -499, -525, 607, 754, -107, -261, 565, 625, -14, -286, 334, 586, 82, -370, -176, 373, 294, -297, -551, -330, 5, 32, -397, -584, -386, 51, 56, -792, -931, 3, 480, -598, -1273, -275, 761, 113, -973, -448, 654, 452, -560, -173, 676, 663, 116, -30, 376, 321, 360, 673, 478, -370, -133, 955, 936, -418, -581, 677, 964, -283, -939, -59, 551, 121, -284, -284, -460, -367, 163, 459, -574, -1297, 56, 925, -213, -1509, -254, 1158, 397, -1018, -634, 548, 536, -393, -141, 475, 216, -321, 26, 714, 341, -416, -41, 525, 534, -109, -415, -45, 570, 872, 288, -686, -1045, 388, 1508, 332, -1698, -802, 1254, 1127, -1012, -1794, 224, 1502, -33, -1515, -544, 631, 223, -560, -385, 42, -179, -392, 131, 78, -455, 22, 537, 52, -763, -139, 820, 272, -425, 163, 582, -434, -774, 615, 1138, -218, -1138, 220, 1158, -143, -1040, -100, 837, 11, -592, -234, 190]
1482A90k47J53J01m98k83O90O45o74j031O68J136n16r61K52R43k19o35J62L70
1501B46k67r3L69J59n82l01M12N82m17o23M95O36p10m38N46M87m86o86O07O50
1521E86n83q20M30R74l38p46J11O07k72l90O13M31p53m50O34N45o43k43P08P2
1541D73p72O5R57l00j296O27J529n07j986J9K099N33k050q24J666R37j157q95
1559h82O35M99r0k93J46n26j2J017K72j360p49J368J272j226j271Q35J253p57
1577A31r51Q52Q99r44q98J143P83j027q97J117R64r73j108Q40Q72l82o93J13L13
1596A54k88K16K56m71n78O29R23o37j290K89J336L9j219n5O52K80m43p0M10k03
1616g0m02N16M86o12l09M44O32m94o10L49O27k45m07K77M05n58j84N57J71o38
$$ y = [190, -57, 96, 197, -301, -584, 106, 751, 77, -954, -286, 850, 334, -627, -375, 568, 349, -286, -124, 246, -21, -114, 255, 414, -168, -469, -57, 525, 108, -515, -20, 616, -94, -532, 14, 501, 15, -671, -64, 586, 3, -817, -387, 587, 249, -497, -386, 221, -51, -441, 172, 603, -150, -600, 34, 579, -64, -307, 401, 473, -299, -234, 723, 423, -873, -246, 1283, 776, -1210, -1191, 908, 1441, -609, -1433, 233, 1170, 13, -882, -247, 252, 162, -131, 15, -511, -523, 494, 766, -594, -1343, 25, 1297, 71, -1200, -365, 888, 131, -820, 32, 931, -13, -911, 232, 1015, -12, -909, 208, 1172, 199, -909, -69, 803, 421, -272, -159, 154, -134, 82, 338, -133, -711, -82, 841, 204, -1086, -797, 539, 578, -641, -696, -44, 236, -207, -277, 133, -70, -472, 44, 530, -82, -391, 53, 685, 191, -419, -70, 557, 312, -95, 182, 587, 29, -155, 402, 573, -65]
1636f5l31O82K79m46m75K76L41j70k20r6K8j03K26L94n87m54M31P20k39j028O1
1657g76J125J42r27l41O28P63n17o77L34O93o7l37p1J61K43m1j21j87L74J29j60
1678C70o63J80O40J16q94l63P51N59q16n26L11P08k66o25J05M33p2l66J17O6m9
1699b84rlJ86J1r6l0J3J87ro4j97K80L62o8m14j47N49L47l03k78k08N35L10n27
1723A43k34K3M22k1l89R2J26o0j08J40m9l59N7L28j07o47J66O30J00p53j31N71
1745f0K49l67k50K47j3N5J86J09m30o4M75K39k54k48L77jn2n7K02j40j80K41N59
1768H23l69q54RQ96M87j052p28N74Q33j24p03l68L28M81N0m88n16K43P54No72
1789c91k99M62N81l36n78J75N33j53l81K38M35k94k07Q4O04j9o92p8P24K21l27
$$ y = [-65, -396, 286, 565, 119, -356, -80, 261, 91, -129, -225, -197, -300, -74, 320, -267, -721, -290, 430, 191, -837, -776, 349, 491, -436, -777, -149, 614, 97, -580, -246, 447, 380, 43, -28, 133, 376, 335, 214, 27, 401, 530, 370, -293, -113, 527, 643, -251, -614, 137, 696, -120, -646, -335, 373, 107, -518, -413, 20, -52, -418, -301, -235, -284, -293, -296, -110, -99, -195, -225, -212, -25, -34, -98, -295, -15, 347, 279, -135, -282, 267, 614, 311, 33, -175, 360, 670, 143, -91, -68, 354, 333, -56, 36, 162, 102, -6, 134, 85, -274, -217, 111, 4, -643, -477, 153, 253, -500, -631, -60, 189, -178, -428, -181, -194, -139, 47, 156, -274, -338, 137, 376, 122, -126, 251, 250, 198, 141, 343, 203, 23, 264, 823, 454, -400, -391, 505, 992, -60, -788, -214, 619, 495, -208, -576, -248, 233, 283, -205, -721, -478, 276, 281, -391, -690, -228, 353, 17, -561, -386, 147, -6, -387, -149, 286, -8, -215, -131, 473, 454, -238, -316, 408, 629, 302]
1810C02m20J77M33j89k18j8M9m2J5J53k62j23K16k4l05J45J79j15l13k7L48K21
1832A82m68l24L89L98m27k97J69O19j76l69NL56P1j12J7q9J95L6J39j85n6l3M44
1855D84M0l68j84O9K26J22m20L9M0q1J48N9k98j42K02J02k02l02J26M06n3k77
1877b64j09J68K80l24J29K63k73k50L09M10j70o12O9P86K33o15m91L23O48J38
1897F48n73m03J60O10J71n23o71J83Q72O2p76j78M06M28l22m20J22K28K6j42j92
1918b84J63m0m4J74J28k36k12J53K36J99l79k30J80M47J75m94l72K84N87J69o62
1939e8l63M96N50k59p00Q7O13J72m56l91M06K35k03l42M5K13k6k28O0J24m2k4
1961i1J7Rk5J64Rl12j45N52J10k39m74M45L70j74m47M7M36L7l88K31N3n2o8J41
$$ y = [302, -118, 59, 492, 303, 85, 67, 116, 74, 89, 242, -20, -143, 73, 49, -256, -111, 68, -47, -360, -387, -39, 182, -286, -610, -221, 177, -250, -547, -378, 241, 65, -304, -299, 57, 128, 16, 33, -56, 139, 175, 314, 129, 73, 40, 484, 524, 156, -28, 41, 267, 389, -31, 8, 48, -33, 115, 174, -124, -266, -64, 38, -164, -466, -340, 66, 13, -264, -373, -205, 75, -249, -120, 143, -130, -380, -71, 339, 169, -443, -374, 412, 645, 30, -461, -138, 510, 648, 75, -328, -168, 442, 613, 90, -581, -398, 474, 536, -240, -418, -12, 416, 94, -326, -204, 24, 50, -92, -284, -121, -161, -205, -31, 97, -139, -351, -198, 38, 237, -142, -372, -192, 255, 430, -64, -436, -152, 435, 604, -58, -421, 75, 625, 366, -334, -247, 366, 538, 82, -309, 97, 332, 129, -213, -168, 45, 19, -209, -149, -25, -67, -91, -74, -65, -90, 74, 83, -229, -374, 178, 288, 49, -425, 20, 390, 216, -231, -184, 252, 289, -99, 132, 185, 133, 65, 206]
1985B06N7l64P0M19k46n24J38O42j08o05J79L30r0n00J89N49l41n04K68M73k63
2006b5m21K84K13p3k33M88j14m55J06O31J21r24qQ05K80q69l06Q07M49o01n18
2027c63J98N65L4k94k43j62L00L97k18m44j55L99J78l48r7J09P7j54J25J93k57
2048a60m04J65O58J22o40l94N47O74n9p61m07P80L83j77p80K87O91L3o49j8L40
2069B31J29j66j01k8j54J08K87J5n59K4N28o1m84j27N28j04o18L10N53l42p46
2090g77M26Q73m83p19K87P54k02o07K93L38k61j46M54O4o37J5Q48j24n86j00R57
2111F67k19n46J1M59j26l07J52K16m37j63N96J47p91m10J052K94p17n61N80L27
2131B24l50l16M63n4l46k6M76L4k68L9j6r8K45K71j63l63M8O09K3o41k29Q96Q5
$$ y = [206, 263, -101, -31, 388, 142, -382, -244, 398, 290, -315, -136, 194, 104, -396, -207, 342, 1, -503, -235, 238, -25, -446, -162, 51, -22, -255, 233, 119, -336, -230, 401, 522, -402, -410, 395, 675, -194, -500, 307, 756, 155, -363, -165, 400, 434, 140, -103, -265, 35, 432, 214, -230, -385, 14, 192, -156, -253, -144, -67, -221, -96, 97, -160, -564, -399, 259, 381, -259, -653, -106, 568, 509, -252, -659, 121, 504, 327, -453, -166, 525, 558, -91, -109, 231, 360, 194, 93, 65, -89, 19, 306, 321, -238, -214, 314, 253, -231, -358, 170, 66, -552, -242, 311, -31, -777, -351, 522, 39, -680, -393, 361, 159, -448, -155, 183, -78, -224, 230, 294, -343, -328, 520, 396, -190, -290, 667, 448, -98, -87, 372, 246, -61, 91, 307, -130, -293, 303, 450, -341, -751, 301, 595, -122, -683, -103, 224, -126, -442, 21, -33, -379, -405, 71, 105, -163, -124, -140, -238, 7, 278, 115, -248, -200, 409, 432, -209, -438, 458, 543]
2154E43l64l87L00J65l4j05m9j16J39m2q2n7Q9J17j17j45K24l09n2J6N49o9p23
2177e09j38O36L52n30l54K90K83J26o2l06j20K17N36k58o39L04O17n5p04R3P00
2198D79j33n86K00M82p2m64M8M67k99k39K00L27l67r8J38k0k93J65M98m34m91
2219d92L01O29k72q16K39O21L2n35J1K60j22j6M29p3n44r8R03J80q18l82O95P00
2241H32o16n89K53L92J3j42j86j33J44M41l2p02k75O89L53m51n72M10L68k68l66
2262d37L53J87k28n1K46o3k32NJ76J16j10O8k02J08J6Q3J8j22K05R9l17j76K69
2285A1L53j64m37R6M53K5m01L7J09L8j82j40J39J70j48j94NJ43M31l02k65p3N76
2308B80J39o72k37M12M29k82l32J23L68J02l15j88J66J77N6k52j19L82qk50pL2
$$ y = [543, 179, -208, 92, 257, 223, 118, 69, -47, 92, 50, -32, -89, 0, 117, 0, -145, 79, -230, -282, -266, 283, 214, -509, -647, -11, 341, -189, -543, -253, 30, 156, 94, -212, -332, -115, 421, 163, -476, -172, 445, 390, -314, -221, 479, 346, -240, -40, 442, 370, -94, -46, 421, 122, -117, 83, 410, 43, -55, 83, 63, -230, -65, 433, -1, -492, -191, 438, 166, -650, -411, 210, 242, -293, -282, -22, -144, -160, 269, 196, -348, -446, 457, 637, -181, -563, 132, 832, 216, -373, -120, 272, 285, 143, -43, -176, -32, 409, 377, -325, -600, 89, 442, -9, -581, -171, 197, -71, -437, -84, 103, -125, -176, 70, 7, -225, -220, -44, 72, -38, 30, -172, -64, -48, 35, 53, -69, 136, 235, -82, -258, 11, 364, 200, -237, -141, 312, 337, -64, -27, 82, 120, -62, -202, -63, 107, -41, -235, -230, -87, 344, 42, -223, -296, 280, 419, -253, -490, -78, 351, 69, -263, -140, 228, 330, 15, -173, -7, 170, 226, -26, -145, 237, 229, -21, -28, 4]
2330DL55j82j71j6J33q3j03j4N4J19O7k73j90J66K44ml82P7O7K68j8l48j54K37
2354a47L18J65l00m22l9P48K40n73n44L67P11j82n74j73O97L76n12l45q1M54L89
2375E73k49p15L2N16M33m98o40K98M80o0m24j8L15l1k4j12M6j55J10J57l7q8j75
2398b66K60J90j31k54m4M34J41l08k98K20L25l0k25J5n2J57J08k35r9K29L7k8
2420A46k58J04J67J7n81K00L94J65l52m95L62M89j38n21q1M21J78l06j40O4J91
2441B6O4p1j08j35M04J40l27j35K24M04m44j08N5K49J30m03j49M29p9j23j43J97
2463I7p4j96J36M7m5j35J33J95k11l07J37L49L4m43q9K64L72j94m80MN38J17k90
2486d1l18J77O42j14m53l15M10N24k21n18j20N77K57l27l76R2L70Q0l02l24K76
$$ y = [4, 359, 177, 6, -10, 123, 40, -63, -77, -23, 96, 163, -110, -300, -134, 110, 106, -276, -199, -132, 136, 118, -230, -384, -147, 171, 336, 36, -386, -425, 323, 563, -10, -554, -187, 524, 342, -232, -405, 292, 668, 156, -189, -270, 184, 573, 324, -391, -359, 157, 590, 92, -548, -250, 230, 170, -254, -272, 43, 12, -12, -124, -78, -233, -123, 34, -3, -91, -266, -6, 184, 53, -201, -245, 189, 330, 22, -276, -56, 269, 239, 14, 29, -23, 134, 242, 7, -92, 137, 174, 146, -112, -8, 159, 176, -405, -205, 189, 354, 2, -493, -131, 358, 220, -301, -382, 39, 217, -89, -229, -165, 26, 90, 19, -89, -224, 180, 320, -7, -142, 82, 486, 42, -66, -11, 238, 368, -35, -184, 245, 166, 43, -100, 97, 23, -173, -37, 10, -35, -170, -37, 158, -53, -360, -223, 126, 160, -283, -372, -108, 264, 70, -410, -406, 132, 249, -41, -359, -182, 460, 346, -107, -422, -12, 512, 291, -227, -347, 230, 487, 160, -216, -124, 246, 326, 24, -300, -24]
2507b4K04k8p3j71j73K92J95n0l78P4Q7K62j15k17o0J04R8J6j85n8K63L2k6k74
2531b05K2M13K6l85l35O13L77l41m16N9M54J06n08p0K72J61rl03K0K96L6l18k86
2554c21J35N21q0m23j92M05J70p9n82J70N11j16l54j09L16K00j79l83J96K02J23
2575A31j31k25R0J68J12J31m27r9J63N12j15l76j20J71J99L6l6l33P4L10j26k50
2597a41n3K11J08n0l38LM28K5l81j54L20K89k23m62J77M03n0j54k47J11L55J1
2619A88l27q8K78K35k02j35o7J72J94j65k25nL40J03j37k75M9J88Q8n4j71k51
2641b67K56J41Q7m23n8J81L60l07l61Q0L92J72l86l33L56K59n9k94j89M22L63
2662C92j08m60J7L50n7j26j23J93J16j00j84k0N56j46l93l15N79K19k45m42J29
$$ y = [-24, 180, 152, 79, -92, -265, 27, 222, 172, -206, -132, -45, 217, 102, -115, -175, -71, 27, 43, -142, -200, 63, 95, 69, -205, -183, 230, 256, -129, -464, 149, 526, 185, -231, -172, 282, 388, -120, -190, 82, 243, 234, -69, -49, 247, 283, -35, -321, -186, 335, 255, -168, -360, 45, 215, 136, -446, -276, 235, 119, -235, -344, -28, 172, -7, -390, -194, 8, 131, 0, -225, -135, 33, 145, 276, -151, -250, -87, 425, 310, -66, -186, -15, 184, 220, 184, -149, -75, 235, 109, -141, -194, 17, 125, 75, -263, -260, 168, 193, -188, -342, -22, 267, 44, -418, -241, 162, 112, -42, -289, -178, 177, 188, -139, -227, 51, 286, 84, -51, -118, 54, 248, 83, -142, -147, 193, 296, 159, -116, -67, 121, 209, 155, -16, -267, -11, 130, 217, -206, -264, -83, 277, -30, -391, -311, 81, 253, -133, -466, -110, 149, 90, -204, -393, 29, 392, 284, -176, -159, 191, 134, 8, -115, 78, 194, 94, -90, -110, 446, 300, -93, -408, 171, 390, 145, -297, -168]
2683a68L68M3l35j52R3L65j37o6l57J08M70q0j74m40K59L42l2l12j08L39J12k2
2705A16k90l8K06K14L4j93l54J54N01N3m02l20M14L68o3o75N1L62J97m32r6J79
2727a4J69j17j49k29K68L55l39k49P6L06J41l37k51K29K54m0j30k6j8J33l6j33
2749a37J44P5K03k82j7L7K3K6Q5j50k9R8J57Lk51k54K98K46l15k28Q9K02J61j66
2773A8k20K1J71K12l19k94K77K73P3m10j51M28L43k69n35R8N83L4m56k78N14P7
2795A90j60j12l4L18n2j20j79J31J43J21l07r6K73K39j73l62j09L18J32Lk25j35
2817a96Q5K08j3j37k1Q5K5J1j45q7J63J71j89p7j2K60J79k78l46K14M80m9l36
2840el17K59L04r1k34j03J97J68P1l86M0K7L07k55l52L07L02j92j73j49L41J27
$$ y = [-168, 200, 243, -92, -244, -151, 214, 77, 11, -346, -238, 232, 152, -22, -462, -203, 139, 107, -205, -313, 26, 138, 116, -174, -212, -6, 208, 242, 49, -305, -151, 350, 403, 1, -319, 95, 463, 400, -275, -224, 138, 335, -97, -193, -14, 155, 38, -111, -340, -72, 283, -56, -305, -229, 77, 218, -119, -370, -141, 113, 73, -57, -83, -101, 32, -4, -137, 7, 82, 285, 3, -14, 23, 46, 72, 157, 7, -22, 76, 233, 236, -15, -269, 29, 275, -40, -268, -179, 23, 184, 18, -202, -181, -10, 202, -117, -411, -134, 139, 212, -198, -349, 79, 422, 153, -382, -284, 299, 333, -123, -401, 113, 190, 30, -82, -116, 202, 150, 30, -149, -18, 125, 246, -61, -157, 116, 355, 182, -180, -289, 29, 161, 164, -61, -196, -111, 97, 84, -53, -74, 11, 36, 47, -98, -185, -22, 149, -40, -117, -129, 131, 310, 32, -314, -100, 380, 331, -5, -322, -63, 241, 150, -84, -187, 10, 178, 249, -137, -97, -70, 237, -18, -370, -63, 239, 47, -126, -275, 66, 193]
2862A93k73j69K34lk16K01L6Q1l88K42J34Rn2J4J07j05p1RK18j26p6L5o0O7J08
2887A49j23l4l1K54m3k53k74L73L53m06l09P2M29O0l86n6J84K67j71l17l7M20
2909A21P8k25m06L17K97r5j83k70L06M18k07l76qK59P2L8j97r2K65K57k47j70
2931d8K51N2j03j00M7j02p6P2R8n9r8n3K26L9m90J91K08Qj81m5J31J20j86N1J19
2956G2j15l2nj64j8L95J30l26l98L58N30n9o94j3N47L12n14j76J27J31O5q0qp4
2980im7K04oj16m8J44nk57o3K61J15q2k23J10P1j4j93K27j18r0J03K76k25j56
3004a41k0L29j1k68O8J98j11j23l2j9K38o6j30O5JK37j09j86k2J17J34j21k61
3027b33K34K32j61k77J4L16J33l76j94J13L54R2l42k16J70K87r8k94l3K81qJ40
$$ y = [193, -80, -249, -15, -18, -234, -33, 3, 84, -304, -62, 72, 81, 29, 43, 150, 45, -26, -17, 201, 75, -1, 34, -26, 41, 149, 26, -8, -39, 215, 172, -81, -355, 18, 371, -35, -344, -272, 157, 217, -169, -225, -41, 226, 55, -262, -299, 121, 199, -26, -432, -115, 182, 87, -96, -366, -60, 358, 151, -225, -233, 26, 98, 136, -61, -153, 112, 369, 122, -48, 203, 255, 152, 52, 99, -3, -79, -7, 91, 32, -66, -119, 107, 146, -344, -153, 55, 63, -118, -163, -32, 88, -98, -47, 72, -43, -75, -80, -244, -262, 133, 263, -63, -461, -103, 427, 368, -326, -339, 208, 520, 6, -170, -43, 88, 153, 73, 65, -9, -56, 148, 142, 26, -22, 122, 117, -140, -203, 58, 173, 91, -132, -22, 49, 35, -158, 69, -49, -139, -36, 240, 15, -141, -161, 168, 157, -111, -43, 155, 44, -79, -111, -130, 108, 42, -88, -23, -22, 215, 106, -80, -102, 15, 149, 28, -233, 1, 233, 72, -205, -191, 125, 258, -118, -312, -199, 155, 247, -95, -311, -141, 146, 48, -246, -279, 2, -6, 134]
3049A34o2j14m6m4K44J8j78kO6Q7n2j00Q0J68k08Qj6j10Q4J3J26j67r7K36J45
3074B13m30J1L28J6l70k8L13J15k82j80K01K84j51n5k30K16J30p9j39k1K9L01
3096A92P6k90j56M08qk19j89K56O8q7j59K03m9j05K4R5J67k87J08K5L3j21j07
3119a22J30M2p3K4q5O0Q2R5k69j02J69N0m2j15J39J4j8L8j62J25J21j15k3K14
3143A77P8j92k12J54J40J03k73j92K95J17k03j28L4J74M6j62j44O1J07J66j06
3164D0l06J89J34O2j90k04P2K70Mj84N3np5J05J90q0m3j37R7J26j55q4J84R5j93
3189c5j38J42K12m2j14j69J38R0M3r1j80J21R3n2j0j66J13J6n6r9n6K91k50j6
3213b15K59J43k93p6J67R5Jo9j10J26j15oK41j17k0P8j09l2J78k0r6j9N4J34j31
$$ y = [134, 72, -42, -88, -132, 112, 130, -48, -50, 16, 103, 51, -49, 31, 199, -9, -1, -17, -127, -43, -30, 96, -71, -168, 68, 213, -217, -206, 122, 138, -232, -260, 53, 168, -114, -294, -93, 191, 40, -15, -245, -29, 101, 22, -117, -138, -109, 192, 268, -22, -178, 230, 222, 3, -186, 70, 138, 51, -108, 95, 46, -59, -35, 60, 227, -60, 48, 73, 106, -15, -122, 8, 50, -23, 1, -84, -24, 58, 153, -116, -218, -49, 1, -41, -156, -17, -3, -21, 17, -145, -20, 101, -14, -37, 177, 255, 63, -149, 5, 145, 248, -25, -217, 78, 195, -8, -136, -102, 72, 118, -44, -188, -127, -20, 146, 40, -266, -77, 57, 119, -71, -275, -203, 67, 71, -113, -60, -65, -140, -35, 155, 75, 32, -105, -8, 118, -37, -121, 63, 158, -35, -173, -31, 181, 139, 25, -144, -6, 84, 127, 36, -144, -23, 70, 18, 8, -158, -45, -29, -85, -184, -240, 51, -199, -215, 44, 187, -106, -182, -15, 80, 81, 12, -98, 28, -87, -93, 148, 31, 11, 89, -20, -52, 126, 106, 10, -9, 45, 179, 48]
3238D8j8J4R0j6q8j43J91j22r9l0J02K64j75j51m1J50O6p4j02Q3l5o3%J95k4n0
3264b8j89J58N8J34r6j59J50J1P6m0j55J27J37j13k13J53L7P2l2k12J73N9j32
3287b4M4r8J29n8l8j37K7K11j02M3kj05J0J68pL2j85q0J05J67J2k27l5K67j38
3312b1J27k70J28Q7P5j70p7Q8K24j05j98j1J83K3j4j93J41r8J6J10o2L8o9j06
3336a54J78P7j89K6r0J47L4M5k09M5j7K49p7k6k09R9J54Rp4k1J03j2j32J36k0
3361G2j9lj47L01k59R5o8J60r3j93J47j4l7J2pJOQ9j16j25N4J50k7J3j98R3J57
3388D4j9n7j1J74n1j65P9J13k14K4P6%m6N4k9K25p0k81J36J26J11k28rj5j5n1
3414i9J43j25J19m0j66J91Rm0Rl2j09J26L8k0j87L0K09n2K4n1J06Jk10J20j1N0
$$ y = [48, 30, 44, 134, 118, 30, -113, 78, -44, -143, -173, -71, 193, 18, -133, -174, -24, 42, -32, -134, -51, -86, -149, -149, 46, 22, -28, -217, -59, -1, 133, 37, -122, 28, 39, 115, 75, -80, 47, 184, 71, -142, 11, 48, 120, 88, -124, 49, 108, -24, 20, -78, 51, -7, -45, -182, -155, 56, -46, -3, -5, -110, -100, 68, 61, 93, -92, -172, -67, 100, 112, -115, -150, 117, -21, 106, -164, -36, 51, 126, -44, -121, -33, 191, 86, -112, -123, 60, 83, 69, -124, 17, -81, -65, 45, -17, 21, -48, -154, 24, 101, -88, -62, -152, -5, 29, 74, -135, -90, -107, 142, 65, 39, -170, -71, 83, 92, 18, -3, 100, 88, -44, 92, 72, 53, 50, -97, 204, -55, 40, -28, 132, 39, -154, -7, -21, -58, -46, -53, -52, -46, 43, -73, -198, -144, 6, -21, -8, -206, -113, 44, 25, -32, -43, 131, 80, -85, -6, 107, -107, -83, -7, -7, -53, 1, -28, 197, 127, -154, -18, 108, 219, -9, -18, -33, -48, -99, 44, -81, 38, -2, -168, 23, 32, -8, 1, -31, -140, -14, 24, 4, -183, -153, 56, 4, 28, -23, 83, 84, -126, -6, -17, 33]
3440C3O5j13j12K33j0q2P5n6Q8m4L2j29N1q3M9Lq0q3K54l0n0j2J0N4l44K71J46
3467A36j49j69Q6R7Q6j69J1P2K0j39O7M1M4N2j76N6KN0J04j69Q5nj27J64p1O8
3493F7j48j4lJ70m4Nj44L8J49Mj22j24J05J37l6j02Nkk0j1J14l3O6j23K3J59r7
3520A9J2l4j07O2K4r9j8J91Qk1j53N8K01j73lQ1N5N4j54j00P0k6K38j57j04Q2
3546FM0n8L3N1Qj52K8J61j30P3k4j64Q6o3Q2J07n7r9R1p3P5n7J56j07j98J34J10
3573E9Oj31j5N4J04j38p3K08n1oj42K30j1k46p1J64K05o3q6j47P8m3K59j98j7
3598g1J1K43j84J5j88J68j0l3j09K57k4j24K0O5J5k6l1J51j11o1L1J65l2j30q1
3623g4J9N8n7O6O8j23o4J53k5Lp2L6q0K6k9p8J67J3j43J97q5m1k2L7J45q3l1P2
$$ y = [33, 98, -15, -127, 106, 96, 14, 89, 33, 121, 77, 109, -20, 31, -52, -3, 0, -80, -163, 91, 61, 11, -1, 9, 63, -281, -10, 136, -13, -182, -96, 1, 87, -82, -71, 1, 21, -118, -51, -10, 34, 86, -90, -34, -32, 18, 122, -47, 38, 33, -94, 70, -1, 67, -81, -95, -98, 72, 28, 33, -111, -73, 76, 80, -42, -166, -61, 76, 40, -62, -57, -59, -79, -90, 24, -9, 57, -66, -43, 116, 19, 31, -3, -110, -48, -24, -123, -141, 50, 58, 37, -116, -58, 143, -30, -33, 48, 103, 157, 3, -97, -27, -53, 185, 28, -76, 6, 46, -12, 21, 72, 80, -72, -44, 117, -13, 60, 36, -128, -42, -105, -23, 84, 27, -72, 19, -54, 21, -36, 120, 13, -185, -51, 59, 65, -66, -81, -27, 77, -61, -134, 74, 23, 17, -125, 105, 94, -152, -223, -59, 146, 83, -3, -150, -72, -115, 144, -54, -71, -60, 183, -1, 14, -174, -6, -16, -49, -158, 99, 75, -49, -29, 36, 51, 25, -6, 145, 34, -27, 4, 169, 137, 7, -74, -55, 3, -54, 12, 80, -43, -107, 46, 21, 24, -48, -12, -92, -66, -95, -173, -6, 7, -136, 61, -24, -65, -87, -50, 95, 12, -19, 53]
3651E3M7j43qR4k5J67j28j07P5j9j1K5K6k8J23j27k7nJ14J22r2j29j49J45O2o5
3677a0j07O7Q7j71R0P6j08J8j03J69j9j40O5J04j29j0o6Q4J32oMo7n7R0mM0j3
3704A6L0N9j9q8N7O5j00k2J7R6M9j25j18J1J20J5j21L3R3j3j65K7L9n1O6m6M5
3731c0Pk3L7j00Q5q9J62q5n2J6N8J6q1J58l5j8l0p5N0M2o7M9R7j0j86K31k7pm0
3760E3k4j6R0j45J34k20N2m7J81j75M1R9o6N2N8p5k8J9k4J47j6o3j00O1L1J32
3786A51j76j53K16L2o9j82J35Q6kp4J25n6o1P9q0L4n4q8J06J38j51k4L6q5J31
3811A4j46Q0m9R8J06j32r3k4L12n8q0K5n7M4p3%R6j11P4M2j73Q7P6M7l8j3m0j33
3839a19J20p0J01J37j18K1r9J18Lr1J1L5l7l4p5J29j13J12n3pM3k6M0j02K4L6
$$ y = [53, 100, -43, -51, 43, 18, 185, 57, -50, 25, 6, -5, 20, 46, 18, 141, 14, -13, -18, 96, 218, 126, -3, -152, -7, 55, -10, -117, -50, 37, -134, -44, 32, -76, -58, -161, 8, -11, -151, -86, 18, -111, -121, -187, -103, 29, 23, 27, -40, -97, -7, -11, 29, 16, 46, 105, 86, -2, 55, 120, 20, -2, 15, 111, 160, 35, -83, -72, 48, 63, -58, -25, 68, 55, -110, -83, -44, -95, -29, -75, -30, -23, -46, -9, -109, -24, -113, 49, -36, -88, -72, -14, 2, -79, 79, 44, 26, -4, -79, -29, 13, -54, -5, 92, 82, -104, 127, 100, 93, 53, 29, 13, 103, -42, 92, -128, -76, -123, 58, -117, -76, 23, -43, 9, 67, -8, -36, -17, -41, 106, 90, 27, -73, -12, 19, 151, -25, -178, 38, 70, 1, -181, -46, 40, 38, -36, 89, 33, -28, 51, -29, 5, -49, -137, -31, 107, -44, -68, -32, -117, 14, -132, -52, -101, -3, 103, -29, -122, -146, 166, 108, 28, 53, -4, 40, -33, -33, 63, -48, 26, 68, -105, -18, 58, 105, 67, 54, 14, -119, 1, -69, 32, 169, 51, 72, -27, 91, 94, 3, 14, 49, 12, -22, -97, 32, -81, 31, -22, -29, 14, -12, 28, -74, -50, -14]
3865a4K8PL9j54J57k7j34J08j6P4p1k7L4k7J25n9k4n1M3J6p1j10K25r3L1j16J8
3892h9J12k5j12J09j33J14K04j18q1lr2J61j9q3k3R9o8k6Q7J5j20R6L1j19R2k7
3918a8J15j24J3J39m3n9K0l7j9np7NK11j42m6K1N6P3j08K6j18J29j08R7p5J38
3944F4k1j8j31j6J02K0J18j10k9n7J26j54K57m8j03j4K29m2j12r3R4%q9r6J66
3969D3o9J23j27O5j05m1R8O1n8j18J56j21o6J40j1O9r3n7Q6l8J25j87N2N1j6N1
3995A3l8LO7o1q3P3J4M3o8J06L1l0j24j1K7J33k4J1j56oK28j99L2J5o3R3o5N3
4023A4N6r4J29r2k5J09k68J85kJ0j43J47j23J94j81O9j9q2K58p7p8q1K15k34k0
4048a33J96lq6L6N0n3O2p1l3J09p5l1j3OjL8m1J4j7P5j67P0j5Q6pQ1op1Lm7K6
$$ y = [-14, 14, 21, 60, -94, 63, 36, -98, 10, -6, 68, -3, -30, 4, -23, 102, 43, 19, -32, 11, 27, -44, -154, 71, -22, 9, -107, -89, 23, -2, -114, -5, -138, -24, 180, 62, -19, -22, -114, 47, 28, -55, -78, 21, -47, -73, 14, 29, -91, 5, 36, -83, 9, -18, 97, -27, -14, 125, 82, 23, 43, 6, -13, -18, -95, -90, 121, -21, -67, -46, 10, 83, -25, 1, -117, 12, -96, 1, -74, 64, 43, 25, -106, -122, -20, 0, 118, 8, -21, -78, 48, -106, 151, 103, 0, -14, 215, 173, 61, -32, 62, 62, -27, -123, 43, -26, 97, -30, 35, -70, -111, -13, 48, -10, -128, 28, -93, -159, -19, -30, 39, -54, -111, -25, -63, 62, -125, -73, -22, -38, 13, -25, -22, 45, -16, -99, -26, -12, 31, -37, 69, 100, 70, -54, -65, -38, 95, 71, 82, -74, -80, 148, -51, -19, -4, -67, 26, -39, 14, 70, -24, 105, 13, -12, 97, -171, 14, 12, 22, -121, 26, -97, 97, -84, -15, -34, -116, 142, 65, -13, -94, 121, -113, -133, 63, 60, -26, 10, 60, 7, 69, -2, -35, 74, -1, -32, -45, -39, -40, -2, -43, -29, -46, 29, -138, -68, -83, 3, -4, 77, 71, 0, 3, -44, -18]
4079a8r5M1K6J17j6P8j61J13r9M6n5k5N9k5kk4K0o3R9N1j96J34o1M8j0p5K0m6
4107a19Q9k7P1k4m1Q3lj0j01M3RJ70j22n6Lj04N1L3J27j18Q1Ol0jr6J0R7L8j18
4136e9k7K6K2J5L4m1N8k3l5J88j20j59J08O2k8n4K6M6j16m9K38k43O6Q5J03k31
4162a08R5q1J6K9J40j43o9J24J0j9J01k15J38Mj54J35L3J15j80P0Q3j69NN3P1
4187H4k2q0j2qL4j2O4j07J37p9O8j72J83o1M7j20P0p1k7K9J13o0%P0n6J05j40
4214b3N9j30K47k91J05k3O5K5l1K08j68j01P1K0L5j19M2j2l0k7K5M0j9o8L6L0
4240c4n0J2o4L8L6nk8R2L5Jo8j06J37R8J7jj93k4J73q0N5jn3j4P4L3J6j79L7J20
4270G4l4O4k11R5J01j87Q9q0J13J01j79N1n5M9O4q5P4j07P7p7K8K0J8o1P7j08
$$ y = [-18, -113, -72, -46, 71, 55, 133, -28, 85, -14, 32, -23, -48, 11, -14, -16, -40, -20, -83, 16, 67, -129, 5, -56, -8, -18, -93, -73, -119, -30, -57, 14, -10, -51, 32, 29, 19, -82, -39, -30, 140, 18, -38, -35, -139, -88, -55, 72, -46, 35, 41, 11, 10, -86, -76, 21, 59, -59, -86, -60, -38, -23, 11, -30, 28, 5, -30, 158, 38, -121, -13, 49, 21, -33, -7, 39, -77, -126, 112, -131, -65, 20, 123, -108, -13, -94, -78, -49, 91, -52, -121, 3, 13, -6, 95, -120, 18, 22, -132, 3, 36, 151, -29, 41, 124, -45, -40, 13, 84, 62, -18, -30, -38, -4, -16, 48, -59, 78, -1, 67, -105, 78, 17, 64, -56, 14, -57, -84, -55, 58, -2, -2, 68, 12, 117, -23, 36, -94, 153, -138, -33, -56, 9, 34, 3, 211, 43, -58, 13, 33, 68, -51, -9, -21, -51, -78, -53, -13, -32, -100, -64, -34, -84, -72, -136, -98, -62, -67, -95, -3, 32, 33, -35, -141, -4, 94, 111, 110, -83, -107, 66, -14, 41, 40, -13, -27, 47, 80, 96, -83, -46, 74, 40, 104, -107, -12, 89, -98, -9, -89, 24, 125, -54, -3, -58, -9, 55, -30, 44, -63, 14, -63, -35, -15, 3, -58, 19, -89]
4296h9K5l1O3k3K4Q1Pj18P4Pr7M0J64j29o0N4jk6j5R6j0o2j25J71M4M6nj85O9
4325a1O2q0J21k02J26o8P2o3P0%l3m8J54j53N8n9k8J14N1j03L8K9j1l4j24R2P6
4352D6j81J11k2m1J70k49K20j45P1p5K0L9P7l2k1j06Q0K31j86m9J11q5M3q3J06
4377E0l2k0N7l3J4q3k4O5n6J5M3N0j14J13l9J34r7j03K2O6Q1pr3q9n3J16j1j2
4405d0q0J14nK2P2p8q3o2J68p4O7J1rL7j06Mn7Q1P3j06J45j02p5J81j3n5Kj13
4433h1K46k01J09O0m8r9N3n4Q2q4P1%%j28R6l1J92j92P8j5j62O8k2N7j05n1J24
4460c7M1rm2n0N2N3n6J2O0M1p9M9p1q3J31L0m0P0k3j11Q0n1M9k4R0q1p9Q7nQq8
4491g6J78j14q9J45L4j07K4j8Q3Jl7q7J14k37J45R2L0j02KK1m5Q1L9m3n7J6O0
$$ y = [-89, -64, -95, -32, -55, -31, 50, 57, -61, 13, 20, -77, -37, 127, -2, -62, -8, -9, -35, -50, 46, 36, -26, -151, 20, 64, 110, 105, -80, -11, 51, -29, 92, -110, 16, -52, 20, -43, 27, 27, -6, -54, 100, -53, 5, -54, -82, 32, 83, -20, 18, 47, 36, 2, -122, -30, 46, -135, -24, -46, -87, 83, -166, 54, -91, -20, -95, -75, -36, 41, 9, -12, -118, -38, 193, 7, -42, 69, -16, 27, -56, 50, 18, -2, 55, 22, 36, -47, -71, -6, -62, -47, -4, 46, -68, 45, 6, 140, 43, -60, -38, 28, 109, 102, 9, -80, -133, -17, -28, -40, -120, -6, -11, 11, 83, 5, -78, -140, 28, -46, 21, 32, 23, 60, -46, -42, -99, -18, 55, -51, 94, -8, -83, 98, 85, 30, 32, -81, 165, -36, 73, 133, 85, -14, 39, -15, 67, -17, 54, 54, 54, -74, 22, -9, 183, -9, 69, 54, -108, -40, -62, -5, -110, -161, -37, 4, -5, -47, -97, -45, 8, -48, -36, 24, 65, -14, 35, -36, -119, 12, 42, 2, 72, 49, -62, 18, -33, 16, -8, 82, 1, -78, 9, 4, 12, -76, 102, -12, -101, 44, 78, -29, -5, -23, 60, 61, 24, -63, 51, -186, -41, 51, 81, -21, -19, 2, -43, 38, 77, 34, -23, -7, 53]
4518E3q2J8j0M9Qj20J08N%p6J91j69q7J14k5P8j40J35k6j38R9N9o4r2J65n8L5
4545C0k1L7L6m3RK8k07J01J50j61J32j55N2n7K5J08j4M2j02Q8n0j6kr1J16j07
4571g2N6oN1m5J32p6lj0m7N5j45J38j78Q7O1j15J19p6J29j88R2J34p9K8j09N8
4597il4l3J36j24Q2N3M7o7k7P3n5o5R3j22M4L2q1J85l3m1pJM9l2q6L6j13J78k9
4626E1q7J29r2n4N1m8oK06j72K3k7l8n3J07N9j06N6J03n4k2M0j10P1m7L8K3Q3
4653A24p5J7p4P0q0j1Q9jp2j08J41J3M6j54N1M4J6o6rR6l2r0l3J34j98K06m4P7
4681G7j12R9Rp4J63j49J2l1m4l5O7O3j3k5o5O1Nn4k0N0m4J53lj00K6j25J12k0
4709a7K4n5L8m2r7N6P6j6J18n3k1n2N3q7P3l3J15j00K8j9J27mn4n7L9m4n0MJ13
$$ y = [53, -29, -11, -21, 28, 36, -84, 24, 29, 29, -47, 144, -25, -112, 2, -23, 55, -85, 50, 24, -114, -15, 44, -20, -112, 53, -5, 30, 9, 46, 82, 39, 48, 76, -131, -30, 120, -41, 91, -64, -12, -69, -44, 64, 50, 92, -10, 78, 28, 12, 10, -81, 35, -72, -16, -22, 29, -16, 116, 40, 37, 27, -20, 35, -110, 28, -150, -63, -2, -117, 2, -74, 55, -133, -41, 93, 14, 42, -67, -9, -43, -76, 60, -64, 18, 71, 118, 51, 24, 97, 42, -23, 70, -52, -8, 24, -57, 128, 95, 54, 47, 48, 97, 65, -21, 15, -98, 80, 51, -36, 93, 1, -53, -2, -50, -56, 150, -22, 1, -26, -64, -117, -10, 49, -57, -1, 102, 48, 26, 66, -44, 27, -20, 18, 41, 124, 49, 66, -8, 62, -18, -29, 60, 59, -13, -121, 20, 33, 79, -75, -24, 20, 36, -30, -39, 57, 25, -65, -98, 36, -162, 44, 0, 77, -35, 64, 73, -1, 162, 13, 25, -6, -50, -85, -18, 45, 32, 7, -58, 3, 8, -46, -66, -16, -60, 93, 90, -10, 16, -109, 3, -17, 7, -48, -10, -52, -149, -93, -17, -33, 85, 32, 11, -41, 12, -75, -2, -35, 80, -20, 8, -11, 116, 112, 58, 1, 40, -4, -54, -50, 63]
4738F3k0k1j4j63K68j45K3j5L0J2M2j31J06j63J22L2q2Q7n5QP2p5Q2K2j65J04
4764B4O5j53k7J11o1kQ0k1k2qL2P3k11N4J63L7r0k0j0M7p7OP2K4n7j8O2n4K2p0
4794b9R6m9j45J23p1J28%r9nrk5N1J1p3P1m7J13k2k1M0P7q8j6J15j18j7N7q7p6
4823a15O9L7j02J27l8R2j44N0L1j0P0O5j88K6p7J05O8m6Kj07O2M9k5j05j7J98
4849G7K9j58J00q7O4l2j9Qp6LJ98k2Jj56K8J27j7n9qJ24k05R6Pm2M3K5p2m0J07
4878D4m4l4pJ7l5L3NK6k4n5K7q5O2lK3r4J33qj4O6j04N9qJ29j45J8J66j03m7l0
4908c2J2J22q3J3j05Q4o0R4Q6r7rj13K09j53N1k1l7lJ08q1j07k2J16k8L5j05Q5
4935d1j7M6p2J05L3p9o2R4n6M7kr4J31KN4j31J16K6m4J25k13k7L0O7n2m0P8j0
$$ y = [63, 43, 22, 8, -155, 113, -32, -9, -24, 6, 18, 60, -71, 35, -128, -6, 26, -56, 31, -24, -16, 56, -19, 63, 85, -80, 24, 89, -64, -91, 20, -41, -43, 37, 16, -6, -14, 18, 91, -120, -66, 97, 134, 44, 24, 14, 61, -16, -10, 62, 86, 29, 11, 73, 19, 41, -29, 67, 18, -127, -4, -75, 53, 53, -46, -51, -60, -85, -34, -23, -96, -25, -72, 41, 19, -2, 38, 115, 27, 11, 126, 8, -9, 48, -39, -115, -46, -9, -111, 16, -22, 70, -74, -24, 7, -3, 67, 132, -56, -30, -107, -2, 66, 20, 22, -85, -23, 26, 1, -104, -121, 77, 106, -52, 48, -39, 25, -7, -26, -18, -94, -91, 107, 85, 86, -70, -42, 85, 68, 9, 1, 125, -80, 16, 23, -19, 24, 49, -23, -63, 44, 0, -34, -41, -24, -59, -26, -21, 5, -19, -74, -47, -132, -70, -73, -50, -144, -11, -19, -33, 33, -71, -12, -20, 109, -36, -18, 148, 45, -2, -32, -20, 102, 19, 32, -73, 11, -49, 45, 131, 34, 25, -88, 121, -32, 19, -2, -39, -42, 66, -15, -122, -144, -28, -56, -21, -126, -41, -58, -12, -84, 21, 54, -25, -87, 7, -49, -2, -4, -98, 33, 35, 89, -42, 74, 100, 56, 181, -32, -59, -29, 38, -14, -54, 24, 14]
4963A4P6j49J70j76m6R6JK3rR3q7J9j79K5J43P9k5k7L7m7Kk5J9j5m8L2P9j19J
4992d3Q0j41RQ3P9j7k0l6J06j9m3K9k05J34o2p1J36j30J29R2o7q3k0N7nm2N1K8
5020Iprn0M8L0j37K82j80q9J8N1j03K03j27J48p5K5j12J66j27K1M5O6j40pl7R6
5047HQK2Lj8K7k08J69n8R9j25J19o0K1J7N2r3J03p9l6j16K4K02r8j79K67j3J1
5074F9q9p8J6R3P8j20k9k6J36%m0p3l5R7O0j87R0J1J55p8L4j88J04JJ4o3R7j8
5102C1n1K2l5M7R0j11R8k05R4J25p5k2j27O5J6k7M0n8J51j7j1j0LR8j66J10r8
5129b3J14m3k4j01J44j38l9J06P5m5q0M9o6P2nP1l5O0q1Q8j83J59j5j44J08j5
5155Ik7J16r5P1j65J40pr4N8J8n5M0N2j08O9n0N5m0r2J23L7j04N9J6Kj41J29k
$$ y = [14, 90, -59, 111, -65, -111, -15, -14, 9, 0, 93, 6, 25, -154, -129, 14, 93, 68, 41, 78, 31, 33, 8, 27, 12, -36, -4, 75, -44, -43, 37, -104, -95, -12, 67, 50, 30, -6, 100, 81, 38, 67, -138, -4, -66, -137, -1, -131, -2, 90, 23, -60, -80, -23, -28, -70, -19, 9, 2, -7, -57, -9, 21, -116, 166, -14, -103, -85, -34, -137, 66, -61, 87, 12, 37, -75, 91, -36, -15, 30, 96, -44, -51, -88, 8, 16, 38, 41, 23, 50, -158, 11, -47, 52, -73, 46, -14, 7, 24, 76, -17, 86, 7, -29, -145, -121, 81, -17, -196, 71, 58, 69, -20, -98, -82, 11, 89, -31, -60, -86, 50, 50, 10, -63, -98, -1, 59, -128, -38, -27, 128, 50, 84, -104, 0, 1, 15, -48, 49, 31, -20, 2, -33, 14, 104, -7, 91, -114, -20, 105, 30, 8, -119, -54, -38, -65, -25, -83, 68, 51, 40, 30, 33, 131, -35, 75, -23, 91, 48, 24, -77, 67, -71, -110, -4, 71, 26, -54, -5, -71, 1, -4, 67, 32, 92, 11, 99, -84, 75, 60, -84, 24, 9, -18, 98, 3, 74, -91, 49, 42, -52, 6, 24, -31, 9, 61, -47, 22, -28, 27, -13, -105, 18, 55, -49, 10, 26, 28, -113, 16, 14]
5183A4l5J5K5l2K2J0j15m2J27M3j32r9J55j40K24j07Q3R8r4n7Ol4RO9K4mQ4q7
5211C0j68J64j1K4o4J14M2q7j14PK11j55J1k0k4J88j33j55J07o3M1K5J65j94J29
5236G0j18P1l5O8k3p3J16l4K0q6K0Q3nl6o9n7L0O0n0Q3Q3j52J2J23j14L7M8o5
5264Gp6P1J6j00N8N2O0j73M1K0o4J01j42J80J7j07q4J72lp4l8P3K2j75J65O3j14
5291c2O3j9k02K22j7M8j13o0nQ1J04l0o0J18l4j55Q8J15k11k5J59j12J17Mr1n3
5317a00M3M8jn0N2J05q7nN8j28J41Nk19J42K9l3kM8q1M1l4J1J3K7l1OM8j92J09
5346c7L9M9n0l7R9o8l9R7m6M4o7r3M7qrK08j66n6O2l2M2J3l4M0Mk4K4OJ03j02
5376Ilq9P1R7j75N0L4O7j02J18l6oj40K35j05k2r3M7k5nP2kO4l2m0oK4m4L0j9
$$ y = [14, -21, -6, 19, -13, 9, 19, -96, -138, -11, 32, -100, -199, -44, -184, 40, -67, 16, 114, 20, -37, -31, -65, -56, 13, 37, 33, 117, 30, -138, 26, 15, 39, -25, 89, 131, 44, -70, -63, 148, -7, 4, -16, -40, 148, 15, -140, -33, -96, -55, -30, 135, -59, 70, -48, 23, -12, 56, 33, -40, 76, 42, 62, -24, -4, 79, 74, 38, -31, -88, -58, 2, -48, 35, 118, -34, -22, 101, -13, 24, 72, 7, -69, 2, 18, -82, -24, 28, 88, -85, -44, -24, -88, 13, -129, 51, 68, -39, -123, 49, 46, -28, -66, 7, 29, -146, 19, 82, -32, 31, 12, -190, 32, 15, 63, -50, -110, -115, -34, 70, 40, -20, 98, 64, -91, -3, 112, -99, -124, 35, -77, 40, 44, -47, -100, -57, -9, -10, -60, -8, 97, 10, 5, 63, -65, 76, 81, -138, 4, 33, 0, -2, 46, -35, 6, -28, -17, -4, 23, -8, -2, 46, -146, -37, 2, 51, 1, -36, 63, -5, -44, 53, 7, 51, -16, -109, -62, -70, -79, 129, -37, -93, -31, -63, -21, -8, -42, -2, 2, -22, 2, 8, 111, 9, 6, -83, -12, 85, -90, -40, -6, 61, -41, 77, 41, 35, -105, 130, 25, 3, -90, -43, -68, -73, -1, -3, 61, 29, -11, -17, 7, -37, -7, -26]
5406b6J19j41J11l6m7l9R4j23M2m9K71j76L5j1j23J95j75J15l8mJ30j40ML7j09
5431h4J61j20j6O8l6J50n6j54n3J38ok4j35K17q8K3N5j29P2R0j94J7K0pL1L9o8
5458h9Q8J40l0n2o1K2j13O3J4J75j75M6n0N0p4L3q4J64q8P0p5Qk1Qr6J39J04n7
5486E9l9o5M4LK7k47K86j17P3o5O4q8M6k0l0J42r8rk4N1mM3m8J0K4l9J3R1p6J3
5516B0l6J64j36k0r7R9R2l1j09L2J4r4J26lJ8j6l2L8L5N7k13J01k1J7j09L3O3
5543hj3O6Qj1n0o6R3J9N3j5k%j31Rq9J46kk1J1L9J5p5N7J3j9j45R0J33k36J67
5573C6j72J84k0k4n2K2N4j10J90j41J72r4nK4j5p2Q0Q4p0q0o1Q1j35K18j67P6
5599CQ9n0p8L8r7J40Ol9Jn2m2J22k9m0%o3J54q3nk1l2K5o2J56p6N8nk5QJ7l5r
$$ y = [-26, 93, -48, 63, 27, -20, -59, 35, -88, -46, -95, 176, 0, 35, 24, -99, 96, -79, 36, -2, -6, 124, -16, -12, 25, -84, 77, -43, -59, 9, -27, 123, 67, -87, -140, -2, -8, -32, -167, 50, -38, -15, 40, -89, -17, 73, -121, -104, -84, -91, -60, -21, -89, -1, 139, 109, 57, -4, 18, -95, -32, -18, 157, -18, 28, -22, 28, -46, -13, -97, 67, -21, 49, -26, -18, -39, -31, -127, 12, 116, 59, 20, -45, -1, 2, 29, -218, 68, -49, 24, -41, 23, -65, -19, -39, -69, 73, -25, -34, -58, -7, -11, 32, -16, -6, 18, -21, -8, 83, 7, 20, -16, 148, 12, -8, -105, -6, 86, 55, -54, -22, -8, -102, 24, 21, 39, 23, -9, 29, 64, 121, -92, 9, -12, 5, -104, -71, -8, -21, 45, 53, 42, -8, -74, 19, 38, 91, 76, 74, 74, -57, -48, -137, 9, 7, -14, -3, 36, 51, -24, 33, 46, 27, -118, -28, 105, -131, 36, -136, 48, 28, 4, -48, -26, 28, -82, 108, -33, 139, 45, 40, 64, 49, -23, 57, 141, 71, -9, -70, 11, -124, 94, -73, 3, 92, 42, -36, 2, -95, 45, 51, 12, 13, -39, -81, 41, 12, -28, -28, -91, 63, -20, -25, -46, -78, -53, -115, 41, -35, 23, 18, -7, 1, 18, -17, -26]
5631b6J2n0k8J20P3j14P0r2P0m3M2L8l9j75R8KM2l5m5J07J6l2j28J53L2m0k4j29
5659a25J31l8L0%p2J21r5o9O3M4P2n9J05j41j7L5J54q2q5K3k1O1q7N7J6j23J09
5686GK4m8K8pM8q0rR7l7J05j51N3L7rr9Q1m6J49j52p7J12p5jk2J58m2q1O4n6n1
5716h0J02j33R4Q4l5j50j0J10k1K5j7m0J35j28M9p4P4M5J3MM3j47R3p8J02q9M1
5743A2L0k34L11k18P6Q2Nk8p8N3n4j11J51P7o0o2J2p8K04M1j55N2n6O2M2lj02
5770b9p9J30m9pj5J03m0Nj01P5r2K00k36J46p6N1J13j46N0Q4o1Ol9l9R8k5Jp3
5798d5oJ57k12K5p3Q5N5m6k5j8R6L1l4N4l9o6J63q7q4k2J78j87J49lj34R4n3m6
5826i3N6J52j39j42K95k29M2p3J26j%Oj30J5O1Q7Jo1nJ05j16qJ8R9j29O6k1Q6
$$ y = [-26, -14, -64, -92, 28, 101, -13, 57, -35, 35, -8, 34, 72, 33, -142, -44, -42, 0, -35, -80, 27, 43, 11, -117, 36, 68, 28, 4, -125, 6, -32, -2, -2, -74, 47, -48, -117, -54, -10, 62, 3, 108, -33, -50, -15, 139, 57, -28, -5, -26, 35, -52, 5, 21, -102, 7, 31, -17, 11, 4, 52, -28, -37, 60, 23, 128, -23, 30, 67, 58, -41, 40, -6, 143, -9, -86, 26, -49, -50, -72, 86, 44, -37, 27, -29, -80, 22, -111, -17, 67, 32, -118, -128, -18, -39, -14, -31, -71, 64, -64, -15, -89, -15, 30, 43, 47, 90, -57, 36, -42, 60, -29, 12, 42, -192, 119, -99, -23, 59, 64, 36, -42, 11, -43, -154, -3, 74, 14, -48, -36, -114, 90, 131, -24, 28, -28, 34, 76, 73, -29, -108, 22, -27, -34, -49, 54, 14, 19, -82, -7, -99, 101, -135, 11, -65, -14, 99, -47, 3, 87, 26, 32, -7, -46, 52, 27, 28, -45, -51, 106, -106, -81, -154, -69, -14, -60, -85, -103, -7, 24, -10, 44, 5, -61, 102, 15, -69, -91, 87, -100, 49, 46, -88, 6, -47, -93, -37, 115, -24, -166, 129, -100, -58, -131, -5, -6, -6, 0, -130, -115, -54, 33, 34, -27, -32, 73, -43, -51, -33, 66, -63, 3, -18, 68]
5854F8q1J9p5k3N7p7J03j29K15m6p4J13J2j10n9J8J30pj35kN2P7q9MJ21O2K7j12
5882E9j17N2J12o3k6j2q0K13j43l1K1o1O1J09j09J74j01qj32Q1L4k4ok8ro1J3
5909h2O6Ll1q2J29M3k5J6qqJ6qn7K7Ok4L2m9L6K0J3r6J54q9k7P9p9l0J50j17m6
5940f8R4R0n0j48R8l8O9n1N6m2k7kQ6j1j25P0k8j8Q3K4o8M6J90k98J53J8j06J7
5968A4o9J50j72L6kL8R9j97J33J7mQ7k61K21J2j37K2k7J31j4j04Q1l4n9n0K37
5994A48l8M4j77N4Ok07K02l3J74k20J45j54J33m7l1k2M2o2l0P9l4P4j1k4o0j8
6020f7k8P5J25p7j3J4j13M2nR0Mo2R5o8j1o7P0J1k4j18K18j23L1n6J10j20O0o0
6048f7j3M9JL0p1J33j86J85j3l3j36J57j6o6M1o7J54L1j09L1K0m4k0KP4j54R7
$$ y = [68, -13, 6, -69, -92, -35, -112, -9, -138, 77, 31, -43, 70, 82, -28, -87, -69, 61, 54, -81, -83, -31, 46, -43, -39, 82, 144, 171, 59, -58, -6, 106, 43, 17, 5, -75, 138, -5, -36, -15, -76, -15, 94, -15, 159, 58, 50, -82, -1, 33, 9, 3, -25, -34, -95, -82, -16, -13, -44, -126, 3, 46, 21, 37, 29, 21, 37, 29, -28, -1, 5, -19, 13, -36, 0, 20, 33, -63, 91, 2, -25, 54, -25, -55, 95, -22, -68, 26, 116, 66, -82, 16, -22, 47, -4, 52, 10, -17, -19, 67, 56, -69, 1, -27, -45, 38, 62, -6, 40, 230, -68, 85, 103, -3, 14, -55, 95, -77, -41, -43, -5, 94, -103, 30, 47, 43, 130, -131, 90, 102, -35, -13, -40, 91, 77, -27, 54, 20, -39, -89, 148, 110, 154, -23, 31, 37, -170, 32, -1, 173, -47, 98, -56, 77, 30, -1, -23, 19, -43, -73, 6, -28, 46, 35, 11, -49, -67, -95, -20, 105, 28, 15, 29, -84, -42, -47, 43, 47, -15, 80, 12, 1, -66, 4, 15, -9, -127, 91, -32, -1, -57, 53, -67, -7, -67, -80, -31, -30, 0, -71, 62, -124, 61, 48, 15, -121, 36, 20, -46, -5, -72, 82, 113, 4, 35, 55, 11, -9, -7, 67, -87, 10]
6075A0N5j19JJ29R5j96l4Q1J30j73k5L0J08q0q3J10j06J07K7j45M1K5m9p1J21
6100a1K0j15R0o1O2o8J69r7O5k6jM3m2N0m0l8K6O9j20k2P4L1l8K7M2r8L0P8j84
6129h5J71j50J52p4J84j16n5N7p7L2j9r0L1J02no1j39J27J1J9j04J31n4q0lJ06
6155A1%M6jl8M2k22J44R1P0j46j23J61K8j11K7R3o3m2J58p7N4r0p8l1J17r7Q9
6182A2L4j09L7N9%pl0j7o9M7j4R1Q0r2o6op8J73o7j2J51q1l3J08m5j16l4J50j1
6211E5K0j12P4J3j16L8q8J50r4K8M1j4K2j3lOl0J52k54K5Q1J0j0L4k3J4j09J86
6239H3r9N7k3n8M8Kj70J26J33q0N5q7n5n5J60r3J05l0RN6o7o1J42j7j8k9o7Pl2
6268e8Ko1R1r7K29n0L9k73J91j72R3P3k6O2j95J63J0j04K9r4J54l9Lk7Q6n3N4
$$ y = [10, 65, -54, -53, 76, 171, -25, -59, 22, 152, -21, -46, -16, 92, 12, -71, 39, -67, 40, 67, -78, -37, -12, -61, -132, -11, 9, -106, -16, -77, -15, -83, 86, -11, 54, 28, 27, 70, 28, 78, 38, 0, 26, 95, -25, -47, 27, 58, 20, 47, 89, -9, 21, 99, -85, 86, -64, 88, 14, 198, 82, 27, 84, 7, 39, 20, -70, -39, 63, 58, -3, -142, -15, -4, 15, -89, 42, -12, -92, -95, 11, 11, 57, 56, 18, 60, -162, -18, 73, 143, -3, -126, 35, 63, -48, -21, 72, 9, -33, 125, 48, 102, 12, -66, -97, 20, -77, 12, 46, -63, -26, 33, 33, 26, -4, -21, -90, -43, -57, 34, 114, 22, -44, -50, -128, 45, -22, -34, 117, 36, 3, 111, 66, -50, -84, 66, 55, 75, -37, 37, 50, -66, -28, -116, 34, -60, -32, 9, -5, 17, 4, 1, 7, -23, 129, -125, -100, -19, -9, -19, 15, -8, 6, -103, 83, -16, 41, 18, -40, 8, 10, -160, -34, 99, 19, 74, -13, -68, -123, 37, -56, 49, 19, 28, 84, 17, -44, 98, 81, 63, 34, -33, -26, -58, -56, -117, -26, -123, 106, 56, 95, -178, 13, -159, -66, 7, -19, 43, -152, 11, 21, -83, -54, -148, 6, -33, -30, -57, 29, -24, 30]
6295C0K7n6p2j2J19l3J1r0J08L4q7j11J58k20K21n1K9m4M9K8Q4j46pN8j5R1r7
6322FJ4%MK0K9r0N2P7j79J4J29kj85J09p9R4l3Lj06P5j06K6J03m2J64j55J10l5
6350A7Qq5n7J71k6j73J00R0L1o0n4N5J08k4m4j7k56K26Rm6J3K3j5L0L1j07R2m4
6378dJ00j44O8KL5P9j46K2l0n7J15m3j04Q2r4J31m3o5J03m9J28o2p7O2P7r4N7
6405D9K3j12j4J76j80N0kl1J07m8M6o4k1o4mkP6J4m1L0R1q4J01j02q4J37j43Q2
6433a4Q5k2p4k1M2O3o1P6j58j9P7Q3j29N0L6r0NJ21r9L6K3Pp8N8Q7j37J06j54
6461a01J59J7j34p6O5J05j3l1K5O2j27K5J02o0J1j54R5KN4J08j29Q8j1J9j02q8
6487h9N8L0K4m6j7J5J79nk15R9o1J9Q5n3r7j1Q1Q6J3k14J69p0K8q9n4J56J09j21
$$ y = [30, 57, 1, -71, -83, 36, 3, 14, -76, 32, 66, -21, -132, 26, -194, 27, -24, 5, -39, 10, 38, 122, -24, -31, 27, 12, 103, 6, 20, 20, 24, 44, 73, -17, 35, 112, -67, -53, 76, 74, -111, -2, -81, 13, -20, -17, -123, -48, -154, -128, -25, -67, 97, -58, 52, 17, 25, -60, -117, 54, 28, -145, -45, 45, 76, 16, -38, 17, 125, 101, 57, 40, -216, 10, 19, -27, -14, 9, -6, 24, 55, -52, 40, -4, 96, -48, 20, 22, 57, 136, -10, 12, -18, -75, 40, -3, -107, -25, -119, 12, -31, -96, 7, -42, 86, 24, -53, 9, 86, -8, 49, 72, -40, -54, 122, -58, -8, -10, -41, 66, 18, 64, 0, -21, -85, -89, -91, -15, -1, -42, -12, 79, -5, 96, -6, -90, 47, -96, -14, 71, 49, -25, -46, -4, 59, -2, 74, -84, -103, -26, 57, -72, -22, 14, -76, -71, 50, -49, -13, 10, 17, -61, -3, 84, -53, 53, -101, 58, 75, -59, -135, -70, 35, 22, -9, 16, 78, -49, -24, 78, 18, 29, -125, -30, -28, 26, 134, 5, 93, 82, 101, -1, -89, -31, -1, 23, -23, -40, -25, 154, 149, -66, 33, -28, -9, 76, 23, -74, -85, -4, 82, 95, -119, 50, -20, 8, -81, -135, 21, 130, 9]
6515IK7J04j22n9M9J47j29p7J5j7j4M6P0N0j29k9O0k3np8J77l2l5M1r5o1J27m8
6543c1qN5j5M2Nk5o5J26j12j1p3J85q7J02q3OJ6kN7k4o7p8J03k0j1m6R2j12j8
6572i9R7o8j9J03j4pK3L8N5j76J49j03l0K6P6j17M7O6j27M1l8J24l4j06P0N0r5
6599f8J41j27R0k16J32j9M8k1oJ38q1qn0k1k8J23r7L0pO6q5L2J27m1q0o6J44j36
6627h6J68k44J30K8J3j0m5j6o5L2J78r6mP4Qr4j8l3j1Q5j01J39l2j9P2r9N7l5
6655b4k5m9n5J40j88R2J00Q4j16Lj9J8R3k3rk4K03j74J00j39o9R8l5M0q3J06j21
6682g6j7J20l1O5q5L7P5n9j26K05j7j19L5jP4j84N8M5pN9Kj26O6m6K1R1m1j22
6710a04Q7k7O9ppmj1L8k7J21j47J40j52q7J68q5J06l8J31k14L1Q0k1J5l6k1J6
$$ y = [9, 36, 140, 18, -41, 8, 155, 26, -51, -36, -53, -67, -21, 49, 99, -30, -59, 1, -22, -27, -105, 72, 40, 5, 46, -49, -110, 17, -31, -39, 16, 1, 43, 48, 23, -42, 84, -28, -39, -112, 73, -14, 88, 5, 11, 27, 25, 82, 58, -9, -87, 16, -4, -15, -61, 31, -81, -99, -2, -70, -89, 14, 0, -7, 16, 54, 109, -67, 82, -21, -51, -25, 51, -66, -19, 47, -80, -39, -77, 47, 13, -93, -23, 27, -68, 73, -54, 36, -180, -48, -67, -19, -40, -46, 92, 11, 3, -47, -68, -96, 27, -70, -40, -47, 19, -66, -34, 93, 52, -28, -94, 50, -86, 82, -162, -32, -4, 9, -1, -46, -62, -127, -95, 83, -13, -17, 57, 65, -29, -47, -80, -91, -6, -107, 32, 0, -19, 53, -46, 11, -24, -49, -98, -153, -13, -201, -109, -9, 75, -41, -38, -57, -39, 54, 31, 22, -2, 201, 27, 127, -12, -81, 17, -18, 22, -61, 45, -76, -93, 27, -4, 61, -24, 13, 88, 29, -97, 108, 91, -28, 7, 6, 80, -104, -46, -1, -8, 51, 53, -73, -7, -53, -32, 59, 18, -104, -17, -44, 25, 18, 11, 7, -4, 34, 7, 128, -19, 121, -31, -118, 50, -35, 71, 33, 164, -50, -19, 61, 40, 55, 19, -2, 14]
6737A4J7K4j25L2L9m9J11j35m9Q2O9rK1o3k3J1m4J8rJ2R1k1m1p5J49o0l8L9m7
6766e9n9M3m3J63q1J54j4j65K8P2j25J19j22qL5J01n1j55J79J5k9J08j25M0q3
6791f2M3Kk6J12Nk8r2Q9j55O1J08m7J16j44J20p1n8mL1n9O4j01Q9J2n4LP9j1l6
6820a4M6r3MJ09j37J08rm1n6J16j22J9L3N4r6Q2J2j47J95p8R2n6l6J12l0m7J4
6847C4m5J42q7J20j22K0r9Q0l2pK3M4j7N7M4j98R1m4k6M0jo3q2J02J35j58P9l5
6875eQQ3j51R2k9m9PJ3Rm4J8O6L3M5o8m0N8j52KK06q1k7J22j51J70j11k6j41J17
6904b6L7M1j51R0k2n6Q4K9l%J2Nm7J58j51l6L7k7N6k9J4oK5o7N1l0o4J58q3j7
6934a8R0r6M2P5r1j00K4J7J71j77j4P0l5J09o6J2o9M3kK7O1j03M1j19J24p9L7
$$ y = [14, 31, 55, -70, -38, 1, -48, 63, -72, -121, -39, 30, 21, 42, -21, -44, -33, -77, -59, -68, -56, 35, 14, -27, -102, 47, -13, -51, -12, -59, -118, -75, -118, 45, -36, 118, 104, -61, -33, 39, -86, 33, -89, -97, -62, 39, -12, -167, 12, 27, -2, 106, -19, 21, -62, -19, -17, -43, 69, 74, 46, -46, 43, -112, -51, 57, 10, 126, -18, 102, 31, -27, -31, 0, -59, 5, -96, -7, 5, -49, -46, 33, 22, -14, 32, -61, -57, 52, -85, 23, 14, -27, -83, 33, -89, -70, -37, 17, -79, 3, 15, -132, 63, -15, 77, 21, -15, 97, 67, 20, 34, -11, 131, 44, 164, 42, 62, -37, 43, 11, 4, 27, 71, 54, 111, 155, -43, 48, 4, -22, 18, 17, -46, -128, -26, 109, -49, 30, -5, 3, 86, -65, 27, -2, -51, -44, -31, -22, -66, -48, 18, 51, 96, 28, -12, 46, -106, -104, 102, 21, -6, 116, -35, 135, 24, -2, -143, -26, 11, 52, -99, -9, -31, -87, -3, 26, 23, 23, 35, 40, -7, 151, 0, -36, 1, -26, 30, 1, 15, 9, 34, -33, 18, -12, -76, 82, -1, -18, 72, -24, 18, 93, 2, -98, -74, -57, 114, -63, -77, -7, -42, 67, 1, 13, -56, -13, -15, 12, 73, -30, 11, -108, 16, -63, -26]
6961b6M5m3l3j4Mk1N6M9N9oj2np1n3pJ17j26J05K8j22J83j21J6o5J61k2l2p8P7
6990D3n%L4j12P7j36J1L2N6pO3j29n7J02J07n2p5J15m4j78R3O8l9L3q5J60r0K
7018a3m4j2P8m7M0qK17j75nn8N1L9K8L9j97K7L1j4l5K7N9r4N7rJ51k33J11J8l9
7047a0m5J27J8j27J29o9n6JJ15j42j8R7n5n7J30L5k08J77o6k3l3QR3po1M4m5M3
7075eP9jk4j7j3m3j36K09Oj3m7M5%o3J10m0j31J04O7j60J19j46Q4q0J48pm5L2
7103C2j9M3n3p6lJ69%j67J13k02J11J3jO1L8o1O1pM2j22O4n1j4P7j01O1P0p1J3
7132B0q1J9LO3j0NP8j06m6n8L7J23Mp5N0r3J22m2p8L5L2n8Nm1L8M5J02j59O8l0
7162b8j00J36n0M1L4Om9O6o9K9q5P3j02Q9J31k10J04n5J09J7j21j7L4o9j00K15
$$ y = [-26, 19, -24, -57, -71, -67, -88, -32, 17, 76, 70, 58, 53, -18, -71, -78, 39, -87, 18, 46, -76, 107, -14, 2, -63, 98, 76, 44, -34, 43, 38, 38, 72, -40, 37, -99, -88, -56, 0, -7, 56, -73, -130, -28, 79, 27, -48, 67, 23, -155, -62, 6, -33, 0, -85, 75, -15, -13, -57, -69, 9, -38, 2, -6, 211, 36, 31, -27, 24, 63, 91, 130, -67, -40, -9, -23, -58, -31, 28, -66, -9, -18, 133, -100, 11, 29, -10, -55, 72, 90, -37, 92, 23, -33, -32, 83, -59, -77, 20, -35, -92, 38, 73, -135, 42, -24, -47, -80, -72, 21, 14, -47, -3, -48, -5, 74, 73, 49, 32, 19, -24, -160, 49, 55, 42, -5, 40, 40, -23, 87, 47, -84, 20, 87, -73, 46, -100, -16, -96, 52, 45, 0, 32, 13, 56, 3, -73, -76, 93, 93, -74, 39, -163, -52, -39, -40, 21, 59, -2, 59, 52, 94, -28, 36, -15, -29, 48, -53, 8, 78, 7, 20, -61, -42, -39, 24, 14, 19, 97, -9, -55, -113, -76, 47, 51, -24, 26, -67, 55, 13, -65, -30, 2, -56, -51, -92, -54, -9, 93, -66, 2, -28, -128, 8, -42, -1, 33, 39, -10, 56, -13, 16, -69, 4, -98, -9, 122, -88, 16, -39, 70, 87, -34, -51, -17, -86, -186, 29]
7188B9n0j2R6m8O8p6pL6k1J05r0j22J1R5J12j75J3O2l7NM1PK6j7o5J78j76k6m3
7217h1J88j37p7K27j13r1R2J6r1Q1k7J2k9M6j66J24L1l7J27o0L6m1M6p3Q2r6%
7244a1J2j8n4J58q8k2J2q0O8L0n2J20j30R1k8j15N8N5k9m0l6L0P7k1l6J75j10
7271A6l0l3N9L9r0L8K4O3l6m5n4J3Q4L3o8r7J29J54k68RR3p7l9Q0j30R0l7l9P3
7300d6K7K8j1L1L8j7p5M0m3q5J50qj34J13K9j03J17Mj11l3J9P8J1j4m3l1J04K4
7328E9lj1R6j35J7m9J9J08o5o7O7J5q0l7J70j25M7n6O4j02R3l3K2JJ0k9M1jj75
7357a39J94m7L8j63O2J1lJ05m0M9n5k9M5j86R2J29q7R8o8Q4r4J9Pj9l0O2m9J40
7385A26j81OOR2%nM5l4o8k4P8m3rJ3o4k9jjJ23Jj20L1Q4J5p0K7kK8j24M2P4j7
$$ y = [29, -21, -33, 63, 15, 83, 7, 0, 36, 15, 120, 30, -92, -81, 14, 126, -49, -36, 26, -11, -6, 35, 42, 68, 51, -14, 164, -12, -38, -81, 107, -30, -107, 120, 7, -84, 8, 24, -67, 14, -13, -1, -30, 16, -150, -26, 5, -32, 95, 35, 71, 30, 76, 3, 85, -11, -11, 1, -17, -71, 87, -1, -23, -11, -91, -23, 7, -45, 75, -55, 36, 8, -107, -49, 6, -23, -63, -99, -69, 8, -13, -49, 126, 16, -14, -47, 12, 51, -39, -1, 23, 86, 50, 5, -49, -36, 48, 81, 13, -84, 45, 199, -69, -60, 33, -44, -83, -3, -133, -43, -80, -119, -46, -19, 9, -2, 29, 67, 50, -25, 15, -28, -113, 37, 29, -105, 8, 37, -66, 51, 55, -56, -89, -70, 8, 19, 5, -38, -69, 35, 59, 56, 45, 141, 6, 23, -26, -7, 101, 36, -31, 36, 51, -29, -66, 104, -21, 26, -30, 34, -68, 25, -8, 14, 15, 25, -4, 37, 36, -139, 55, 8, 46, -117, -55, -44, -47, 58, 18, 67, 12, -17, 28, -158, -66, 63, -24, 74, 6, 90, -4, 15, 22, 3, -27, 35, -14, 126, -55, -49, -43, 49, 49, 44, 89, 55, -13, -37, 41, -2, -11, 2, -62, -91, -92, -93, 30, 31, -89, -58, 26, 41, -29, -2, -4, 24, -100, -58, 16, -1]
7417aj03J65j45N4K5l4k8oJ06m3M8oj35J34j8lr9R3J40j3q7j32N5J20j1o5J7K1
7445D9O4o6q2J6K7o8Q8j37O0L0o9R9m5J4O5N3lj56Q0N1j41o1O7K1J44j30P3J7
7473F0p2J00j24p0J58r0j3M5jj2J01n6r2J22j48k1J86j34qJ39p3L2o5N2j10O5
7499b9J12j45N1o2M3L4m7J2J07m1q4LP0n7K2Q5L9j74Q0n1O5n6J2P1p1k5J0P8p0
7528a8J21j78N0j7O9Nj5K3K6q9O2j5m9r5J54j17m4J71O9n8j09M3K4q5L7k8J07
7555D4Nj41k2J35n5R5j20J3kN5Lr7J06JK4q2Pj01J64Q8j85l3J49k0o7K5j7n6J30
7584D6j56Q9oq7J53j14O3p9K0Q4o0L9J3P2n5k2j6j4p5K10r9j19J60j76K13m6k0
7611A8j54K99r6n1m1n4J52k45K35l6k9r9J34L3n3l7j24O0RJ86r8J1n0L7k2o8J17
$$ y = [-1, -104, 61, -84, -30, -5, -39, -67, -73, 33, -10, 38, 32, -103, 31, 13, 10, -89, 4, 144, 131, 44, -88, -33, 87, 76, 11, 28, 49, 113, 47, -35, -19, 8, -60, 28, -109, -49, -19, -88, 11, -34, -20, 45, 98, 95, -61, 19, 70, -71, -132, -65, -44, 100, -30, 43, 60, -12, 88, -36, -106, 52, -38, -51, -6, -7, -19, 82, 26, -66, 56, -92, -113, 73, -61, -69, 70, -3, 29, -36, 16, -94, -29, 83, -62, -11, -73, -30, 4, -43, -31, 76, 35, -49, -46, 24, -33, -11, 74, 113, -61, 19, -32, 33, -23, -11, 60, -11, -36, -26, 52, -18, 103, -75, -25, -42, 27, 32, 17, 40, 66, -23, 39, 24, -25, -120, 34, -83, -127, 44, 113, 55, -54, -11, 13, -72, -35, -63, 44, 49, -92, -114, 21, -34, 61, -59, -46, -48, 7, 10, -87, 19, 20, 44, -38, -31, -132, 32, 120, -65, -98, 51, 31, -36, -11, -28, -84, 46, -110, -21, -27, -114, 39, -75, -12, -91, -71, 13, -47, -8, 5, 77, 22, 0, -16, -30, -105, 105, 6, -113, 47, -129, 84, 38, 18, -136, 163, 67, 16, -25, -79, 73, -172, 63, 27, -2, -101, 33, 66, 13, -24, -148, -88, -79, 107, 9, 20, -30, 7, -15, -83, 34]
7638C4kO3p8N1J12j87l2R1j95J00m0O2%M5n7L1Pj4K1O6r2rk4j5J97q3j67j0Q1
7667d4j1N4L9K1m1j00pR1j18J53k3L2j26O3k3k1N8M1j55l8K25q1l7r2Q2L7M2P4
7695I5j1Pr1M2o2O7m0ON7o7k6K9qL1jN0p0M4Lr7N4M3J7q2K1k2j5nJ77j22j10R2
7727Fm0Q6q2l5l8K21j93O2J6K4Mm8k7M1M6J8P3j77K3N9J1m1N8j51P4q7Q9K9O3
7756H4q0j6K2j0p5M1Q9q7q8J02J2L3j8N2o7j9N0o6J26j43R5j00O2k8P0j28J67
7783H0j62j2J06o4k1M9O7j13O5J11j49K6M2n1M9RL3j67K77j58n3P6m6m2J84q3
7809E3m4m5K6j8N8j26J99r5nn8L1O1N6j11L1J8L4Km0n8q6Q3mJ05j28Q9L8o9RJ04
7839A10k0l6j75K55j34l0j9M7Lo4P7j87J96lJ6j48J97r6k9k8P1m3j06J28j08L5
$$ y = [34, 32, 95, 17, 68, 180, -7, -39, 52, -143, -43, -83, -21, -21, 24, -33, -2, 5, -9, 12, 78, -14, -23, -47, -62, 135, 52, -115, -125, -44, -55, -1, 38, 59, 18, -82, -89, 2, -116, 37, 14, 46, -80, -17, -40, -61, -3, 38, -117, -155, 70, -11, -48, -140, -58, -21, 21, 95, 84, 91, 0, 42, -20, 47, 7, 13, 70, 3, -23, 6, -2, 29, 28, 78, 8, 52, 55, -42, 12, 55, 72, -10, 11, -11, -26, -31, 146, 24, -86, 6, -34, 52, -30, -65, -103, 118, -75, -13, 3, 27, 31, -17, -44, -3, 43, 61, 134, -43, -20, 39, 50, 9, 67, -84, -10, -97, -8, 21, 84, 4, -12, 10, 0, -75, -34, 55, -32, -120, -18, -6, 27, 9, 61, -6, -25, 25, -41, 85, -58, 37, -63, -1, -29, 41, -87, 80, -82, -94, 12, -52, -73, -24, 43, -70, -5, 106, -43, -17, 25, -26, 23, 32, 65, -102, 175, 17, -36, 40, -6, -48, 136, 53, 9, -36, -10, -28, 30, -96, 103, 8, 3, -55, -24, 37, 93, -18, 13, 31, 65, 67, 27, -31, -117, -34, -38, 67, -61, 28, 66, -3, 6, 110, 90, 54, -121, 134, 0, -30, -49, -2, 1, -63, 14, -173, 23, 20, 36, -112, 85, -11, -40, -68, 3, -40, -146, -18, -126, -91]
7865i1L5J48j62M4J27n5o5R6P0k31J43n8q1P5J8j06J09j10J34p1r0P4J36j67L1
7890d7j4J64j45Q2Q5k14R1R0qm7q5J75j76L8j02Q2J33j64P2M7k3j28R7L8j77J68
7916C2j9Nm2r4J69p1P0p9J60j02n2P1l0qj9M8q4J21k16J02K5j6O4Rj09N3oO0l9
7945CJ03j5m3K5r3K1j5L4J27j19K8%O0o3O5p0o3rQ2p1p1J4R5Ql5k9l4p5K00l9
7975B1L9K6j14Q0j46J02J4m6j22J31q6J75o7j4N9M8l9r2R9j45J76j65K17j50l9
8000c8J18N0k6l7j17M8j2O9k8j3ql4l2o1J27l7o3J71m0q3N5L8K3k1l8r1J28km2
8029DN9k9j0p9l5J42l8M5k55O6M8K5J6m5O1N1j17J50j42l8Q9J51q4Qj06J8J33
8056H8o3Qn8LJ06r1k8J7j2m1N4J3J5R4m9M2j17J24r0J2R1q0q0J1K7Q8Oo3j5j91
$$ y = [-91, -56, 92, -70, -26, 101, 46, -19, 77, 147, -84, 59, 1, -80, -5, 13, -93, 16, -94, 40, -31, -121, -47, 89, -78, -47, -61, 103, -42, 40, 125, -89, 2, 92, 84, 37, -48, 127, -49, -11, -113, -31, 102, -62, 10, 57, 34, -94, 3, 41, -136, 32, 13, 18, -24, -118, 51, -20, 50, -29, 131, 29, -23, 48, 18, 10, -9, 39, -45, 76, -140, -38, -13, -29, 35, 44, -65, -12, -18, 42, 3, 106, 91, 48, 73, -20, 1, -14, 20, 147, 28, 56, 56, 116, 53, 118, 48, -15, -24, 58, -13, -84, -70, 25, 33, -2, -31, -65, -140, 60, 21, 60, 86, -28, 52, -94, 8, 22, -24, -146, -15, -101, 74, 7, -7, 52, 100, 61, -31, 68, -77, 99, -66, 151, 1, -38, 80, 130, 104, 67, -50, -2, -14, 55, 27, 14, 6, -28, -60, -121, 6, -31, -94, 77, 37, -46, 9, 47, 70, 49, 11, -80, 48, 46, 4, 63, 34, 24, -55, -90, 52, 14, 59, -196, -130, -82, -57, -41, -86, -25, 26, -91, 59, -83, -121, -32, 119, 35, 43, -63, -45, 88, 25, 33, -25, -22, 84, -7, -35, -18, -30, -71, -17, -4, 11, 105, 56, 98, -19, 105, 15, 27, 118, 38, -42, -31, -4, 84, 90, 27, 12, -179]
8086a79J01K31k37R6j01J22M0j07P0k6O0n3j43N4J01k61K61j5k5N4l8nK4K4r8
8111e0N6M3j36K3J09j13J42Nl1l1M0p0Q5r8J38n4p2k5M5M3J16j46l3K9q9K2P6
8138B4j07O4P7j30M1j24J97j52J48k0l6l0k2J02k4K2j13L4j7k8%J09r4R3Pj3L4
8165D2j3L4j20J26j44rN8O8KQj07j2O6O5qm7j6j5NN3k6p0J13p4N6j33
$$ y = [-179, -78, 153, -84, 12, -89, 33, 73, -34, 36, 10, 70, 17, -126, -72, 29, -232, 29, 14, -11, 43, 5, 0, 24, 48, -50, 6, 49, -87, -64, 45, -68, 74, 79, 48, 17, 57, -13, 72, -26, 112, 58, -14, -39, 6, 49, 165, 19, -14, 15, -74, -52, 24, -83, -19, 58, -72, -31, -155, 42, -110, 38, 18, -18, -48, -70, 32, 8, 30, -83, -49, -66, -94, -94, 15, -79, 14, 21, 8, 42, 29, 63, -57, 69, -75, -84, -26, 42, 44, 52, -55, -67, -1, 64, 56, 9, -7, -22, -17, 36, 10, -60, 53, -21, 35, -98]
8191i8
$$ Imaginary data points
##PAGE= N=2
##DATA TABLE= (X++(I..I)), XYDATA
0@%%%%%%%%%%%%Pj5J6j6J6j6K1k9L2l6M4m8N4o2O9q1R4j03J14j30J46j64J82k01
36a06K24k49K75l06L40l73M12m56N06n65O30p03P88q86J005j150J331j565J876
55A028k317K985m107O325j2267N6057J77808j19087j90043K3784J30108l408q0102
68a3236n068L9257q355j3337J7714m429l2685J3450M2672j2848m8290Q073M2561
81B5479o130l5442P239K6669j1311k2024J3959J6158j6757j3236J7748Q910k0965
94i703r641K1805J3162j5424j1903R032O540o434j844P775J618p840n378K493
108e742M685L298M57l619l971J376N085J498l428j732M385N085m168j0488j53
123g432J4109O533j4565j1945J2630J4612j1512j6560J0609J8083r254k0397N208
$$ y = [0, 0, 0, 0, 0, 0, 0, 0, 0, 0, 0, 0, 0, 7, -8, 8, -8, 8, -8, 13, -16, 16, -20, 24, -24, 30, -32, 37, -44, 50, -53, 61, -69, 77, -87, 95, -106, 118, -131, 144, -162, 178, -195, 217, -239, 267, -298, 332, -371, 417, -469, 536, -614, 717, -848, 1028, -1289, 1696, -2411, 3914, -8353, 47704, 225512, 106425, -83618, -59834, 70274, 66866, -13236, -18304, 20953, 12598, -739, 16975, 12546, -20139, -6689, 35983, 23135, -25155, -17082, 25479, 19349, -16093, -8854, 17815, 6504, -15520, -1561, 14597, -2160, -15396, 2352, 11262, -9703, -19344, 2461, 15623, 199, -11704, -2672, 3868, -2566, -4410, 3365, 4983, -2857, -8235, -5742, -1057, 2241, 2698, -921, -4892, -3516, 1569, 3067, -361, -2093, 2292, 7377, 3209, -7279, -7432, 6677, 13210, -1355, -13300, -670, 13942, 2430, -14130, -3521, 14562, 5308, -15089, -9881]
136i881J8581k399j4172K692R472m811o046R204O972r360m945J0985M297j1548
150i59k591J3993L738j4362n242J0941L128r672k291P035J41o060M30R37n731
165f565J605J4092K089k0230r599K1083J8704j5105k3412O644K4373L483k0626
178c464j2225J2158J8102m32j9203j1921J3259K1193l892k5514q178K1979J6045
191A7907j5394j9842P465J7971j539j4001j52J0240R54o119R24M450k863m060
205d059M715M960m230m953M389N276l854n378L493N391j950n349k58K384Q06j96
221A187n32k577j833L648L695l740n756L250P489j736r003k42R490K999r065n179
237g905Q553Q196o379r225L779J0167r67r702j805Q241L404o866n312L420N303
$$ y = [-9881, 8700, 6301, -7871, -5179, 4293, -518, -6564, 2640, 9612, 252, -4693, 6292, 10589, -959, -3550, 10443, 14181, -181, -5423, 5518, 8646, -1026, -3317, 3718, 3859, -2201, -1771, -834, -6565, -4960, 9132, 11221, -9009, -18608, 2475, 21179, 6074, -17338, -10694, 13679, 17162, -3464, -15689, -3531, 14571, 14139, -5064, -16985, -3726, 17467, 13575, -11939, -20117, 1862, 17907, 2513, -17329, -9864, 8107, 6568, -7433, -7585, 2655, 3609, -2510, -1586, 2864, 1, -4059, 656, 5616, 1386, -3567, 822, 6098, 2244, -3134, 359, 5750, 3800, -1549, -1807, 577, 1383, 1187, 655, -1922, -3755, -107, 3588, -152, -5908, -2658, 4831, 3095, -5908, -6150, 3340, 6339, -2726, -7905, 648, 8844, 2465, -6760, -2981, 7186, 6219, -3483, -5288, 2953, 6357, -509, -5821, -2401, 2902]
252B902j036m753k023K077M598R60n288m328M276O987n77o752j038N586K461k519
268A533p84Q54j163N97M226n23p948j888R785M365j1271p928J0095J0663q611
283B002j3628M731J4300J07j2957m961Q175P488k267p257l154M285P192N93q115
298c466m265Q061R014n451j1297K494J3704J394j4112n868J2693J0318r677j3352
312i810M721J3605o32j2632l569R100M782n925n004K278K466j121p2J908j492
327a397l044J873M499j260m922K52N774K402l960l898Q80L853K954j578n331k083
343d986N324N599l662q477L33Q700K945o725m647M545M351k616l406K185K997
358B460j983l123J121L675L24l617k000K290L994Q1m704k994L763N266k029p061
$$ y = [2902, 1866, -2887, -4910, -2833, 1765, 2725, -2563, -6891, -2615, 4372, 3795, -2957, -3995, 1591, 4052, 1533, 749, 1603, 440, 1037, 5263, 4740, -3208, -5096, 4689, 9054, -2217, -10145, -50, 10613, 2002, -11626, -6895, 7405, 7512, -5445, -10406, -2231, 5257, 2990, -4267, -7421, -3136, 4056, 4649, -3466, -7731, 330, 9344, 3893, -7404, -4910, 8794, 10188, -3924, -9792, 2901, 13219, 3542, -9810, -5089, 8516, 7884, -4748, -8317, 783, 5565, -360, -5364, -3086, -620, -1741, -1813, 95, -1397, -4441, -2568, 1931, 671, -4251, -3999, 1775, 4177, 217, -3681, -2801, 1052, 4006, 2428, -2903, -4986, 338, 5937, 2275, -6202, -5869, 2831, 5776, -949, -5596, -1051, 3300, 684, -2722, -537, 2460, 477, -2646, -1525, 2150, 2474, -1143, -3143, -853, 3141, 3222, -1482, -4476, -713, 4553, 2524, -4537]
374d537p64P162L220o601n318M568P105j481o529q62N087K762j931k695m28P11
390e31K165K891j349n621j351O736N080n422q035K187Q883O42q740m369O118O335
406E619l505p646n34O490L644m649o079J738P159J968o595m792M641P120j750
421B829p215l40O956K461n664l368M711M553l004n291R37N500J469m555m015K105
437a931N413J038m935l515L152M680j293m862l81L770M71k645k2K013j349k916
453c312K175M579j925o145Q67O702P03p033k352O602M127m981n247K568N399P47
469C474l411k635O10L223K353j998m231K54M783J171m478j912M422K115m505k281
485c046N249L009n668m434N508N570m394o516K322O268m65n273j076K969J279
$$ y = [-4537, -5301, 1861, 5081, -1520, -6838, -2270, 4835, 3354, -3175, -4037, 1050, 3812, 1881, -814, -1242, -531, 1634, 4525, 3176, -2445, -3796, 2940, 8020, 2598, -5437, -3250, 5633, 6275, -2465, -6834, -716, 5619, 2114, -5532, -6066, 424, 4068, -581, -6660, -4922, 2237, 4205, -2390, -7182, -2541, 4579, 2829, -4386, -4726, 2230, 4691, -973, -4341, 370, 4923, 1919, -3372, -2435, 3065, 4534, -21, -4036, -1931, 3482, 4520, -415, -3930, -778, 3902, 2609, -2253, -2634, 1136, 1607, -1038, -1060, 953, -396, -3312, -1137, 3442, 1517, -4628, -3761, 2941, 3644, -3389, -5741, 861, 4988, 7, -5240, -2672, 2727, 3474, 63, -2572, -1962, 1261, 3614, 1616, -2615, -2361, 2422, 3593, -885, -2797, 1625, 3740, -765, -3046, 2203, 5212, -456, -4890, 618, 6188, 1794, -4722, -2400, 3868, 3403, -1870, -2946, 23, 1302]
500A302j035p72m74j126J090K976j083m013k43M582K285l714l386J808L639Q56
516B692j711k529q48L002M290j392o620j412P798M687o842p282M334Q226k228
531D165q215J92P058J124n860k305M346K506k759k050J099P74q17O67P76j850
547a149j203K023K038k439k374K701K806l036l049L450L583l394m298L626N191
562D476k886n607K396N911j303n828R99N491l93m858l33M233O32l485j364K264
578C45J420r05j429n37Q83J529l00k595p84L228J477l906k668M227L892m020n477
595e620L294O681j028o706n89N905K016m476k181L368K434k376k358J619K556
610B539n98k333p02J553J765k35k176j655J657K853m18l475j153L118K160k179
$$ y = [1302, 267, -505, -979, -2105, -1015, 1961, 878, -3135, -3378, 1204, 3489, -225, -3611, -1803, 1836, 2692, 981, -1548, -2396, 606, 4896, 3504, -3116, -4528, 3270, 7957, 1115, -6167, -1833, 6393, 4165, -4050, -3858, 3200, 4324, -1536, -3841, 505, 3011, 252, -1798, -699, 75, -742, -75, 701, -1149, -2352, -329, 1709, -730, -3104, -403, 2403, -633, -3682, -232, 3351, -43, -4341, -715, 4476, 1590, -4017, -1621, 4290, 2987, -2841, -1842, 3649, 3256, -1602, -1935, 2298, 2930, -555, -1919, 345, 1765, 860, -569, -1106, -223, 1306, 1006, -1589, -2373, 855, 2332, -1574, -4242, -15, 3877, -143, -5620, -2326, 4355, 3327, -3379, -3968, 1937, 3953, -523, -2704, 664, 3098, 722, -1636, -17, 2539, 1941, -392, -1094, 459, 2224, 1989, -187, -1842, -185, 2668, 2250, -1225, -2378, 740, 2900, 721]
626G21l076N14K774P34k006j255k02R07J336Q34j940k632J698M277j8n414j801
643d549N601M288m373n914J837O665Q02m767k776K795L077k21k180j411J129K212
659B215O8k910j292K929J977l319l147K714L847k418m426J360M072j046l700R12
675b164L475j305l202J226L537p66l539qL057J341j657j543k93J731K339l46l401
692a518r32M415K884m210m229L796N311k844n761J452N676p46n379k56M684N22
708B865m006j141L223J119k635j626J596J495l95j703j180J027K550M78l462k641
724d436L153M469j772n142K25M927R99m142j318L836J982k814k191K213K340p40
740A589j443L72P70k18q6L00k41n14L89Q14o29j187k4J288K60j355p07N25M52
$$ y = [721, -2355, -1841, 933, 1667, -339, -1594, -1796, -889, 447, 1281, -659, -3291, -1593, 2684, 2666, -2748, -4549, 1052, 5340, 967, -4947, -3110, 3555, 4357, -410, -3186, -391, 2686, 2465, 285, -1126, 3, 2215, 2283, -627, -1919, 1010, 2987, -332, -3479, -765, 3082, 664, -3762, -2402, 1670, 624, -3076, -2164, 1311, 6, -3196, -1970, 1567, 801, -2738, -2746, 311, 1652, -5, -1548, -1841, -110, 2229, 1883, -1518, -2450, 1965, 4849, 639, -3590, 206, 5517, 2673, -3088, -1636, 4040, 3294, -2085, -2341, 2343, 2865, -1141, -2282, 941, 2060, -575, -2201, -605, 890, 495, -1208, -2388, -1361, 1189, 1667, -1795, -4436, -1283, 3186, 1414, -3728, -3503, 1424, 2423, -1719, -3037, 799, 2781, -33, -2224, -11, 2329, 1589, 146, 518, 1288, 1070, 984, 1284, 1043, 529, 918, 1732, 1103, -84, -108, 1180, 1440, 85, -622, -97, 355]
759C55o49p44K86M55k83m37j63k86K27J196Jj974q98K696K179k656k979K140M136
778B602r04m151J52L978P68k739p99J711R37p34j94K26j15j83K36l9k32N7l55
797B22p04M45J174p73k608K60L552Q85m297k422L361L917j797m297j33L669J871
814B325k293k859P37L336Q24l191k178K569L208j447l198Q46L216n64k742M91
830i20K809j11k694j5K558K41k083n03J904Q92j418j226j77J286J316l55k446
847i42j201K174K627k042l313Q95L590jl270j003K528J221j411r26P41J50n02
864f85O01Q62n49j191L01J522L98j445q65Q42J599j64j731q67J566J400o30j492
882e28j90O79M82Rl1n17o11L29R22n0q04L2q8k95M67R87p14j977P19K711l01l293
$$ y = [355, -294, -1038, -752, -297, -580, -1017, -1180, -1466, -1239, -43, -42, -2016, -2914, -218, 1961, -695, -3674, -1534, 2602, 1698, -2453, -2301, 1677, 2445, -294, -1093, 618, 1555, 821, 627, 853, 738, 555, 791, 752, 520, 577, 222, -482, -37, 1137, 364, -2244, -1984, 1568, 2453, -1844, -4266, -905, 3012, 1215, -3082, -3215, 454, 2325, 32, -2827, -2090, 1246, 2070, -1121, -3299, -730, 2478, 1031, -2167, -1321, 1895, 1331, -1411, -920, 1889, 1778, -916, -931, 1627, 1868, -215, -718, 1186, 2078, 660, -566, -743, 543, 1859, 1504, -942, -2143, 31, 2658, 616, -2697, -1802, 1788, 1787, -1483, -2486, 42, 1263, -148, -1074, -333, -183, -685, -84, 778, 229, -962, -661, 861, 1259, -186, -1051, -209, 1390, 1226, -505, -1372, 194, 1594, 964, -528, -718, -39, 443, 452, 421, -96, -707, -378, 544, 494, -310, -278, -366, -661, -194, 793, 79, -1898, -1179, 1532, 1231, -2062]
904b062j09L484P58l180p85K799O46k666l96K833L52k849q19K253J140j496q04
921i01M59K85L53K68q91j194J544K325j513l792J313M657m41m911p62M867J716
938C382m081k108K938J992j651j644J213Q68j008m09R84op82K05N54m83k17P80
956E27j36j187N87J305o06j737O49K272m03k870k18K850J318k580k184J330K637
973A554pk001j570J244K137L78j929j756J193K139O2j628q56O92R86l03j76j07
991E2q0j62R2N77j33m72p3P21R1q59m75Q41J174p51j674R5J821M39j641p46J122
1012d1N24r33k62R73k0j155K73J145k06j277J5J178K00q76RL94J24K2L32m35m60
1033d76Q19J003j195j515J339K351j475k741Q83L298m62l396l13K990P92k708
$$ y = [-2062, -2171, 1313, 2071, -1109, -1894, 905, 1551, -1115, -1511, 1322, 1674, -1175, -1994, 259, 1399, -97, -901, -442, -157, 196, 464, -427, -1621, -77, 2248, 735, -3057, -1744, 2913, 2472, -2439, -3201, 1666, 3382, -699, -2807, 131, 2123, 472, -1172, 41, 909, -99, -508, 476, 470, -312, -107, 447, -36, -253, 527, 391, -796, -209, 1096, 490, -1247, -598, 1674, 1271, -1599, -1817, 1033, 2351, -229, -2413, -1083, 1554, 1547, -454, -2024, -780, 1357, 1735, -194, -1950, -757, 1382, 1444, -184, -1040, -348, 638, 335, 159, 52, -28, -190, -98, 479, 346, -126, -199, 522, 613, -246, -721, 120, 1294, 543, -1131, -1036, 785, 1224, -417, -1163, -41, 483, -450, -712, 261, 241, -914, -641, 504, 298, -979, -964, 214, 414, -462, -453, -59, 65, 87, 419, -16, -476, 343, 1346, 151, -1364, -25, 2326, 851, -1890, -1007, 2291, 1829, -1567, -1880, 1110, 1902, -806]
1049h06q67K062R84j609r85Q79Q30o2m82o93m89J291J107j160j756N81K639l63
1067A101k480j68K593M36k403n77K371Q23j914r59J889P51j481r42J615J088j258
1084D85j697O69J654J62j120j065M28J056O29q80j316J39J522M81j457j162J057
1101d15J629p52j647l14J726Q69j265j076O10R24j88m52M02n2p28K41J178J27
1119H17j301o74J319J250o93j493J13J405M27m49r18k42N73Q44j16j104n71P08
1137a05J179n09j230j67O68M73k06l57m90k05R46Q16q30j525J13K074P75j890
1155d70j608J314K096l27j949n19J534J001o47j061J01J022L83n12m52J27M96
1172E29J02k43k01J66n1k75J09O06k99j049l99J236Q94j137j451M87J740P9j637
$$ y = [-806, -1673, 389, 1373, -236, -1221, -342, 488, 426, -56, -749, -1238, 53, 1160, 0, -1756, -1175, 1464, 1101, -1379, -1547, 1046, 1482, -921, -1498, 873, 1696, -218, -1177, 712, 1463, -18, -960, 655, 1743, 485, -1212, -543, 1111, 1273, 153, -912, -484, 572, 1201, 321, -995, -856, 666, 1147, -310, -1472, -415, 1214, 462, -1185, -1499, 227, 1096, -169, -1245, -635, 289, 101, -351, 51, -1, -729, -488, 690, 817, -484, -1158, 161, 1411, 718, -775, -662, 743, 1170, 721, -197, -439, 134, 978, 862, -242, -813, -105, 1074, 565, -665, -832, -164, 309, 103, -254, -744, -949, -3, 813, -17, -1542, -1429, 645, 1420, -470, -2078, -764, 1332, 1005, -944, -1463, 71, 1072, 425, -636, -535, 487, 870, 358, -94, 33, 529, 631, 388, 187, 353, 302, 27, 136, 742, 443, -606, -1005, 231, 1125, -12, -1463, -976, 764, 843, -794]
1191g94o14J453P55r40j235O77J265N9j053p42R31Q98n9j283q5R42O76o98p55
1210f02N66Q78m64q95L30R32r2j042J60O45K12l27m57J4L10K23L1o18l99N23M52
1231C80l60m59J98K94l57j10M32%q83R0R91M04j297n32R39J196o78j124J45R11
1251A80O18n60o55k34N86P70J7q79m74O10R49r3q23o66L24R84N71r48j423L93
1271g53J564M19j504j222Q95J628k73j538n53R28J146r6j313o22R37J078l94j085
1289g58q3J174L53r79j81R64R6r87K20J067j04j298k51J604O03j409j209P62J763
1308A347k40j702p12J027J554j79j747r21J357J822o48k519K5K258J107k101j592
1325a864J133J900l31j704Q9J186Q4j063m1Q02K76p30j51N55L45o26k48L95O46
$$ y = [-794, -1408, 45, 800, -140, -1375, -698, 567, 626, -427, -1169, -238, 660, 601, -682, -767, 175, 851, 153, -602, -36, 842, 378, -517, -187, 745, 653, -389, -229, 416, 628, 301, -156, -142, 168, 391, 422, -196, -595, -72, 380, 20, -439, -241, 53, -304, -414, 18, 18, -865, -775, 216, 620, -677, -1209, -270, 926, 248, -876, -731, 180, 798, 238, -417, -651, -65, 705, 722, -157, -631, -21, 928, 835, 12, -654, -330, 654, 1225, 277, -1146, -753, 811, 1230, -274, -1496, -601, 1027, 754, -784, -1337, -409, 737, 641, -672, -1294, -357, 721, 327, -758, -841, 333, 686, -293, -474, 490, 586, -401, -181, 886, 782, -516, -767, 837, 1440, 31, -1178, -416, 1347, 1107, -595, -1307, -280, 1274, 1095, -652, -1573, -216, 1606, 958, -1561, -1536, 722, 1829, -272, -1864, -731, 1169, 838, -866, -777, 409, 493, -570, -611, 191, 467, -263, -414, 141, 486, -140, -388, 7, 653]
1344F53j98o12j92M37L37l1m11l81M68J54j19n74J1Q81J35j045m33R25Q08r71
1364a58r41O51J085l79j252K19J373j98r22N8M78J80j57K63j21m62J34Q91j43
1383E99j164J72J111K91j320m70J099O49o43n20P4J73j85O18J1r50l86J113P46
1402A018j354r98J116J237r06j545N81J359p1j100J22Q20j51o35L68P68n21n61
1420d53L57Q14l17o35j31N55M90J96o55p34R9J304O66j219j626J010K007l57k520
1439a149l21K357P91j789j386J047J259m80j092L06N01m70pM27j10l28J0O61n65
1458c38m78O42O43n28o30O62N22o80m49J180M79j430o92J707Q78j482r64J255
1476B97R99r50r45O85N40k92m35K05k08k75M97O76r85q84Q14J000p23j054L87
$$ y = [653, 455, -157, -349, 88, 425, 394, -17, -398, 70, 224, 105, -469, -458, 423, 558, -487, -920, 5, 813, -158, -1099, -448, 637, 258, -994, -775, 598, 400, -522, -464, 14, 194, 37, 300, 179, -283, -149, 742, 599, -565, -393, 718, 1009, -311, -781, 318, 967, 324, -196, -122, 51, -134, 484, 495, -455, -841, 272, 1018, -336, -1334, -218, 1019, 113, -1432, -851, 508, 437, -663, -541, 279, 128, -507, -139, 629, 108, -453, -96, 718, 401, -234, -365, 190, 680, 876, 221, -513, -414, 890, 1556, 337, -1289, -279, 1728, 1371, -1149, -1470, 887, 1678, -111, -1497, -450, 809, 329, -763, -457, 44, -426, -433, -6, -116, -444, -434, 227, -338, -816, -174, 469, -59, -689, -27, 495, -185, -634, 546, 1025, -405, -1097, 610, 1488, 6, -958, 297, 1296, 346, -599, 86, 626, 334, -101, 104, -104, -379, 118, 794, -191, -1075, -261, 739, 16, -1038, -651]
1495f51R04j83o93KM64l5k52L09L07p13l5O63L91m40n09N24O19n38m15M98O32
1516H49n39p11O89O27m72r35O39Q53m53q97K04O32k30n39L66K81n42n54P58L06
1536C32o99l59P23N9p06O2O61j07r05L28J440m60j711K99K124K07k177o53K020
1555D78R97j392q98Q16Q47l84l48M7j70O1Q12O7j353n13J502R88j369j390J035
1574a67J167p59j300O72J062r65q67Q76Q84r03q80J061Q12j148q11R31Q53l16
1592B02r68K93O11j41j6K02k99l57P65O17n80r23L83J279k23j153j66R83L51p65
1612I5j86L12o7l83K76M11n19m35L89N40l21r24M62N94k99n45L98K69l51l60N42
1633a02M15o08k87N35L52l76n02N45K62n7k86P9J32RK53J03l38m92N20N46k96
$$ y = [-651, 253, 70, -623, -621, -157, -192, -444, -135, 172, -541, -576, 87, 478, 38, -471, 53, 672, 134, -281, 217, 849, 310, -401, 288, 915, 443, -492, 147, 1000, 547, -350, -146, 486, 256, -283, 83, 364, -178, -732, 26, 332, -367, -726, -3, 56, -650, -588, 73, -34, -939, -611, 829, 369, -1342, -1043, 1081, 1288, -889, -1542, 478, 1475, 83, -815, 1, 848, 464, 116, 163, -7, 54, 866, 933, -420, -933, 569, 1557, 188, -1202, -167, 1000, 241, -1059, -387, 675, -290, -1157, -281, 603, -300, -1180, -119, 693, -455, -1266, -335, 518, 202, -766, -473, 138, -3, -19, 183, -116, -473, 292, 909, 329, -594, -211, 1068, 845, -308, -474, 509, 860, 95, -91, 221, 154, -229, 47, 458, -61, -496, -107, 433, 112, -812, -350, 244, -55, -600, -202, 67, -284, -644, -102, 313, -295, -582, -47, 305, -71, -573, -28, 234, 177, -109, -30, 102, 111, 364, 467, 129, -363, 157, 703, 407]
1654D07q29K94Q46J57j208k74R50M71p29n83J95O62k73l20r9K11J25o8j31LR7
1675i6K08l63l32P1Q11O7p65k63Q87L91n54n33M63P08n46m85L54M76j72m92K41
1696G6J79r2K8j11p3O1j7j8RJ03Ok69k38M25M6j24m18L3M55J84k41m23jM93K69
1721C42n61k74K88M67j58l88K14J61j17O0j4L4j82J80K85j33m83Q8P52q5n52k73
1743c49M96J69l20k46J06J11J8J98j37k54n9L50K99n10l08L59K21j27j20N2J01
1764E0l14K38M80l09o66J87J054J0q41m44N21P35l26p25j51M82N65j50n77k03
1784c84K76O14k48n77j36M90M45m97n53L83M56j56m83Q1N89k38m13N3O45k49l99
1805c01q4O05J79n44j83L63L34k29J9j69P3J34o4L1r3o6J33L6k22n6L07n2l09
$$ y = [407, -422, -128, 718, 875, -333, -607, 343, 814, 85, -498, -303, 359, 86, -234, -333, -122, 3, -65, -196, -193, -96, 112, -251, -583, -512, 299, 366, -399, -662, 225, 616, 62, -471, -8, 700, 154, -331, 23, 499, 327, -165, 76, 255, 163, 191, 80, 7, 68, 51, 33, 42, 145, 151, -118, -356, 69, 115, -9, -427, -394, 61, 245, 4, -419, -420, 73, 342, -219, -493, -205, 262, 104, -284, -70, 91, -26, 34, 20, 54, -128, 52, 337, 204, -279, -191, 561, 476, -76, -349, 147, 316, -4, -250, -144, -33, -15, 183, 46, -208, -267, 83, 382, -128, -436, -77, 144, 17, -103, -51, 50, -264, -26, 454, 145, -521, -334, 720, 730, -111, -555, -34, 701, 375, -350, -501, -19, 546, 396, -181, -384, -108, 506, 258, -319, -455, 35, 480, -17, -570, -187, 269, 113, -370, -289, 300, 62, -351, -298, 347, 98, -301, -385, 220, 399, -145, -328, 35, 369, 140, 159, -10, 63, 197, 133, 164, 71, 5, 138, 174, -48, -104, 203, 151, -158]
1828a58j34M46K18o05l20N25M13l39m85J81M06j27m94K25K44J81k30p6J30J22
1848A23R4k10n8j00Q1M12J40m29k46L94M6M3k32q1J84P6j1j03j24q2J07J48j58
1871A4l01P9K73L8k96j83K52J87l11J02M1k48R5K12K83l33m52J75P51Q4o71k57
1893d66M26N32j13n19k71L11O52ko47l11L16R38k70q01j95O69L34m82l96K15M71
1914C91j99k17k18K23K2j38J7K7q0j40M1K44K5l06j11J64M48q5m05l71M02O32
1936C66J47q25k01O50N86l81q21K54O53J65o47l20N21L35k51l89J71L31j35j98
1956A1M5rKn3j29N7J14O4k05k07j20M81l3k83j82L39L86l89l13Q6M35r8l25K10
1980a16R4l5j6K26j06l01L11L28r3n09J82N75k39m59k4N80j14n13K70L74l33m05
$$ y = [-158, -292, 154, 372, -233, -553, -28, 385, 46, -439, -258, 148, 21, -473, -248, -4, 177, -53, -129, 1, 123, 217, 7, -51, -151, -70, 342, 482, 53, -193, 201, 247, 290, 58, -23, 161, 237, 226, 123, -1, -83, 24, 172, 14, -287, -208, 65, 103, -193, -376, -124, 63, -248, -146, -105, -353, -258, -46, 237, -96, -548, -373, 378, 462, -209, -466, -40, 492, 379, -140, -411, -100, 552, 550, -97, -408, -92, 846, 576, -225, -420, 249, 583, 101, -295, -80, 391, 192, -25, -243, -20, 2, -136, -119, -92, -172, -312, -271, -27, -2, -308, -419, -255, 193, 108, -297, -668, -266, 366, 513, -312, -513, 137, 723, 342, -479, -225, 428, 593, -54, -374, 147, 482, 231, -158, 13, 344, 209, 11, 56, 47, 49, -4, -133, -76, 38, 102, -103, -310, -430, 51, 18, -265, -447, -108, 278, -111, -424, -338, 97, -1, -326, -116, -22, -57, -73, 153, 47, -254, 57, 385, 292, -217, -35, 540, 301, -158, -182, 398, 284, -229, 41, 415, 82, -323]
2002c23R5N61k54m67L39K75m18q8K06R6l71M9O48l6q94n7R34Q4q28k98R49M41
2024F43p49o39O96M84j73l51j95K05K14K99j55n09L7M43Q7k93j41J83J9r3k9K02
2046A85k15l63L00M15j45n46k07O01N04l02p26j58Q32L72n42o27K62O79no06j35
2067d27N73Po6j51j8N2J11K11n9m55J21M31k2n46J02O48l23m82K81M92l30o49
2089d99L50O52l04r14L63Q43l34n71J65M96l25k62L86J74n40j0O86o5p53K65N93
2110C96M6p06L6N74j8m78J28L04l19j88O26k7p55q5Q83M54r90n09M47P37n38l09
2132b91K92J42l07r8L28Ml50j4J87m5K76l8r9m45L13N24j62o19MP81M4n64k62
2155c99N49N7L8l12K0J01L0M3k5k01J50M0n8k5plj89J61M62k45o58l7O43L24p34
$$ y = [-323, -228, 333, 79, -388, -49, 226, -192, -280, -74, 22, -349, -300, 348, 312, -582, -639, 295, 379, -449, -747, 202, 643, -106, -745, -49, 435, 262, -89, -284, -79, 135, 434, 279, -230, -193, 250, 337, 44, -97, 86, 105, 12, -17, 185, -30, -393, -93, 322, 177, -369, -576, 25, 529, 227, -499, -657, 175, 547, 5, -622, -360, 319, 314, -292, -427, 146, 153, 87, -64, -82, -30, 81, 292, 233, -222, -101, 330, 308, -238, -136, 512, 189, -293, -12, 480, 150, -499, -149, 503, 199, -715, -352, 491, 157, -414, -249, 247, -78, -340, 46, 220, -320, -330, 356, 291, -462, -197, 396, 442, -264, -228, 346, 328, -150, -22, 282, -37, -225, 401, 374, -381, -466, 417, 871, -119, -628, -181, 556, 18, -291, 1, 143, -164, -262, 66, 70, -280, -294, -107, -152, 124, 86, -13, -458, -145, 379, 217, -402, -398, 383, 427, -137, -399, 150, 207, 245, -67, -47, 54, 84, 127, 102, -99, 51, 91, 33, 8, 1, -2, -191, -30, 432, 187, -471, -508, 135, 459, -275]
2180b75l09M37K80j98j7j22r6L85K59k82n94K23O25o2p32J64O32k3n71J28N34
2201C86m5m99J66M66k68l21K25K45l10j90K14R2j72Q5L16m58n02M33N29k42o90
2222e40J31O93l2n61j62M06k0j9J35j06m48LR67L1o88n16Q67N57o07n66L05N00
2244C30O4l02j55P1K03K91j97o50o4Q47K83p76m43N09M71l20m60J20M16l11k11
2265b84L52l3k09n5J50J52k75Ok6J72j57R3k5j8J86o5o7k25L91L05k23m00Q2N56
2289C83j25l00m5L19k6l00R5M8J91j11j71j8K18J74k56l89K41L68q5l71m03N33
2311c0L90l37n58L09L10O8k69l41L49K29o2l07Q4J79L4Rk91J62L70k14k03O4J76
2334A21K7k90K11J32J09j65j65j41K97P8M5l92m9K38J53L0m13jQ4K82J2k28n06
$$ y = [-275, -584, -147, 133, -65, -82, -204, -300, 85, 344, 62, -532, -309, 316, 254, -478, -314, 318, 295, -276, -148, 386, 341, -158, 8, 474, 206, -115, 110, 355, 45, -145, 69, 161, -11, 74, 390, -68, -570, -137, 392, 150, -540, -409, 284, 252, -309, -471, -65, -85, -104, 31, -75, -523, -520, 447, 478, -210, -726, 141, 698, 91, -475, -170, 330, 394, 92, -63, 8, 211, 502, 305, -345, -409, 438, 721, -55, -498, 11, 482, 162, -298, -178, 238, -73, -284, 68, 35, -174, -229, -79, 73, -202, -196, -222, -50, -207, -114, -139, -157, 29, -36, -103, -328, 63, 368, 145, -255, -173, 383, 258, -42, -87, 232, 206, -94, 1, 49, 240, 129, -42, -60, 158, 332, 76, -313, -72, 296, 211, -160, -563, -30, 360, 23, -535, -226, 84, 152, -117, -458, -109, 120, 58, -249, -165, 14, 48, 57, -234, -72, 298, 84, -119, -55, 121, 148, -142, 69, 201, 310, 145, -20, -161, 136, 214, 259, -133, -182, 56, 209, 239, -174, -175, -91, 191, 203, -25, -531]
2357e31K08P06k2n98m66N23O95m19o09J35N55M24o35l95J81N78R2l05n67J63N70
2378B83K72n59n80N88N10l5o03o6L51L8l0k26R4K1j94J81M6j45k06J44K95j06
2400G3l33j9J97K63k50k65J28M05j02k97q7K40J75j0j06p6J60J26k42r6J28K41
2422B53j42k98mM06K66n01k91K13M85p1n16k5M56O0j66l56N8K29L7j98q5J86O8
2445F4J9l22m7K71R0K9m32J89L98k65k27J44K22K7k05M5J34j20l5RJ69M7j43L4
2469I5J72k22r4J43J99r3k80j15K53J94j41n70J70M74N1m84j3R0M59j67n33pL73
2492d6L29k14n59K42M28L51o64k46K80M44j6n27J5P5M22q4k13m2j14L13K15k85
2514A04l49J26J44K42k49k10O7K30J2l1j78l6J37J30k42j38q2N64j4o31NL97L70
$$ y = [-531, -323, 383, 361, -237, -703, -180, 515, 96, -513, -378, 177, 601, -34, -429, -248, 330, 422, 117, -450, -287, 283, 555, -4, -584, 4, 514, 479, -124, -190, 161, 199, 169, -57, 37, 58, -136, 45, 91, -54, -260, -116, 179, 73, -260, -279, -82, 181, -69, -334, -206, 199, 97, -200, -287, -47, 128, 118, 12, -64, 96, 222, -20, -116, 12, 253, 111, -187, -191, 215, 481, -20, -311, -98, 387, 316, -200, -225, 231, 291, 125, -231, -173, 56, 93, -105, -190, -4, 64, 83, -239, -286, -15, 75, 104, -328, -139, 259, -6, -233, -89, 133, 160, -45, 0, 134, 14, -21, -12, 157, 204, 61, 95, 267, 45, -49, 94, 293, 200, -80, -195, 58, 252, 111, -459, -289, 185, 236, -248, -261, -171, 288, 121, -412, -419, -46, 283, 69, -490, -248, 180, 531, -133, -379, -99, 345, 329, -198, -183, -108, 314, 230, 17, -25, -139, 174, 389, 104, -245, -119, 25, 267, 18, -192, -125, 105, 117, 86, -92, -128, 9, 139, -103, -241, -323, 241, 227, -404, -399, -2, 368]
2537C68l75l34M2N66m3l33j73K88K19j11l28J70L03m7k16j85J79L04o1m41L0L73
2559A95K04l13l22N3N44k14l15j23K50K88l60j87Q2L34n7j73j48K00R4J54j98
2580a2j71q9K95K46l1n18o1M13K85k57p4j28J77K60j30k00j95L61M3k04j95J80
2602eL14q3n20o1N14K64l15m48J42K83J7k94j06J28K53l8j98J0J44J58j06k27
2624a74j0J87L48k88l16O6K12J79j65j77J33K09N3j18r2j51J38K08k1l07j8J77
2646G3J98m0m13P2L01M9k77l24K22M52j69n42L4M68L4j44l07J6L10K45m09k5J07
2669f9K05j13k15R3K53J5l57n3O12J60m21k17J0N57j60n96K32J01K41k03j19k66
2691c10K46K86o7k63k05K20L29r7m56N6K06K68j52l52M5J35L30j33q1m22L64L68
$$ y = [368, -7, -341, -299, 267, 224, -109, -282, 6, 225, 114, -214, -44, 259, 212, -4, -189, -10, 294, 233, -208, -178, 195, 399, 86, -236, -183, 361, 147, -168, -291, -41, 247, -113, -300, -218, 116, 59, -114, -262, -62, 32, 186, -12, -183, -272, 23, 269, 238, -280, -341, 72, 357, 100, 26, -102, 75, 335, 205, 5, -190, 171, 214, 10, -185, -5, 309, 226, -294, -355, 159, 423, 108, -340, -198, 85, 102, -192, -298, -170, 83, 45, -153, -143, 1, 159, 53, -174, -184, 3, 351, 63, -253, -187, 25, 204, 39, -138, -5, 204, 257, 139, 47, -104, 34, 242, 221, -86, -104, 73, 271, 231, -182, -110, 191, 240, -37, -361, -139, 313, 144, -398, -364, 104, 138, -6, -313, -297, 13, 258, -151, -176, -69, 136, 23, -192, -99, 154, 169, -188, -241, 371, 531, 110, -107, -97, 460, 300, -296, -64, 37, 278, 75, -44, -310, -64, 222, 155, -108, -313, -93, 236, 139, -317, -261, -55, 213, 61, -291, -246, -111, 219, 86, 5, -417, -53, 315]
2713C15j4m09l45M12L50j42l66r3M86J29l67j8N2J41O0l35o6K95R6k26j65J20
2735i0K74O0l67k2L0K99o1k71j3J08M7qr0QN6J19j60lN6O3K2q4j17O9K15L3J5
2762A88k66%J42J51k35k32P8L33J83l13j40OK45J20k19j29J12K58k5o25J14L77
2784A23R6l17m85L17O92k87m69j5L10K61l01k72K08K33rk21j17K31J75J2k63p8
2806a76L36L4m8k94M8L70p8q7j57j6J13J60j10j77R5p1R3M9j92K2J00K18k30l20
2830c18J15J96J40k67k81M29J13l1l98j07M25J31q8k73M7J54J91k32j34N9J16
2851a3K85j13l86J69L95k65j56j99M65N6l48j0J33K05j60p0J26p7r8R9J18o9j70
2874h3R9N9l6j93J10J48j84l6K4K12j49j30K03k35O5J37J94l02k15L60M26l27
$$ y = [315, 301, -108, -453, -41, 309, 167, -199, -292, 194, 323, -44, -62, -10, 131, 191, -144, -210, 85, 181, -45, -210, -90, 184, 244, -123, -145, -115, 184, 123, -148, -161, -53, -6, -14, -104, -96, -40, 79, -81, -84, -28, 35, 57, -27, -144, -75, 140, 173, 188, -78, -78, 64, 215, -20, -252, -174, 159, 342, 29, -111, -105, 140, 260, 41, -88, 24, 282, 257, -368, -254, 123, 219, -98, -583, -266, 426, 139, -330, -345, -35, 226, -75, -347, -139, 94, 85, -136, -253, -22, 153, 165, -98, -176, 160, 194, 146, -148, -100, 270, 192, 105, -52, -68, 45, 205, 95, -82, 13, -58, 35, 84, -108, -86, 14, 232, 2, -318, -203, -7, 133, -134, -415, 14, 127, 96, -302, -409, 16, 147, 59, -214, -167, -13, 178, -54, -188, -129, -13, 272, 159, -227, -58, 337, 72, -84, -283, 182, 238, -110, -120, 13, 218, 58, -12, 114, 37, -61, 38, 156, 87, -83, 16, 75, 39, -154, -44, 104, -80, -116, -92, 120, -29, -159, 44, -191, -126, 11, 205, -97, -312, 48, 474, 147]
2896A47m91K67L94Qn55R7K75J80k82k75J83L44Rm20j68J12L96K4m71j03J90M51
2918C12k27m31R6L37k7n3k19j7L63r0j11l8J69J68j21l44K29P9r2J26kRl02K82
2942I6J91k12m66L05L25km32L0K50m1k04J6K12k2j4j66P3r6K49N8k71l39M21L07
2966B68j69n39K5N78J14l07l57L90M8M6r0K3l3n8J43J35l31J66K09K2m18M2K44
2989A51J07k13j97J90m7j08N2N3N5k45M1L09k15k46l6M16k0j13j11K48j6k78J04
3012a19J21J71j23n7N4Q3l6M6j50o9K22O6k46K1N3L61k11l14pL79q9j48k07J60
3036c9L23j52l91J82M3J55ol59J14J06M5N1j66mK4m2K19n9j23j43K56P1j33j54
3060a82J69J34j45J8J43j34L1K9m6r0O5J90m5k40j0L15rk22j51M42p0k15l08L45
$$ y = [147, -344, -77, 317, 325, -230, -133, 142, 322, 40, -235, -52, 292, 301, -119, -287, -175, 221, 245, -226, -329, -139, 312, 85, -346, -250, 87, 60, 7, -212, -229, 134, 44, -67, -105, 64, 232, 111, -233, -4, 75, -17, 109, 107, 116, -186, 96, 287, 75, -391, -86, 239, 237, -195, -165, 85, 44, -160, -144, 68, 46, 32, -134, -61, -157, 92, 150, -121, -460, -39, 268, 99, -440, -415, 163, 277, -30, -387, 3, 51, 97, 7, 30, -3, -61, 82, 217, -114, 52, 261, 283, -135, -93, 151, 258, 45, -152, 38, -9, -117, -65, -12, 43, -202, -161, 148, -67, -313, -349, 67, 47, -66, -177, 71, 55, -223, -119, 2, 173, 50, -7, 47, 130, 94, 140, -10, -79, 143, 209, -37, -16, 37, 398, 187, -127, -134, 245, 156, 8, -199, -39, 284, 132, -259, -77, -34, 121, 115, -244, -130, -24, 21, 72, -94, -98, -74, -116, 103, 44, -79, -222, 34, 105, -28, -182, -13, 121, -24, -6, 137, 3, 34, 63, 17, -73, -8, 182, 137, -103, -113, 202, 193, -29, -180, 262, 192, -23, -331, 14]
3084A4J59k27j94J20K77q2o8r9j03P5J17K6k58r4L29L04l97J1J48J45k65j4K54
3107A78j6j75K0J06l7mj76K44N8k52K9J07J53k84p5LK28qr8j32j06J74J56oj89
3132a02r1J89Oj47Q9L1Q6j34j6nK81j66j15O6K87m3l20m2K08K34k07l32L20R4
3156A71J05j89j96J21L9J11k38j08K45J5J21k06n5J48o0J21k41J2P4N3p5K03j36
3179C5j75J25k7j9O4j49J94rJ3k07J4K75j08%r7R5J10l9q0q5J12J3O0j46q6J82
3205F5K6k16J01O4J00k32l8J03j8m5o3J1L41j09l13J4J86J1o3lK13j92O3L5L7
3230G8O8r8n2K7q1J30n5J31q1m2Jj78P7J78r2q9m1M0K96k25j40L6K59j30%o7k0
3257g0O3p2q3J17M3j5j18J03J53r1q0j24K13j1L6r6M0J5P1n2j36J00p5Q5N4j49
$$ y = [14, 173, -54, -248, -128, 149, 67, -1, -100, -203, -128, -11, 15, -243, -337, -8, 296, -101, -90, 58, 203, -62, -76, 178, 162, -13, 7, 113, 76, 72, -104, 140, 198, -54, -25, 82, 235, -49, -124, -121, 107, 99, 1, -131, -237, -63, 93, 87, -102, -193, -4, 2, -145, -56, -25, 61, -73, -89, -94, 187, 21, -94, -28, 259, 216, -104, -146, 62, 296, 89, -243, 77, 171, 276, 87, -109, 12, 51, 162, -76, -184, 61, 76, 197, -9, -64, 84, 24, 145, -96, -84, -10, 43, -32, 171, 35, -140, -15, -42, -61, 3, -146, 48, 39, 52, -155, -141, 134, 26, 26, -71, 24, 134, 95, 15, -70, 42, 55, 115, -31, -117, 65, 91, -125, -24, 40, 140, -92, -130, -27, -45, -90, -153, -142, 199, 90, -223, -209, -23, -12, -75, -78, 135, -57, 6, 41, 78, 146, 48, -4, 23, -58, 72, 17, 148, 67, 25, 26, -152, -75, 103, 11, -78, -119, -79, 217, -8, -148, -112, 147, 17, 17, -50, -70, -7, -79, -162, -45, -2, -17, -135, -32, 121, 30, -50, -174, 39, 28, 64, -32, 8, 23, 94, 42, -94, 6, -69, 16, 70, -79]
3283g9J34J15k3k30l4K87j9j7j47M8P2j60K6l9JJ26m4j1J19k11P5j9Q3j33J21
3308D1j63K11m1Qk43R1J44oM0j89R0P7k5k00M9J82R7k78q8K12J9L7m6m7J18j64
3334g4l7R3J16j02p1p4K42p5Jj31J02l7K9O1p9N7n5Q8j35oL8Q9m9j19O9P0j7J4
3362HN7q4N3j06J58o0j00K4%K70k06k7j13J50J72j6j43n8PK49j72k27k5J59J03
3387G3l4j30K2K46j57r8QJ3J39q3j8P7j94J11P2K9Oj81k5J56J12j05j66J52k2
3412CP4ol5P1p7m9o0Q3R7j06k0J36j41J09r1n9O2O8r3N3j64J11R7j7j19jK08l6
3440I8j90k9K16o0j26N3l0J37j20J6j11J49J80r0j5j75n0K13m4k2Lo1J86j66K47
3465B09j30J3k22N4Q2m4r0K4J12P5j34n8J30J1j93J04N0o6l1J03L0j45j9J37J05
$$ y = [-79, 55, 170, 147, -83, -117, 170, 151, 134, -13, 35, 107, -53, -27, -66, -65, 61, 17, 6, 125, -86, -11, -30, 53, -80, 41, -122, 89, 48, 56, -187, -96, 48, 42, 82, -107, -17, 60, 35, -165, -116, 66, 163, -115, -203, 9, 28, 65, 19, -28, 90, -74, -111, -18, 98, -4, -75, -149, 93, 18, 19, -112, -10, -47, -18, 43, -36, 21, -34, 54, -81, -87, -49, 40, -9, -128, -59, 11, -6, 8, 65, -19, 34, -72, 86, 26, -74, -50, -50, 220, 14, -13, -126, 24, 196, 180, 37, -21, -14, 235, 63, -164, -189, -30, 73, 39, -91, -69, 177, 20, -78, -70, -57, 82, -1, -19, 58, -136, -25, 47, 76, 82, -99, -124, 32, 144, 39, -127, 25, 3, 77, 71, 36, 107, 30, -19, -79, 4, 101, -5, -25, 111, -30, 79, -12, -71, -9, 59, -34, 19, -145, -34, 63, 46, -73, -74, 134, 98, -92, -121, 95, 35, -91, -38, -68, 69, -51, -35, -146, 3, 183, 93, 78, -97, -147, 66, 22, 0, 3, -58, 128, -38, 209, 79, 92, -130, -76, 6, -38, -128, -104, 8, 83, -51, -109, 21, 32, -161, -57, -7, -73, -104, -1, 29, -116, -135, 2, 107]
3490A07j29o8L4MN5J06n2m0j62J17J44n7j55m0K07J37j08p9p9J15j05J39j39Q4
3514C6j12O2m1O5m0M5J3l4k08J80P0mokK9j02K3K8k9J13n1PN1p8m8J6R0j12LL3
3544cLLj27J95j26J12oj29N6m8J11Q6j31P4j38p7J37o2K8N9l3j18N5o6J57l2k4
3571d4P2o7Nr9J85L6l4j64P9J1K5K8o1R1Jj78L02Rj21j47K0O0L5Lj16J14j89K14
3599G0j11R3k09J25J87l25J48O7j13m5K4%M0n1p9J89rn9q8K57q3j02k8k2R6O3
3625C5nO6q5J0R0n3j55L8JJ5R1l3J6n4M5o6J40O1j21l9R0J1o2j14OJ26n0n4j12
3654a62L04k82J11m7J60j05O7m7J2j5K4m6J10Kk0m4pJ3K6Q2j92Ql4J43l3L5o6
3681cO2k1m5r0J00n1J1l0K1L3RO8j25P0M6n4q3N6j38J26J6J26J4n9jP5q8n6kJ42
$$ y = [107, -22, -90, -56, -52, 3, 109, 57, 17, -145, -28, 116, 59, -96, -136, 71, 208, 100, 21, -58, 57, -48, 91, -48, 36, -76, -14, -55, 10, -30, 15, 28, -6, -214, -34, 36, 32, 26, 24, 53, -49, -26, 2, -27, 86, 35, 42, 93, 15, -33, -17, 73, -39, -36, -3, 0, 3, -124, 71, -55, 57, 51, -78, -22, -70, 41, 127, -4, 70, -68, -145, -8, -70, -42, 17, -16, -134, -79, -145, 12, -20, -44, 28, -39, -34, -133, 52, 88, 54, -110, -31, -20, 5, 33, -28, 63, 64, -114, 188, 197, 76, -71, -51, 9, 44, 47, -69, 45, -144, 70, -41, 52, -157, -32, 155, -170, -22, 45, -68, -113, -89, -89, -49, -100, -179, 10, 1, -58, -146, 111, 28, -74, -102, -124, -28, 35, 30, 96, 11, 21, 111, 58, -97, -59, -58, -43, 48, 15, 31, -23, 22, -44, 96, 157, 36, -3, 87, 98, 36, -78, -72, 54, 4, -50, -162, 142, -140, -29, -76, 84, -21, 46, -1, 11, -4, 20, -26, 84, 86, 66, 22, 15, 28, 54, 136, -56, -48, -82, 61, 28, 63, -3, 59, 38, -7, -97, 3, -48, -37, -67, -46, -13, -4, 64, -61, 9, 55, 1, -82, -26, -164, -38, -22, 104, 118, 59, 58, 133, 45, -11, -13, 129]
3711A29j64M2N8j28K8J54r5O6k09K5Q9N7j65P1N0Ljm2k2J75j30P9q1n2kL6k7k2
3739g8L6J8M2PL3O1j46J27j8p3M7o3o8L02n4k30J3P1J14k8r4j52J99P2j34oL9
3766C7N5j43J23Lp2q2J04p8J4j12O5M5n8J73p8ml8P5N6o4j96K08J6m9J4nk8J22
3794A03j6k1j83K67j83lJ44l3j06J38n3r1J92j38M6n7J1j16J48rp4k3mQ2OJ43
3820A70j76j17P2lJ29j12M5N5j06nM5j01J12n1J22q2k6J69j80k0o9K55k15qJ34
3845C7K6o9j96K23K2q3m6oJ7K00p4J7j40J18k1R7j30l7m1RPoR8n8J21j72J37j40
3873i0J41j27N8J12M6j99lRP5Qk6Q5j28J52k6j25J20r0Q3L7p8m4K2l1J26l6n0
3900B1J2q2M5K9j06nK45j23j23J10o1kL9j36O2R9N7l8j7k9o1P0l0KN9j08R1n1
$$ y = [129, -35, 7, 65, -63, -35, 119, 24, 90, -119, -94, -5, 52, -113, -42, 8, 11, 10, -32, -54, 121, -9, 70, -11, -63, -65, -29, -56, -78, -42, -24, 18, 25, 58, 119, -27, 100, 82, 9, 56, -7, -75, 227, 173, -57, -44, 27, 141, 113, 19, -133, 66, 138, 4, -2, 37, 92, -51, 72, 75, 3, -79, 25, -53, -39, -151, -86, -41, -99, 74, -4, -8, -46, 29, 85, 21, -175, 33, 49, 0, 14, 9, -19, 103, 87, 66, -117, 150, -33, -36, 108, 75, -31, 107, 54, -37, 155, 17, 63, 6, 17, -99, 49, 40, -34, -57, -61, 21, 27, 170, -6, -123, -51, -54, 75, -37, 8, 63, -43, -48, -3, -104, 8, -43, 79, -3, -29, 140, -40, -60, -129, 126, -89, -97, 37, 63, -6, -202, 21, 43, -40, -86, -92, -75, 125, 51, 68, -72, 46, 25, 122, -8, -45, -86, -77, -70, -76, 22, -36, 85, -87, 50, -90, 51, -76, -18, 94, 140, -59, -62, -53, 22, 30, 4, 89, -39, 113, 87, -38, 82, -8, 75, 112, 34, -10, 12, -19, 107, 71, 21, 33, -49, -4, 25, -81, -86, 159, 36, -87, 23, -38, -40, -1, -137, -75, 24, 81, 43, 26, -3, -64, 6, -24, -22, 37, -71, 20, -31]
3928c1J20r6JJ4J9q5J41q0l5R3j8J3j52K1J8M1n5RJ5J27M3j73M8qJ1k6J9l8M0
3957do6P3N1p1n1L4K6j05J25J4j06J23nm9n6J00p7J17n8j91L36o9j25MP8n6K4
3984A6p9JP0l9l1Q0m8m6J22k1n9N0j18n8J13j36J64R0o1K7L9n6q5R8p5Q2j4qk2
4013dN6j9j35J28Nj00K7J17n2K5j5k2q1J11R0k10P1q9J29j65J00j53L41r6j05
4038d6J1k5K17k13o5M6J4Q0m0R1j7k3o7n5J91m4p6K7P1j7p9m4o1M0N6J9N5p0k8
4067e2P5K2m3q9p5J61n9Q6j19J45j38J73j48J33j61j8K6J41j09p4J42n6o5L6L2
4092c4J1m6K3n0M7K8N7L5r9K0L6Mj10J9J68n8j26R6N0p3P2j1j0j00J18r6j48K44
4120F7q3rk9J05j18p8M4M1J64j79j0k0M8L8o2P2l0k1J39l0j35l6J7J50m7P0m4
$$ y = [-31, 89, -7, -6, 8, 27, -58, 83, 3, -32, 61, 43, 56, -96, -75, -57, -16, -71, -62, -47, 80, 123, -50, -2, -10, 1, -25, -6, -44, -4, -70, 3, 54, -17, -68, -34, -8, -113, 12, 26, -80, 43, 38, -11, -67, 33, -44, 73, 15, -176, 160, 91, -34, -30, 48, -8, 16, -63, -62, 8, -31, -62, 18, -30, -76, 46, 25, -34, 16, -102, -160, -47, -183, -19, 71, 10, 37, 76, 20, -65, 33, -42, 40, 26, 18, -4, 52, 33, -102, 26, 31, -69, -42, 75, 23, 48, 33, 11, -70, 41, 131, -79, -8, -97, 32, -133, -33, -186, 155, 59, -46, -35, -60, 157, -56, -121, -75, -61, 19, -21, 70, 53, 30, -37, -92, 99, 55, -21, 6, 77, 60, -19, -63, -124, -84, -28, -9, 46, -24, -52, 23, 45, 2, -87, -162, -1, -60, 26, -93, 52, -86, 87, -61, 72, -89, -107, -81, 60, -49, -123, 19, -37, -102, -66, -34, -23, -69, -46, -96, -49, -21, 36, 71, -28, -8, 28, 32, -78, -59, 109, 51, -75, 21, 71, -2, 70, 59, 49, -51, 67, -29, -177, 67, -16, -25, -54, 51, -67, -145, -101, -60, 104, -75, -85, -105, -57, -19, -81, -9, -39, -60, 79, 49, -86, -122, -105, 45, -2, 68, 24]
4147B4l2R2m5L3j13O6MP1q7p4Q6j93J52%j05J80j40O8J16k2j05o3J06J8JL0q9
4174b1J07j3p4L3k17J66J51j29L8j1m0Q4Nj29k1R3mN4Rn6QoL1n7j3l4P4j14N4
4203c2J08j06R8m7r2L8l5PJ59j04p1P7J8q5M3M3l7M9m8O9o3J8noMn0J20j8L6p6
4233A2P9jJj34J97r8m9m6QO6j33J00o0M2k6N6m0J19j81N8J00j74k2J80J09j34
4259B9r2O4J08j04k6k5j6M5k7Q9j2j43J49O0p1M9j53J88j28Ljk18K65L0l5lj4
4286A1K0j49J06mj0K6P5j32o4J77p2pj18R4N8K0L7Q1j74O0O0p8K6o0O7j31J59
4313G8j11Q5L6j50L0L5p7rM8J43j74J27N1j98QR6R5m7k8l8k1p8RR5r2PN0P3j39
4342i6Q8j45J14k6J42j71J15J81k58l8J17j08L0QJ33n6m1kO9o7R4k0m8O0j47Q2
$$ y = [24, -8, 84, 39, 72, -41, 25, 29, 100, 13, -61, 25, -168, -16, -16, -121, 59, -81, -13, 103, 81, -24, -87, 19, 37, 38, 68, -21, 86, 73, -1, 32, -185, -19, 132, 3, 41, 30, -10, 74, 79, -50, -71, 22, 18, 72, 81, 25, 33, 27, 58, 1, -12, -46, 28, -86, -32, 76, -30, 68, 21, -71, -33, -68, -61, 98, -6, -77, 0, 18, -67, -24, 19, -18, 31, -17, 52, -11, 7, 2, -4, 0, -50, 70, 52, 88, 12, 91, 90, 91, -43, 154, 56, 7, -39, -31, 35, -98, 2, -58, -16, -42, 14, -26, 93, -88, -30, 70, -104, -126, 54, 163, 29, -63, 1, 109, 5, -21, -46, -62, -17, -44, 45, 33, -110, 39, 99, 28, 77, -76, 112, -16, -13, -14, -232, 33, 63, 28, 25, 11, 31, -118, -12, -16, -26, 0, 75, -57, -121, 56, -16, -23, -141, -47, 11, 31, 68, 149, -25, 35, 95, 17, 43, -17, 50, -81, 78, -33, 52, 88, -62, -32, 3, -74, -83, -35, 108, -66, 61, 112, -86, -78, 18, 113, 66, 38, 0, -21, -99, -90, 5, -87, -80, -30, 43, -96, -8, -153, -39, -65, 77, -94, 21, 202, -56, -94, 23, -85, -55, -47, 86, 30, -11, -13, 56, -11, 83, 63, 15, 75, -72, 10]
4368A0n3o0J03J2l2k7J8J59j19j22K10nj73M2M2N8p3K5R3k05J12N2nj28N3q0J7
4395g6P1L0L2l2q6O6K9J31p5o2n1o2K83k29J3J34j83Q4k1p9mR5M0q5RP9m5L3j31
$$ y = [10, -43, -103, 0, 12, -20, -47, -29, 130, 11, -111, 99, 94, -79, -37, 5, 63, -10, 15, 108, -97, 15, 67, 62, -66, -13, -93, -76, -5, 25, 57, 25, -61, 5, 34, 165, 90, 28, -23, -85, 198, -31, -18, 116, -67, 17, -4, -83, -87, 8, 48, -37, -28, 51, 6, 39, -92]
$$ [...]
8191D0
##END NTUPLES=NMR FID
##END=
