##TITLE=1H_SA_28.120
 DMSO, 8 sc, 
 23.7.2019
##JCAMPDX= 6.0         $$ Bruker NMR JCAMP-DX V2.0
##DATA TYPE= NMR FID
##DATA CLASS= NTUPLES
##ORIGIN= UXNMR, Bruker Analytische Messtechnik GmbH
##OWNER= root
$$ XWIN-NMR		Version 3.5
$$ Tue Jul 23 14:43:36 2019 Russian Standard Time (UT+4h)  she@DPX200
##.OBSERVE FREQUENCY= 200.13155
##.OBSERVE NUCLEUS= ^1H
##.DELAY= (6, 6)
##.ACQUISITION MODE= SIMULTANEOUS
##.ACQUISITION SCHEME= undefined
##.AVERAGES= 8
##.DIGITISER RES= 18
##SPECTROMETER/DATA SYSTEM= spect
##.PULSE SEQUENCE= zg30
##.SOLVENT NAME= D2O
##.SHIFT REFERENCE= (INTERNAL, D2O, 0, 15.7039)
##AUDIT TRAIL= $$ (NUMBER, WHEN, WHO, WHERE, WHAT)
$$ ##TITLE= Audit trail, XWIN-NMR		Version 3.5
$$ ##JCAMPDX= 5.01
$$ ##ORIGIN= Bruker BioSpin GmbH
$$ ##OWNER= she
$$ F:/spectra/data/she/nmr/H-F/1/audita.txt
$$ ##AUDIT TRAIL=  $$ (NUMBER, WHEN, WHO, WHERE, WHAT)
(   1,<2019-07-23 14:42:45.62 +0400>,<she>,<DPX200>,
      <created by zg, POWCHK disabled, PULCHK disabled
       configuration hash MD5:
       00 E9 B6 7A A2 85 ED C7 34 08 36 98 17 FE 4E 26
       data hash MD5: 16K
       44 B9 0A 21 53 B3 71 B5 F6 25 7B 8B 4B A4 F1 C0>)
$$ ##END=
$$ 
$$ hash MD5
$$ 04 9B 6A B6 38 08 AD 64 59 59 58 FA B2 88 41 54
##$RELAX= 
##$RELAX= 
##$RELAX= 
##$RELAX= 
##$RELAX= 
##$RELAX= 
$$ Bruker specific parameters
$$ --------------------------
##$DU= <F:/spectra>
##$EXPNO= 1
##$NAME= <H-F>
##$PROCNO= 1
##$TYPE= <nmr>
##$USER= <she>
##$AMP= (0..31)
100 100 100 100 100 100 100 100 100 100 100 100 100 100 100 100 100 100 
100 100 100 100 100 100 100 100 100 100 100 100 100 100 
##$AQSEQ= 0
##$AQ_mod= 1
##$AUNM= <au_zg>
##$AUTOPOS= <>
##$BF1= 200.13
##$BF2= 200.13
##$BF3= 200.13
##$BF4= 200.13
##$BF5= 200.13
##$BF6= 200.13
##$BF7= 200.13
##$BF8= 200.13
##$BYTORDA= 1
##$CFDGTYP= 0
##$CFRGTYP= 5
##$CHEMSTR= <none>
##$CNST= (0..31)
1 1 145 1 1 1 1 1 1 1 1 1 1 1 1 1 1 1 1 1 1 1 1 1 1 1 1 1 1 1 1 1 
##$CPDPRG= <>
##$CPDPRG1= <>
##$CPDPRG2= <>
##$CPDPRG3= <>
##$CPDPRG4= <mlev>
##$CPDPRG5= <mlev>
##$CPDPRG6= <mlev>
##$CPDPRG7= <mlev>
##$CPDPRG8= <mlev>
##$CPDPRGB= <>
##$CPDPRGT= <>
##$D= (0..31)
0 1.2 0 0 0 0 0 0 0 0 0 0.03 0 0 0 0 0 0 0 0 0 0 0 0 0 0 0 0 0 0 0 0 
##$DATE= 1563878564
##$DBL= (0..7)
120 120 120 120 120 120 120 120 
##$DBP= (0..7)
150 150 150 150 150 150 150 150 
##$DBP07= 0
##$DBPNAM0= <>
##$DBPNAM1= <>
##$DBPNAM2= <>
##$DBPNAM3= <>
##$DBPNAM4= <>
##$DBPNAM5= <>
##$DBPNAM6= <>
##$DBPNAM7= <>
##$DBPOAL= (0..7)
0.5 0.5 0.5 0.5 0.5 0.5 0.5 0.5 
##$DBPOFFS= (0..7)
0 0 0 0 0 0 0 0 
##$DE= 6
##$DECBNUC= <off>
##$DECIM= 24
##$DECNUC= <off>
##$DECSTAT= 4
##$DIGMOD= 1
##$DIGTYP= 9
##$DL= (0..7)
0 120 120 120 120 120 120 120 
##$DP= (0..7)
150 150 150 150 150 150 150 150 
##$DP07= 0
##$DPNAME0= <>
##$DPNAME1= <>
##$DPNAME2= <>
##$DPNAME3= <>
##$DPNAME4= <>
##$DPNAME5= <>
##$DPNAME6= <>
##$DPNAME7= <>
##$DPOAL= (0..7)
0.5 0.5 0.5 0.5 0.5 0.5 0.5 0.5 
##$DPOFFS= (0..7)
0 0 0 0 0 0 0 0 
##$DQDMODE= 0
##$DR= 18
##$DS= 0
##$DSLIST= <SSSSSSSSSSSSSSS>
##$DSPFIRM= 0
$$ [...]
##$SUBNAM2= <"">
##$SUBNAM3= <"">
##$SUBNAM4= <"">
##$SUBNAM5= <"">
##$SUBNAM6= <"">
##$SUBNAM7= <"">
##$SUBNAM8= <"">
##$SUBNAM9= <"">
##$SW= 24.9336996594482
##$SWIBOX= (0..15)
0 0 2 0 0 0 0 0 0 0 0 0 0 0 0 0 
##$SW_h= 4990.01996007984
##$TD= 16384
##$TD0= 1
##$TE= 0
##$TE2= 300
##$TE3= 300
##$TEG= 300
##$TL= (0..7)
0 120 120 120 120 120 120 120 
##$TP= (0..7)
150 150 150 150 150 150 150 150 
##$TP07= 0
##$TPNAME0= <>
##$TPNAME1= <>
##$TPNAME2= <>
##$TPNAME3= <>
##$TPNAME4= <>
##$TPNAME5= <>
##$TPNAME6= <>
##$TPNAME7= <>
##$TPOAL= (0..7)
0.5 0.5 0.5 0.5 0.5 0.5 0.5 0.5 
##$TPOFFS= (0..7)
0 0 0 0 0 0 0 0 
##$TUNHIN= 0
##$TUNHOUT= 0
##$TUNXOUT= 0
##$USERA1= <user>
##$USERA2= <user>
##$USERA3= <user>
##$USERA4= <user>
##$USERA5= <user>
##$V9= 5
##$VALIST= <valist>
##$VCLIST= <CCCCCCCCCCCCCCC>
##$VD= 0
##$VDLIST= <DDDDDDDDDDDDDDD>
##$VPLIST= <PPPPPPPPPPPPPPP>
##$VTLIST= <TTTTTTTTTTTTTTT>
##$WBST= 1024
##$WBSW= 4
##$XGAIN= (0..3)
0 0 0 0 
##$XL= 0
##$YL= 0
##$YMAX_a= 162139
##$YMIN_a= -218101
##$ZGOPTNS= <>
##$ZL1= 120
##$ZL2= 120
##$ZL3= 120
##$ZL4= 120
##$ABSF1= 10
##$ABSF2= 0
##$ABSG= 5
##$ABSL= 3
##$ALPHA= 0
##$AQORDER= 0
##$ASSFAC= 0
##$ASSFACI= 0
##$ASSFACX= 0
##$ASSWID= 0
##$AUNMP= <proc_1d>
##$AZFE= 0.1
##$AZFW= 0.1
##$BCFW= 1
##$BC_mod= 2
##$BYTORDP= 1
##$COROFFS= 0
##$CY= 11.3945322036743
##$DATMOD= 1
##$DC= 2
##$DFILT= <>
##$DTYPP= 0
##$F1P= 18.9103706918063
##$F2P= -1.10871071338519
##$FCOR= 0.5
##$FTSIZE= 0
##$FT_mod= 4
##$GAMMA= 1
##$GB= 0.15
##$INTBC= 1
##$INTSCL= 1
##$ISEN= 128
##$LB= 0.24
##$LEV0= 0
##$LPBIN= 0
##$MAXI= 10000
##$MC2= 0
##$MEAN= 0
##$ME_mod= 0
##$MI= 1.114404
##$NCOEF= 0
##$NC_proc= 0
##$NLEV= 6
##$NOISF1= 3.799351
##$NOISF2= 2.8
##$NSP= 1
##$NTH_PI= 0
##$NZP= 0
##$OFFSET= 15.70392
##$PC= 1
##$PHC0= -8865.09
##$PHC1= 14.00096
##$PH_mod= 1
##$PKNL= yes
##$PPARMOD= 0
##$PSCAL= 0
##$PSIGN= 0
##$REVERSE= no
##$SF= 200.130013532006
##$SI= 16384
##$SIGF1= 3
##$SIGF2= 2
##$SINO= 400
##$SIOLD= 16384
##$SREGLST= <1H.CDCl3>
##$SSB= 0
##$STSI= 0
##$STSR= 0
##$SW_p= 3612.71676300578
##$SYMM= 0
##$S_DEV= 0
##$TDeff= 0
##$TDoff= 0
##$TI= <>
##$TILT= no
##$TM1= 0
##$TM2= 0
##$TOPLEV= 0
##$USERP1= <user>
##$USERP2= <user>
##$USERP3= <user>
##$USERP4= <user>
##$USERP5= <user>
##$WDW= 1
##$XDIM= 8192
##$YMAX_p= 0
##$YMIN_p= 0
$$ End of Bruker specific parameters
$$ ---------------------------------
##NTUPLES= NMR FID
##VAR_NAME=  TIME,          FID/REAL,        FID/IMAG
##SYMBOL=    X,             R,               I
##VAR_TYPE=  INDEPENDENT,   DEPENDENT,       DEPENDENT
##VAR_FORM=  AFFN,          ASDF,            ASDF
##VAR_DIM=   8192,          8192,            8192
##UNITS=     SECONDS,       ARBITRARY UNITS, ARBITRARY UNITS
##FACTOR=    0.0002004,     1,               1
##FIRST=     0,             0,               0
##LAST=      1.6414764,     0,               0
##MIN=       0,             -218101,         0
##MAX=       1.6414764,     162139,          0
$$ Real data points
##PAGE= N=1
##DATA TABLE= (X++(R..R)), XYDATA
0@%%%%%%%qJ6j6J6k4L2l2M0n1N9p2Q8j04J20j39J63j90K19k51K87l26L70m20M74
31B51n34N99o70P48q36R32j034J148j272J409j560J726j912K118k348K607k898
48a526L231l618M071m608N259o070P106q491J0452j3452J8695l0501J06500k7261
62E9787j78982P7577J43092O0665j11277j02717m684P5803J8226m5812m6815K3505
74c1632L6530j660k8941J5144L6507r033o1968q932Q6188Q5543m4289j34126o2263
87a22932R4421J32056M595j29493r7705M6927J14076K1113r1164p0578M2824Q4580
99B8720R173o6329m2406K9746M6707N552j5029R607K0597k1056n5942j0171P1972
112A1141P3816k9117j10227n4698O9690R8319k835r3107n0921N7804Q1587n851
$$ y = [0, 0, 0, 0, 0, 0, 0, 0, -8, 8, -8, 8, -16, 16, -16, 24, -27, 32, -40, 48, -56, 64, -75, 88, -102, 117, -134, 153, -173, 197, -223, 251, -283, 316, -354, 394, -442, 490, -544, 604, -668, 741, -819, 907, -1005, 1113, -1235, 1372, -1526, 1705, -1913, 2158, -2450, 2809, -3261, 3845, -4646, 5806, -7646, 11049, -19452, 87048, 59787, -119195, -41618, 101474, 162139, 50862, -51855, -56539, 19264, 37490, -8322, -55137, -31632, 4898, 3238, -25703, -10559, 25948, 16915, -45053, -53985, 32203, 117746, 73457, -60669, -122932, -28511, 103545, 108140, -21353, -119058, -72131, 41945, 63058, -28106, -98684, -55860, 28720, 37893, -28436, -70842, -41096, 5611, 11163, -3866, 5741, 26338, 5282, -50660, -60831, 11141, 84957, 55840, -54387, -109085, -39395, 58924, 56089, -37018, -87939, -30135, 51452, 45601]
124D5601q2645m4595N1943P8716O794o2445m4819J6963L3941J734j1637J5946
136E497K4712j7228n0211j2529N5260N9096j3599o7920l0656M6787N5020j8891
148C5338p1375k4192N9879O5119j8170p7906l8873M3238O6167J5521l3517k6536
160e307O747J4135j842l306J7615K1060r827l8095j8540K5098L1084j1211l8252
173a0641r528L5285K7333k8550n5528j1162N1930N4897o055n4029l3650K1979
185a7719M4145J5115j6637j4602L778L402j2980j3857L817J3559L71j5500j0609
198a7717N739O101j1462j6418R342L5719K3969k0632m3401j4510L4328M5339O173
211D2570l1958k9945K000J9673N107j3603j0176P137J1180n035j9654j2987O289
$$ y = [45601, -37044, -81639, -29696, 49020, 55814, -6631, -51450, -34487, -546, 1188, -10449, 5497, 30209, 12981, -37230, -49759, 5501, 64597, 50998, -16922, -47578, -791, 54229, 35338, -36037, -60229, -350, 64769, 46599, -31307, -70180, -26942, 39225, 54746, 21229, -5307, 1440, 15575, 13733, 10427, 28042, 49102, 39275, 1180, -17360, 7738, 38822, 27611, -10641, -20169, 15116, 42449, 13899, -41629, -52791, -861, 54036, 47981, -6048, -39698, -17719, 26426, 41541, 24904, 10302, 14080, 17482, 4502, -9355, -5538, 8021, 8392, -7108, -17717, -11978, -5877, -17339, -33757, -24415, 11304, 35273, 14641, -28760, -43270, -8942, 36397, 42570, 10612, -19333, -17333, 2340, 7447, -6156, -16332, -9195, 1985, -3050, -22704, -35691, -29402]
224b9402J6220J0048J219j311k877q215r161N894K3277K1796o008l0716k3424
237c2660P636K6209J1419j5083j9815P77J6353L450j7439j5439J2660L0577J5443
250B4088j6414k5987n796J7506K0097M412m331k716k749r902j0400M972K1176
263A3956J4766j0867k4175r113J4549J4509o970j4983M961K3215P293k5200k9639
276b7698M700L8104K7177j3016l2762j0435J7367J5493o402j0700P132J5358n546
289A8772k6930j5591J6614K5717J629k1377j0398J4354J3443j2872k2821O060
301a3400L5838K1565k5130m2114o867L5235K9723j0161k7985m430K0781P645k2658
314a958j9969J5790L2320L576l4080k8604J0403K7330K997k1271o499K2551J6852
$$ y = [-29402, -13182, -3134, -1915, -3226, -6103, -14318, -23479, -17585, 5692, 27488, 21480, -9236, -32660, -25024, 1185, 12604, -2479, -22294, -21517, -5164, -1714, -19153, -34592, -21932, 8645, 24088, 7674, -18313, -24109, -6603, 13494, 17906, 13575, 10859, 8110, -1792, -12192, -7220, 13956, 28722, 17855, -6320, -15433, -884, 13625, 6655, -8328, -3367, 19848, 27141, 1941, -27698, -22998, 15106, 42283, 29267, -3495, -13930, 3437, 18930, 12528, 1828, 8960, 24318, 18772, -8158, -23749, -7135, 18582, 20211, -1166, -11564, 2790, 16233, 3361, -19460, -13400, 22438, 44003, 18873, -23241, -30108, 5127, 34850, 24689, -3296, -7726, 13055, 20700, -1958, -21927, -6137, 26183, 29759, -4321, -32925, -22522, 4808, 7805, -13466, -19965, 2586, 19438]
327A9438j9732l3653K172M1783L1423j8765m2188j1324K8644K2029j6267k7121
339b3561N567K9279N960l3502l0096J4132L9363J2098k6954k3928J2101K4674
351E133l470k5166j656L4665K7384k0794m2966p107L8574L1934j5512l4742m282
364a8005K7062R847k8014k8433J4300M0209R863l4380l3012J1729L6829J2948
376B0943j9499j3030J8417K1039j2476l0890l365L4807K7587j8435m1073j0143
388b6118K7833K0344j7454k5972O746L2607Q350l1684l0262J4739M2119J5633
400C6881k6122k6291R017K5080J718k1181n540K4933K2069j5500l5488q974K7578
413H180K4499j1671k7427m390J9717P416k2240k0602J4700L5006Q416l0251k9579
$$ y = [19438, -294, -33947, -31775, 10008, 41431, 22666, -19522, -30846, -2202, 19827, 3560, -23561, -17994, 11285, 17245, -16257, -46353, -32221, 7142, 19240, -7714, -31642, -19541, 5133, 1663, -23503, -25159, 9506, 36890, 16096, -26870, -33977, 4597, 36531, 21019, -13723, -18005, 9057, 18904, -9110, -37543, -23243, 16966, 26829, -7551, -40563, -28834, 7995, 20943, 1444, -11586, 6831, 27870, 15394, -15496, -18861, 15946, 43533, 25098, -15975, -26118, 1715, 22059, 4605, -21367, -14621, 17986, 26336, -5348, -35610, -20871, 21248, 36881, 10759, -15532, -6515, 18565, 20283, -898, -6438, 18495, 40564, 25064, -10424, -19398, 8180, 32679, 21008, -6419, -10809, 8908, 16324, -5916, -26518, -11818, 23188, 31604, 1353, -28226]
426b8226R512L2201J2178j9017j5903J0776J7269q472k5994o091K5543K3225j1663
439A5338l0955r953J9259J5823j0125j7587M956K0930L299k5188k0224J3617L1392
452A0582J0998j9382j9097O739J9405J978j5546n115J7786J6322j1913k8666j0300
465b6209J8882K0332m522j9897o355J0757N359j1706j0975J1690K3970N324k0436
478c786j9557O838K3145R571j1602r847O476R671o521j7582l215J7830J6050p891
492I580k1571r403J1132J2156k301p739L254J2420K710j3444j1412Q837K1643
505A5862R024j1608j4496J52R812J866q967l521R227R432p920j8681p916J1728
519f006J7197K033j0462o741M095M752l936m495O892J3532L874j3839j5126M48
$$ y = [-28226, -18714, 13487, 25665, 6648, -9255, 1521, 18790, 10318, -15676, -21767, 3776, 27001, 15338, -15617, -25570, -6311, 9512, -613, -18200, -13244, 7686, 10985, -14203, -34427, -20810, 10582, 21580, 2198, -16899, -10160, 9245, 11223, -4323, -9438, 8348, 24670, 12757, -15909, -26209, -7327, 13005, 8483, -11414, -17769, -7012, -1653, -13359, -24334, -12644, 11326, 16650, -3786, -23343, -16505, 6640, 16211, 4609, -5238, 1238, 10909, 4388, -13194, -16409, 1421, 17471, 9580, -11991, -21394, -10262, 1894, -407, -8146, -4892, 7528, 10238, -3206, -14618, -5781, 15862, 24886, 13278, -1218, -1066, 8746, 10612, 1645, -1876, 7351, 16783, 8863, -9818, -17734, -6006, 11191, 13224, 2762, -3979, 116, 4868, 932, -3563, 3329, 16861, 20735, 6896, -8230, -7782]
533g782J3834R002m952r836j302M686k077q987l612R271J2588L9j3311j0660K947
548a0152J1425N165l079k386K513J953n818q360J527J1144Q608m375j1817o231
562i883L769N240N68j993K161M858j479j0508r182M245J3259O985o439j1029l742
577a3170N125M503o70L92N236N354l304j0282n933N877J1197L355p416q405j287
592i428K514j137k610K819Q058M529n805j0371j314R394J0983J078n749k766L061
607C256J033n004m615M686J1194K685j0692j2584j618R700O645j926m328P67L695
622B894k476p291m01J0808J1411j058j1115p771L396P866J009l843p67L960m15
637F207q885r588J524J2194Q130n714j0659k682P198N813j856j969N973Q210j903
$$ y = [-7782, 6052, 15054, 10102, 266, -1036, 3650, 1573, -7414, -11026, -1755, 10833, 10872, -2439, -13099, -10152, 1273, 6438, 3359, 973, 3486, 5439, -379, -8739, -7212, 3932, 12540, 8165, -3652, -9883, -6114, -874, -306, -2299, -138, 4720, 3241, -7267, -16449, -12204, 1055, 8040, 1601, -9428, -13170, -8045, -3542, -4212, -3820, 1416, 6770, 3466, -6816, -12749, -6872, 4325, 7680, 264, -8141, -9428, -6914, -8051, -10661, -7842, 216, 4745, -1060, -11431, -12745, -3351, 7632, 8710, 2961, 195, 3256, 4289, -715, -5330, -644, 10550, 13235, 2543, -10041, -11659, -1959, 4686, 2760, -1568, -801, 2894, 418, -6873, -7274, 3534, 14945, 13887, 2772, -4999, -1603, 6263, 7272, 3429, 2662, 6622, 6207, -2678, -12266, -10742, 1452, 9582, 3868, -6791, -9473, -2275, 3538, 1682, -287, 5686, 13896, 11993]
652A1993j1590p031O756J1866K327q786p862J320L398l190o699K089R677N008
666I276q016j2709j704J0132R154j140n464l69L924n19o927l451Q041J1309m57
681A1080j2968j0582K872R351J669o011k800M511L144o243q834J837J2227J0019
695I272m451j1387k737O784N838l237l516M611P011j631j1214o885O878J1115
709F451K291q475o376J869L831k344n840J236R897N481p104j2124j763J0971J0025
724H026p35o594j054N444J238o481m649O389J0449M47j2611r736K665Q884K224
739C906n755k719M521L182n289q023K412J2262Q693m687r939j583P617N233l561
754F270m289L908O658j417j1266q569N283J0277K525q442p898J433M979q65m760
$$ y = [11993, 403, -6628, 128, 11994, 14321, 5535, -2327, -1007, 2391, -799, -7498, -5409, 4268, 9276, 1260, -11449, -13153, -3021, 6133, 4993, -471, -840, 3084, 2565, -4362, -7813, 228, 11537, 11080, -1888, -12470, -9598, -247, 1422, -4589, -7389, -2878, 266, -5977, -14811, -12974, -747, 9272, 4821, -6566, -9303, -2519, 3319, 82, -3434, 1177, 8188, 6557, -4657, -11542, -4664, 6451, 8742, 267, -6109, -4240, -409, -2753, -8593, -7357, 2540, 8021, 917, -11207, -12970, -1999, 8026, 7291, 697, -357, 5087, 6325, -156, -4805, 1584, 12033, 12480, -131, -9867, -7202, 1682, 3906, -1849, -4568, -47, 3135, -2154, -10177, -7765, 4497, 13190, 8503, -1436, -3019, 4598, 9831, 6270, 1981, 5889, 12547, 11130, -136, -8705, -3422, 6855, 9380, 938, -6960, -5527, -548, -1413, -6173]
769f173R46R517O213n302j0684j758J0309Q782k173p416j832M045p25p481m786
784h518N198R833q55j1720r085L047J0191L392m817k941M316M889l279p016P04
799f661R937Q213l350r868l344N063N147k210m529Q70N131l05r117p223L684R887
815A325L416o578o357J224N788J014l659k91P667O096m581j0153l072P940Q471
830H250p93p574l617K556J740m251m002L243Q019K019q049q232J549Q723N341
845D922k546l813K128L986j038m857r58P539O881j875r178n001M052N171p57n516
861h60o48M701R97n968o395K167Q663M994l661o945r53N367K921k446j740M363
877D557M636k571q216m112M961P483o7n531m238M84J751j927l133K074O452K273
$$ y = [-6173, -5227, 4290, 10503, 5201, -5483, -7241, 3068, 11850, 9677, 2261, 429, 4474, 3749, -3732, -8518, -3320, 6513, 5658, -6062, -15147, -12100, -1909, 1483, -3334, -6275, -1959, 2930, -349, -7365, -6661, 3276, 11489, 8139, -1729, -5073, -10, 5137, 2927, -1602, -732, 4399, 4094, -5023, -12246, -8562, 1325, 4741, -1837, -8194, -6970, -1182, -168, -3827, -4118, 3549, 9645, 5064, -5089, -8161, -221, 8250, 7457, -117, -3734, -1178, 562, -3689, -7691, -4448, 3571, 5590, -2459, -10691, -9142, -419, 4922, 2376, -1437, 691, 4677, 3639, -1218, -2176, 5363, 12244, 10369, 1191, -3810, 242, 5413, 4656, -860, -1508, 3193, 4190, -1778, -8173, -6006, 2657, 7651, 3990, -2955, -3908, 1459, 4380, 1934, 194, 4557, 9193, 6622, -1594, -5706, -745, 6738, 6671, 1140, -3098, -2614, -863, -2790, -5923, -3849, 2603, 4876]
893D876n598p152O44P620N307k140m158M78L150n45m439j913M039N599p30p920
909b882n381K195N325Q26l792p47L432J580l541n059J638Q025M537l483n924j226
925d477L974K061k629j682L291M294k590p768l909M952P015J269n559m336J583
940d511L066Jk842J349N595L324m472o635j15O888N193k039m513p26K856J36m490
957a935k510M060O153q28p193m720L477O442Q53m325p87M333K773l969o017J035
973c158P571N168l490p318k312M263K837k266l577J544M596r29p239m559M311
988d558Q161K054n380m906K013N192L23l764j41N483M078m323q746j540P218N763
1004F927l152o993j580N133J786m539m776L289P736J641o557o432K350P448K475
$$ y = [4876, -722, -7874, -7230, 390, 5697, 3557, -601, -123, 3027, 2482, -1957, -3870, 169, 5768, 5038, -2882, -8263, -6068, -743, 83, -3709, -4456, -1024, 556, -2985, -8044, -6406, 1619, 6156, 2673, -3251, -4477, -503, 1558, -1071, -2753, 538, 4832, 2242, -5526, -9435, -4483, 2532, 3801, -1758, -6094, -4511, -1445, -1444, -4286, -2937, 2658, 5982, 1510, -5125, -5240, 1648, 6841, 4802, 289, -437, 2419, 2555, -1935, -4445, -385, 5768, 4940, -2253, -6973, -3496, 2946, 3799, -526, -1313, 3020, 5793, 1824, -4193, -3158, 4413, 9581, 6091, -1227, -3539, 724, 3561, 1295, -2282, -738, 3858, 2929, -4310, -8869, -4558, 3603, 5657, 277, -4629, -2616, 2576, 2899, -865, -1006, 4477, 8555, 4232, -4514, -6054, 1164, 6927, 3775, -3218, -4798, 335, 2121, -2418, -7194, -3905, 3831, 5472, -1085, -7517, -5167, 2281, 4756]
1019D756m092l656K783M638k388o641j815O034O266k477q417m100M158N446j457
1034i62n150L44N299K350n969o195L355J0012M356n885p096J412O699K446m934
1049H2l660M132N297k105q137l881N360P012o77o972l393M072M557j941m984P78
1065d460P376L829m680p056L34P553M830l666n641J006N297N70o736m479M705
1080a218P522j52q370o554M186P165J068n490k195N217M217k531o191K60P982
1095D916N879m148p386j816N052L921l239m590P28M616K58o502n045L503P362
1110C509J378n943m634K687N970K30n143j543N300N705k321p665k651O318N440
1125F637k070o082k290L876J912m267m478K155O157J164n724n813J746P224K506
$$ y = [4756, 664, -2992, -209, 4429, 2041, -4600, -6415, -381, 5885, 3408, -5009, -9109, -4951, 495, -962, -6112, -5768, -469, 1881, -4088, -10283, -6928, 3084, 7440, 1555, -5541, -4129, 2570, 5016, 82, -3578, 554, 5851, 3746, -4391, -8272, -2912, 4100, 3423, -3549, -6942, -2870, 1687, -254, -5238, -4460, 2916, 6745, 2065, -4991, -4657, 2896, 7726, 4060, -1581, -575, 4722, 5292, -1444, -5923, -1218, 6304, 6152, -2218, -8772, -4586, 2579, 3647, -1843, -4038, 1179, 5396, 2865, -3326, -3066, 4916, 10795, 6647, -739, -2555, 2497, 6418, 3179, -1411, -683, 3933, 4191, -2311, -7356, -3853, 3509, 4887, -1056, -5690, -3003, 2967, 3197, -1946, -3489, 1811, 7516, 5195, -2470, -5121, 1197, 6637, 4567, -1515, -3805, 71, 1983, -2284, -6762, -4607, 1550, 2714, -3010, -8823, -7077, 147, 2653]
1140B653l583l002K614M490j118m930j630N616O001k324p922k671M181M924j853
1155A446n471q13M856K416m899n170J716P513K970m645m964R74N728J735l741
1170c49k835L974M675j584o336k748M441N393r80n795k311L413K670k871m218
1185e461J199O385K493m792o142J410O864L922l026m408J589M526O07m974k682
1200b490M438N340j506o417l509L498M875r32m875j030L875K749l233m781J097
1215b901O253L645m076n192R17N216K048m109m104K990N115o30o768l500L252
1230a844O474k65n737l394L219L968j480m613m5N571L191l675n832j24N942L853
1246E209k680m712j02M316J085m344l639L097N441l35o623m434L698O069K3n049
$$ y = [2653, -930, -3932, -1318, 3172, 2054, -2876, -4506, 1110, 7111, 4787, -3135, -5806, -1625, 3299, 1446, -4025, -4838, 18, 2434, -2465, -7635, -5919, 1594, 4564, -81, -5045, -4071, 1657, 3392, -349, -3184, 790, 5465, 3881, -2455, -5203, -762, 4631, 3651, -2144, -4455, -1042, 1628, -1243, -5461, -4262, 2123, 4616, -176, -6318, -4908, 1956, 5878, 2852, -1556, 33, 4559, 5166, 192, -2490, 1948, 7288, 5782, -635, -4144, -646, 4229, 3297, -1578, -2608, 1267, 4016, 783, -3998, -2901, 3352, 6997, 2921, -2271, -1354, 3862, 5910, 1801, -2303, 687, 5802, 5172, -1596, -5096, -1844, 4630, 4365, -1372, -4766, -1547, 2421, 941, -3672, -3717, 1854, 5045, 1370, -4462, -4586, 1356, 5209, 2529, -2183, -2285, 2031, 3116, -1228, -4867, -1770, 3671, 3336, -3287, -7721, -4023, 2046, 2069, -2980]
1262b980k752M017M532j884n638n45N669M569k717o217q04M951K578k744m099
1277d064R03M945P80n155m111K353O097K264n248m001K026M604O43m276j842M404
1293C22M714k031o448k031N477N755j790n840k272M050L558k797m837J217N848
1308B895J933m835n156K219N560K540l935l633J808M560K75m447k472L204M899
1323E415p24n455l160L202M586r60n017r46M095L428k762n496j91N721M278k752
1339C262n767n58N000K612k836l999J806M860q5n138l404K725N078R78m949l531
1355c946J845M150l9m134j149L448L756j986m549q52M293L751j917m967j077M011
1371F38K353k958m288K99N274J786m503m521J057M925J623l697l154K280M170
$$ y = [-2980, -5732, -1715, 2817, 933, -4705, -5250, 419, 4988, 2271, -3946, -4750, 201, 2779, 35, -4064, -3161, 1784, 2564, -2591, -6702, -4349, 1748, 4012, -1236, -5237, -3211, 1393, 2036, -2240, -4082, 322, 5036, 3005, -3443, -5474, 3, 5758, 3968, -1872, -4144, -94, 3464, 667, -4170, -2953, 2895, 4828, -7, -5163, -2944, 2616, 5156, 1221, -2412, -604, 3956, 4231, -216, -2688, 516, 5415, 4691, -764, -3924, -722, 3864, 2904, -2113, -3059, 1036, 4464, 1702, -3794, -3985, 1736, 6014, 3262, -2505, -3063, 1937, 4549, 1713, -2286, -480, 4380, 4295, -843, -4247, -1522, 3556, 4534, -415, -3946, -2101, 2049, 2010, -2124, -3273, 175, 3931, 1945, -2604, -3456, 837, 4588, 2671, -2296, -3373, 638, 2991, 33, -4255, -3956, 1318, 3104, -1399, -5920, -4863, 62, 1685, -2012, -5166, -2886, 1284]
1386A284J08m183k279M093M641q53n245j710L051L746j386l280j039L283J886
1401B117l066l817L84N150K612l313m504J65M278K679k781l134J678M470L02l921
1417g01l069K878M391J10m101k541K271L570j371l824n94L131L415k288m605l04
1433c632M049K973k015k808M41L574J269k785k742K107M394R22m507l927J880
1448h07M207P07l823k725K162L269j227m000j048L620L544j616m197j109L939
1463H96L024j880l563M85L639J145l398l163J414M095P45m110k850J718L440L56
1479A993m394k389L599L830j197m253j812L818L902r20l926j004L286K363k018
1494H78l400K11M113J677l543m385P37M181J989l573l196J571L222N43l658j528
$$ y = [1284, 1392, -2791, -5070, -977, 3664, 2811, -2434, -4144, -1093, 2653, 1267, -2013, -3052, 231, 2117, -949, -4766, -4382, 768, 3380, 67, -4437, -4272, 6, 2685, -96, -3230, -1552, 2918, 3220, -701, -3770, -892, 3499, 3609, -492, -3033, -762, 2808, 1437, -2387, -2981, 150, 3565, 1277, -3328, -3632, 417, 3390, 1375, -1433, -992, 2582, 3851, 1066, -1676, 431, 4825, 5747, 1240, -2687, -807, 3400, 4107, 284, -2441, -279, 2990, 1763, -2237, -3285, 335, 3879, 2263, -1934, -3043, 896, 3920, 2040, -1523, -1038, 2601, 3746, 348, -2815, -1401, 2694, 3439, -671, -3521, -1803, 1637, 1993, -2401, -4790, -1191, 2639, 1442, -2811, -4623, -805, 3097, 2177, -1749, -2753, 533, 2896, 878, -2522, -2311, 1802, 3479, -64, -4449, -3712, 469, 2458, -1115, -4311, -2740, 482, 1025, -2633, -4161]
1510d161L160L642p62m031j922L688L846j053l980j169L373K915k847l702k78
1525c281L968K140k847l589j06L958J503k739k328J345M055Q19l913k460K662
1540h13M116j85l170k023K344K765j256l074o00L389K445k132m795k24L928L352
1556D067k235l885j6L300K020k410k889J527L854R60l747k709J908L724N45l729
1572B85k068K026K901r29l576j035K551K602j098l538p99K970K445j825k563j52
1588a803L543J728k501l663J077L399J859k840l466M59L529Q67l098k096J693
1603a313K855k37l235j724K298L554n04l619p94K213J946q36k444k09K823J817
1619B591k277k930L20K969J721k420k767M13L076J133k552k618J447L252Q73l106
$$ y = [-4161, -1001, 2641, 1879, -2152, -4074, -386, 3460, 2407, -1573, -2742, 631, 3546, 699, -3003, -3281, 687, 2827, -20, -3609, -3715, 243, 1746, -993, -3321, -1976, 2079, 2898, -1015, -3475, -813, 3303, 3118, -52, -2075, 269, 3034, 1778, -1296, -1896, 1493, 3938, 1806, -2989, -3213, 715, 4067, 1832, -2053, -2069, 1231, 3251, 841, -2048, -521, 3333, 4293, 546, -2163, -255, 3469, 4014, 285, -1783, 243, 3144, 2215, -1361, -2396, 155, 2757, 1659, -1879, -2678, 292, 2737, 912, -1651, -1803, 1740, 3468, 967, -2696, -1619, 1780, 3639, 799, -2667, -2208, 1321, 2188, -910, -3006, -1313, 1542, 1305, -1930, -3654, -1356, 2198, 1694, -1925, -2719, -506, 1440, 604, -1840, -2049, 774, 2591, 314, -2616, -2296, 673, 2394, -26, -2793, -2380, 696, 1829, -723, -3341, -1894, 1358, 2231, -875]
1635h75k060J736K753J28k826r81K192K578j265l142n43K955J732j404k764m50
1651b236K219J499j318j952M02K334P26k012j833Q21L033J093k685k161J368K703
1667B001O24k770j649J437K612l41l370p95J885K842r50k713p18K051K549j902
1683G93k058N3K695J223k072k031M86K514P46k036j814J288J975K05k660j794
1699b487K218K454l88k640j746J755K645K2k558j185K563J737j539k256l28K731
1715I98K248k424k743K4K369J531j955k301M65K531K39k342j246J382K426l94
1731H08j940j369K105J975p36k481n75K466J969j424k734j74J838J970j236k516
1747b054l3K292J167j562k071N73K782P58k049k091R06K550P11k287j061J178
$$ y = [-875, -2935, -1199, 1554, 1682, -1144, -2125, 67, 2645, 1380, -1762, -2305, 650, 2382, 978, -1786, -2236, -17, 1482, 164, -1788, -1386, 948, 1674, -338, -2171, -1350, 1683, 2776, 91, -2070, -702, 2001, 2625, -145, -1794, -357, 2255, 1914, -1456, -2251, -366, 2476, 1526, -1187, -1905, 146, 2695, 793, -1265, -1212, 1483, 2706, 634, -1397, -911, 1603, 2349, 313, -1501, -213, 1762, 1967, -693, -2487, -269, 2185, 1797, -843, -2589, -834, 1811, 1833, -725, -1910, 653, 2390, 851, -1405, -1733, 998, 3246, 822, -1921, -1897, 472, 2003, 48, -2253, -1788, 743, 982, -1360, -2606, -1224, 1202, 808, -1132, -2501, -396, 1579, 843, -1638, -2213, 253, 2222, 798, -1936, -2110, -272, 1698, 462, -2054, -2087, 205, 1372, -190, -2261, -1688, 1094, 1852, -197, -2288, -1382, 1168, 1879, -408, -1469, -291]
1763b91K194q43k442k59J976J520j203k445p67K706J433j059k199k04K714Q83
1779A714j603k039N86K369J092j781j846P84K525O15k478j352J276K404m29k098
1795b61j767J732K228o33k367q75K129J503j005k346P3K446J412j482k587M87
1811a313K693Q76j651j934L56K444J44j826j906J259K291l8k332j622J461K422
1827A324k88j810q86J592J716o25j998l10K171R84p62k246K56J500J160j348k222
1844a792L54K032J053k105j825Q75K454L25k078j585J280K031K42j973q25J484
1860e3J719m15k186o99J646K154j328k017n17J573J232q75j866K55J592J097j618
1877c06j690Q51J890P42j899j331J057K146j23j857p41Q02J780q4j700j075J190
$$ y = [-291, 1903, 1060, -1382, -1641, 335, 1855, 652, -1793, -2560, 146, 1579, 520, -1679, -1883, 831, 1714, 111, -1928, -1342, 1027, 2119, 338, -1508, -724, 1801, 2416, -62, -1414, -138, 2266, 1837, -261, -2028, -296, 1932, 1299, -1068, -1943, 186, 1689, 684, -1662, -1589, 857, 2269, 787, -1800, -1313, 1380, 2256, 605, -1329, -973, 1471, 1615, -211, -2117, -858, 1433, 1395, -937, -2559, -1098, 1324, 1036, -774, -1660, -68, 1648, 1023, -975, -1285, 886, 1870, 1108, -1138, -882, 618, 1778, 430, -1792, -1438, 594, 1647, -458, -2283, -1408, 1046, 1371, -707, -2292, -1012, 1019, 1261, -712, -1537, -53, 1666, 1251, -935, -1634, 12, 2166, 838, -1179, -1696, -123, 1109, 234, -1632, -1377, 215, 1312, -306, -1996, -1145, 745, 1487, -412, -1743, -686, 1460, 1337, -520, -1261, -459, 1321, 1237, -463, -1538, -348]
1894c48J362m08k075l2J664J142q08j802k56K022R56q98j686O13J199Q29j337
1911A37j230J302J038M9j589o57R81J607l78j621o53R32J588p39j482l92J179
1928G2J442o24j847k66J700Q73j297j198L92J527P20j514q79J36J700l29r30o57
1946i79P74R62l50j177m28J341O34p69j079R8J160R01n55j156m80J532P09l88
1964G50j336K72Q23K08q11r23M65J410j13j058p04N71J061q2q09p75J170O36k46
1983E09j039J98J086J47q00p00K85J245Q4j133r98P97J046j54p11n13J92P68R8
2002D07m87q83O67J293m29r81o69J043Q40n80q32j82P21O90m57n69K2R04o5n07
2022e4p83N86J040j86j029l23O00P72M25r16q83P33J111n25p47k61M77N97r8j119
$$ y = [-348, 1014, 606, -1469, -1501, 163, 1305, 497, -1305, -1561, 461, 1417, 519, -1167, -554, 645, 1474, 137, -1093, 209, 1247, 1296, -293, -950, 31, 1638, 1260, -361, -1014, -82, 1506, 767, -715, -1107, 72, 1514, 890, -957, -1223, 477, 1350, 53, -1145, -753, 774, 1494, -20, -899, -763, 937, 608, -322, -979, -205, 757, 407, -770, -1198, 143, 777, 8, -1071, -973, 187, 1088, 533, -623, -1103, 429, 1138, 750, -586, -314, 509, 717, -94, -1017, -552, 858, 745, -313, -1017, -446, 615, 533, -276, -1051, 119, 755, 509, -530, -332, 754, 901, 101, -599, -314, 931, 1015, -118, -1116, -319, 727, 573, -138, -651, -459, 309, 407, -80, -963, -296, 997, 568, -413, -1082, -39, 801, 221, -611, -793, -72, 618, 161, -408, -386, 518, 453, -54, -837, -251, 789, 603, -426, -749, -149, 623, 1048, 132, -751, -18, 1093, 568, -179, -440, 37, 634, 536, -583]
2042e83k05Q86O17k9j203P8P11L95j51j141J33J031L80p27r76O12O91J13j079
2061d47m52Q79Q15l27r09o30P70J129l25n17q00P22O42j36q06J10L76P69o53o05
2081c95l74P03Q54l93r61k89R49M87p31o81O21N92k20l16p33N28J052j25r27l49
2101g08M27Q62K47j212m01O94M84L59r83l76N05R19l39r85j25O76Q94n16j024
2120f02n1O11P02k14j065Q4O94N42k50o96O3P94M7r12n75N60P34K86j176k77O04
2141i7R30l81r34l56R55N95j13j174j13P97P88n75j008k26J008P18p63o72n2O51
2161b2M91n35p30M61L60N4k29n92O38P20n06o15l39J048N83k27q82n58P27Q27
2181F74l23m52n10O19P65o75q51L90Q06J3l19j034N20R82j98n28l10O33J39k10
$$ y = [-583, -788, 98, 715, 686, -517, -439, 272, 667, 516, -625, -492, 539, 919, 192, -784, -172, 519, 632, -447, -899, -20, 795, 468, -441, -1071, -301, 828, 503, -14, -814, -92, 550, 414, -392, -282, 94, 863, 210, -395, -769, -66, 788, 395, -566, -855, 94, 581, -150, -831, -210, 382, 162, -154, -887, -359, 693, 568, -359, -708, -281, 581, 828, -384, -785, -91, 393, 752, -231, -607, -102, 817, 478, -507, -632, 44, 938, 422, -602, -653, -42, 660, 446, -619, -535, 159, 701, 451, -245, -182, 612, 659, -253, -828, -268, 466, 752, -424, -701, -97, 833, 452, -482, -838, 117, 712, 599, -575, -688, 109, 897, 322, -686, -912, 96, 814, 51, -621, -673, -22, 469, -66, -796, -335, 25, 79, -150, -742, -104, 616, 110, -505, -844, 204, 787, 560, -322, -880, -153, 674, 351, -101, -611, 8, 773, 98, -753, -363, 443, 456, 137, -897, -377, 605, 407, -121, -431, 202, 341, 131]
2201A31m45k77P35L48o25m44J08Q31K7n97o59P41M86M5l92n66P41L39j62o45K31
2222d9J78K57k57l93m08Q52Q7j51n14l49Q68K69m48l05J90O49n35n70R2R43K97
2243G03r45m97L28Q65M87q02q65N04O81K40j137k52P01M68m6m50n95R56M67l85
2263D26r01q9J154K12o53m57K02O46J22j073l07P27P62O5j278n66P05J167j37
2282G27j420N3P36P52l93j332KJ127J22n70n41J84Q90K60p56m56K47R46L53j191
2302b60k69N45Q07o04o46k23P93N14l52q87n6J333L94o08j191J36J384j72n71
2321F7p54L57J322l69j026m29Q78N45j79j069m8R98P44o19q99J94P50J10m80o77
2341e84N60O14O3r96l41P95Q50o8j351m31J023O09m13o86l39P14N49k38q46K11
$$ y = [131, -314, -591, 144, 492, -133, -577, -469, 362, 389, -208, -867, -126, 360, 405, 13, -553, 188, 527, 365, -280, -49, 129, 386, 129, -264, -672, 180, 267, 116, -398, -747, 121, 390, -58, -363, -173, 476, -59, -629, -537, 406, 703, -242, -739, -411, 454, 941, 139, -726, -222, 459, 699, -438, -690, 11, 479, 433, -17, -612, 344, 811, 426, -475, -564, 590, 802, 149, -308, -106, 540, 662, -411, -718, 9, 771, 836, -442, -1008, -303, 864, 727, -693, -640, 96, 848, 455, -877, -875, 252, 374, -196, -737, -553, 337, 597, -159, -615, -368, 578, 931, -260, -529, 16, 823, 219, -427, -650, 143, 657, 305, -582, -638, 695, 1089, 481, -710, -574, 810, 638, 67, -687, -330, 992, 623, -403, -832, 46, 591, 412, -657, -705, 293, 1037, 418, -481, -287, 463, 573, 93, -584, -24, 590, 653, -343, -684, 111, 961, 893, -458, -889, 134, 743, 330, -356, -695, 19, 568, 330, -516, -305]
2361c05M07P10r33m84n1J060J17j120o87J321N88n44o19J59N99K05o23n23k8J091
2381C40K76o15p27N82R36k47o53n83M99O97J17n54l59K88O49l75r45J86L73Q85
2401G70o84q20K06O21N78o20o41M71N13L47j153j34O94M57k18r95j04J016O01
2420I05r13n78K02R85M4q15m02J91Q97q8p85k02O27R58m21j016j67R33L60l90
2440C25p92J62P97L15r13o46M09J005pp70q94N66J146K51j081q00Q37Q77l56q96
2460d65k56Q71N34o17n58J87O22O61j080p03N75Q33M7p32n76N98Q71p15m76l64
2480g43P44N98l16j165L04N91Q84q67p63K40O50M55p31n23K32P24r4p99k99Q31
2500d7O06o57n87j61J067N45o02r51L06Q23N02j087m08L94R17k2j119M2O94O30
$$ y = [-305, 102, 812, -121, -605, -656, 404, 521, -599, -1286, 35, 623, 79, -540, -381, 218, 423, -200, -723, -751, 340, 616, 1, -726, -144, 792, 545, -108, -691, -192, 505, 622, 68, -291, -3, 646, 271, -674, -488, -115, 770, 86, -734, -528, 93, 671, 51, -590, -119, 394, 741, -412, -546, 148, 605, 387, -608, -712, 304, 905, -8, -586, -384, 601, 645, -170, -572, -381, 516, 428, -357, -559, 68, 1026, 605, -411, -578, 355, 715, 325, -467, -305, 492, 807, -106, -752, -343, 662, 655, -115, -1009, -443, 703, 954, -127, -927, -90, 787, 431, -465, -721, 150, 684, 67, -491, -304, 318, 979, -101, -804, -229, 604, 651, -81, -657, -59, 812, 97, -379, -743, 1, 599, 283, -882, -578, 13, 897, 30, -733, -493, 157, 612, -119, -642, -410, 314, 220, -579, -878, -47, 559, -98, -685, -846, 221, 766, 164, -787, -481, 342, 844, -243, -651, -257, 660, 638, -481, -439, 255, 885]
2520H85o45q39lN50N68n85q68M66N88M50o38n63O25Q39j23j063k33O76P62k28
2540F21r84j13J005M5j87r18J93R87R2j014m05M58R73j91n97q12P20O64J07j020
2560c76n0N03O29m21r26K9R10M75p72r18L50J439j25j229p67J050R32k69j176
2579g12k36J211N62o07j003N0R62N68n66j138L81J093K79q72p98N53R20j4r24
2598b91n05O37R18p46q84Q8J016O00p82r38o2J629L20p60j234M26J474k1o76j253
2618a044P24J354l50j279k66O37J077m99q38l44Q42J001p98j400M94J055J55o59
2636a38p63O24J064j85q44r92J106J214l00j353n85J121J081l06j069n46R84J068
2654A181r66r40Q8J548R8q62j130R17J013k94q59n78R82N20k11j024J17O21Q44
$$ y = [885, 240, -599, -602, -52, 516, -69, -937, -471, 117, 567, -71, -634, -9, 830, 707, -356, -589, 87, 849, 621, -363, -476, 529, 574, 387, -531, -338, 649, 741, -273, -678, -220, 753, 562, -35, -847, -127, 537, 644, -376, -426, 77, 706, 285, -641, -612, 298, 773, 1, -917, -567, 872, 747, -482, -1249, -199, 733, 464, -712, -948, 263, 825, 218, -785, -735, 227, 795, 229, -909, -528, 565, 844, -28, -826, -273, 647, 633, -291, -796, -159, 759, 13, -871, -783, 233, 833, 51, -887, -949, 680, 1000, 240, -994, -568, 906, 885, 209, -1044, -320, 1034, 684, -595, -861, -224, 853, 354, -484, -828, 14, 1015, 217, -1183, -689, 366, 521, -138, -901, -277, 787, 602, -242, -1234, -128, 1086, 786, -567, -1152, -31, 1050, 744, -325, -871, 113, 1181, 215, -725, -637, 911, 1009, 147, -983, -66, 947, 653, -206, -784, 198, 718, 507, -517, -400, 221, 1065]
2673A065r82q82J97J210p8n79l45j09R97L94r45n88M25Q61k1q85m08N97J112n97
2693D39j089k01Q78J275r96r02j0J035J69r00l74K84Q98j8q95n32P70J017m00
2712D48j286k86J374M64n15j091k28J137Q75p44p29K0P39L15p41n33M87O96K30
2731F32j102j96N18J062o59o44j36O06Q86q32l39j65R02K10j292q2P6J228J6r32
2751b43n60K95J149m48p39O4O20L20l34r31O76N11J18m13o57M78N37N1n17k46
2771b69N90R4k34m77j04R26k72%l48L4L13O48p03o76M62N93J63l98r25M12L77
2792B06K64o98k60P66K05k03m73k22Q34J91m96k52J03L86Q4m44m87P71M74k58
2812D91j004k33J027L51n24n42j39R53j00j82m70J27M32J06p62j38L40N87m01
$$ y = [1065, 83, -799, -602, 608, 530, -49, -394, -503, 494, 888, -57, -645, -220, 641, 620, -265, -673, -76, 1036, 439, -650, -851, 27, 1302, 306, -596, -606, 429, 598, -302, -676, -392, 506, 488, -407, -939, -169, 848, 448, -838, -1124, 250, 714, 199, -892, -1120, 17, 892, 148, -581, -561, 178, 493, -248, -781, -294, 402, 632, -470, -666, -148, 914, 255, -389, -525, 81, 967, 135, -204, -369, 533, 743, -549, -631, -555, 673, 689, -243, -803, -508, 641, 193, -546, -482, 138, 458, 124, -807, -131, 380, 498, 85, -572, -94, 443, 494, -23, -269, 321, 415, 181, -296, -400, 526, 254, 254, -94, -60, 253, 901, 198, -478, -16, 577, 740, 342, -583, -171, 206, 470, -228, -488, 278, 483, 280, -193, -415, 419, 610, 114, -138, -35, 351, 435, -9, -496, 275, 749, 491, -513, -746, 281, 632, 108, -434, -573, 380, 280, 98, -372, -245, 187, 293, -469, -607, -267, 320, -81]
2831h1k97l09J078K80j90j019k51R74K56p75j72J44R14k52o20k93J68Q88P6q44
2851c25n67Q86L66L0o09n28P32N68p31k64r6R76l3q18l67M08R49o2j076m77J050
2872A2M93j06j072M5P26M36k08p37j59O12M48k04q69Q6J104J92q32k19K9Q12j41
2893D48l73k92J78O40k63r70m7R21O42n18r12J1J261nl15j279P65N86J75p40r60
2914a047R01Q91l84r51k82P99O97j71j146j21P52N02l32n17k54R18K16n45l90
2933d64K26P90J71p23p43O25O76Op83p71J101M82k90r34k16R20N99p86n22L5J065
2954D64J30o67p15M01J148j19r60l62O90K07J45j028J45P43M96p65j068L05Q05
2973eM00m48j155N88R95k76m7p00K16P87Q8q83j52N57P56k25p98l85L80J027n88
$$ y = [-81, -378, -687, 391, 671, 481, -538, -789, 185, 441, -334, -506, -362, 552, 300, -320, -613, -445, 443, 519, -325, -892, -6, 360, 390, -219, -747, -15, 553, -178, -442, -538, 438, 405, -413, -780, -372, 577, 515, -561, -1038, 12, 505, 399, -673, -628, 98, 534, 326, -411, -570, 42, 490, 286, -583, -497, 607, 799, -33, -252, -223, 589, 448, 75, -217, -39, 601, 338, -632, -679, 242, 884, 366, -546, -535, 726, 721, 406, -873, -108, 478, 653, -87, -1047, -146, 745, 361, -590, -872, -73, 624, 453, -693, -814, -62, 440, 108, -409, -663, 255, 471, -74, -464, -238, 552, 723, 0, -743, -118, 558, 564, -219, -990, 111, 593, 303, -631, -847, 73, 672, -114, -636, -601, 464, 594, -73, -788, -387, 761, 642, -318, -680, 10, 217, 362, -666, -521, 222, 718, -47, -1115, -810, -5, 395, -53, -1208, -620, 375, 99, 52, -648, -432, 355, 443, -440, -592, -35, 721, 496, -302, -687, -307, 720, 132]
2994A32r12K3R68K84p07m18L34Q64R7j217j48P36O76j00q75k41N92P71m46p31
3014c18R1N05O33o64q12J30P71n8j88q27N36P31Pn66o70N24P64J4j018N1O30L09
3036E75l50r37M26N83K83n81l61n7P29K36o44n38M92L44J04m58k55N71M30r7j078
3057e83J35L12K45J41n14j12J56O92n91k43j22N77L00n05n04qR64k61m57J5J05
3078b58O31J03q07k16O14L18J59p21k09N40l1P2m40J07K56K22n76Q4j41K31N69
3099E07o98J93j07j4K98k47K10j11J68l10l65J96P42l53m54j61J48L20L3j59M7
3120a17K04k0o1k32k56N42L25j10k95j90L67J29k92m7J32K37j38k66m0L92l3o7
3142A64n36K95J67J65k17k23J74M64k27K88n43N4R1l2k52K56O2q7J7k81o5L48
$$ y = [132, -780, -757, 211, 495, -212, -630, -296, 568, 665, -552, -700, 36, 712, 612, -263, -504, 88, 859, 413, -318, -227, 278, 911, 247, -565, -435, 336, 278, 90, -737, -201, 530, 537, -29, -699, -175, 589, 603, -415, -364, 266, 575, 225, -712, -286, 297, 580, -1, -362, -419, 310, 546, -98, -636, -144, 200, 304, -154, -409, 162, 592, 495, -583, -448, -136, 109, 250, -264, -376, -220, 472, -119, -362, -484, 93, 393, -112, -616, -624, 340, 79, -378, -363, -258, 373, 476, -331, -547, 67, 385, 544, -177, -386, 154, 123, 195, -245, -138, 118, 340, -236, -152, -293, -62, 507, -191, 2, -105, -119, 179, -68, 142, 31, 199, -111, -476, -280, 462, 109, -345, -506, -358, -38, -5, -164, -117, 87, 67, 6, -226, -482, 60, 385, 275, -20, -210, 157, 286, -6, -53, 79, 316, 178, -88, -128, 264, 231, 164, -372, -77, 90, 255, 38, -185, -11, 453, 226, 514, -29, 25, 116, 84, -168, 88, 150, 63, 80, -201, -266, 82]
3164H2J24j86m06K15J91L12k44k31J8L58Q3o74L31M41j67k00m34K99L15J58l17
3185F8j94J85j80L97n13O5j55L19k45O8k44M68N22k22n46r6J05L05N8n46J97K66
3207H2n2k65N0R4r0K25k79l37K33J60M01k39j23P6j17J51j59kL37j74J77k74L58
3230B33J94l75R3k08k8K91n5k83j41M53J35j77r6j61K66R9q5l40l1M23K7n9l6
3253A39q9Q0J28k17K21r6M0j05k07R3M06l76k57L8J90J79l10P4K27j56j57J56
3275AJ90m59N56j53K9j68m16N43K48K0l49k33O8J58K2k78K93j54L61k60j57N75
3297D37j16N2p65K96J24L26l69Q0j50k19N54j73j00K76l74J45j41l37M33O1K18
3318B58o61K30J45O4J80k49j30K06J02j33k93K32K87k58J52k70p4M53J64k13l00
$$ y = [82, 206, 20, -386, -171, 20, 332, 88, -143, -125, 233, 316, -358, -27, 414, 247, 47, -387, -88, 227, 385, 68, -126, 59, -121, 276, -237, -172, -327, -8, -253, -185, -429, 39, 561, 339, -207, -303, -198, 107, 165, -381, -184, 82, 30, -235, -185, -91, -181, 44, -235, -572, -339, -179, 222, -17, -140, -64, -181, -30, -189, -191, 146, -28, 149, -125, 233, 427, 52, 145, -63, -91, 200, 145, -138, -279, 174, 309, 132, 36, -125, 141, 240, 155, -185, -216, 207, 234, 175, 139, 50, 130, 258, 41, 262, 166, 206, 101, -106, -13, 393, 17, -240, -202, -12, 167, -143, -69, 158, 2, -155, 1, 191, -268, 288, 135, 164, -4, -420, 123, 371, 391, 42, -191, -123, 35, 57, -221, 72, -82, 279, 19, -138, 437, 321, 373, -392, -96, 28, 354, -15, 65, -85, -304, 250, 77, -23, 253, -121, 24, -117, -454, -21, 40, 258, -403, -173, -28, 36, 216, -33, -163, 43, 145, 12, -281, -49, 238, -20, 132, -138, -212, 241, 405, 192, -108]
3339a08j84M42n3m23P3L31M82n94j39j45P38N0m89k10J00j9M60r3M9L9k59J14
3361A62o1q1j1K61k59l97K42L74j33o3j42j1J61J67M8j39l17N8M07j57J1j52O1
3384B9J74j76r5K4K99m30M57l73q1K39r3J23k49P1J72q8J33j10Q2j76J48j89j01
3407b10J28N3K33l40k1J45l02M60m9l21J68j02L13k43j32K09k49L34k64N39j51
3428A98M7k87L91j39j18l0J5J69k33jJoJ40j37j21K53j44J2M18n68K17M2j19j60
3452a60K41m63N90j39o6R8m18L37Q5k21K47k79M9k95P3L86j05j48K04L3k51K04
3474BQ5j32n6m8L67J30k53l76K69n2J0K54l90M56M1k12m00J37M39k32J52j95M8
3497D4M42k87j91k60K03K90r9k26O5L03j50k44j5q9J62k2l9kn5J0R9J78l8j60
$$ y = [-108, -292, 150, 97, -326, -253, 78, 560, -34, -173, -318, 420, 470, -19, -229, -129, -148, 312, 219, 268, 307, 48, 162, 101, 20, 9, 270, 11, -386, -144, 230, 97, 34, -108, -119, 42, 209, 257, 118, -199, -141, 266, 109, 120, -32, 29, 203, 27, -68, -44, 255, -175, 282, -91, -172, 67, -26, 97, -152, -81, 91, 3, 136, 26, 108, -68, 80, -109, -210, -82, -29, 204, -136, -157, -12, -314, 146, 97, -224, -56, -158, 155, -88, -220, -11, -260, 74, -190, 349, 198, 245, -42, 349, 210, 92, 62, 77, 246, 13, 12, 13, 7, 147, 10, -111, 142, -2, 10, 428, -140, 77, 119, 0, -160, 81, -382, 208, 69, 3, 101, -317, 20, 105, -116, 131, -148, -99, -394, -321, 65, -40, -188, 16, 49, -202, 2, 87, -45, -101, -149, 218, 348, 95, -281, -12, -64, -54, 200, -190, 266, 307, 95, -305, -168, 271, 39, 191, -4, 44, 486, 199, 8, -252, -49, 241, 142, -84, -19, 284, 134, -110, -125, -214, -52, -74, -113, -115, -170, -160, -61, 117, 79, -81]
3521h1L7J49L7k81L38j10J26l31M38j66J1P4j14J68q3j16k38J10J28k4k6j54K7
3544h1r5K19k7k16j35J14L54l92J70L62j67l38K39n15N45P5R0l66J83K2j91j63
3566c13M82L7k48K24l17lL36l16K46P6k84J20j85K8L5k51KL05j0L45l99J30K88
3589C28l31j82J82K24k4P0n14K92J69L6k01K6M09k88l15J86Q7J01j25O4j04j82
3611i2O3PJ01l52J53k05N74l79K08j07M25o52K66J37k61K06J06k83k77N55l31
3632a38p6j12l2L20J74j34Q2L4k0o3j91NM83m46K81k98Mj98O57k06J10k14j69
3655a47Q2j41K80Q1k40j90K59k56J64J03J69k37k46L12n7J07j8l2j54ON17l88
3677b6J09k68L36K3k06jJ30RO5j85m2L72l81R3M0k24N5J54r5j69J42J16K17j46
$$ y = [-81, -44, 105, 142, -139, 199, 89, 215, -116, 322, 156, 167, 241, 127, 295, 212, 96, -142, -32, 96, 72, 46, -108, -81, -176, 43, 16, -200, -335, -221, 133, -259, -89, 273, 106, -232, 7, -508, 37, 112, 202, -164, 19, 41, -150, -313, 169, 206, -42, 182, -135, -138, 198, -118, 128, 204, -80, 40, -145, -117, -82, -333, -331, -26, -36, 309, -90, 40, 328, -3, -185, -3, 221, 197, 267, -247, 45, 214, 250, 49, 75, 484, 196, -119, 67, 154, 255, 130, 194, 90, -92, -29, -22, 79, -273, -120, -325, 249, -130, 78, -29, 396, -256, 10, 147, -114, 92, 198, -85, -362, 193, -138, -214, -326, -358, -38, 136, 2, 84, 118, 98, 35, -156, -151, 332, -114, 167, -131, -127, -325, 332, 126, 236, 22, -147, -65, -206, 74, 155, -85, -275, -16, -272, -108, -5, 164, -73, -319, -7, -64, 43, 25, -7, -161, -155, 362, -26, 83, -185, 151, 174, -32, -33, 97, 106, 171, -14, -56, 316, -65, 28, 68, -156, -101, 53, -42, -211, -69, 47, 264, 118]
3701A18m37N71j76J7k68MJ15J35P9l1n5k5j79L92m93K64j18J9R5J33n3M4k4l3
3725I4k8P0k66J00o0o3L45l95M4l9J96K65m7k65j61L32N6l59J18j82M6J04J69
3748G4o0j23K79j85J74l51L41n29M38l51O6J36J36o0K17l32K53j75J06O0j69L1
3770b4L03k21J6j5j95K92j14L18m26N8J1k36K57J55N1J30l28j84L63k98J56n8
3792A1N8R7k49J81j47k25N26j97j86k4M6n7K48j43j38NN8K57j54M7l0K2M3QK6
3817H3Kj72j7J72p6k08L5R8J46l98N75k64J56O0j01j04K75n19K88L63l96J08R1
3840A97l07P5K04k79L6J99l47L9K16MMk3k41J7K2K29K8q0l3j27j42J8J66L62j57
3865H0J36k72m9K27k36j03M22n0j11J64o6j15K51k52r6L0J91q3j77J35k26%J77
$$ y = [118, -319, 252, 76, 93, -175, -171, -56, 79, 158, 127, 72, 47, -132, 260, -233, 31, -87, -68, 27, 160, 107, 151, 127, 94, 66, 136, -130, -30, -90, -153, 192, -203, -159, -198, -2, 263, 216, -49, -210, 122, 178, -181, -63, -245, -199, -95, 74, 14, -109, 170, -15, 159, -192, 149, -380, 58, -293, -227, -91, 45, -15, 202, -130, 123, -52, 54, 114, -55, -24, 279, 58, 74, 59, -136, 156, 42, 360, -66, -8, 3, -233, 24, 179, 230, 360, 32, -152, 211, -87, 69, 11, 69, 166, -83, 98, -49, -274, 252, 55, -131, -155, -109, -166, 82, -61, -199, -194, -136, 121, -33, 14, -16, 6, 49, 57, 83, 85, -87, -104, 68, -8, -216, -181, -83, 63, -335, 240, -24, 132, 192, 91, -13, 262, -257, 31, 394, -2, 106, 197, -110, -35, 169, -110, -74, 125, -222, -183, 33, 37, 41, 18, -223, -206, -184, 45, 73, -7, -40, -167, -309, -291, -125, 237, 80, 216, -56, -105, 122, -114, -217, 205, 155, 44, 208, 142, 27, 278, 26, -70, -40, 151, 68, -109, 26, -200, -200, -23]
3888b3Q0J64j73j52N35m62J47k35K12K24l60Q1l4n9J21P6k21j47J81k69L26O7
3910G9m1q4J36j23q6q2K59j93k00L31M10j38j05k61J35m8j70n7L66l25L84j68
3932A9R7p6Q7n4J2m9P6o7n4O1M1O7j40K07m46K90r1J35k10N7k80L72N0Mk69M1
3958a20M43m53r5J62l0M00n32J69K23k22J74k52n3Pj1M66j96K0q3q6L50l82M6
3981e5J05J75k95K12k95J87K17J51j79k91K45p2j11n5L14r0ol8J60k74j98K10
4003A7l32L40l9j74J31j18J58j80K06l1P6or3j34n6N6J53j16L70o8K75m36m3J86
4027A42k5K51m04k8J82r5j36J20J32k55M87j35j74pk22M98r8j92J50l29K27j85
4049i6RK15j53m5l9J58j10r7j41J65K59k27Q9O3j24lJ15K46k34j71k09O84l19
$$ y = [-23, 57, 221, 48, -104, 431, -31, 116, -119, 93, 317, -43, 38, 4, -55, 66, 142, -79, -226, -45, -314, 12, 79, 38, -46, 90, -33, -119, -201, 58, -135, -335, -4, 406, 268, 163, -98, 37, -11, -181, -238, 128, -197, 187, 19, 116, 40, 127, 73, 85, 36, 112, 45, -9, 52, 93, 160, 20, 227, -219, 71, -20, 115, -95, -38, -318, 54, 104, 108, -161, -120, 323, -130, -225, -63, -93, 307, -225, -56, 167, -55, 119, -133, -186, -179, -190, 276, 80, 100, 17, -69, 281, -101, -55, 50, 225, -70, 142, -153, 34, 251, 402, 223, -68, 177, 105, -6, -61, 253, 163, 157, 119, 279, 5, -193, 17, -315, 25, -14, -188, -57, -175, -17, -197, 9, -22, 54, 48, -45, -179, -235, -179, -26, -142, 228, 160, 435, -1, -44, 142, 117, 368, -36, -64, 118, 23, -113, 7, 139, -116, 371, 236, 62, 55, -167, 331, 233, 41, 191, -138, 89, -96, -87, 128, -25, -70, -109, 49, -61, -158, -299, -134, 125, -102, -13, 50, -74, -77, 38, 284, 50, -121, -330, 354, 35]
4072C5k41k60M33j2k61L52j98J11L53m39Q2k14J99J03j1L17k63n7k18kJ90j06
4094a07k17P38j49k57l95L92o2J83j27k53N27k63j04k60N06j11j27Q7n4P0j78
4115a61J66j8l1M5o1Q7j6J4l8LL05Jn60L12M7p7Q2Om36K85K59l96J34n6J81k79
4141b02l9N4j97l4K70l56L47J38J06k85L74m47N76k06j8k83J38M04l81L44m40
4162a37K2Q8k3K48j28j0P0j07q3J33j87j28PM11l38R2K5j05K91N9m15J30J91n3
4186E3K32j05k27J52P9n8mk75M7P7J19J27j42j11m8M3l3K36l25K64o8L9J16l89
4210b01R2J06R5J74m87J56K68k77P8j14J10K35j19k0ll76K64K8j4R6L9K1k24J44
4234G1j52k0K22m0q5j25K59Nj66k2K10q6Q8k11j05M94o48j36L88J22k2J36k06
$$ y = [35, -206, -466, -33, -45, -306, 46, -152, -41, 312, -127, -45, -259, -60, 43, 32, 349, 86, 29, -189, -191, -1, -107, -324, 414, 265, 8, -387, 5, -57, 126, -1, -254, 273, 10, -94, -354, 152, 41, -86, 1, -53, 17, -161, 5, -13, -44, 1, -60, 27, 11, 25, -13, -10, 295, 296, -264, 48, 95, 18, 100, 106, -330, -45, 214, -182, -48, -104, 77, -202, -241, -187, -384, -418, -148, -504, -157, -19, 87, -198, 176, -271, 305, 99, 81, -202, -64, 340, -41, 303, -137, -115, -27, -50, 198, 70, 60, 130, 23, -60, 73, -114, -242, -235, 176, -162, -70, -45, -150, 141, 200, -215, -85, 106, 53, 285, 180, -47, 105, 184, 126, 122, -153, -106, -29, 90, 217, 75, -36, -84, -41, -74, 162, -163, 101, 33, 72, 188, -201, -109, -3, 92, 266, -221, -65, 203, -74, 4, -110, 0, 235, 116, 96, 93, -283, -19, 9, -5, 91, 130, 151, -73, 71, -81, -101, 121, 81, -4, -129, 130, 135, -31, -53, 157, 71, 159, -52, -157, 337, -311, -447, -59, 63, 41, 177, -29]
4257b9j15J42J5l18K34j13L27m73M20n3j62K85k17O8J3n9J84pl48j3K04K97k04
4280G8j23L9K72o2j21l02M00r9O4J99L1j78M3j13j23j06K50j01j89mK31j19j95
4303b28J16Lj04O0K00J82k12L4j07j62J06K81P8j71j91PJ91Q9j50M06k97n23N06
4326A14R6M6l96k61K51J44r2M2n8J43n8J14Rj07J91N1k32m5j75K71K2l74J43O6
4350i5L76m44K18k4N9j54J83M1l2j86k70K79J22n0k05k9M94l86j25J39J56j68
4372a01Q0J04kj75K4P3L12l19j79J6J4L19n0J04j57J05l05k16N54J91l88m2K49
4395B11J22n19K26p0L8k2k6p9M0N1m00N68l20O1L44K8p2l29J54q1j27J05R4j1
4419a4M65j54m28K04j98R7k8P7O6l76j0L08k75J55J99k9J93l06J35k20o2J37K83
$$ y = [-29, -144, -2, 13, -305, -71, -184, 143, -330, 90, 37, -125, 160, -57, 11, 24, -35, 149, 142, -206, -219, -15, 282, 78, -45, -6, 266, 204, 83, -219, 181, 82, 146, 345, 376, 198, 241, 128, 5, -101, 149, 48, -141, -145, 86, -33, -228, -112, -109, -213, -153, 47, 229, 17, 51, -56, -218, -112, 169, 247, 76, -115, -108, 83, 172, 22, 428, 131, -392, 114, 210, 256, -140, -401, -150, -6, -98, -56, -114, 29, -29, 85, 94, -13, 178, 229, -3, -48, -223, 48, 70, -304, -161, -95, 281, -163, 55, 31, 90, -64, 119, 160, 128, -58, -328, -49, 73, 23, -182, -211, 283, -103, -228, -89, 67, -101, -21, 83, 81, -94, -70, 3, 315, -4, -183, -167, -153, 166, 116, 220, 63, 168, -137, -353, 201, 392, 4, -38, 211, 333, -186, 40, -30, 8, -14, -40, -119, -79, -28, -428, 140, -180, -119, 225, 253, 181, -148, 6, -75, -202, -97, -3, -14, 451, 297, -131, 73, -125, -28, -56, 21, 87, -289, -299, 9, -266, -111, 88, 59, 252, -54, 81, -139, -201, -64, 219]
4442B19l30M36l64J10j98j84K95q4K34J9j96j06K90j11k5PJ45j22m3k9J4J28q9
4465A6P6l6j30K35k01J29l24J09k2K77k66L99m53k16N56m90K40O0p0M00k24K0
4487H5l30J94p7n1K44j21j09L56k55nK45k44M4j27L13k92K58m6k21J44l18J34
4509a79K26K83l84j56J64p6J21K85l47L15j43k68j0J43k7pnj02n4K27k4k07K91
4532F6j27l5K46l86j44J96K51J50l56L0J20J12q7n9J78N5N3j04j25k31J43k1P3
4555bP0k19L04o2m13N71m65K01k4j48K13k15K21j57K60k69J59k42M04k67o0M38
4577B98j50l4n8j14J11k65L68J86l74r0J56j76K06K7Nn7j42J77j04l7K25l14J88
4600C2k8KM5j32J50k04K46r6j22L45q1k67K51p7J5p3O1j51k00R1%L15j89K37j91
$$ y = [219, -111, 325, -39, 71, -127, -311, -16, -100, 134, 153, -43, -149, 141, 30, 5, 12, 157, 35, -8, -37, -23, 105, 16, 92, 56, -74, 161, -40, 89, -235, -126, -148, 129, -137, 262, -191, -407, 149, -341, -101, -41, -111, 289, 65, 85, -245, -51, -128, -179, 65, -56, -165, 191, -64, -69, 176, -68, -24, -151, 162, -130, 128, 82, -139, 5, -313, -179, 47, 330, -54, -210, -46, -122, -1, 284, -63, 252, 109, -159, -169, -26, -53, -60, -65, -167, -221, 6, -18, -225, 66, -61, -96, 150, -236, -380, -184, 67, 217, -139, -109, 11, 123, 36, -23, 155, 210, 263, 159, 34, -197, -54, -75, -2, 68, -151, 153, 91, -322, 249, -216, -15, -39, -187, 26, -189, 32, -125, 135, -134, 25, -217, 187, -80, -140, 298, 148, 114, 56, -58, 53, -212, 156, 342, -32, -122, 34, -142, 64, 91, 96, 39, -103, 74, -30, -67, 158, -156, 32, 4, 6, 51, -81, 69, -135, 111, 15, -107, 238, 157, -110, 141, 64, 79, 6, 67, -84, -284, -193, -193, 122, -67, 170, -21]
4625b1j43n7M36l99K2K3l0Q2J51k02N08l85O8l86O52j40m96l8O99k12k51O0K31
4648A72L2j92N0O3J4l4l30K59J30j94J11K8l59J66J65L19l28r9J79k86L85q9j60
4671Bm58K09O32k59l34L60o8l25M23k8k95K67J5j19j46L6M2j48L22k29K07%k63
4694a57J70j92n7M15m06q0L26k58J96K67j77j07J16J44j47o9M2N8o2k0K27k46
4716a7j38K82j49J76j1j25l30J93L10k23Q2j14J95o6j55K0K68l05K48q6J0J62
4738B27k78k9K44l6j47l43M61k46J53m0R4O8j99M9j1L5J82o6j05M1K24Q5k61m6
4762E6k46K41QL49o56Q3M1K03k55K11q7K51M6k87j63J9L68l56k78J98M16K8m2
4785A48k19J09no0J15k67J70O1l59J36J44q6K41J87m83J97K57p4k52K76l21m7
$$ y = [-21, -164, -221, 215, -184, -162, -139, -169, -87, 64, -138, 370, -15, 53, -333, 319, 179, -317, -355, 344, 132, -119, -59, 172, 204, 12, 62, 125, 139, 105, -225, 34, 164, -30, 81, 109, -250, -84, 81, 400, 72, -27, 152, -134, 251, 162, 2, -456, -247, 385, 126, -208, 152, 84, -241, 182, 154, -141, 126, 141, 22, -124, -88, -46, -194, 128, -101, 106, 106, -157, 13, -179, -236, 179, -227, -307, 19, -239, -43, 224, 47, -60, 56, 200, 53, -16, 26, 84, 22, 2, 229, -17, -155, 127, -22, 154, 143, 18, -312, -119, 191, -32, 50, -64, 131, 65, -90, -70, 198, -107, 141, 55, 65, 227, -51, -80, 164, 128, -19, -362, 99, -147, 6, -34, 60, 128, -71, -22, -33, 2, 184, 118, 13, 54, 278, 363, 102, 56, -190, 51, 59, 408, -248, -165, -124, 79, -176, 35, -52, 199, 245, -42, -205, -186, 182, -174, -452, -254, 162, 190, 148, -71, 38, 33, -27, 88, -179, -9, 52, -307, -171, -27, -113, 128, 315, -168, 29, 286, 212, -40, 236, -85, -132]
4807a32J54j7k2j03L50q1M1k00j6J43k60L58k97j50M32k09j23J43P0l20L67L7
4829A65j23o0J5O2K39j45n9J88l15k1K13q4Nk93j4J55N50l17N3l91J10P4r1J04
4853B0K2J18k10j91J70J15p4qK24k42M2M6p2q9j3P8j4J36q0k97M36Q6n48K78j4
4878h1J68J51J23m03K25j64r9L03k42K88j29l41K24n18M81O2r6o2k15M62k48L0
4900h1Q0o8J77Qk04jJ24J03k64r4J79k34L02j12j35J0O1K16R2m30K01K8j43Q7
4924i8Q4R0p7O6m6j03K52p5l4k18J64K11L0K8l40o7K28j07rj25L11N6k52L19l69
4949h1L18k63n4j01L34J00n26J23J6rJ61N6j67o6K87k9j58j80J09k4P1j38J18
4972a03m6Q0m0L25j63O5j06L3j54M8J28j77qL08j41j25o8K05k7k22QM61k69j51
$$ y = [-132, 22, 5, -17, -120, 230, 149, 190, -10, -26, 117, -143, 215, -82, -232, 200, -9, -132, 11, 81, -239, 128, 165, 42, -18, -3, 59, 298, 153, 94, 282, -33, -54, 159, 75, 80, -213, -227, -72, 478, 161, 214, -177, -67, 7, -84, 20, 42, 160, -50, -241, -71, 44, -30, -38, 186, -56, -14, 32, -40, -129, -142, -64, -78, 58, -22, -319, 117, 203, -345, -67, -81, 87, 238, 361, -42, 183, 19, -80, 223, -19, 269, 140, -201, 23, -495, -14, 48, -48, -110, -325, 137, -111, -81, -1, -69, 108, 116, -88, -89, 35, 138, -126, -220, -41, -275, 27, -85, -220, -210, -149, 67, 159, -271, -70, -42, -185, -98, -14, 76, -1, 65, 19, -84, 168, 93, 59, -159, 5, 216, 246, 274, -66, -133, 95, -12, -21, -146, 165, 221, -31, 288, -81, 237, -26, -80, -181, 153, 253, -273, -150, -134, -143, 18, 74, -93, -159, 128, 99, -59, -239, -130, -154, -83, -221, -103, -149, -69, -109, 216, 53, 118, 12, 45, -109, -61, 67, -110, -118, 190, 49, -76, -144, 61, 34, -188, -180, 281, 12, -139]
4996a39K94r8pj37L26l40J68k9M3l49M17l02K93jl50K38k11J02lj54N73r4j10
5019A30l23j09K13L18k35k13N01M2j92o2m2j08J10m46M08k16L41J87l60j62K05
5040a3K16r5pm12k0L12J63j8k66R1J24j23j64J64J26N3q0k74j41L64n4K3j45P5
5064a01J70j58J21j7r1l7K80k8Q0j26j73K44j93k19M04Q6j47k54J53J56mL8n9
5087A25j72J10j31l40K92K0J78kj48K17k3l39K26j59n0L07j36p5n5k6K37j59M54
5110C51k37k10J85k17K69j28O9L40l34k88k2R1K40J20n36L16J63l00j7M3K87j74
5132A1J34k5p9j40J69N0j20Q6j49J63j13Q1j51mN3j02L4K82l64M09p6l32N17m24
5156i0L41m67J70mK89J8n81L37LK71m34K9J0j92R9J83j27M5J31p6J94j94K05p5
$$ y = [-139, 155, 57, 50, -87, 239, -101, 67, 38, 81, -268, 149, -153, 140, 139, -211, 27, -184, -82, -85, -239, 334, 240, 130, -193, -302, -89, 229, -6, -219, 282, 324, 132, 70, 28, -80, 30, -416, -8, -224, 117, 304, -56, -218, -13, 203, 108, 101, -311, -331, -19, 144, 126, -140, -49, 75, -48, -212, -48, 78, 131, 51, -223, -364, 0, -54, -31, -176, -101, 69, -89, 32, 15, -76, -113, 167, 139, 219, 93, -80, 164, -29, -248, 156, 242, 95, -159, -6, 150, 146, 184, 125, -47, 63, -68, -408, -116, -96, 82, 80, -68, 149, 126, -213, 13, -146, -196, 111, -25, -100, -155, -181, 56, -103, 351, 114, -96, 89, -128, 141, 13, 82, 422, 88, -200, -222, -131, 109, 229, -307, 9, 172, -128, -145, -102, 185, 11, 145, 120, 41, -99, 70, 120, 0, 86, -63, 100, -13, 68, -83, -87, -34, -136, -102, 180, -184, 225, 149, -183, 334, -90, 251, -216, -46, -50, 239, 257, -324, 13, 16, 287, -147, -118, -108, -300, -201, -18, -145, -100, 31, -45, 149, -45, 160, 85]
5180H5jR8j78J05n4j42P8j22L72m6n38L13P4j10K97j99j43PK28m9j60k64P31k91
5204I1k07p3K18J6J36j76l89J79K58K29l00j5J14O2j82k44L68l50M35J61l57M0
5226A4J03R8j66l2k47K23O8k2J2j23J72p9l3M9K59n18L32k31J00l1j73L6J44L7
5250hO2p5k7j15q2K60J33l63K93k9o4J47m80L06pL24j12k31J36j43M6m3l13O10
5274B25J01l61k06K92o3l8K84l7k44n0J8M34k90l54L70k02R6j23K58j58M3J73
5296A68j54k0M1l0k40J78J3J29j0R3l15m0K35j52J24m64K90K07j86O0J58k63L4
5319a44L26j83O3N8Mp5j50Q3J99k52j0P7L3J15j75n9p5J23J08k6q9J97k93Q8K7
5344c0M5J01r4r6p4m6K16q1kJ16k01K07m25K69K92m57M92q1n7j33m8L25J71l50
$$ y = [85, 84, 182, 4, 109, 55, -87, -9, -131, 241, 195, -343, -30, 44, -66, 231, 32, -111, -104, 124, 75, -85, -349, 382, 91, -116, -189, 29, 45, 181, 5, -384, -205, 53, 282, -18, -33, 81, 143, -39, -283, 85, -265, 170, 331, -26, 14, 117, 215, 49, 17, -230, -7, 61, 39, 51, -72, 100, 21, -12, 37, 296, -222, 110, -121, -21, -52, -225, -189, -45, -8, 54, -21, -48, -163, -245, 15, 148, -215, 78, 49, -15, 132, -348, -42, -49, 275, 163, -68, 68, -75, -29, -72, -385, 225, 326, -35, -241, 51, -12, -50, 234, 197, -47, -97, -79, 355, 65, -289, 81, -121, -25, -148, 110, -48, -5, 168, 14, -6, 35, 5, -235, -57, -44, 85, 75, 168, -147, -187, 48, -104, 20, -444, -154, 53, -133, -73, 85, -178, -144, 182, -1, 62, 120, 124, 49, -101, -18, 181, -71, -81, -4, 29, 144, -31, -90, -165, -42, 66, 40, -49, 148, -145, -57, -30, 15, 116, 22, -74, -148, -194, 22, -59, -61, 55, -146, 61, -364, -95, 197, -260, 232, 151, 94, -39, -87, 238, 409, 59]
5368E9k45L05k96N9l0j75J96M79l38J22k97K46J65K4l00j57L19j13O7k85K21J62
5390A88j10k84m0K80K5j10n7J87l45L93j75j19r2L29Lk47jJ08M26k16m87K28j27
5413b43J05j8j05J52J56q0k19J40J05l3L66l70K29q3m68L68n5K77k74J30J62l73
5435a31K66j84r0J22O5L7j33J12K79m65M74m31pk56L6M07Q7l32J70m13K09J18
5457f0j08O6K0J74k89L01k84O7k23M61Rm75L38j48k2M6J02j19K83j2J2j04J36
5480A71k48Olp7J39p6k35Q1L13K47k09L21l79k46l5L11O6P5l1j38j36O1j32M2
5504a12K80k08r1k6K56j82K60m15L02j57j84O18l25j56K47J1M0k95K35J05j76
5525B7j1k30J41j39K80l39M20j91r0J93m44J65L87j67Kj31R3L15l86J95k13n8
$$ y = [59, -186, 119, -177, -118, -148, -323, -127, 352, 14, 136, -161, 85, 250, 274, -26, -183, 136, 23, 90, -195, 26, 188, 78, -206, -246, 34, 59, -51, -108, 79, -266, 127, -48, -167, -259, 70, 73, -174, -175, -67, 359, 143, -344, -116, -243, -138, -156, -261, -109, 47, -33, -252, -112, -7, -40, 326, -44, 185, 102, -366, 2, -53, 224, -50, 80, 242, -131, 135, -49, -139, -17, 48, 85, -48, 64, 343, -122, 352, -79, -86, -342, -306, 101, 188, -144, 26, -387, -178, -60, -168, -102, -82, 92, -197, 104, -180, -113, -336, 125, 134, -341, -3, -151, -173, -127, -25, -144, 139, 127, 139, 35, 171, -77, -71, -74, -151, -12, -88, -323, -242, 71, 318, 109, 430, 51, -195, -230, 81, 147, 222, 191, 53, -83, -22, -154, -112, 168, -40, -131, -157, 99, -83, 177, -238, 64, -93, -277, 341, 16, -140, 107, 118, 158, -137, 98, 203, 27, 16, -214, -73, -212, 68, -271, 149, -42, -132, 61, -383, -218, 169, 2, 4, -127, -34, 281, -105, 90, -123, -181]
5547a81QJ53J66k85J72l6R5j98J02o3J35j14j01P3J38N7l5P6k80K85j83K30k27
5570a3M4O6j78j08L82l73M66j2l53j25K63k5K00l78K57J24o2l36J09J74j71J04
5592E5j36o5L52J15j74j20j54K99k34O7M0K95l23M4k56K93j91L16j63r2K72l76
5614a36L44j25m06L67k34J98K51O8k31k68K08k79L68k20M4p4L5j6j85M51k31k6
5636i7J84j2oL6O5M2k03j91J65j55J09L65l34j71Q9J48j89J71Q0j51l17J52K13
5659gJ9k53J58J25k86M93k15j46K37k9k70N4J77k5m1K8l22L82J11k05j04p2L51
5682A60j05k09K04L7j02j57L28q9P6k51J01j30Q6MJ27j66N3K47kn83J72K38O4
5705A03Q1m03j28L22L77l96K93m74O6L13K0L1L9j94n4J03j8qj60K28J00k28L7
$$ y = [-181, -173, -20, 146, -139, 33, -3, 92, -106, -4, -67, 68, -46, -147, -74, 64, 121, 86, 162, -118, 167, -16, 214, -13, 31, 97, -81, -189, 193, -180, 286, 274, -79, -204, 59, 34, 234, -144, 113, 237, 175, -161, -52, 122, -49, 55, -81, -146, 206, 321, 147, 27, -127, 172, -62, 5, 45, 340, 17, 61, -195, 98, -93, 223, 60, -32, 240, -136, 208, 83, -323, 44, -190, 8, 259, 327, 96, -172, 36, -243, 125, -95, -51, -125, -90, -106, -291, 160, -71, -97, 87, 75, 69, 105, 170, 212, 9, -182, -17, -172, -63, 302, -32, -203, -114, 34, -155, 16, 96, -55, -372, -220, -7, 12, -241, -83, 42, -244, 249, 34, -112, 125, 96, -174, -120, 57, 32, -9, 19, -303, 79, 190, -15, -119, -191, 160, 55, -154, 50, 87, -15, -172, 156, 67, 143, -108, -7, -137, -51, -47, 80, -86, -33, 214, 212, -371, -199, 39, 103, 184, -219, -347, -25, 352, -44, 249, -225, -159, 154, 174, 205, 244, 50, -4, 99, 81, 73, -87, 141, 241, 13, 50]
5728E0j36P9J60n4P2j86M01j77j94j3M3K20l14j49M15k54J70k78K82K8k20Q0r1
5751f6J07j47K51j54r7L20j94J27k10J36o5j6j52K89k26J46P7r8k29J99j48K08
5773E8pJ13j76J03j65P3J42j73M0j27K23l14K80J56Kj89%L2J25j96J05Q6n0j95
5797e4L89n21ML22n3q1k94J94K16j00j1j96K69k30P6R8p4pj50K45Pl06J21J62
5821B6J22k28j84K56q3O9J36r3kJ22k05J79l57N16j75j69j19J63p5KJ56k12J2
5844a43Q6J45j2j3K8j28J50p7K09k21Q4j33n7j41J17J2K98J19j23m37K16P0j14
5867f5M08n50L41j16ok00L64k82m7qL27j04Q1l28J06N8J04J55n33J53j39J54L52
5890B25k35k43lq0O76k98M4k29R4L1l07K34M86l73k62L1K49q1lj4R6L12k50J3
$$ y = [50, -86, -7, 153, 99, 171, -15, 386, 209, 15, 2, 45, 265, -49, -198, 217, -37, 133, -145, 137, 165, -55, 25, -66, 41, -106, 145, -9, -106, 214, 20, 147, -63, 73, 8, -8, -160, 129, -97, 49, 126, 28, -201, -2, -150, 58, 51, 164, -12, 91, -74, -1, 141, -32, 8, -119, 104, -210, 70, 226, 228, 39, 39, 71, 196, 0, 105, 191, 141, -54, 335, -186, -182, 140, 87, 6, -288, -94, 122, 22, 11, -185, 84, -146, -70, 28, -46, -53, -203, 42, 49, -257, -136, 26, 148, -80, -264, -8, -91, -22, 114, 21, 19, 141, -64, 115, -242, 274, 99, -70, -189, -26, -101, -99, 57, -155, -143, -57, 88, 76, 63, 91, -37, 113, 36, 245, 24, 108, -25, -82, -223, -106, -94, 204, 323, 200, -237, -21, 49, -65, 343, -207, 134, 18, 12, -188, 176, -106, -153, -161, 166, 62, 143, -185, -79, -21, 83, 238, -295, -142, -281, -127, 225, -10, -253, -256, -336, 340, 42, 86, -143, -49, -18, -325, -91, 395, 22, -240, -209, 40, -41, -44, -58, 38, 350, 100, 113]
5914A13j4J32o7k13K66j12Q5k50N7O5M7j10j61O5J01K8k29K18j03J06J67Q9n90
5937c10K44L40k08j75m0L24m01K98l65M68m11K75L9m6N2j65J42O3j12K49j76j28
5959d3J11K8J20l61L39k53M2m2M11n22R7j44K56p4K0l2K70k57KJ36J55q6m7l32
5983b06J89J13N8k19M2j7J18j38O3l3l00K77L1j67K80J33l24J70o9k04K94l62
6005b71K70l15M37k71L19l17K44k68l5L39k84K61j6k12n0J26J37k93J5J94r4j39
6027b23K59J77l53R1j42k1M83l11p2N53k14j04k40K27P4j19j98J73N0N0j4k20
6049i4K56m11J96M3L01n50J55p9J84j0r8J03k5Lj5k15R2K71k40J74j39J67n3l59
6073c43K93J9K18m34J42L90k92J14m42J59J23N3j00K37K30m92j0L66j41k34J09
$$ y = [113, 99, 231, 164, -49, 217, 105, 190, -60, -3, 62, 109, -1, -162, -97, 4, 32, -197, 21, -82, 24, 191, 280, -310, -66, 274, 66, -109, -149, 175, -226, 72, -293, 175, -236, 39, 78, 32, 84, -81, 61, 124, 12, 261, 85, -43, 68, 96, 216, -145, 194, -59, -17, -59, 352, -170, -73, -217, 39, -35, -15, -47, 223, -34, -32, 104, 259, 173, 126, -206, -17, 96, 154, -65, -23, -40, 78, -60, 3, -30, -330, -53, -22, -189, 91, 224, -100, 70, 1, -203, 91, -271, -1, -316, 121, -150, 169, -148, 96, -172, -207, 132, -152, 109, 93, -119, -169, -43, 94, -199, -184, 10, -84, -223, 36, 213, -140, -49, -191, -212, 271, -40, -112, 441, 227, 123, -117, 110, 184, 65, -133, 40, 90, 140, 126, -94, 162, -249, -53, -10, 291, -259, -104, -183, 1, -9, -107, -4, -29, -26, -41, -256, -164, 107, -133, 41, -98, 69, 16, -343, -50, -31, 187, -247, -105, 285, -7, 107, -335, -176, -53, 0, -100, 137, 367, -125, -135, 231, 90, -144, -35]
6094c5J97r8j66K10j30l2j76J20L58n6k52J1K99k64o0j7J12M6R4k14J12J32k65
6117g4L4J14q8J13r3l6J04j44j17K45j53J14j08j30L85k52j59K26m2j25L84p3
6139A25M1m17k4K1O09l62m6j94L99k76p0O36l46k50J78Q9J49j00l19n9J24J89
6161I7j67J51k07K25k3j25Q1n1o8K31j00j17L0J52o5J13M9p0l47K98l5O0k17J02
6185cJ34l53K47J43q8l5J01O3j13j63J16n8N5R7l49J94O1j03j25L29j95p8O9J41
6209H7Q1k33J00K8M6J85k62p1K24j49m37L77K49o8j64K9K38K4o77M13l3l55L87
6232A9j6r1j43J51p2L21k94L44k71L5Q2J54k11j89L7p0k9K87p7K6k97J76J51l
6256B0j70L9Q4J21J14Q4k17L01n61L32k96k00J73K0L70r3k1j9pj73O8K3k9K37
$$ y = [-35, 162, 64, -102, 108, -22, -54, -230, -110, 248, 192, -60, -49, 250, -14, -74, -91, 21, 67, 161, -53, 59, 191, -74, -40, 74, -14, 99, 6, -30, 74, -70, -187, 58, -95, 19, -89, -219, 166, -86, -245, -19, -61, -186, 198, 125, 166, -251, -275, -254, 355, -7, -53, -247, 152, -124, -194, 442, 96, -154, 24, 113, 262, 162, -157, -216, -92, 97, -70, 81, -126, 99, 76, -49, 32, -19, -87, 144, 44, -73, -43, 109, 44, 157, 206, 136, -211, 87, 52, 112, -105, -3, 131, -222, 25, 168, 80, 45, 146, 209, 96, -67, 49, -9, 46, 143, -206, -12, 49, -54, -179, 150, -45, -123, -54, 87, 168, -65, 35, 63, 109, 294, 32, -39, 185, 36, -401, -24, 225, 157, -7, 22, 260, 284, -393, 20, -13, -368, 19, 3, -88, -231, -80, -152, 169, -125, 219, -52, -17, 65, 219, 8, -181, -144, -214, -243, 44, -33, -7, -304, -128, 23, 20, -150, -111, -27, 94, 208, 292, 75, 376, -185, 147, -149, -349, -176, -156, 214, 121, 100, 81, 74, -99, -31, -8, -37, 200]
6280B00q2j6J85k16k39K45m0k93K54l51L22J97j27m96L83J2J91k73J80Nj48K23
6302A16q2j56N17m86J77M9j29k46K04j92J00p6L08j08j57J33k63J23j90L00M14
6323C56k72K2j68J02R2r0j08K53j32k02J86k93N44k11j85J39m2K25k48K11O7j94
6345E2k33J84k09M85k15j43J2j9J02O4l4n3J1J0k13K45l00M33L9m61l2M70l61
6368a66M6Pj08J49q1J45J03J3j52M00n46L26j41l5j54J37Q3k06J99J89nk28j01
6391a26K50m42K07K01l67Q2J84j51J3J57j26L27NJ31l44J54k60J61j37K18j43
6412fP8J16k11J79K4m7k09M8Q2J66j60j25j36M4q1M99l84j30j8j9k4K27K23P1
6436B07o3j42N0k12J69K0N1K53k62n3J00o8J92k05K8K25o2p5M6J1k13K21n92N34
$$ y = [200, 118, 102, 287, 71, -168, 77, 37, -256, -2, -353, -31, 166, 39, -457, -74, -62, 129, -144, 36, 41, -107, 116, 34, -122, 395, -91, 86, 135, 6, -240, -36, -228, -128, -204, 104, -4, -161, -28, -291, -168, -358, -58, 356, 84, 106, -62, 40, 132, 42, -66, 187, 55, -147, 39, -254, 290, 79, -106, 33, -9, 216, -32, 179, 246, 52, -181, 3, -206, 279, 64, -79, -67, -86, 16, 80, 46, -7, 4, 14, -199, 46, -254, 179, 218, -243, -275, 195, -166, -120, -113, -221, -72, -153, -8, 95, 108, -44, 356, -190, 136, -5, -40, -194, -57, 26, -180, 19, 208, 203, -25, -126, 124, -318, -111, 90, -277, -195, -11, -162, -149, 8, -118, 209, 214, 345, 1, 155, -105, 56, -81, 137, -6, 72, 188, -23, 156, 180, 133, -76, -28, 54, 220, 60, -65, -201, -157, -238, 261, -123, -253, -271, -290, -314, -87, 136, 207, 144, 2, 52, -160, 9, 29, 80, 333, 71, 18, 118, 50, 242, 37, 65, 290, 228, 153, 199, 210, -3, 218, -374, 160]
6460A60n8k25Q1k6j47J24r6M00k90M54m98M75m15nL22m19L8K05L5lj75L57j95
6483I9k98NR2o6J24O3Q8m46L44r6K27j92P7k36J17L8J29o7J76L2m3k13p9J10O8
6508E3K1j80l5p7O28l87L2J39l13j13J22L54k40j26J27j08K28l56L01ok02j12
6530b50L9K98j51QK50j99k11M54m07Q0K00j54O3j99L69k66J51J17j02J56k7k39
6552b0l2j29O24p22J12k8K34j05qN2N4L43m15K1JJ27N2j66L21l26N2j92k1j79
6576c50K63J29K8p1m1j98L05R4J8j74r8O4j55K03k78L73l10M17j17kp6J34j3j39
6600Fj53K31l17j63L82L52m20J52j51J23k20K72q9l17J36L53k88J24K68k03K8
6621A06k28NJ33l10L99j44j75J16R7K36j07l60M57k67j17J7K87j84K28k2p7J7
$$ y = [160, 102, -123, -42, -68, -215, -91, -187, 213, -77, 377, -121, 354, -61, -66, 256, -163, -125, 80, 115, 112, -63, 294, 99, -199, -194, -102, -168, -44, 19, 107, -339, 5, -91, 136, -56, 21, -215, -98, -60, 69, 2, 178, 210, 167, -46, -125, -15, 53, 74, -106, -141, -218, 410, 23, 55, 194, -119, -232, -110, 244, 4, -122, 5, -103, 125, -231, 70, 64, -138, -250, -211, 87, -64, -56, 194, -5, -216, 238, -169, -89, 111, -43, 20, -179, 190, -76, 75, 192, 90, 246, 219, -20, -52, -181, 443, -279, -167, -195, 39, -66, -74, -22, 32, 375, -40, -19, -18, 109, 161, -5, 316, -10, 42, -150, -171, -350, -87, 42, 70, -1, -42, -240, 65, 159, 177, 3, -95, -31, -186, 17, -261, 112, -198, 219, 102, 100, 24, 158, 145, 6, -147, 84, -233, -396, -14, 338, -82, 70, -81, 42, -178, 94, 5, -312, -176, 177, -111, 13, 281, 78, 106, -122, -117, 16, -294, 105, -39, -214, -98, -1, 235, 128, -232, 225, -42, -159, -142, 145, -39, 189, 167, 90, 107]
6643A07l03R5K66j70l24K47l12P05k63K15j03j05k26O3K88J61l45n2K16L4o9l5
6665I0j14j46K99k98j73K87L4j40K7J27J66M0j4J33m31K53j24L5k3Q6k37j64J8
6688b69L66n1O1k10K05L5J56l35l1j78L47m9j05M37l05l1j92M3L59m16J28P5K15
6711B55p39M89N8j65J16J21o9j32L7k4K03o9l1N6j20L3K46J9n13J90NQP2q4O1
6736B3j69K28l14L18k4R4j41j37K39M4m00R3M15j52j55k59K36Qrj63M32Q3j78
6759A12L9k61N0P8j27n6J43q2K41%k78Q8o9L0q8K08l10L71o2j72M24l35P5k60
6783b41L4L43k22L06p1RO1l41J27o4M2o1K71l38N5J41J45k11L92k70j26j66P5
6806a10J8J22m9J43k1r2K2j11K65j31k2m3j7RK5J17j04J25r3j96P1K29n8J41n1
$$ y = [107, -196, -101, 165, -5, -329, -82, -394, 311, 48, 263, 160, 55, -171, -108, 180, 341, -4, -56, 160, 194, 125, 90, -24, -170, 129, -169, -342, -55, -21, -161, -134, -7, 159, 199, 185, 318, -113, 140, 16, 51, 28, 114, -123, -287, -269, 97, 46, 107, -103, 102, 137, 293, -42, -73, -251, 96, 47, -58, 379, 74, 43, -149, -106, 253, -163, -35, 40, 255, -484, 5, 63, -102, 14, 135, 66, -66, -29, -53, 150, 81, 50, 106, -14, 19, 265, 284, -229, -39, -34, -26, 46, -38, 23, -146, 82, -232, 86, 62, 156, 15, -122, 117, 161, -239, -146, 269, 117, -38, -297, -61, -53, -62, -225, 207, 290, 112, 151, -110, -60, 18, -109, -165, -22, -104, 137, 137, -141, -53, -122, -92, -180, 28, -282, 89, 27, -145, 279, -56, 19, -241, -207, 136, -86, 220, 149, 158, 219, -122, 5, -59, -17, -78, 193, -145, -90, 51, 196, -15, 377, 107, -19, -185, -110, -92, 30, -19, 124, 103, 11, 33, -78, 187, 56, 34, -9, -26, -17, 8, 125, 21, 146, 53, -143, -72, 157, 99, 240, 189]
6831A89P3l56o4l22M25Q3j98J48o4kj6q5R4n6O9L82j54n2R0J7p7j83J07l8j43
6856a33q6j67L83j2o8K99k31k9l3J97j15K53k15k5l3j13j62M40k21O9qj19K09
6879H0nJ32j59j4l4j02J05K0k80L09j73J08K05m04K22M6N2k08J36j20J45O0r0
6902C1p5Q4j50L9L05k79J08M5j50L8KQ2k56Q7J51K7o4m3K78l58M91m24K80n08
6926b59L95j69n6J35P4M0n0J63k88J64j71j2R7N8l18R2q5O3M1J03m6j03K32j6
6950H4L9k4J3Nj24J53j03P1P8k70M31l42P5J85l27J44k3N0m32J22J03J8J8J45
6974H9JL4j56M7K9j49o2M78q9k69J21n5q9K22l2Kj44k46K46K14k97P3K89l63O0
6999d6j59J18L62n02K89K0l84K62K92j89j21j26J30J63Oq0n4j87n9O8K14p5J48
$$ y = [189, 262, -94, -158, -480, -55, 28, -170, -22, -86, -88, -104, -189, -95, -151, -82, 300, 146, 94, 184, 201, 124, -59, 48, 10, -133, -219, -386, -3, -15, -83, 216, -15, -44, -77, 120, 5, 258, 43, 18, -15, -128, -290, 150, -71, -2, -10, -129, 80, 75, 207, 48, 34, 0, -102, 3, 23, -257, 52, -121, -13, 192, -212, 10, 56, 108, -100, 36, -84, 61, 121, 31, -44, 40, -110, -71, 234, -45, 63, 108, -42, -4, -2, 80, -176, -89, 62, 89, 25, -18, 260, -98, 393, -31, 249, -259, 136, -33, -89, 46, 120, 160, 110, 273, -15, 149, -22, -34, 63, 121, -197, -105, -190, -127, -86, 17, -29, -132, 100, 84, 123, 99, 112, 117, -7, 146, 43, 114, 192, -78, 353, 11, 86, 271, -56, 88, 65, 115, -317, -195, -92, -74, -56, 89, 90, 124, -32, 15, 44, -105, -167, 311, 222, -47, 74, 19, -70, 152, 120, 122, -22, -268, -22, 192, -105, -32, 257, -106, -46, -205, -87, 275, -227, 62, 82, -302, -40, 252, 63, -58, -184, -54, 109, 115, 35, -19, -206, -265, -197, 17, -58, 90]
7022I0k12K03q1k0m5O2J31k45l2L1J08N3p7q1P7j50M4K9J57j32k0j6Q3L4J94Q8
7048B73j83J9n5k21M72o23N03j82j02J07J15N1k61L9j63J90M3K57n50M25k41J44
7070E7R3L5k56M2M8k86K99K29j53O3J49l79R8j37r3k3J9L18pj2j49J64j58KKK02
7096A67k70J34j01j27RJ6J55Rj07K38J69n75K36L22m84K78o5m2J80l19L48l76
7118b05O34m45l84L06J02j00j4K08k09N11l09l1r0Q0M9j70P4Nn3O1j53L19O1j05
7142A42k8n8L5O7j32k05r3L47m4k93M30l90J54N2j50K74m46L53l5n3J76l7lj61
7166i8L30k43J93j11qJ9oJ49n64N74q8j49p3J24J07k88n8L83k20M8k83P0K31k30
7190a91O3L18j5j33L55m66K57k97K0o4M9P9j40l3L99Q9m64K55k24J62j76l1K49
$$ y = [90, -122, 81, 0, -20, -65, -3, 128, -117, -149, -118, -10, 43, -34, -115, -38, -188, -144, -115, 42, -90, -110, -126, -43, -9, 185, 273, 90, 109, 54, -167, 305, -318, 185, 3, -99, 8, 123, 174, -87, -48, -211, -21, 22, 279, -271, 154, -87, 57, 150, 185, -71, -29, 19, -267, 32, 261, 108, 171, 320, -59, 39, -98, -191, -214, -195, 123, 116, 104, -45, 119, -39, -37, -35, 167, -103, 31, -70, -197, -188, -172, -17, -8, -115, 123, 292, -283, -47, 275, -209, 69, 4, -38, 142, -177, 171, -205, 429, -16, -400, -94, 8, -92, -106, 102, -107, 404, 95, 64, -26, 54, 103, -67, 7, 12, -41, 20, -133, 186, 247, 142, 114, 56, 91, 158, 26, -179, -272, 75, 31, -262, 168, -222, -68, -16, -166, 108, -338, 15, -20, -73, 103, 66, 63, -98, 232, -11, 182, 71, 63, 82, 76, 225, -339, 235, 147, -2, -75, 49, 156, -132, -190, 193, -27, 21, -262, -192, 39, -191, -128, 190, 175, 42, 397, -69, 188, -109, -89, -153, -104, -25, -165, -198, 201, 290, -174, 81, -143, 19, -157, -188, 61]
7213F1L6m3j01N2K43k12K16l24J63j44Ll8J77l17L16j20m3M37k31k80R4KJ15k71
7237b09j80L40j87M6L22O6r3m5P1j39n9J59n5P7j6k77Jj7J00J71k72N47l80k76
7261c05N02k27k11P2K66l51L70rj27mq6K66k70M77j44j91J75r3j57p4k13O79l73
7284b8J63l23L77k55R8Q6Lq8lJ55j69K41k53K91l16k5J04o9J90Pn20N06Qk25l1
7309g6j09M25k54P8l1J31J2M7j96r6J83p4nj81o9L96o0L50m93J17O0j39N6r4k83
7334c05J21K65j15L81j94k07J80j67k25J21j11J12q3K8P8J9K2Q7l02K29O4j7k06
7357b25Q3K92k07O6k1j09K59m63M31J06l33J87j96J67k9j69J14J57k08J36j15
7378g7L89p35L86m8M7o1J81N3P0j82N6j78R9N0l38L42J75j52J43p3k32j28L12
$$ y = [61, 97, 54, -47, 5, 248, 36, 252, -72, 91, -53, -50, -88, 89, -228, 88, -32, -75, 362, 131, -149, -55, -53, 62, -209, -389, -49, -236, -190, 132, 198, 105, 60, 131, -8, -67, 92, 37, 114, 98, -179, -178, -195, -95, 76, -196, 351, -29, -305, 197, -30, -241, -169, 97, -254, 116, 107, -20, -24, -110, 156, -114, 363, 219, 28, 203, 110, -47, -121, -334, 345, -28, 135, -188, 189, -66, 32, 118, 121, 33, 30, 185, 16, 257, 4, 295, -21, -46, 58, -11, 179, 186, -334, 172, 180, -45, -76, -185, 240, -14, 64, 33, 164, 176, 223, 27, -69, 114, 40, 35, -146, -215, 181, 121, 471, -22, 95, 155, 16, 72, -22, -305, -184, 81, -34, 347, 153, -54, 126, -41, -266, -145, -256, -144, -227, -199, -121, -102, -80, 7, -295, -66, -2, -19, -225, -142, 150, -57, 9, -12, -121, 138, -325, 106, 212, -121, 66, -130, 37, 8, -161, -47, 110, -98, 38, -77, 312, -423, -37, -85, -38, -99, 82, 135, 205, 23, 79, -99, 0, 50, -288, 54, 229, 77, 220, 147, -85, -213, 99]
7401I9M6k3j48o7j24L25j78O7j70K51J12k73J77o4rj06j29J00m9K78J77k80o1
7424d9K07k26J51J22l98J06L45m55M53m82J76J68r5J10l4k3o5oM65n92p3K4R3
7447g8j2J88O8j29r5K05j20m37K81J57j90L83l41K1Q7J83j92K6n3J01lq7J80p6
7471F7l1L1J8j03k7k9j67J2J2M94k91L43Q7m37M8J82k70K3r9K38k73J88L6q4j12
7496a44K82j84M6q6P3K5j81L39q8k48j65J06q0J23K51j24l01M89j09P5k19o5M39
7519B54j81m72K99M4L4m9O0J75j31r7K7J07l7k80K09k7j68K51J73J18j15k06k37
7542b49M68k89k8L78l43R1k3o1L83j90NN3j14j57K16q6j94M35l18J67k29Q0J16
7565A11l3p5K21j31o7J14n47M58j24K34J27k47j61K71O1j43J62k40J4q4J20k75
$$ y = [99, 145, 122, -26, -93, -217, 108, -70, -3, -173, 78, 190, -83, 94, 30, 21, -85, -214, -114, -163, 115, 292, 12, -49, 158, -68, 83, 205, -193, -87, 258, -197, 256, -226, -50, 118, 23, 133, 99, 76, 11, 5, 470, -122, -195, -171, -78, -90, 98, 166, 37, -58, 147, 27, -410, -129, 28, -162, 221, -120, -99, -12, 171, -21, 5, -48, 53, 50, -37, 143, 67, 36, 67, 85, -18, -45, -74, -241, -229, -217, 277, -14, 329, 416, -21, 27, 209, -61, -38, -137, 101, -172, 16, 52, -32, -144, 138, -46, 0, -86, -13, 12, -169, 170, 82, -166, -331, -225, -305, -182, 69, -55, -356, 133, 24, 99, -120, -185, 254, 73, -399, -100, -56, -22, -71, -11, 164, 33, -64, -37, 70, 33, -247, -38, -65, -233, 18, 191, 309, 194, -12, -249, 219, -70, -98, 280, -63, 28, 5, -56, 327, 137, 142, 195, 81, -76, 140, 54, -140, 295, -23, 144, -85, -5, 111, 78, 3, 224, 93, 26, 140, -407, 51, -73, 161, 288, 41, -120, 151, 212, 69, 231, -9, 5, -79, 41, -234]
7587b34K76J67n48N40n03P9K03j86O6K02K04j39J8q5o8M8K6J25j83J42j03J5k03
7610a41Q4o0j78L15k4K35j95j21j76M18j62j79L35k9%J32k84j3L9N2jl6J99j25
7634H5j20O6o2j23P8Q5J21J14l47L4R2J94k38l1L83n04J45J88o1k69K35J7p2j29
7658a19N6J15o6L25m76r4M50k16P6j50J13j42J20J19j12J10Qj81j61J68J67J8
7680A28O5l9k37J16L1r3L76k04l83L28Q8l56J46L9j2j12J33j40pl3R7r5L3J62
7704C1R6j79q3K7l0K60j28k0Q7j38K38j24O1j95J59m7j11J97J10n64J46K93j52
7727f6MMM1J03P7k06p0L62n38L52j11q7K97j09J1K1k65o7K84j40K36j36J55k63
7751a11J62k53K39J68k97O6k12K13j97L56k05K79l93L81J8J10Om75J17j44M1j58
$$ y = [-234, 42, 209, -339, 201, -302, -223, -20, -206, -140, 62, 266, 127, 145, 60, -8, 40, 66, 191, 8, 150, 47, 62, -141, -57, -117, -295, 20, -4, 231, 36, -85, -261, 157, -5, -184, 151, 122, 122, 254, -30, -43, -4, 48, 47, 11, 210, 85, -35, 31, -31, -154, -76, 9, 130, 244, -103, -69, 23, 217, -21, -52, 331, -173, -28, 160, 99, -170, 65, 82, 10, -119, -63, 52, -14, 311, -165, -259, 191, -25, 51, -99, 14, -128, -8, 111, -1, 109, 117, -64, -225, -57, 110, 128, 193, 154, -83, 33, 64, -29, 347, 143, -240, 88, 176, -180, -34, 5, -7, -119, 14, -126, -133, -166, -69, -164, -131, 31, 127, -52, -135, -108, -138, 122, -6, -26, 61, -77, 161, 37, 98, -97, 62, 15, -96, 101, 211, -353, -207, 86, -66, -62, -58, -17, 86, 163, -43, -113, 249, -289, 63, -48, -135, 162, 53, 64, 85, -180, -247, 37, -103, 133, -3, 152, -111, 51, -202, 37, 205, -92, -26, -238, -25, -222, 134, -71, 208, -185, 196, 214, 324, 330, -145, -28, -172, -131, -289]
7773b89J41r5K51j47l03O08j57p7K38l01J34J23j57M6k53R4K39j05j5K7j06R3
7795a1NL11j88k28r0j9L23q3K3j11j80K36O2k58N5J03J49j92k45J58J6L10R5j20
7819A21k75K25q9P8l20K75J52Lj08j06K13k64J36k6j14K02k69L83M0l85m2j7O1
7842a26K08K7j10K9j40P6mL62m03l6L4J60J8j08j32J69ml03M18K30l97R6l52N11
7866B23n1j48K8J24j77m6K59k6m83L96p0K11m92O2L66k25J2L5K8J5l95K00k4J33
7890d5K3R9l1K0Oj17j6J53Q0r7j32o2J1J94q7O3K4R3l61Q3L19l09R0K3q8rR4R8
7918A19r4m7N2o6K5J41k30J97j59lJ75J2j34L41o01M31j64j46r9J50J87K3j60
7941e0K76j37j83J11K17k60j64O9j87L52rj81M92l28j32P3j45L45k32P1p7r6K28
$$ y = [-289, -148, -243, 8, -139, -442, 166, 9, -68, 170, -131, 3, 126, -31, 15, -238, -144, 95, -10, -25, 2, -104, -11, -6, 305, 117, -111, -201, -220, 103, 20, 43, -68, -248, -12, 50, -208, -153, -50, 99, -93, -338, -180, -164, 146, 241, 121, -154, 71, -18, 60, -260, 15, 167, 170, 62, -44, 169, -95, 41, 15, -99, 103, -166, 217, 257, -128, -170, -187, -126, 82, 109, -1, 28, -112, -36, -40, 322, -81, -117, -83, 77, 95, -13, -145, 24, 20, -283, 135, 365, -32, 64, -288, 223, 172, 24, 52, 176, -1, -47, 212, 186, -297, 99, 29, 240, -252, -190, 176, -49, -37, -2, 26, 41, -354, -154, -178, -45, -22, 77, 46, 66, 72, -45, -61, 92, 172, 75, -57, -119, -108, 86, -1, 62, 86, 179, -182, -99, 220, -89, 1, 24, -64, -73, 21, 119, 25, -22, 30, -36, -11, 130, -100, 97, -62, -65, 110, 122, -12, 329, -272, 159, -5, -151, -250, -100, 87, 110, -50, 226, 89, -94, 17, 234, -26, -190, -121, -308, 44, 35, -146, 346, 18, -114, -41, -186, 159, -73, -2, -79, -175, 53]
7964E3P8k0j04r5K21K3j66k00J74o2k41K71m7m0K58k71K60J3l58M24j13j67J64
7987E5J87k40L1J00k67J07k0p8K39l64J57o8J62l1NJ40j16L8j38k24L89Q5j41
8010Hl0J78k74J51j58J07m34L08J07o3J22k05J57J24k03K1K5p4j7N39n82J84p
8033a6o0K78k23j56K42k9m6j95M07n05K97j54J86J09qJ18n00K41K95q6j37j60
8055a02K32j94k59M97j82l0Q2j22k10L44k3Lq3K47j83J07j59j10K07p3J28j88
8077g1J56J4O5m7l12O3m21L89K39q5L4j26Q7R8M5j56j74K07j35K34P9k07J20j65
8101f9j47r6K10L49n38P4J68n8J34K23k26k64L4L94l83K24M02k05j90K6nn4n0
8124d7j15L05j35OK9m3N6O0k12K96k64J42m05N39L7O2k65k10J75p6K07l47K22
$$ y = [53, 131, 111, 7, -88, 133, 156, -10, -210, -36, -98, -339, -68, -115, -155, 103, -168, 92, 105, -253, 171, 58, -109, 55, 242, 2, 33, 133, -134, -27, -47, -125, 114, -250, -93, -161, 1, -30, -25, 115, -1, 37, -101, -325, 64, 149, 8, -22, 156, -118, 33, -125, -18, -452, -144, -37, -100, 22, -183, -26, 98, -105, -84, -59, -133, -150, 389, -193, -9, -16, -76, 202, -21, -177, 65, 36, -10, -205, 202, -303, -6, -160, 26, 135, 127, 245, -255, -14, 281, 195, 58, -102, 130, -64, -323, 174, -8, -38, 44, -78, -288, 56, 33, 36, -47, 200, 17, 124, -35, -145, 62, -11, 117, -71, 85, 99, 164, 117, -195, -132, -553, -164, 75, -10, 24, -102, -15, 83, 128, -28, -202, 5, -130, 104, 183, -24, 96, -69, -216, -312, -102, 247, -291, -217, -49, -107, 27, 250, 24, -240, -206, 188, -195, 29, 431, 226, 36, 62, 57, 3, -47, -162, 143, 8, 14, 43, 0, 56, 116, -96, 200, -64, 78, -327, 212, 249, 311, 46, -164, 11, -65, 142, -205, 17]
8147A7j03P0P8R9Rj56l9j08K95J44k07k5j24K81j60l97K03Q2k9o3M9o8K07l03
8171b48L64j44J98l07L72j54q9N2j2K94n92J47QJ90R4k70M5L19q5j86
$$ y = [17, -86, -16, 62, 161, 170, 14, -25, -133, 162, 306, 99, 74, -50, 231, 71, -326, -123, -41, -70, -133, -84, -152, 55, -248, 116, -28, 170, -137, 235, 81, -8, 44, 32, 326, -266, -119, -111, 79, 173, -97, -52, 267, 182, -4]
8191d
$$ Imaginary data points
##PAGE= N=2
##DATA TABLE= (X++(I..I)), XYDATA
0@%%%%%%%%%Qj6J6j6K4l2L3m1N0n8P1q4R5j08J26j47J69j93K21k51K81l16L59
32A91m01M45m99N57o19O87p63Q46r36J037j148J271j409J563j736J933k158K422
50A283k733L101l553M122m859N862p313R612j3833K4108r6166j37732J57952J66720
64A06571K1380j34537p8563M8261R9462R089o3221m6556K6693L2005j6626m2146
76c8188J831K3597j5452m7745R513Q1351M9176p1303j12432k090J32408J10639
88A21305m3496j38977n5450R2425J15328j0959j08073n3196O4167P6387k0944
99C8517q4566l2981M6424M7624q106k9881K53J6096j3647l0080J8361P5717M7013
112I0744n4817r7223j1662R7181Q1970l8956j03529k9813P4959O7804l5104q6405
$$ y = [0, 0, 0, 0, 0, 0, 0, 0, 0, 0, 8, -8, 8, -8, 16, -16, 17, -24, 26, -32, 39, -45, 50, -58, 68, -79, 90, -103, 118, -133, 148, -168, 191, -210, 235, -264, 293, -326, 361, -402, 444, -492, 545, -603, 668, -741, 822, -914, 1019, -1139, 1283, -1450, 1651, -1902, 2220, -2639, 3223, -4090, 5522, -8311, 15797, -80369, -218101, -60149, 106571, 127951, -6586, -85149, -36888, 62574, 71663, 8442, -38114, -11421, 20584, 3958, -38188, -36357, -12760, -28212, -75957, -66444, 14907, 64083, -7220, -119652, -121742, 10666, 121305, 77809, -61168, -116618, -24193, 91135, 80176, -27897, -81093, -16926, 59461, 38517, -46049, -79030, -32606, 15018, 6912, -22969, -22716, -6620, -20267, -50347, -31986, 43731, 90744, 35927, -61296, -72958, 24223, 106193, 67237, -36292, -66105, 8854, 76658, 41554, -44851]
124d4851j9318P3494O8121k2464p5306l1033M0821M5060k401k1165M546J2286
136B7790k2045l8570O228N8791L8647l6628o7739q689O1240M5836l3487o5223
148c3849k296O8362M3751m5641q0028j3776O3915N7661j4296n4755k7623J7134
160b1441K1864K39m651J1962J1674j5703l0079k275L6096K9116j6519l4029O08
173a3138L6739J5713l7269m5898P710N5484L0724l6742o4682k0219L9507M4009
185A1938J479k9201j4679J1753J2402l286l265J3341J7050j947j7221r404O090
198d950L602j3071j3792R580K3968K417l4068l7037N801M7053L7129j0528l9290
211b3186j8296K0839L0255P944j2959o710J0225R719q172j8869o549J2436J4517
$$ y = [-44851, -64169, 9325, 77446, 54982, -20324, -51357, -10536, 34524, 32123, 10958, 15504, 27790, 5745, -32825, -26597, 32194, 70841, 34213, -33526, -42215, 19025, 64861, 31374, -33849, -36145, 32217, 75968, 30327, -49701, -63477, 438, 58099, 43803, -10952, -38575, -21441, 423, 662, -3989, 7973, 19647, 3944, -26135, -28410, 7686, 36802, 20283, -13746, -13138, 23601, 39314, 2045, -43853, -36143, 19341, 50065, 13323, -51359, -71578, -32071, 11938, 13417, -15784, -30463, -18710, -6308, -9594, -12859, 482, 17532, 15585, -1636, -11040, -4950, -1348, -14419, -28211, -18631, 5337, 7754, -26314, -63351, -57550, -10497, 26632, 16104, -23186, -41482, -20643, 9612, 17556, 4597, -2113, 8112, 17831, 9659, -9210, -15759, -3323, 11194]
224A1194P99j0730j0131o032n007j94J2048K1905J1059j4696k6387o331K4915
237B412L1318N390k1225j8247N921J4828j456j9620j1825J4191K2107j520k7388
250e114k3796N262K6398J7835k847j0997m943L68k369q04J1239J8572M449j8655
264A4598k2761n08J9783J2002j0403j4835M796J6098j978k7125j9615J6986L7486
277B4524J1982k7986l3693J01K7203J6890r318j1918O692J1447q930k3020m924
290b0950K2964K0901q938k7203r500J5703J0998j3866j7447J1695L0875O304l3660
303a2124l4810J0317M2419K1506k2945l0680J368K4597O583j9816j0317K1961
315a941K8663o635l5859j8027K2533K9337l345k5711p683J8306Q922k3913k5589
$$ y = [11194, 11993, 1263, -8868, -14900, -19907, -20101, -8053, 13852, 24911, 10215, -16172, -22503, 2412, 33730, 39120, 17895, -352, 5569, 20397, 18941, -679, -12504, 1687, 23794, 22274, -5114, -28910, -23648, 2750, 20585, 17738, 6741, 1798, 2166, -203, -1007, 10232, 28804, 33253, 14598, -8163, -8671, 11112, 23114, 12711, -2124, 2672, 18770, 16792, -10333, -29948, -12962, 24524, 36506, 8520, -25173, -25072, 2131, 19021, 9703, -2215, 4477, 15924, 6994, -16026, -20950, 2014, 22915, 13977, -13226, -22726, -7023, 3975, -9891, -27338, -15643, 15232, 21536, -12124, -46934, -36617, 5802, 27308, 4363, -26317, -24949, -352, 6231, -13585, -23902, -1941, 26722, 20087, -15772, -33799, -11266, 18071, 14726, -10985, -18668, -362, 8560, -15353, -40942]
328d0942J3685M1551J6741l1534l7631N243L9298K1182j9630k3083J0756K7672
340B3308j225l4344j9399K5460L6354k423l6205k1644J7479K3814p327k3858K269
353a7741L0535J3897k9833l5633R754M6752K4557k5100l2972O284L2787Q517k7304
366D500j8639K2828L3750n847m3382k6285K1375L5876J423k9337j4513J8221J6886
379A6856j4208k3500R602L7633J7580k6805l6412L523L5346J6981k2591k5522
391a1517J0068K7045k622l6109k1306K4625L7729n22l7685k4504J6172K6424j782
404F016k1685k162K4356J3866k1106k8466N820L5426K0024j9112k7557J778K2343
417I541M517k1919j4813J8401K6854o277l6929k1928K0632L3896L737k5561j4468
$$ y = [-40942, -27257, 14294, 31035, -499, -38130, -32887, 6411, 27593, 7963, -15120, -4364, 23308, 22083, -12261, -31660, -6200, 30154, 27731, -8474, -30118, -12639, 11175, 3848, -20010, -17741, 12794, 26691, -3142, -38775, -29021, 17731, 42288, 17188, -15784, -9500, 23287, 31804, 4500, -14139, 8689, 42439, 36592, -6790, -33075, -11700, 24176, 25599, -3738, -18251, -30, 16856, 2648, -20852, -11250, 26383, 43963, 17158, -19254, -15731, 19615, 36596, 14005, -11517, -1449, 25596, 22974, -13135, -34441, -9816, 27913, 27391, -10294, -34798, -18626, 7798, 6016, -15669, -17831, 6525, 20391, -715, -29181, -23361, 12065, 32089, 12977, -14580, -12802, 9541, 14058, -7861, -22674, -4273, 22581, 16304, -20625, -42553, -21921, 11975, 15712, -9849, -24317]
430b4317J4880J6640q420k0278L833K8643J5665j9847k9581j15K5870J4417j4249
443C141j7587O170J7625m205k6150j2519J9529K8214j857k7947j6838J3697K1330
456B603O48j4358k3J9154J2492j4845k2228K586K6484J7128j2714k2459m115J3017
470C370M657j2183p856J2643J7204m688k4687j2801J5225K4363L482j6436j0053
483g760R070R853o229j1899L803J9585J0066j4325k1517j882J6644J1273o813
496I869j1592O47Q160k409j5193p042J3412J8193J273j6874j2761O807J4503L316
510A0309p300j417R517N596j0455j5876p47J6530J2702o391j6234o945N007N450
524b54l595l055N806R277l232j4737r504Q617J6707O469r085j0553J531O180N2
$$ y = [-24317, -9437, 7203, -1217, -21495, -17662, 10981, 26646, 6799, -22782, -22897, 2973, 17390, 3141, -14446, -8276, 9349, 5144, -21006, -33525, -13996, 14218, 12361, -15586, -32424, -18727, 2603, 3251, -11107, -11130, 8024, 20516, 5671, -16557, -13971, 12513, 29641, 16927, -5532, -9647, 3370, 8027, -4156, -12012, 631, 17835, 13147, -11540, -24341, -9116, 15247, 18729, 2293, -7760, 1310, 11163, 4934, -6965, -3162, 16423, 26489, 12164, -9353, -11235, 5409, 16682, 9869, -1723, -1076, 7084, 4675, -10518, -17560, -4148, 14045, 15318, -1556, -14317, -7510, 6993, 10309, 3009, 1592, 11109, 16705, 6250, -9626, -10373, 6157, 18859, 12468, -3766, -10711, -5704, -254, -3849, -6904, -1098, 8179, 4947, -9790, -19294, -10677, 6030, 12499, 3414, -7139, -5608, 572, 624]
539F24o479k22R913P174o927j5851p212P525J1754J377p510m570J768J514m112
554a1234l701N830J1825M733p703j1012j040Q749P491n83l003O31K642l768r037
569i180l461Q568J1895J608j1565j0856J48Q809N619j261j103L504K260m689p675
584g379L83J0706J0470l99j0209p495J903M912N7k924J597M646q02r173q117K385
600i439J1851P561l372p993k340M808L065k866j569O864Q328j976j2832q658M788
615c780J1958M912o069o912K66K144k676n230K186R617O216o972j2536l713Q841
630a748R351J008m640j046L088p07o986n041N848J0544K271j0881j1984p98Q820
645b901M275m155l444L765M779m659r917j525J1299J1329j170j0701n787N128
$$ y = [624, -5855, -6077, 3836, 11010, 4083, -11768, -18980, -11455, 299, 1676, -5834, -10404, -8636, -7122, -11234, -14935, -9105, 2720, 7453, -250, -11262, -12302, -3553, 3938, 3355, 352, 983, 3625, -143, -9180, -12641, -4073, 7822, 9430, -2135, -12991, -12843, -4034, 1585, 324, -779, 2725, 4985, 296, -7379, -6996, 3710, 14180, 13781, 3572, -3923, -2020, 2892, 2949, 25, 1622, 6268, 5466, -3707, -11824, -9439, 2412, 9973, 6601, -1392, -3732, 1076, 4141, 1275, -294, 6570, 14898, 12922, 90, -8568, -3780, 8178, 13090, 7021, 109, 375, 2519, -157, -5387, -3201, 6416, 12632, 5660, -6876, -10589, -1748, 7603, 8611, 3971, 2925, 6013, 5306, -1680, -6721, -873, 9671, 11942, 1061, -10923, -11721, -2901, 1374, -2781, -6225, -2460, 2319, -2340, -12257, -13782, -2483, 8846, 7676, -3025, -8812, -3684]
659c684O010j527m249L265Q081M53j0955j0392K959J1466O229o337q700j160L812
674d729l3m901Q26R727Q326m190j2279m980R725J1598R34q219l126L526J209o938
690c524p019L656J1033L729j0564j1709L07J0661N952l956l097N013N458k851
704C089r094j042J0654J0640k092j0138n213M408N278k164m675J973P252P66j0340
719f98j0630K534J2389O832n856q741l84O073K032m024q61Q213Q594l727j2285
734e39n534P465J0311j87q932m167L143J316p047n968M100J0916K862r889r745
749a1895J129J0269M746l934l585M219N578k653q769k572R325J0484j689j1133
763d80o283L319N841j588n742M77O482J533q894r430K891J2296O613n622p303
$$ y = [-3684, 2326, 799, -3450, -185, 7896, 8349, -2606, -12998, -10039, 1427, 7656, 1319, -7381, -8541, -4729, -4762, -9663, -8837, 890, 9216, 5026, -7253, -12233, -2508, 9090, 10024, 1805, -1321, 2205, 3414, -3524, -10543, -6887, 4146, 7875, -2689, -14398, -14091, -3430, 2522, -1434, -4531, 482, 5940, 3089, -6005, -7047, 3607, 14247, 12155, 2017, -3196, 1212, 6490, 4326, -349, 1624, 8876, 9642, -698, -11328, -8794, 3595, 10427, 4571, -4170, -4554, 1519, 3551, -473, -1334, 6879, 15473, 11746, -539, -6073, 1392, 11703, 11516, 2584, -1583, 1560, 2876, -4171, -10139, -6039, 4877, 7739, -2150, -11895, -10766, -497, 4249, 315, -3270, 949, 6527, 3874, -4895, -7467, 1858, 12342, 10653, -480, -6763, -3444, 2397, 809, -4933, -4456, 2026, 3559, -5335, -14765, -11874, 422, 7035, 1413, -5890]
778e890Q56N964J374m241r58P160P403m661j1859n565O774R589k65q170m798K843
794d444K740m440n528K644R366M261o286q903M07Q945O684k025l872K032N560
809G141j531p303l186O935Q325q27r773p520K784N949o05m599j56O322K835o487
825a696q017K729J0946P380l508p698j875M967K895k734k674L274N529k324r682
840b488o517M013Q756J980o142n383J785L275j034m039J479P632N063m549q413
855d582p48P455O710k378n110p6L922l09o192m918L901P569J327p798p377J113
871g491O099K605l498p37L167L312l741o569N40P765O391k130o834l195K413K899
887I96j225k358J739L917j135p657n569L263P936K594m677n059J273M194M54k646
$$ y = [-5890, -5034, 930, 2304, -1937, -2895, 4265, 11668, 7007, -4852, -10417, -3643, 5946, 5681, -2489, -7287, -4444, -1704, -6144, -11672, -9028, 338, 4599, -1687, -10590, -10183, -1238, 5446, 3421, -451, 1581, 7141, 5610, -1693, -4879, 2056, 10381, 9554, -219, -7739, -4955, 994, 389, -4210, -4366, 1956, 4791, -1696, -9713, -6984, 3962, 11342, 7834, 136, -1739, 3228, 6123, 3389, 715, 3989, 9518, 7194, -2488, -9005, -4992, 3764, 5744, -398, -5781, -3996, -721, -1755, -5794, -4315, 3317, 8380, 3831, -4582, -5330, 2125, 8835, 6457, 1347, 1271, 5193, 4884, -1308, -6226, -2325, 5244, 6571, -1227, -8604, -7491, -1392, 1213, -2285, -3022, 145, 3457, -284, -6853, -6313, 1452, 7843, 5713, -1121, -4316, -1903, 996, -229, -2587, -848, 3069, 1934, -5723, -11292, -8029, -93, 2501, -2176, -7235, -5962, -1768, -1314, -3960]
903c960J74N549M428k491p359k467M900N841o95m687k121K883N77m270l393L668
919c423O700J741o026n692J526N831K586k528j267L444K950l074o252n74P310
934C252N786j833p608l680K704L774j178k921M07M267L00n632n228L274P511M073
950G268l835n390L07M583N72l549j184M776L988k820p969k458N293N441j466m932
966a375j731L630J996m523l858L054P911K198n978o691R14O280L297k872l055
981h03J837L379k069o309k141O014O217k001p836m766L180N286p04m230K19N028
997C01K608n271n784K362R483M063n228p002R29N503J657n344l502L885N985j549
1013C096q424m117M919P188O68n498l255M102L735k122m710J040P222M655m875
$$ y = [-3960, -3786, 1763, 6191, 3700, -3659, -6126, -1226, 4615, 3920, -767, -2888, -5, 572, -3698, -7091, -3423, 3277, 5018, -1008, -6700, -5174, 657, 3243, 715, -552, 2892, 5842, 2768, -3484, -4058, 3252, 9038, 7205, -403, -4083, -1379, 2395, 1217, -1704, -1297, 2970, 3270, -2362, -7590, -4316, 3195, 7268, 3433, -1957, -1650, 2933, 3505, -44, -1228, 3548, 7536, 4716, -3253, -5711, -418, 5023, 3557, -1375, -3106, 524, 2520, -2003, -5861, -2807, 5104, 7302, 1324, -5367, -4453, 1827, 5124, 2252, -803, 1034, 4413, 2344, -3965, -6106, -92, 6125, 4124, -3712, -8478, -5298, -12, -716, -4946, -4727, 301, 2909, -2362, -8146, -5784, 3699, 7762, 2534, -4468, -3539, 1964, 3621, -1723, -5225, -1340, 4645, 3096, -5328, -9445, -4526, 2662, 3330, -2168, -5423, -1321, 2414, 292, -4418, -3378, 3844, 8499, 3624]
1028C624p816q58O617M979l097n477n7M392K47o856m456M988Q159N63q165o499
1044i712M114Q248J771n030k196N130N058k893o733n87P312N757l576p822k379
1059c538M762L605l314n026J339O139J202o495n661L023Q456L038m941n343K422
1074c32O164K63o242j954N744O105k976r406l924N973O542j814o757k455M438
1089f31K662l865n258K065P654L202o253o582J054P402L671l418m477K182M854
1104D262o83o059k639M925N930j265p378m356M078M988j248n755o98N449L646
1119C197m101o611Q16P993N187m020n968K72N656K119m130l013L234N340j077
1134D894p769m243L310O355L02n681l451K956L877j489m646P77O616M055m009
$$ y = [3624, -4192, -5050, 1567, 6546, 3449, -2028, -2085, 2307, 2554, -4302, -8758, -3770, 4389, 4952, -3213, -9712, -5598, 2650, 4421, -609, -2805, 2325, 7383, 4490, -2243, -2830, 4482, 10239, 6663, -1159, -3538, 1224, 4829, 1515, -3511, -2172, 3967, 5169, -1326, -6987, -3964, 4492, 7530, 2589, -2754, -332, 5832, 6095, -147, -2101, 3643, 9748, 6772, -2634, -6558, -585, 5957, 4143, -2614, -5069, -631, 2031, -1834, -7092, -5027, 2627, 5829, -424, -7006, -5952, 1450, 5121, 1703, -2774, -592, 4262, 3579, -2480, -5119, -194, 5736, 4471, -2907, -7263, -3185, 1803, 555, -5200, -5898, -449, 3197, -904, -7515, -6699, 1294, 6481, 2461, -3507, -3235, 2421, 4540, 410, -2603, 631, 5971, 4894, -2875, -7118, -3808, 2547, 2849, -2832, -6283, -3327, 550, -939, -5585, -4808, 1808, 5863, 1854]
1149A854o412O3O664M725k757n160O2N062O51n110m139K896O643Lo759m926L245
1166c395N309P66m372j441M098L998k421m782m37O696M428k742n682r75M243J970
1182E261l522l859J561N070L04o574n262L058P052J428m575m584K516M592J6l885
1198a403j188M971M389k761o442j190M973M673k590m995p21L806J624m328l925
1213e107J931O083J230n960m570K550N758R40m313k568L575M490j678o118j446
1228e203N731N097k184o561k318M344L471k634m402O12N364J179m960m930J957
1243e437O580K274m462m310J400M891R54m081k344M945M663j951o570k701N747
1258d02N334j755o263j706M146L745l198n009O69O420K721m452n116Q57O211K469
$$ y = [1854, -4558, -4495, 2169, 6894, 4137, -1023, -961, 4101, 4752, -358, -4497, -1601, 5042, 5045, -1714, -6640, -3395, 1914, 2680, -1692, -3133, 965, 4963, 2542, -2240, -2677, 4019, 8447, 5705, 23, -952, 3291, 5261, 1739, -2120, -559, 4511, 4815, -1759, -7021, -3963, 3089, 4517, -58, -4642, -2126, 2466, 2482, -1403, -2591, 2380, 6769, 4008, -2434, -3624, 1349, 6022, 3432, -1563, -2284, 1522, 3146, -1182, -5107, -3176, 2907, 4137, -1823, -6393, -3843, 1915, 2855, -1458, -4026, -451, 4039, 2361, -3757, -5203, 528, 5625, 3441, -3120, -5438, -1094, 2377, -257, -4659, -4047, 1317, 2496, -2464, -7394, -5437, 1143, 3417, -1045, -5355, -3955, 936, 1890, -2191, -4535, 410, 5073, 3122, -3448, -6149, -402, 4932, 3177, -3086, -4792, -646, 3099, -99, -5108, -4439, 1981, 4702, 250, -4866, -4009, 2202, 4671]
1274D671l639l791K601M696l09m902l108M027N201k77o036l434L061M749r88m506
1290a984j106M517L119l523n177M50O835L898l385o003n17O002K522l877m201
1305b430J568N317J04n756m375L286O034O06n292l155L005M198n34m580j214M331
1321A113M310k175n545j565N001L913k538m741o74M220K402m197m699J618N708
1336B151K323m708n535J100N893J997m117l384K734L927p11m685j601L901M804
1351D089q06n719k513L168L794j208l837q24L644K556l165m508Q73M964L226l312
1367D22m482O98M770J557l061l493K019M899P20n212l761K614N288J82m327k847
1383d014K339L613r17m323j168M483L565k163m739o27M226L413j605l594M99L966
$$ y = [4671, 1032, -2759, -158, 4538, 4229, -673, -3781, 246, 5447, 5170, -866, -4300, -1239, 3510, 2522, -1984, -3090, 1427, 4546, 1023, -4154, -3704, 3131, 7029, 3644, -2359, -2876, 3126, 5648, 1771, -2430, -862, 4455, 4559, -1197, -5572, -2286, 3748, 4354, -938, -4093, -1088, 3110, 2576, -2004, -3218, 1113, 5423, 3248, -2297, -3862, 1139, 5052, 2514, -2227, -2901, 1319, 3721, -476, -5175, -3557, 2151, 4474, -234, -5769, -4669, 1224, 3221, -896, -4280, -1546, 2381, 1670, -3015, -4616, -715, 4089, 3283, -2436, -4949, -1781, 2013, 805, -3032, -3856, -212, 2344, -821, -5329, -4456, 508, 3734, 422, -4060, -3362, 1408, 2965, -96, -3589, -1570, 3329, 4049, -1163, -4924, -2310, 2978, 3160, -1167, -4014, -1675, 1938, 1021, -3302, -4470, 13, 3578, 1415, -3324, -3951, 275, 3688, 2083, -1511, -1012, 2954]
1399B954P07l014k853J996M259J055m131m574J531M985J063l746l218K985L414
1414C413l33m325j656L971M424j126m637j456L355L453j901l826K07L598J472
1429D633l182m482R01M242J511l519l511J263L148O18l284j880K916L834k14m597
1445a603j976L432M135l08m352j724K647K842j904m025n6L683K237k958m641M98
1461d073M102J967k493l103J074L731O32l428k382K914M029r6m457k170K868L772
1477B887j183l780j361L182K838k394m209p49M271L206k346m201j17L966K086
1492B096k371k694J794L894J076m021l327K486M212L42l662k759K270L115j134
1507A317l550j033L423K713j896m079n96L775L424k136l699P10L859J937k841
$$ y = [2954, 3661, 647, -2206, -210, 4049, 5104, 973, -3601, -2070, 2915, 3978, 232, -2986, -1, 3413, 3080, -1245, -2901, 1070, 5494, 4368, -269, -1725, 1630, 5083, 3182, -644, -437, 3161, 4633, 1451, -3031, -2130, 2112, 3623, 104, -3407, -2144, 1004, 1622, -1662, -3542, -626, 3208, 2994, -1603, -3579, -147, 3988, 3680, -672, -2396, 251, 3093, 1189, -2836, -2892, 791, 3028, 70, -4571, -4073, 29, 1996, -497, -3600, -2526, 1205, 1837, -1591, -3973, -1059, 2970, 2874, -1583, -3753, -885, 2887, 1704, -2076, -3437, -255, 2583, 189, -4020, -4769, -498, 2708, 362, -3839, -3956, 10, 2096, -275, -2969, -1175, 2719, 3795, -226, -3553, -1067, 3145, 3487, -175, -2934, -664, 2451, 1317, -2233, -3266, 157, 2870, 974, -3105, -3701, 74, 3498, 1362, -2337, -1627, 2232, 4169, 1328]
1522A328l424J586M393J100l771l083J375L328Q82l405k604K166L017n56m166
1537a834j012K844L684j142m050m41K729K683j413l328L90L556J662l033m097
1552b802J004M316J810l325l801N92L592Q87l178k436K229L509n14l818j806L150
1568e91L503n34l863j245K962K722j450l326m68L086J895k067l352j98L316J378
1584A768k566k504N68L408R59l389k494K122L942P45l783k014J403L869ml325
1600a295j130J761K657r06l183j027K961K382j351l062n56K552J688j828j830
1615b167M22K939Q71k278k600J671L348O51k692k280J066L391K33l129k049K555
1631d8K540p52k758j669K351K787q76l022m38K480K099j459k934M69K923J633
$$ y = [1328, -2096, -510, 3883, 4983, 1212, -1871, -496, 2832, 3714, 309, -2295, -129, 2888, 2332, -1834, -2846, -2, 3682, 2540, -1510, -1951, 778, 3461, 2048, -1280, -890, 2666, 4328, 1295, -2802, -1798, 2518, 4328, 1003, -2798, -2206, 1386, 2273, -905, -3341, -1112, 2397, 1883, -1935, -3741, -591, 2912, 2378, -1485, -2730, 232, 2954, 1504, -1822, -2290, 796, 2691, 624, -2728, -2926, 390, 1768, -798, -3302, -2734, 674, 1633, -1756, -4250, -2128, 1814, 2559, -1224, -3238, -1835, 2034, 2030, -1295, -2425, -664, 1993, 1087, -2096, -3123, -162, 2220, 869, -2193, -2749, -197, 1491, -337, -2167, -1745, 1194, 2065, -213, -2813, -1142, 2206, 2857, 165, -2115, -1049, 2342, 2575, -554, -2603, -48, 2492, 1740, -1018, -2687, -336, 2451, 1575, -1447, -1885, 595, 2694, 1235, -1699, -1230, 1693, 3326]
1647C326j898k909k5L012J318k130j764O40K112j04k292j599J907K667l93k750
1663h82j467J760K667O6l200q16K362K270j000l261l74K494K371j875k975j09
1679a969K576J482k048j968P22K512L62k347j470J036K543R8k190j197J818J913
1695A873n44k320j055J910K126j007k742q87K225K131r86k740l67K446R36j428
1711d29k315P99K800J153k517j911R23K662O13k151j442J070K172m30k365j385
1727b753K263J769o84k401l99J970J869j582k030J08K519J417j506k525K51K662
1743I48J644j959k187M02K374R45k312j824J403K531j1k721j422J713K648l51
1759A821k370j053K230J738j293j851j65K466J165j537k473K84K621J073j789
$$ y = [3326, 1428, -1481, -1506, 1506, 2824, 694, -1070, -430, 1682, 1578, -714, -2313, -406, 2261, 1868, -882, -2349, -589, 2078, 2144, -1056, -1872, 490, 2760, 1760, -1501, -1875, 619, 2990, 1115, -1860, -1969, 607, 2089, 41, -1927, -1205, 1307, 1669, -678, -2148, -1112, 1431, 1529, -661, -1858, -40, 1873, 1329, -991, -2046, -136, 1990, 983, -1759, -2646, -421, 1710, 724, -2016, -2383, 63, 999, -429, -2744, -1945, 855, 2008, -509, -2420, -1497, 1165, 1778, -373, -1815, -745, 1427, 997, -1368, -2753, -490, 1279, 595, -1806, -2205, -235, 1634, 52, -1978, -1870, 649, 2066, 560, -1965, -1714, 948, 2592, 633, -1554, -1152, 1222, 2167, -145, -1969, -566, 1965, 1954, -767, -2189, -476, 2172, 1821, -549, -1602, 628, 2366, 1073, -778, -943, 1523, 2688, 1151, -1322, -1038, 1583, 2656, 867]
1774H67k336M55K339O46k102j986J059K370J97k181j306J435K498k82k403j271
1790b001K221K010p07k657l54J934J858r58k524l41K024J118j604j971N62K405
1806A015N26k112j838J147K538Q73k376j921J243K329K52k172j294J627J777n40
1822A074j999j489K428J522o28k579n58K006J325r47k408M22K041J275j558j651
1838a724M61K225J105k272j541J530K117Q9k733j011J140K270k11k477j123J917
1854b38J524p03j642r36K080J310r20k359K8K558J012j051j879R7K336M84j123
1871E78j666R60J645Q5j885j649J391J663M34k015j504J921J363J49j959q96J617
1888B32J652m97j697n39J909J000q46k059M5J655N34j236j463L63J904M92j440
$$ y = [867, -1469, -1014, 1325, 1971, -131, -2117, -1058, 1312, 1509, -672, -1978, -543, 1955, 1673, -730, -2001, 220, 2230, 1523, -1134, -1488, 446, 2304, 1346, -1178, -1519, 505, 1623, 19, -1952, -1390, 1015, 1541, -571, -2409, -1262, 1276, 2149, -227, -2148, -905, 1424, 1676, -496, -1790, -163, 1614, 1074, -925, -2414, 14, 1536, 908, -1671, -2229, -223, 1102, 155, -2253, -1831, 210, 1485, -73, -1724, -1263, 962, 2067, -205, -1746, -216, 1901, 1990, -743, -1754, -614, 1656, 1445, -1032, -2155, -238, 1286, 583, -1059, -1995, 85, 1395, 475, -1884, -1856, 702, 1714, 663, -1216, -1119, 1217, 1701, 578, -1088, -128, 1517, 1602, -283, -1932, -541, 1122, 1556, -459, -1963, -42, 1321, 1470, -489, -1385, 232, 1884, 1387, -310, -849, 1060, 2060, 1214, -845, -800, 855, 1389, 153, -1310, -947, 957, 1449, 9]
1905Ij410J017J407j20j067q94J101J083j99j830P8J362N90k92j222p29J456R89
1923A329k98k010k71J925K80j012j294N58J349N84j581j229P22J647L88j431r51
1940a295N31J561k0j452l01R71Q20p45r13J5J435L09j143j041M33J243N86r52
1958D2r60J12J211L84p54j128N89J220J59q39q76P50J468n30j456l62R09Q69m82
1977C26j061l64R28Q80r61m85M29Q65M09j048n91K83J292j6j058q02O24J112l18
1996D44o11o30N86R90j51j186J25L62O03k36q40j86Q42R32n82j082k0J193J62
2015G15l89r63K91J230n61r46k27R27Q48n22j071l01J122R89n07j133k91R17O09
2034G37Oj132N2P46P04o99o29j39N76N58l84j196L80R51K05q19p70K75J290k57
$$ y = [9, -1401, -384, 1023, 903, -164, -1058, 43, 1126, 927, -903, -825, 537, 1127, 835, -387, -1116, 340, 1329, 1031, -979, -1250, 675, 955, -57, -1351, -793, 556, 1140, -441, -1670, -948, 699, 1087, -344, -1295, -764, 797, 777, -675, -976, -5, 815, 70, -843, -828, 607, 916, -227, -1268, -835, 408, 994, 42, -918, -806, 405, 789, 35, -1093, -504, 716, 875, 36, -840, -90, 1378, 848, -608, -970, -61, 808, 326, -735, -1099, -171, 709, -252, -737, -308, 557, 966, -82, -673, -390, 902, 886, -172, -974, -350, 762, 444, -167, -797, -211, 779, 628, -558, -433, -71, 532, 296, -544, -730, 112, 1044, 462, -620, -640, 553, 715, 326, -637, -346, 884, 323, -623, -850, 77, 925, 403, -668, -969, 153, 1142, 635, -498, -789, 128, 737, 743, -389, -337, 409, 1113, 414, -215, -354, 222, 780, 396, -800, -420, 531, 736, -83, -853, -578, 712, 455]
2054D55q39k89N45P55l68q04k17Q61Q74n52j104l11Q77R63n21j326J5O17R23n99
2074d5l70l65R57K23k74o93j85J034M84n38r68l0R84O44r54o02K83P13L07q74
2094b69J17M65N8l13p35PR54N60n52o05m33O19P49J6j218L43O87J51k49p76k47
2115f71R42Q21o84j111K43P03L20m45p71j57J122j61k46n76K66N98J46n27l52
2134e40P76M05j96r90j14Q87O10k99j172j33Q07M70k96q81R7Q05M80o83q49N27
2154b89R19L60o94p43K79N73L46n87o19M00R28k53r30J46M15N60l73r31k43J133
2174C97N54q34q31K21P26O71o60n89J30N32Q2m19k84k4J122n5j085n22P09J124
2194I65o03l95l85M28M76o79O1j29N45j39j22n67K52N05rn91l08N42K83k66k33
$$ y = [455, -384, -673, -128, 627, 259, -545, -762, 99, 973, 421, -683, -994, -117, 846, 325, -1001, -986, -369, 554, -45, -415, -780, 177, 400, 126, -567, -752, 282, 766, 228, -740, -770, 214, 858, -96, -698, -415, 298, 605, -269, -152, 313, 371, 58, -677, -670, 284, 844, 292, -313, -746, -127, 622, 638, -580, -237, 450, 601, 352, -424, -671, 271, 1092, 408, -703, -460, 243, 563, 118, -653, -810, 312, 151, -95, -671, -405, 193, 339, -188, -540, 236, 641, 445, -545, -659, 228, 838, 539, -633, -766, 41, 511, 215, -666, -569, 236, 716, 33, -816, -289, 630, 990, 296, -447, -168, 405, 751, 164, -455, -55, 873, 620, -310, -164, 251, 811, 438, -493, -736, 397, 951, 117, -714, -493, 233, 904, 244, -345, -215, 317, 399, -20, -304, -328, 794, 739, -346, -868, -159, 965, 362, -33, -418, 10, 486, -193, -132, -261, 284, 145, 23, -544, -292, 213, 204, -387, -695, -153, 130, -136, -369]
2215c69j26M90M36m21o72L72M46K69l12o12M71N90K30p09l45J72O88n40k58k63
2235d63N65K13m71j58J66L57M87o46r17Q92P76J17j044n25M83O97l52p50Q8M18
2255f7K23l25n25K5R21J12l10n80NR25n8j69p95O35K37m8l95k49L51R30l06r62
2277d25l83R95N92l76j135p9J489L10o70j027M67Q54J41q92n53N20R33k25r13
2296c77o89J084O65J85j168o79J088O29m68q03J48Q68L08r77p07P45J128K39j248
2315b9j222Q82R35M51j162n62Q65N10o4j323P8P09J026n94j079p3J041L09n20
2334A78j089N01O85M96j224m43R97M39l13o13l26O43Q21n71n23n92R62Q47n81
2353B94j128J48N80N72m70o10L80Q48j43p66n98Q41Q04J54j329k98P44O90m60
$$ y = [-369, -495, -5, 431, 10, -662, -290, 156, 425, 113, -499, -28, 562, 792, 83, -262, -90, 598, 58, -200, -463, 102, 315, -156, -314, -148, 209, 696, 50, -867, 25, 801, 918, -126, -651, -168, 529, 177, -573, -485, -67, 156, -169, -694, -669, 252, 364, 54, -526, -521, 404, 346, 177, -618, 17, 254, 206, -189, -438, -87, 843, 537, -425, -808, 187, 779, 403, -732, -811, 678, 988, 318, -709, -242, 612, 753, -139, -692, -172, 761, 536, -377, -1066, 18, 683, 868, -300, -979, 109, 738, 270, -533, -385, 483, 791, -186, -893, -148, 980, 1219, -29, -1251, -369, 566, 1017, -145, -707, 158, 668, 604, -719, -641, 68, 1094, 500, -579, -652, 389, 698, 178, -911, -410, 275, 771, -453, -896, 101, 540, 227, -386, -712, -69, 752, 181, -342, -934, 28, 875, 294, -834, -686, -106, 466, -4, -614, -234, 614, 471, -295, -893, -52, 752, 906, -423, -721, 23, 713, 253]
2372B53j075K89P91L93o64q97N64Q61L24j341m87P13R90p5r18o27P92O48J26j072
2392d12J05N77M16m58o52L70N45J07p34p49O70P49K17j238N7N29M97n54o15K7
2412e46O09O73o73q26K80Q18K70n96q57O55M86N21j249k83O28M07K07j055P2O10
2432A51M87m97p73m7Q22L94n00m51j12J326j21p96l33N12P64k27j282J47R03N98
2452I65o89p96l57R87O88r90o42J41J055M4m29p45N08J031j01j192l59R85Q68
2471I72n33j060n04J026N06l1q50p8R83j40k23r53K00Q23K30j040j46J70J390
2490G42k45p47o28P61P97m13m87r6Q51J94p63n27M87M60K23o60q32L97J004J23
2510F41q62q0M28O27o63n48j61R33L38o6q67M8O87M79n34j229K93Q61J24o04m94
$$ y = [253, -822, -533, 258, 651, -13, -910, -346, 515, 839, -502, -989, -276, 714, 639, -279, -906, -114, 534, 660, -412, -307, 270, 686, 228, -424, -54, 491, 598, -136, -885, -215, 534, 751, -487, -430, 99, 596, 42, -573, -546, 63, 736, 63, -763, -483, 335, 605, 9, -848, -193, 293, 814, -435, -718, -90, 317, 524, -531, -459, 151, 638, 141, -632, -679, 143, 537, 37, -414, -526, 800, 679, -117, -450, 62, 826, 599, -683, -536, 367, 965, 276, -520, -877, 110, 798, -192, -834, -693, 362, 406, -23, -768, -260, 771, 670, -522, -881, 104, 972, 439, -621, -1125, -99, 407, 376, -474, -552, 431, 291, 68, -885, -685, 138, 368, -672, -818, -648, 742, 497, -250, -878, -117, 680, 267, -220, -316, 535, 729, -34, -561, -74, 386, 609, -51, -883, -486, 518, 641, -221, -301, 127, 754, 91, -457, -618, 315, 653, 587, -280, -232, 455, 934, 400, -829, -536, 325, 449, -155, -649]
2531f49O77K49m9q16k19J042N16q30n01L13P30M66r00q03M99Q86L8q08n30P62
2551G3O14j22j075j34M73Q44n07r52k20J063P15p10o52J23J105l16o69l04M57
$$ y = [-649, 28, 277, 228, -588, -807, 235, 751, -79, -580, -267, 463, 929, 29, -774, -275, 611, 649, -159, -689, 73, 687, 565, -510, -644, -171, 673, 166, -786, -1006, 57, 772, 62, -590, -467, 638, 322, -347, -651, -194]
$$ [...]
8191b17
##END NTUPLES=NMR FID
##END=
