##TITLE=1H_SA_28.119
 DMSO, 8 sc, 
 23.7.2019
##JCAMPDX= 6.0         $$ Bruker NMR JCAMP-DX V2.0
##DATA TYPE= NMR FID
##DATA CLASS= NTUPLES
##ORIGIN= UXNMR, Bruker Analytische Messtechnik GmbH
##OWNER= root
$$ XWIN-NMR		Version 3.5
$$ Tue Jul 23 14:49:02 2019 Russian Standard Time (UT+4h)  she@DPX200
##.OBSERVE FREQUENCY= 200.13155
##.OBSERVE NUCLEUS= ^1H
##.DELAY= (6, 6)
##.ACQUISITION MODE= SIMULTANEOUS
##.ACQUISITION SCHEME= undefined
##.AVERAGES= 8
##.DIGITISER RES= 18
##SPECTROMETER/DATA SYSTEM= spect
##.PULSE SEQUENCE= zg30
##.SOLVENT NAME= D2O
##.SHIFT REFERENCE= (INTERNAL, D2O, 0, 15.7039)
##AUDIT TRAIL= $$ (NUMBER, WHEN, WHO, WHERE, WHAT)
$$ ##TITLE= Audit trail, XWIN-NMR		Version 3.5
$$ ##JCAMPDX= 5.01
$$ ##ORIGIN= Bruker BioSpin GmbH
$$ ##OWNER= she
$$ F:/spectra/data/she/nmr/H-F/1/audita.txt
$$ ##AUDIT TRAIL=  $$ (NUMBER, WHEN, WHO, WHERE, WHAT)
(   1,<2019-07-23 14:48:07.60 +0400>,<she>,<DPX200>,
      <created by zg, POWCHK disabled, PULCHK disabled
       configuration hash MD5:
       00 E9 B6 7A A2 85 ED C7 34 08 36 98 17 FE 4E 26
       data hash MD5: 16K
       79 4C 57 03 B0 DA 68 DE C4 D4 3D C6 DD F0 5B 30>)
$$ ##END=
$$ 
$$ hash MD5
$$ F3 93 0B BC 30 34 6B 65 97 FD 89 D6 00 BC 52 60
##$RELAX= 
##$RELAX= 
##$RELAX= 
##$RELAX= 
##$RELAX= 
##$RELAX= 
$$ Bruker specific parameters
$$ --------------------------
##$DU= <F:/spectra>
##$EXPNO= 1
##$NAME= <H-F>
##$PROCNO= 1
##$TYPE= <nmr>
##$USER= <she>
##$AMP= (0..31)
100 100 100 100 100 100 100 100 100 100 100 100 100 100 100 100 100 100 
100 100 100 100 100 100 100 100 100 100 100 100 100 100 
##$AQSEQ= 0
##$AQ_mod= 1
##$AUNM= <au_zg>
##$AUTOPOS= <>
##$BF1= 200.13
##$BF2= 200.13
##$BF3= 200.13
##$BF4= 200.13
##$BF5= 200.13
##$BF6= 200.13
##$BF7= 200.13
##$BF8= 200.13
##$BYTORDA= 1
##$CFDGTYP= 0
##$CFRGTYP= 5
##$CHEMSTR= <none>
##$CNST= (0..31)
1 1 145 1 1 1 1 1 1 1 1 1 1 1 1 1 1 1 1 1 1 1 1 1 1 1 1 1 1 1 1 1 
##$CPDPRG= <>
##$CPDPRG1= <>
##$CPDPRG2= <>
##$CPDPRG3= <>
##$CPDPRG4= <mlev>
##$CPDPRG5= <mlev>
##$CPDPRG6= <mlev>
##$CPDPRG7= <mlev>
##$CPDPRG8= <mlev>
##$CPDPRGB= <>
##$CPDPRGT= <>
##$D= (0..31)
0 1.2 0 0 0 0 0 0 0 0 0 0.03 0 0 0 0 0 0 0 0 0 0 0 0 0 0 0 0 0 0 0 0 
##$DATE= 1563878887
##$DBL= (0..7)
120 120 120 120 120 120 120 120 
##$DBP= (0..7)
150 150 150 150 150 150 150 150 
##$DBP07= 0
##$DBPNAM0= <>
##$DBPNAM1= <>
##$DBPNAM2= <>
##$DBPNAM3= <>
##$DBPNAM4= <>
##$DBPNAM5= <>
##$DBPNAM6= <>
##$DBPNAM7= <>
##$DBPOAL= (0..7)
0.5 0.5 0.5 0.5 0.5 0.5 0.5 0.5 
##$DBPOFFS= (0..7)
0 0 0 0 0 0 0 0 
##$DE= 6
##$DECBNUC= <off>
##$DECIM= 24
##$DECNUC= <off>
##$DECSTAT= 4
##$DIGMOD= 1
##$DIGTYP= 9
##$DL= (0..7)
0 120 120 120 120 120 120 120 
##$DP= (0..7)
150 150 150 150 150 150 150 150 
##$DP07= 0
##$DPNAME0= <>
##$DPNAME1= <>
##$DPNAME2= <>
##$DPNAME3= <>
##$DPNAME4= <>
##$DPNAME5= <>
##$DPNAME6= <>
##$DPNAME7= <>
##$DPOAL= (0..7)
0.5 0.5 0.5 0.5 0.5 0.5 0.5 0.5 
##$DPOFFS= (0..7)
0 0 0 0 0 0 0 0 
##$DQDMODE= 0
##$DR= 18
##$DS= 0
##$DSLIST= <SSSSSSSSSSSSSSS>
##$DSPFIRM= 0
$$ [...]
##$SUBNAM2= <"">
##$SUBNAM3= <"">
##$SUBNAM4= <"">
##$SUBNAM5= <"">
##$SUBNAM6= <"">
##$SUBNAM7= <"">
##$SUBNAM8= <"">
##$SUBNAM9= <"">
##$SW= 24.9336996594482
##$SWIBOX= (0..15)
0 0 2 0 0 0 0 0 0 0 0 0 0 0 0 0 
##$SW_h= 4990.01996007984
##$TD= 16384
##$TD0= 1
##$TE= 0
##$TE2= 300
##$TE3= 300
##$TEG= 300
##$TL= (0..7)
0 120 120 120 120 120 120 120 
##$TP= (0..7)
150 150 150 150 150 150 150 150 
##$TP07= 0
##$TPNAME0= <>
##$TPNAME1= <>
##$TPNAME2= <>
##$TPNAME3= <>
##$TPNAME4= <>
##$TPNAME5= <>
##$TPNAME6= <>
##$TPNAME7= <>
##$TPOAL= (0..7)
0.5 0.5 0.5 0.5 0.5 0.5 0.5 0.5 
##$TPOFFS= (0..7)
0 0 0 0 0 0 0 0 
##$TUNHIN= 0
##$TUNHOUT= 0
##$TUNXOUT= 0
##$USERA1= <user>
##$USERA2= <user>
##$USERA3= <user>
##$USERA4= <user>
##$USERA5= <user>
##$V9= 5
##$VALIST= <valist>
##$VCLIST= <CCCCCCCCCCCCCCC>
##$VD= 0
##$VDLIST= <DDDDDDDDDDDDDDD>
##$VPLIST= <PPPPPPPPPPPPPPP>
##$VTLIST= <TTTTTTTTTTTTTTT>
##$WBST= 1024
##$WBSW= 4
##$XGAIN= (0..3)
0 0 0 0 
##$XL= 0
##$YL= 0
##$YMAX_a= 231439
##$YMIN_a= -341001
##$ZGOPTNS= <>
##$ZL1= 120
##$ZL2= 120
##$ZL3= 120
##$ZL4= 120
##$ABSF1= 10
##$ABSF2= 0
##$ABSG= 5
##$ABSL= 3
##$ALPHA= 0
##$AQORDER= 0
##$ASSFAC= 0
##$ASSFACI= 0
##$ASSFACX= 0
##$ASSWID= 0
##$AUNMP= <proc_1d>
##$AZFE= 0.1
##$AZFW= 0.1
##$BCFW= 1
##$BC_mod= 2
##$BYTORDP= 1
##$COROFFS= 0
##$CY= 11.3945322036743
##$DATMOD= 1
##$DC= 2
##$DFILT= <>
##$DTYPP= 0
##$F1P= 18.9103706918063
##$F2P= -1.10871071338519
##$FCOR= 0.5
##$FTSIZE= 0
##$FT_mod= 4
##$GAMMA= 1
##$GB= 0.15
##$INTBC= 1
##$INTSCL= 1
##$ISEN= 128
##$LB= 0.24
##$LEV0= 0
##$LPBIN= 0
##$MAXI= 10000
##$MC2= 0
##$MEAN= 0
##$ME_mod= 0
##$MI= 1.114404
##$NCOEF= 0
##$NC_proc= 0
##$NLEV= 6
##$NOISF1= 3.799351
##$NOISF2= 2.8
##$NSP= 1
##$NTH_PI= 0
##$NZP= 0
##$OFFSET= 15.70392
##$PC= 1
##$PHC0= -8870.337
##$PHC1= 20.40096
##$PH_mod= 1
##$PKNL= yes
##$PPARMOD= 0
##$PSCAL= 0
##$PSIGN= 0
##$REVERSE= no
##$SF= 200.130013532006
##$SI= 16384
##$SIGF1= 3
##$SIGF2= 2
##$SINO= 400
##$SIOLD= 16384
##$SREGLST= <1H.CDCl3>
##$SSB= 0
##$STSI= 0
##$STSR= 0
##$SW_p= 3612.71676300578
##$SYMM= 0
##$S_DEV= 0
##$TDeff= 0
##$TDoff= 0
##$TI= <>
##$TILT= no
##$TM1= 0
##$TM2= 0
##$TOPLEV= 0
##$USERP1= <user>
##$USERP2= <user>
##$USERP3= <user>
##$USERP4= <user>
##$USERP5= <user>
##$WDW= 1
##$XDIM= 8192
##$YMAX_p= 0
##$YMIN_p= 0
$$ End of Bruker specific parameters
$$ ---------------------------------
##NTUPLES= NMR FID
##VAR_NAME=  TIME,          FID/REAL,        FID/IMAG
##SYMBOL=    X,             R,               I
##VAR_TYPE=  INDEPENDENT,   DEPENDENT,       DEPENDENT
##VAR_FORM=  AFFN,          ASDF,            ASDF
##VAR_DIM=   8192,          8192,            8192
##UNITS=     SECONDS,       ARBITRARY UNITS, ARBITRARY UNITS
##FACTOR=    0.0002004,     1,               1
##FIRST=     0,             0,               0
##LAST=      1.6414764,     0,               0
##MIN=       0,             -341001,         0
##MAX=       1.6414764,     231439,          0
$$ Real data points
##PAGE= N=1
##DATA TABLE= (X++(R..R)), XYDATA
$$ [...]
2485B883j831j472n42m69M90J459K135K61k828l514r54L980M248l55l518l743
2501c770J82L335K808J91j663k030r01N66P76J809J330o42l132k681J105L196
2517D79L490r68l705k873R27L304K235n10j518j618o58L22Q92J643J409j263l283
2534a695k375J248M388K766j802m182k332K121L603J727j570j997p57j14K7Q42
2550a02J709J671j956l906j708K643M539J683l514m141k48L135K628k40j144j132
2566h3p8q30q71J553L059P63l408m190k93M744M351j079m587k644J536L013J513
2583B469j134r13J72p85j928j59K494L148p24m285l169J853M678K446k207l995
2599b039p52J701K340j65l23J0m15j561k137J326L891K229k508n052j250L385
$$ y = [2883, 1052, -420, -962, -1431, -941, 518, 2653, 2914, 86, -3428, -4382, -402, 3846, 3491, -27, -3770, -3588, -253, 2555, 2746, 1083, -947, -1848, -1282, -506, 1303, 2633, 1991, -1141, -3822, -2717, 479, 3969, 3001, -704, -3577, -2650, 654, 2889, 2379, 861, -757, -1415, -1093, -201, 1442, 2851, 1588, -1695, -4070, -2822, 1566, 4332, 2530, -1652, -3984, -1863, 1740, 3467, 1897, -100, -857, -971, -944, -102, 1607, 3278, 1322, -2584, -4292, -1649, 2890, 4573, 1059, -3082, -3330, -195, 2433, 2193, 1049, -83, -161, -991, -1862, -309, 2750, 3513, 105, -4085, -4378, 366, 4717, 3638, -949, -3593, -2057, 956, 2469, 1335, 422, 594, -191, -2119, -2278, 216, 3364, 2640, -1645, -4814, -2961, 1717, 4163, 1956, -2039, -2791, -1090, 1250, 1085, 762, 772, 357, -1204, -3341, -2015, 1876, 4105, 1597, -3455, -4705, -1320]
2615a320M270P93k899l052K18J770J019r4J32O31j356k544j356K741L974N98l769
2632b44l643K68M068K639p54k290j469P8Q68M56J056J057l34k522k936Q75L478
2649F51L168j331m314k182J519L717J596j255j930p94L3M11Q67Q68J240j173k551
2666a460j834J718K997J968j827l354j223J907K671J303j186j747j106k54O28
2681g99J199J484j19j617k370r11K303L415L33j985l231l82K257K705M69j414
2697A337k021m59P9O31P15J370R3j539k478l98K226L096N44k377l595Q6K630K855
2715B795j16k011j799k82M57M43J416R76M5k726k472N41L746K480q60l879k147
2732c393J400L081J697j300j654r32J04k28L46J647J404o50l258k214J951L849
$$ y = [-1320, 2950, 3743, 844, -2208, -1990, -220, 799, 705, 837, 1468, 112, -2432, -3788, -1047, 2927, 3525, -244, -3887, -3619, 449, 3088, 2334, 44, -1425, -1347, -479, -23, 1033, 2090, 1756, -766, -3702, -2827, 651, 3819, 2488, -1826, -4008, -2489, 1228, 2824, 1569, -361, -1155, -1122, -711, 156, 1024, 2264, 1091, -1460, -3294, -1576, 1421, 3389, 1562, -1792, -3015, -1108, 1563, 2866, 1680, -67, -1173, -1427, -799, 400, 1884, 1765, 148, -2222, -3133, -830, 2585, 2918, 933, -2298, -2680, -423, 2282, 2751, 1337, -684, -1143, -1064, -433, 282, 1652, 1745, 206, -2272, -2670, -444, 2652, 3196, 819, -2776, -2690, -60, 2795, 2679, 668, -1131, -1413, -956, -513, 903, 1879, 1924, -802, -3274, -2733, 1013, 3493, 2633, -1246, -3393, -1993, 1088, 2785, 1485, -169, -1101, -997, -1225, -879, 768, 2172, 1522, -1736, -3950, -1999, 1850]
2748A850K072k279l882r62K072K780M16j400j201j55n33n86R84K487Q30j789l369
2765b665j035L095L640M89l365k908P29K032J404l70p60n0l88j153j050K080K959
2782B684M23l126l967J024M091K474p63l474j949J059J774J003k70m33l42r99
2798g91j687P66L372J641j566l713j660K378L398R99j884k519m01Q61P71Q15N13
2815A293J66j336k008o92J773L496Q93k953l306j98K225K674K05j206k225p2L33
2832i38R78P96N23j00j827j657J99K748K032k51k918j841M43K535J639j60j869
2849C32j368o13O23J133J090M21r17k017j277J024K781J861j202k618k065Q11
2865b001K772J794k93k412j467r4J037J384R01l12j238j670j049J740K391J380
$$ y = [1850, 3922, 1643, -2239, -3201, -1129, 1651, 2067, 667, -534, -689, -1222, -1808, -824, 1663, 2493, 704, -2665, -3700, -605, 3035, 3524, 159, -2749, -2020, 12, 1416, 1046, 286, 236, -152, -1305, -2355, -275, 2684, 3107, -19, -3986, -2962, 1129, 3603, 2840, -634, -2583, -1524, 250, 1253, 983, 550, 208, -791, -2478, -1712, 1660, 3301, 1735, -1978, -3638, -1260, 2138, 3137, 1253, -1266, -1667, -806, -35, 780, 1293, 1459, 123, -1885, -2577, -804, 2692, 3585, 632, -2674, -2872, -647, 2027, 2232, 1026, -1199, -1271, -938, 40, 836, 1359, 1259, -568, -2225, -2026, 722, 2754, 2503, -415, -2256, -1813, 722, 2361, 2201, 332, -1036, -1649, -1026, 107, 1197, 1618, 701, -1316, -2593, -1569, 1212, 3073, 1871, -747, -2812, -2001, 771, 2565, 2272, -140, -1607, -1701, -664, 720, 1621, 1309, 71, -1599, -2648, -908, 1483, 2863]
2881B863j610k458j593J539K573J133j335j970q57M29J100Q61M48R8j179j975
2897a933j86J995K230N50k096k797p51K232K868N70k336k231j5J232Q81N03N34
2914A250j45j423j627lK343K454R3l217k599M91K821J758l92j822j092O3L70K79
2932c98P99J453k38j922k542J052L017K257j606l104j763J817K810O84j475j777
2948i36k16M47oM47J309J298j436k602j064K166L299M16k545k699L1J793J552
2965A254L33j171p68j74l58o84J399K730j38k513k930K88L474K411r18k720j806
2982b291N20K266Q04k01p62l13n28j045K03K074J595m41l135j532J281L134Q40
2999B469q86k811p25J178R75M07J98n52j46j055q42J081K258J226j820k587j010
$$ y = [2863, 1253, -1205, -2798, -1259, 1314, 2447, 1112, -858, -1715, -1286, -186, 675, 1123, 1221, 42, -1933, -2119, -124, 2106, 2656, 560, -2237, -2988, -756, 2112, 2682, 346, -1885, -1900, -668, 213, 716, 1250, 1105, -318, -1945, -1948, 395, 2849, 2942, -275, -2874, -2383, 438, 2196, 1804, -18, -1110, -1047, -677, -398, 401, 1854, 1616, -306, -2848, -1796, 1221, 3478, 1872, -1232, -2995, -1178, 1632, 2316, 841, -936, -1152, -705, -711, -264, 1045, 2343, 907, -1695, -2759, -593, 2706, 3122, 577, -2122, -2091, -298, 1254, 1587, 416, -352, -526, -884, -1568, -169, 2561, 2423, -90, -3020, -2732, 742, 3153, 2235, -485, -2291, -1771, 495, 1299, 1098, 336, 23, -505, -1550, -1347, 727, 2322, 1881, -1254, -2786, -1505, 1629, 2469, 1583, -1228, -1953, -775, 200, 607, 805, 253, 107, -948, -1790, -709, 1549, 2775, 955, -1632, -2642]
3016b642J993K824K54k159j796l0Q30J277N04n6m61p46r70o82K098J548M24j657
3034E53k567L10J518K037K65j710j556r8L66J017R59n6n98j220j052K58K269J418
3052B113l59k485j848Q58K417J174m60j744j018P0R35Q64M09j00q30p14p21M62
3070i77J859J602j170k120j694J344K247J038q53j944q19M02J037P36L04rp47
3087B36j264q73J224K129R29j696k191p94J696K332L95j748j519M25J44Q30J8
3104B73N02M61r03j635m08J548K120N21k463k225J23J864K035k51j485r83n2K40
3122g18L80J087M26l03j903j124P09K140J607q88k352j221R48K156N82l44j450
3139b68m50K14Q0K58J014Q64o71k375q86J338K573O29j357k487p05J661J383L97
$$ y = [-2642, -649, 2175, 2429, 270, -1526, -1556, -726, 551, 1055, 999, 538, -208, -1178, -1860, 238, 1786, 2210, 553, -2014, -1704, -186, 1851, 2116, 406, -1150, -1248, -882, 135, 1094, 1038, 440, -780, -1832, -1574, 695, 2113, 1754, -731, -2579, -1721, 696, 1870, 1410, -334, -1352, -1282, -347, 517, 926, 826, -4, -718, -1439, -977, 882, 2484, 1314, -806, -2500, -1156, 1091, 2129, 1276, -668, -1487, -1085, -48, 688, 992, 983, 236, -1028, -1901, -677, 1452, 2381, 685, -1506, -2300, -604, 1728, 2123, 375, -1144, -719, -575, 255, 273, 775, 1236, 333, -1302, -1710, -162, 1958, 2479, 16, -2209, -2086, -222, 1813, 1562, 77, -906, -958, -718, -338, 749, 1175, 872, -1031, -2155, -1446, 694, 2301, 1413, -939, -2160, -1212, 944, 1526, 1182, -268, -718, -504, -424, -166, 848, 1712, 1041, -1334, -2220, -882, 1691, 2320, 963, -1524, -2229, -568, 815, 1212]
3157A212l80r44p01k62J54J105J123K33j312j909j76J861J955J59j945j952J37
3174a642J554Q97Om41l33m07o68j33J428J713k67k143j728N50K123J864p99j883
3192c09j603P11J178J088k74j71n56j217M9N07J941L30o39j914j111J153J619
3209G82J262r43j941o10P69P07J185k10m85j002o08k58J028J913L15j422k014
3226a532p16J561K036Q57j519j770m74Q42J222N96k48n41q34p72L08J499J132
3243A647K24k034j387q8J254K040O0j280j728q4P69J265J53k77n19n73n73M8J653
3262E70J272j90k422j512N74K092J392m46j725j120P49J047O32k0k99n94o50n65
3280a215N01J661J003r56j987j369J402J925N88n35j399r61N91P39P11N04m21
$$ y = [1212, 832, -112, -813, -1075, -921, 184, 1307, 1540, 228, -1681, -1857, 4, 1959, 2118, 173, -1779, -1642, -88, 809, 815, 374, 41, -366, -1034, -1167, 261, 1974, 1707, -436, -2164, -1614, 509, 2373, 1574, -309, -1912, -1201, -23, 1065, 791, 620, 64, -1153, -1104, -597, 1344, 1674, 1035, -879, -1990, -837, 782, 2044, 1101, -840, -1450, -681, 26, 1211, 1001, 516, -486, -1094, -1352, -324, 1589, 1904, 482, -1532, -2248, -687, 1349, 2206, 687, -1083, -1557, -715, 507, 1103, 855, 314, -520, -1292, -984, 515, 1647, 1871, -163, -1550, -1638, -384, 1656, 1716, 436, -1292, -1376, -607, 658, 811, 534, 15, -558, -1131, -1083, 570, 1842, 1652, -770, -2282, -1708, 384, 1776, 1330, -395, -1515, -766, 281, 913, 893, 594, 0, -650, -1215, -714, 947, 1950, 994, -993, -2362, -960, 965, 1553, 1018, -381, -1342, -751, -12, 699, 1203, 782]
3297G82j098j065l49J552J632N00j613k364K2J585J768J83j589o60k94M96R96
3314D84K6L45k71j142j189L88J722J685m3k256j451K09J660J256l80p89j265j2
3332a023M58O20P29O08p67j537o72O11J964J348j325k053r06Q25J941Q58n32j274
3350a27o57j73N66Q06N03K88r79j125q68J192J737J044j621k051l71J422J135
3367G21N43l03j278n09Q1L04M76J048J12j404j632L8K101J479j71j646j550K45
3385a345J141J372J6q49r14l30K29L01Q23Q92n51j068j517N77J558J623q89j428
3403c59j209N17J484R47l40r50j65r55K41N98J275N81j175j892k19P13K007Q09
3421A908j351j466n58N38J422M43K8r05o48M6j12J093P36J80j002j739r0J165
$$ y = [782, -316, -1381, -1730, -178, 1454, 1954, 341, -2023, -2001, -416, 1352, 1535, -54, -714, -1008, -512, 484, 510, 855, 584, -558, -1747, -1359, 363, 2048, 2005, -251, -1702, -1493, 167, 1423, 1043, 254, -1011, -1023, -565, 55, 784, 1392, 625, -912, -1584, -973, 991, 2339, 1014, -1039, -1945, -1120, 821, 1679, 1147, -127, -784, -957, -391, 415, 918, 1206, 227, -898, -1766, -574, 1163, 2207, 586, -1465, -1836, -414, 721, 1264, 961, -317, -826, -745, -441, 35, 1083, 1195, -209, -1841, -1803, 298, 1777, 1606, -40, -1590, -1345, -204, 1168, 1184, 335, -579, -909, -680, -379, 444, 1336, 785, -283, -1800, -1223, 335, 1958, 1069, -359, -1568, -1051, 433, 1380, 1040, 90, -75, -1030, -789, -191, 1084, 1665, 490, -1402, -1621, -908, 1099, 1908, 557, -909, -1467, -929, 493, 936, 964, 59, -589, -543, -655, 438, 1174, 1354, 352, -1387, -1477, -312]
3439c12J658J58j108j491o5O71J157K80k33p25o47m18O43Q94Q24L2j689j381M24
3458a328J677J303l54j550j040K30J246M96N10m63n77r76j40K72J281Q33q91j351
3476h22q73P36J502J062q62j325q54Q22R02M51J45m96n65o44j14O93J505M67j077
3495F53j936l19J339J324L32j224q21j61K22P53K48J85k26m11j047k58J035J629
3513A317M3j123j622j64J523J600m63j212q39r4P40O72J54L47o15j061o05N45
3531h57J416J102q83j334q04K80J351R44m09j048l97q1N65K52Q00r0q05j006l48
3550a352O03J546N54n83j718p45Q99J551P56n33j340m53K25K68P90N91k42o39
3568A78j071o3Q46J371J89r91j887J38J259R22r5m35p69j05j70M65P37L27m18
$$ y = [-312, 1346, 1504, 396, -1095, -1160, -489, 668, 948, 715, -10, -657, -1075, -432, 462, 1286, 1318, -371, -1752, -1328, 349, 1652, 1298, -252, -1292, -1062, 184, 680, 1190, 727, 150, -826, -966, -694, 587, 1420, 529, -822, -1695, -959, 543, 1605, 743, -582, -1436, -614, 288, 739, 884, 388, -177, -821, -935, -242, 1263, 1730, 653, -1283, -1602, -263, 1061, 1393, 169, -652, -813, -591, 162, 410, 595, 369, -42, -1089, -1347, -312, 1317, 1360, 237, -1385, -1549, -26, 1574, 1111, -101, -940, -1034, -294, 378, 532, 879, 264, -797, -1402, -857, 559, 1661, 778, -556, -1360, -1080, 271, 1215, 806, -242, -639, -720, -155, 97, 897, 807, 2, -1004, -1352, -749, 797, 1351, 768, -950, -1695, -796, 755, 1511, 978, -362, -815, -590, -322, 468, 1059, 817, 178, -893, -956, -110, 1261, 1450, 459, -1428, -1290, -31, 891, 796, 361, -408, -513, -683, -218, 519, 846, 428]
3587D28n54j006j12J486J397l67j508j225M41J330N50o0n62m93m68J34L82R16
3605G09L66n72j093p33P59J167P56m81j435n74M70J135O21o25j06o48m30q6J047
3624B47Q55K84j168j095l97P12J781K4j092j216q7M92J028L65M1q52m65j79L87
3643c35O23N99m4o25j439J55J019J420l0j265j158J17N97R21P0j8l51j088l00
3662a132L48J590K38k63j181r03L49J294J013n44j206l89j38Q70P24J05n38n20
3680b83n92J66M52P69P35n27j402n73P09J245N87o35r33n57J12N03Q16K42k93
3699E41q17o23O9R74N97L48q00j218k44R02J470O6r70p86m89M49O52O22M3n78
3719B08m83l46N3Q01P11J72j193j409N50J120P28j54p68q59J00M16N77N44j05
$$ y = [428, -126, -1132, -1244, 242, 1639, 1272, -236, -1461, -1020, 310, 860, 800, 238, -255, -723, -589, -207, 709, 1075, 503, -590, -1323, -564, 603, 1359, 878, -557, -1131, -661, 474, 1095, 470, 364, -284, -714, -800, 247, 1102, 1386, 218, -877, -1274, -562, 1219, 1243, 151, -1065, -1152, -660, 368, 733, 774, -78, -543, -722, -335, 288, 887, 843, 218, -1221, -1066, -47, 1373, 1343, 78, -1080, -963, -366, 555, 625, 607, 256, -832, -1132, -784, 806, 1044, 781, -400, -1303, -954, 340, 1353, 809, -397, -786, -924, -54, 670, 775, 237, -283, -875, -709, -257, 512, 1247, 720, -682, -1255, -546, 699, 1286, 651, -282, -839, -727, -224, 592, 834, 541, -276, -899, -830, 144, 741, 1089, 289, -929, -1173, -271, 1199, 1265, 295, -491, -980, -531, 121, 743, 786, 208, -275, -621, -568, 233, 944, 1116, -77, -1486, -936, 184, 912, 758, -10, -869, -769, -353, 224, 768, 663]
3738F63o14q16n87Q54Q32J031o20j379q42P84J073P07m33q73n29L23Q8O49K36
3757E47J51p02p56r7N56J202K53o74j315m89P86J053O02m71p49p68Q5P62N37M42
3777I55m25j156l86K27Q09J091j71q68j150l83J263J050k02m76l89l98q6O07Q00
3796G12L66n23p90p58K29J059O99k29j507o96M09J193R45l33l64r44k64N65M19
3815A88P45km50j159l58M29J279P84r43j334m36N64J049J33k92k3p54k16L59P75
3835C38O51j43j042p39k02J006J127K04p24j227l09P55Q66L38k58o24o60k46M48
3854d41J042L98l10j139l53j37J203O80j39q05r49J25O60R39k8j72q43j65l69
3873h03N20J041L12o27j143n11N18J069R63q21j089l41O6O97P67j07j64q50L2
$$ y = [663, 49, -767, -1354, -500, 332, 1363, 743, -636, -1478, -694, 379, 1086, 653, -220, -749, -426, -338, 311, 547, 698, -4, -760, -857, -301, 901, 1154, 480, -835, -1324, -538, 515, 1117, 646, -103, -871, -786, -24, 513, 955, 530, -626, -1012, -785, 24, 1115, 944, 76, -1074, -1457, -194, 856, 654, 178, -211, -609, -695, -88, 712, 1078, 555, -235, -993, -764, 295, 994, 765, -742, -1438, -1029, 164, 1109, 776, 412, -532, -796, -231, 188, 933, 931, 481, -678, -1036, -607, 672, 1456, 513, -821, -1257, -693, 356, 489, 197, 174, -580, -796, -437, 338, 989, 846, -196, -935, -1137, -131, 996, 1200, 476, -751, -1060, -305, 561, 899, 641, 17, -643, -889, -441, 601, 999, 689, -450, -803, -940, 263, 943, 804, -1, -950, -825, -165, 774, 746, 574, -269, -434, -803, -283, 758, 1070, 443, -700, -1211, -693, 376, 1339, 518, -571, -912, -846, -149, 618, 511, 347, -503, -471]
3892d71j26Q33M11J13n19j465J04Q37Q29M03n12j055l47N64Q84K84j37k66p29
3911c65l37K32O93N98j90q28n09n74J463R06j38r02o43m2L28Q42J02q3o52l90
3931d89k22L46P34L92j53p53j047M33R17P44k46o78n40P4M35M28J71m1l69o89
3951e53j57M39O74P86q64p87p81M78J276K58j73r75m14L45K20N13N21j64q53o30
3971h41K11J017K49L51j018p99J66K84J090k1m23p57j40K62O38K98J57k57o65
3990a98q31M96O91N11m7q84q30N62N61M59K47l91r06lJ68P53K76j05k18o62m58
4011h09M09R55J81m66n76n19L60R80J15k9n10l96n87M36K36P15J03q78o44j09
4031a033O29J328n0q26o06m64M15J275rl18o00K6k12j35P38N50j90o70o82j79
$$ y = [-471, -597, 236, 647, 760, 241, -1224, -1120, -283, 546, 949, 437, -618, -965, -401, 483, 767, 630, 364, -365, -702, -470, 223, 821, 631, -197, -706, -1280, 183, 1089, 951, 49, -594, -636, -308, 534, 636, 553, -99, -489, -711, -365, 369, 761, 608, -145, -1192, -759, 158, 902, 656, -22, -562, -488, -53, 375, 546, 505, 136, -553, -710, -271, 403, 1189, 325, -462, -1243, -765, 511, 769, 596, -379, -793, -448, -228, 285, 806, 642, -211, -841, -630, 387, 636, 987, -31, -830, -664, -380, 710, 689, 266, -491, -631, -369, 269, 567, 724, 467, -198, -1029, -533, 158, 669, 622, -262, -1092, -530, 31, 490, 737, 346, -560, -563, -395, 358, 634, 529, 311, -351, -809, -400, 555, 736, 270, -306, -825, -465, 515, 630, 601, 91, -305, -892, -456, -220, 495, 598, -280, -924, -1033, -404, 924, 874, 48, -558, -1022, -607, 668, 659, 341, -259, -233, -445, -580, 158, 708, 518, -152, -834, -1013]
4051a013P61J091r3n27q14k69N94P72J61k55l57m56p6J77P00N35n36j031n38P76
4071c98N76O14K9j054m31o4O22P26K43n54l72p28K61N99L75L11j63j161l23M92
4091d00Q93N69k34j031l68J53M29L13L41k49o78m27l7N60J071r9q85q08J44N92
4111a51P14M78n91j291P0M17N32O14j39n00o40K9j8R23N32n37p53l78k7P60O95
4132G39K42q86p17j32N05O14M16k43n37n52k61M39J127M69p44p65l80P3R43N77
4152I27p7q80n82J82M21L50N12p70j43l85k98N25N56M54n48p52m18M20R07K12
4172F13M4q77o18K24L29O27L47m56l21n73K53M68N63jo06o85k12P03Q13J75n66
4193B44m92l20M28QM66L81m64n11m37P6Q72M14l19m48r63M47M95J138m46l81o46
$$ y = [-1013, -252, 839, 746, 219, -595, -864, -270, 502, 663, 408, 51, -405, -481, -304, 396, 931, 395, -636, -1174, -398, 178, 792, 821, -233, -664, -728, -106, 620, 863, 309, -63, -791, -530, 69, 444, 755, 592, -569, -892, -400, 493, 1062, 828, -203, -571, -418, 11, 324, 665, 416, -262, -689, -726, -166, 905, 806, -79, -887, -743, -151, 563, 1041, 450, -841, -771, -354, 178, 792, 653, 153, -487, -458, -476, 447, 979, 442, -311, -689, -716, 44, 739, 981, 95, -622, -754, -249, 365, 781, 538, 1, -551, -812, -373, 754, 1223, 479, -286, -666, -593, 350, 927, 850, -30, -612, -430, -9, 341, 853, 83, -60, -445, -743, -218, 338, 792, 244, -508, -926, -506, 401, 613, 657, -220, -838, -614, -285, 342, 689, 233, -88, -661, -408, 60, 623, 622, 16, -669, -881, -178, 635, 810, 244, -248, -568, -140, -132, 334, 715, 251, -260, -697, -621, 251, 665, 346, -102, -1065, -618, -123, 1015, 569, 188, -458]
4214d58l7P8O46M25j82l46p99ON36L03L09j37r66o0K88R16O8l84k45l37m40O73
4236a43L7P42l86l13o33J7N95P08K28o74j043J92N72N79L6k72k53n09j32N69M93
4257D10O81j305O8r42L55J227M20j57p74q15J92P02P45l11k39m45m56j08N32L95
4277A75L05j82r18m78L92Q64P14k11q42l26k22P12P63l62j76q04J35J05M31N07
4297E82J91j030n73j01P31R75K70n58r08k94J31Q11N6M39m63q89J1J34Q70M69
4317H54M7q55q39J2P49O91K3m95q04r3L47O36K57j79p14n3k75P84M00J78j78o67
4339a74p61M51N28M91J30o82l61m67N09L98L03l7j47n61m2J97Q18O4n32n45j90
4360f10L03M71N46L6m10o98k24N21M87K34n37m08k90J72J76Q81j11n16n96o6L17
$$ y = [-458, -495, -417, 229, 654, 472, 126, -673, -667, -131, 172, 481, 344, -622, -682, -394, 522, 590, 206, -39, -376, -816, -143, -106, 636, 250, -63, -696, -679, -84, 624, 852, 178, -865, -673, -101, 478, 514, 242, -11, -520, -652, -83, 410, 1091, -214, -146, -1088, -733, 494, 914, 757, -17, -832, -640, 62, 807, 496, 257, -188, -644, -752, -220, 175, 480, 298, -620, -1098, -706, 158, 872, 661, -181, -507, -729, -17, 746, 384, 208, -596, -461, -356, 75, 582, 773, -257, -830, -931, -200, 775, 1045, 487, -421, -715, -584, 227, 283, 722, 259, -630, -619, -485, 385, 854, 901, 46, -793, -781, -32, 659, 682, 187, -617, -710, -363, 273, 530, 351, -363, -416, -691, 93, 493, 671, 493, -174, -935, -484, 44, 535, 665, -17, -378, -845, -336, 62, 365, 328, 181, -380, -422, -225, 593, 657, 125, -420, -610, -307, 164, 710, 746, 336, -362, -586, -65, 422, 656, 119, -289, -579, -407, -231, 650, 539, 23, -573, -639, -322]
4381c22P94p2l14r8m24j07P38M32r0j01p49l19K15Q35M28j71n85p52J10M94O62
4402F04j02l94n90k59M51J68N70L24o09o25q9N19L13M60l47q24jJ98L08L78N4
4423E07l41o62OM38J55M24j38m75n75J09M24P05j35k41m31k59O4Q40l2J51q04
4444b70k52K23L96J51J48k88p6m68j59Q21L60j73k02o85n9L07P98M9m30o45O5
4465c89j90M37P19o2Kj136Jq4J112L3k04l09m37J84M03P50n87m90k67M7L49K35
4487A17J95O00j085l8l33l4R15K34k89k73l76J49J08M88K04m07n90k0K03N46K81
4508E95k98l41m65l9L59Q31K00n33o15l48M11O67kj74n52r6Q3M55J61J62k00m09
4530a48k72n5N20M60K19p70p27P2L17P72o8J21l80m13j3L38K52L51l71k92j04
$$ y = [-322, 472, 400, 86, -12, -436, -543, 195, 627, 537, 436, -313, -632, -417, 418, 846, 675, 90, -662, -552, -58, 604, 502, 108, -482, -741, -290, -122, 448, 772, 163, -462, -551, -32, 281, 741, 394, -430, -431, -233, 75, 453, 507, 166, -496, -490, -52, 103, 527, 389, -86, -661, -552, -128, 577, 442, 201, -230, -489, -425, 415, 383, 534, -270, -522, -299, 97, 248, 396, 108, 32, -436, -595, 226, 586, 413, 211, -474, -533, -226, 572, 621, 191, -454, -389, -579, -142, 577, 515, 517, -619, -618, -702, 410, 443, 239, -70, -507, -323, 80, 830, 243, -247, -514, -467, -118, 117, 312, 912, -173, -211, -544, -578, 337, 571, 282, 9, -367, -218, -110, 378, 582, 175, -415, -435, -232, 314, 595, 297, -44, -509, -548, -189, 642, 842, 309, -306, -654, -243, 424, 422, 248, -304, -400, -317, 138, 299, 461, 261, -148, -420, -475, 45, 505, 724, -46, -773, -701, -384, 388, 320, 441, 61, -352, -365, -27, 225, 576, 205, -87, -191]
4551a91m10R35j39K54o00o33O63P4K42K72j33k83k97l2M22L06l0k55n79j14M19
4572a09L92K61k68k24m36j14N62N74k47k07m64k59K22Q67J05oo92m42J11L43M23
4593C92kk44k79m56L03N94L61j39n96l84k37M73N61K54k47l86p10K64M00M32J66
4614E20n05o41K40J15M02K63o8k43n03RK72O18J70l77n94k25L94P2O85n94p3k75
4636c38o2M99N8N00l08m62l62n5O09P09k52m27m66k06L39L75M93j94p54k65N2
4657e17P42K76p8j38j41n23R9K53P46m68m9p67q3M19O03j23o0m70k19J6N63K71
4679C52N42p91m08r3j01Q63M30j43j207j49M50N16J80j54m9l83o5j94M36L96J21
4700E49m85r6k43q1P50K07m52k66o54L40N79L68n8l77o04M0M94R6N30j44o19o74
$$ y = [-191, -601, 334, 195, 449, -151, -784, -121, -47, 195, 467, 334, 51, -246, -278, 144, 450, 420, 165, -414, -528, -109, 283, 544, 276, 52, -384, -498, 64, 638, 391, 184, -280, -539, -317, 550, 655, 649, -43, -485, -374, -31, 392, 390, 146, -133, -589, -286, 308, 669, 530, -66, -450, -687, -214, 347, 601, 354, -32, -742, -478, -78, 354, 520, 15, -626, -386, -271, 131, 394, 326, 83, -420, -411, -139, 479, 649, 272, -322, -547, -153, -81, 604, 10, -63, -338, -400, 99, 157, 657, 349, -113, -475, -530, 79, 788, 536, 109, -357, -563, -224, 151, 644, 450, -304, -569, -517, 225, 501, 423, 285, 144, -379, -280, -27, 719, 251, 202, -565, -648, -229, 374, 251, 191, -279, -498, -482, 81, 352, 894, 103, -305, -398, -499, 364, 794, 651, -556, -705, -255, 261, 441, 287, 238, -145, -210, -404, 32, 428, 549, 64, -32, -275, -356, 394, 601, 149, -117, -771, -431, 148, 516, 458, 81, -523, -483, 11, 107, 637, 493, -126, -800]
4722h00J81O84N05k46k26m66k84N09N68J04oo95q7j51M97N2M16l83l55l02k3N21
4744A3O47k53n41j55k87N91L31M9k20k50m01K64N82R7j4j98o95k95M41N55J03
4765C64k57m02l6J26J29L76R2m20k92q0K18N71r5N2j33o62l62O42L22M52o53r4
4787a42m85L35N48M33j60m33m11l24L28K58M97j76l91k62m29Q29M76j62k58l09
4807b38j40M69K35M20k98n57j10j71J20N22K95m31m13J0l17R03J72j11l91n4k71
4828c56J46M95J05J1m10l81m27R92L80j16k14l44o47N78L75L60j00n79L5m72L34
4849b35P13k40j83q1m28J48K63P21k51n02n00J71J29M36L82k03m67m37K09M69
4869A14N75n1m57n20k73K94M79L56m42j27l34j0J65Q76l29k15o07R1L73J43J78
$$ y = [-800, -619, 65, 570, 324, 98, -368, -652, -143, 425, 529, 523, -172, -259, -410, 87, 139, 555, 172, -183, -485, -508, 13, 660, 407, -134, -289, -576, 15, 346, 395, 175, -75, -476, -212, 370, 467, 453, 255, -440, -735, -294, 261, 364, 107, -295, -331, -205, -76, 300, 392, -28, -320, -400, -182, 389, 294, 346, 213, -449, -811, -169, 153, 605, -48, -142, -627, -292, 256, 689, 529, 96, -315, -639, -311, -53, 444, 268, -123, -385, -814, 15, 491, 329, 71, -238, -378, 91, 326, 746, 448, -109, -219, -390, -270, 252, 547, 116, -297, -287, -604, 299, 471, 360, -31, -85, -356, -210, 285, 390, 401, -9, -390, -817, 175, 555, 439, 225, -119, -766, -188, 187, 547, 447, -132, -97, -569, -235, 478, 238, 55, -26, -454, -306, -43, 678, 427, -75, -575, -404, -275, 161, 543, 340, -127, -564, -355, 114, 689, 638, 181, -339, -612, -318, 161, 517, 75, -52, -386, -396, -231, 645, 316, 101, -506, -415, -42, 101, 279]
4890B79l68R3n6l58K22L43K06k70l06p0J72J10M87L6n89m74j51P45L74j14j5j51
4912A45o52K33lQ17j54k99k97k45K41L17N44m77q9n60L58J9K24K52j26m30l30
4933e12L09M32K54l74o8m26M8J44M86o0R3m48j75O3O5K51J48k53m53J00M36j4
4955D6L45l79j05k1l90L74N52R1l93n9n63L48J84L68K8m9o91j78N45N19Ml08m95
4978b27l4l8N21L80l75R3m71j66j72P70J1J79o90Q3l38L96M55j77m08M1o4q3M36
5001A22K99j58l92j22O4J46P4P8K77m57n56M54l1O75j93m70J09j78J83L36m3m27
5023b10K18m36K58J03J59J15J13p22P8K74K1L52O4l27j24j38L6N86k48K23o67
5044b72j57J3L44O38n35J26l52l71M70J74K21q0r2n35J65l3O47j97K67o06j32
$$ y = [279, -89, 4, -52, -410, -188, 155, 361, 91, -215, -285, -113, -3, 484, 520, -69, -543, -694, 51, 425, 311, 296, 145, -507, -274, -277, 540, 386, 87, -210, -455, -214, 103, 647, 170, 81, -479, -121, -102, 122, 374, 248, -182, -512, -203, 229, 483, 109, 41, -385, -337, -193, 293, 233, 326, -122, -297, -234, -169, 82, 230, -23, -476, -376, 60, 46, 391, 12, -93, -114, -504, -130, 422, 513, 120, 61, -502, -154, 30, 398, 426, 377, -314, -492, 53, 572, 576, 268, -227, -261, -299, 222, 602, 227, 320, -151, -317, -489, 281, 292, 471, -219, -136, -474, -78, 377, 200, -208, -167, -231, -314, 122, 421, 263, -129, -251, -187, -41, 33, 111, 388, -69, -625, -171, -202, 473, 280, -190, -81, -259, -76, 260, 217, -210, 8, -428, -170, -67, 92, 207, 320, -402, -324, -50, -29, 323, 387, 60, -64, -202, -166, 420, 172, 395, -272, -429, -416, -72, 566, 31, 157, -195, -566, -96, 78, 299, 219, 127, -408, -243, -276, 371, 174, 441, -165, -297]
5065b97k03M69N29m06k13j81q7M18J78L72l88o47L16k8N01N6o7l79k31pK73K23
5087B01L37k6p67k68N32j05M89J18j74n33j60K60K79L36k25l83l05j59P0N63J86
5108B66q1l39l93M55J71M81k24m57k3j22K78j23K55J0l79k19O7J89L53L03l39
5129A29p57K24O34j58M8J32j10o26K26J65K22l3O9l26l27L06L45J66o8j57m85
5150c81J83J39K87J49j92l53q5K1J15L07p9O2m21L9M5K84M25k58m72l68N34J63
5172A44k5J98k15k67l78L63J45L98K0m26j12j42N83K56n08L7Lm81J4K02K48J37
5194A94r4m49j7K17N10k35J07l32o3Q5K52L5R0j84k42l59K29K93L30L3m80j87
5216b67L2K87qK48k57q5k63K05L4M29m3l23j26l34M49M12l7k32j97k02J2J82M32
$$ y = [-297, -500, -31, 498, 92, -121, -302, -389, 29, 207, 579, 191, -456, -140, -168, 333, 389, 322, -57, -288, -295, -22, 201, 538, 512, -255, -523, 9, -96, 393, 511, 337, -196, -356, -96, 183, 519, 294, -89, -394, -553, -483, 80, 266, 185, -154, -547, -92, 79, 560, 336, -121, -144, -266, 12, -111, 144, 154, -225, -444, -377, -188, 165, 468, 129, -628, -404, 230, 72, 120, 252, 142, -484, -258, -93, 129, 96, 165, -161, -488, -182, 163, 329, 261, 104, -381, -198, -59, 228, 377, 185, -168, -253, -232, -117, 190, 111, 173, -248, -209, -164, 120, 545, 287, -185, -553, -19, 144, 119, 317, 102, -165, -543, -180, -35, 363, 383, -43, -155, -297, 286, 542, 34, 71, 74, -407, -393, -191, 57, 194, 100, -349, -366, -149, 361, 126, 233, -99, -162, -77, 175, 210, 300, 116, -126, -485, -256, 37, 367, 400, -80, -267, -235, 52, 44, 292, 35, -50, -313, -108, -74, 355, 312, -11, -137, -471, -22, 390, 353, 121, -76, -278, -266, -84, 348]
5239C48j5l13k29o4L90J56K45k51l49l5L5o4P76l88j16m04j17M51J82J64j86j86
5261C0l79K22j05M29J78q7l67l11L72J8M56m68j06J1n52M73M50on2j38o17L12
5283b37K04K65P5m19m16K38K77J86M00l45k17l48K26J04J67J69n9l38k99M92j6
5304A09K94M6l77m62J32K0K87K99l32m3l77M04l20N82K67n70k53m7M55o6K74Q0
5326D02n18p3o8L91N4n3q4k01r2K26JP6L31l21l13Lp3L95J59R9m90j26k19L01
5350a93L65K89l48o23K97J80J93Q3q0m30J6J28K65K0o3L96n93l50K53J18L87k12
5372I8mm44J54M01J9j01r2j38k84K69N3L20J14k67m73j7L70M84j42nn26n4j8K39
5396d4L51k50k03p0j42N6M50MJ87k77l73j8L50R8mJ13m23j97L18J65J34L4k32
$$ y = [348, 333, 20, -209, -273, 117, 273, 518, 267, -82, -117, -82, -146, 630, 242, 126, -278, -395, 56, 238, 402, 216, 30, -349, -127, -232, 197, 375, 288, -79, -390, -18, 0, 456, -12, -118, -107, -659, -186, 264, 258, 206, 68, -549, -237, -33, 232, 307, -112, -528, -290, -13, 173, 573, 228, 11, -337, -111, -7, 160, 329, 270, -68, -367, 125, 109, 403, 449, 72, -390, -258, -238, 49, 348, 16, -27, -404, 0, -320, 262, 529, -41, -294, -341, 114, 48, 322, 402, -116, -189, -257, 134, 188, 135, 51, -150, -242, -16, -15, 61, 392, 71, -242, -239, -312, 83, 242, 341, -149, -275, -494, -193, 172, 461, 113, -510, -213, -33, 160, 243, 163, -267, -251, -123, 142, 162, 99, 495, -98, -448, -195, -77, 310, 98, 94, -350, -196, 205, 224, 123, 31, -107, -391, -122, -69, 251, 365, 98, -375, -392, -22, 462, 320, 315, -211, -265, -283, -44, 307, 57, -146, -216, -358, -302, 148, 152, 339, 62, -311, -329, 21, 119, 115, 228, -195, -392, -74, 91, 225, 259, 27]
5419B7m4m78K26O59J16l37l99m3K02J9L40p3j50P2m64m0L79L58j86l11l16J44
5441b99j8N56k80J56k44j99K38M55p1M9l37j16J3K44O2j15R8m03QN8M21k07L1
5464A00j97L38k83K32k31J18K62m52k22K53p6J33L18J3m93pL98l74K32j00K4m3
5486e7k32J92M95l60j20L0k22K84J08J42r1j35j52R9j21K4N79l78j57l22p6P08
5508B38JL56p90l98L19J54L2L18K5k40l7j07l72J179m08q5j07k12O4K4K99J1m75
5531b11J65m73L67M39r5R5m57q5n1J33J00P2K74k68n12K11M19j89L52m46rJ25
5553d4j62M69P8m23K89l82N4J97P9J14j49j20j98k2M74o6l73j54p2J7L78k28j7
5576b61O50m10m8l0K07Q2p7j43J7j78J95J28J63J11l71k95J58K23K4J79l04k93
$$ y = [27, -17, -495, -269, 390, 506, 169, -230, -273, -71, -52, 288, 215, 65, 137, -327, -367, 12, 370, 184, -127, -443, -299, -317, 239, -41, 115, -129, -328, -90, 365, 294, 343, 6, -110, -97, 147, 209, 94, 192, -211, -203, -145, 276, 69, 100, -97, 241, -42, 190, -41, 77, 339, -113, -335, -82, -158, -25, 293, 306, -187, -194, 204, -170, 62, -38, -14, -57, -289, -97, 398, 38, -82, -52, -274, 10, 118, 260, 169, 34, -118, -19, -140, -116, 463, 85, -72, -394, -470, 238, 239, 595, -195, -593, -274, -120, -88, 230, 255, 15, -22, -129, -501, 678, 270, 185, 78, -134, -70, -46, 253, 264, -211, -46, -519, -152, 287, 192, 287, -170, -255, -306, -173, -73, -1, 273, 5, -507, -296, 123, -66, 286, -160, -169, -44, -206, 263, 341, -82, 207, -175, -121, 76, 155, 269, 120, 0, -198, -220, 254, 188, -185, -339, -411, -394, -16, -244, -261, 389, -21, -69, -99, 108, 190, 113, -30, -13, -191, 4, 132, 295, 406, 35, -260, -102, 121, 145, 324, 20, -273]
5598b73K2K75K78j48JK41l92j19q0M45l0l45j31k9J69L85o1j22k66K4KK73N1k17
5622d7m1k02J22o1L45R4r8j02k30M2K88M1R0J53m89k15L11J52j0j32j41n1L9j47
5646b89K92J56K8n30K09K37l93M74J25m01k30Q5l34L40N22K8j67l46J71l83M98
5667I2j49J31j16k62Q2Q3L79j06j26k17M6J3M64K90m49j31k11o5N08R5q5k89k06
5690b29J73R1o4J19Lj91j94K25Q6M06k44m2q6m06J23O83m85Jr1k37L60L7J48K0
5714B06N2k09k38R7J18J67J68n16J59k79J34N40k89m6l6k56n2P4L13n8l3k88r1
5737c63K15K05J72J37l79O9k33L63L19l08j58L5l32J08K86K74p7n13k35L39J35
5758E9j81M63q8p30M56j44K64j32R3q8j6Oj61J92K68l84K33j31J8O5O5Nl95M8
$$ y = [-273, -251, 24, 302, 154, 155, 396, 4, -115, -195, 250, 220, -125, -256, -285, -116, 269, 208, 86, -180, -156, -154, 119, 170, -47, -88, -290, -168, -229, 116, 210, 112, 10, -220, -178, 110, 151, 241, 394, -95, -310, 1, 153, 143, 11, -130, -181, -142, -289, 3, 159, 187, -343, -134, 103, -290, 184, 309, -92, -322, -237, -571, -231, 291, 319, 152, -194, -23, -406, 92, -57, 74, -42, -304, -222, -139, 240, 134, 8, -209, -163, -150, 314, 604, 155, 24, -187, -252, 256, 351, 266, -23, -229, -56, 35, -29, 90, 93, -98, -292, -67, 19, 425, 181, 139, 53, -353, -230, 453, -32, -31, -122, -359, 1, 38, 186, 206, 258, 49, -189, -92, 26, 193, 361, -155, 4, -275, -141, 399, 110, 64, 28, -228, -280, -206, 107, 49, 16, -272, -363, -148, 57, 229, 366, -13, 56, -177, 186, 505, 197, 39, 74, -258, -150, 136, 410, 333, -180, -415, -76, 59, -122, 341, 253, -477, -21, -165, 99, -33, 60, -28, -44, -38, -199, -7, 261, -123, 110, -21, -3, 62, 127, 132, -263, -215]
5782b15k41n2L52L28K35k89l05K17p8L07q3k46L96k22m29K44q4P8K12K9l93K65
5804B6r5K65K5l24j42J15J83r5P8j72k23M91j67K76j19q1j16J29M5k98L47j1O0
5827A97m56R3p1L52M1o9J45n35M6K89L00l08J75m7k70l9K09n2R5l0L0j69m1J99
5851H4j0J45m2k53K37J23j58Pn0j1k81j4J85J74N9r9k18J86j92K10K2J84j99k93
5875b04k21M46m6K14j79r8j83J49J99l6K8M9l15ml2L99L4j83j60o5J77M5K51r9
5899A66j78r0j70M7L33n9q6r3l5J14n2j8J86p4k25K28k34J03K28K8j05k68N6K87
5923H9j4N1j07L6l02N7L01J5L9Ml36M0K57j00J12K09m34k04L43k92P07k14k70
5946a3K61j71r2k16M89r1k87j03K63R3L40m20k32j2k18M21J1P3K09j25j17l93
$$ y = [-215, -456, -508, -156, 172, 407, 118, -187, 30, -48, 259, 176, -70, 326, 104, -325, -81, -165, -87, 125, 154, -239, 26, -69, 196, 221, -103, -245, -130, 53, -42, 36, -136, -359, 132, -35, 241, 122, 41, -75, 54, 99, -199, 148, 137, 197, -259, -166, -237, 115, 156, 87, 232, -303, -257, 32, 332, 24, 199, 152, -118, -157, 52, 0, 95, 65, 95, -74, -115, 84, 74, 219, 177, -76, 161, 284, 126, 133, 83, 72, -209, -223, -38, 136, 195, 96, -122, 64, -128, 82, 104, 288, 89, -204, -425, 21, -25, 189, 10, -88, -271, -122, 77, 41, 69, 118, -197, -201, -233, 166, 200, 17, -143, -208, -31, 14, 265, 166, -12, -102, -272, -225, 108, 49, -37, -130, -165, -51, -103, -121, 65, -9, -234, -6, -240, -137, 91, 119, 14, -254, -198, 89, 75, 126, 19, 55, -247, -190, 111, 126, 165, 169, -167, -127, 130, 30, 142, 351, -83, -287, 56, -236, 471, 257, -13, 248, 77, -15, -231, 258, 167, -120, -223, 40, 133, 473, 53, -179, -191, -409, 12, 23, 96, 305, 180, 63, -330]
5968c30L89l7QJ96k75k3K15q1J25l13K49o39N90M5J90J30l66j12K1O9j16J10J4
5991E9J5k14j15K40j65O05k8m71J61k63J97p4L53j44l06r3L61R0j99J98k02l2
6013b7n8L32j63j4O8j82l16K76o8L35M6n5l85J37M54j86j5m54L58p16O02J32M5
6036A46J00j78j9j52m4o9J78k7J78k46K5Q0l4M78k30j30k37J61l7J3R7j88j35
6059b70J61j51K49K13P2j78k28j89M05J2j20M6j87l6m0J72j49L87k03j65Q7k7
6081a39J12j0R5k45r3K35k17K16J74q7O3l59J52K24k14J8J9o4k23J59M52k52k7
6104a1m8n1J59j63Q8L2J78l61J38j04M67m04l7n8Q8OJ96J38j06k03R2k1k62M73
6128B26O2l67j48K20K61O5j87J60k10j43j71N52k67K95j65j56k20l21P57l13J08
$$ y = [-330, 59, 22, 30, 226, -49, -72, 143, 62, 187, -126, 123, -516, 74, 119, 309, 439, 73, -39, -18, 51, -65, 45, 59, 74, -140, -255, -15, -180, 425, 397, -74, 87, -176, 21, -53, 300, 156, -150, -243, 118, 208, 9, 207, 5, -27, -85, 247, 84, 70, 138, -44, -360, -84, -152, 183, 229, 174, -211, -74, 380, 194, 179, -275, 83, -633, -31, 101, 146, 246, 68, 49, -103, -147, -216, -38, -65, 113, -133, -108, -28, -62, 416, 186, 56, -181, -20, -57, -44, 53, -135, -270, -109, -260, -11, 202, 274, 96, -132, -321, 84, 96, -24, 22, -165, -201, -241, -69, -218, 169, -34, -199, -112, -139, -27, -37, 58, -187, -280, -45, -262, -46, 128, 41, 104, -255, -103, 121, -93, -75, -56, -120, -343, -184, 268, 16, -11, -59, -110, 49, -114, -26, 6, 184, -177, -39, -143, 324, -80, -117, -175, -87, -81, 115, 253, 147, -56, 36, 15, -247, 226, 288, -79, -227, -7, 254, 319, 132, 292, 82, -61, -232, 320, 53, 348, 183, 27, -193, -514, 243, -70, 38]
6149C8l62k41M11K09j22J98j9L9P2l87L06n9k48L96k58j68k77K98K69K09l49j25
6171a70mN9Q5K99m7k70l69L19N9L23k04j1m51M7L48M3J07k0m14L7M02j81l4K09
6195A62J21l63p2k9K36l47J24L28k13K16l67M39j51J33l42L44k96m8K29j13K35
6216B26m14l22K52qK05J83j55K7l25L42j04K21l79K89j10Q5L62l34j02j97J97
6237f1o5J8L95j56K58m10j34QJ90L41k16J48m51j22K81O3L09j40j14m12L4L32
6259I6j7J13l01L69n50L50j16M39M4l38k39J32j06P8K9o9j84K94j78M76l6k96
6281a0J12k88r0L22m0M91j68k31m04J33J90JK32j80J4j18n9J25L2j13J87k07q1
6304a50L45j48k9K73j94k62N4nnJ67r9J02k9o7K47k13j35j4K09km0RJ03m24K26
$$ y = [38, -324, -565, -154, 55, -67, 131, 112, 151, 223, -164, 142, 83, -165, 231, -27, -195, -472, -174, 95, 304, -45, -170, -174, -115, -30, 269, 222, -48, -417, -98, -39, 284, 80, 69, -382, -335, 13, 56, 163, 143, -271, -234, 168, -13, -47, 162, 283, -80, -152, -181, 55, -292, -168, 160, -53, 163, -204, 235, 84, 217, -125, 219, -77, -125, 104, -9, 226, -188, -510, -258, -266, -61, 122, -33, -6, -331, 11, -93, 128, -251, 38, -72, 13, 375, 41, -61, -258, -61, -126, -108, 287, 131, 389, -21, -155, -147, 43, 384, 168, 316, -135, -257, 24, 87, 396, 256, 142, -270, -236, 96, 79, 192, -109, 260, -290, 60, -56, 383, 427, 89, -150, -18, -124, -46, -17, -86, -270, 24, -154, 322, 286, -10, 102, -186, -276, 46, 6, 497, 329, 98, -306, -173, 17, 18, 250, 70, 84, -34, -93, 32, 64, -49, 138, -69, -150, 195, 47, 18, 291, 97, -165, -111, -116, -121, 46, -53, 49, 20, -47, 200, -13, -148, -162, 47, 45, 5, 14, 117, -307, -81]
6329h1k78K74Q4O5r7j69k2J09j62L63p0L42l91Q5K26k00N3Kk46j81n6K87K34K8
6353A99k55Q5k99O47m05j4N0K8K31o19K58R9P6r3k04j77K47q5K42o9O0j56k90
6376d44M34K52k6j19Ll06M5J78O1J33j15q0j68mK00m7L6p2M1J14j31rJ07J15j95
6401Cj54J85q6L69n74J98j70K14m1k30L77j69O6j20J55p7J38J43j25m43L44o1
6423e8N35m70K36j25j27j44rJ03J73k64l6K94m4j02J12j45M03m36J41O0k15M57
6445C39m26K10l01J2K2J86J57R2l94j78L2L03L58l56J28l31J76l8J10m3J05j23
6467D0k12J25R5o8R4j12l08L43l34K92J66k5N4k44r9L45k35k18J30M92n80J36
6489a23K92j23K4J17j83m11K62P1P9J52L8l74l48nO70M3j40J83l25K12J62j73
$$ y = [-81, -359, -85, -1, 64, -33, -202, -224, -115, -277, 86, 16, 358, -33, 52, 278, 78, 131, 133, -113, -294, -350, -63, 171, 199, -56, 29, -270, 377, -28, -42, 8, 36, 267, -352, -94, 5, 81, -12, -216, -393, -146, -231, 11, -58, 2, -154, -444, -10, 242, 216, 97, 100, -206, -161, 17, 78, 211, 96, 16, -152, -156, 44, -3, 33, -39, 2, 116, -15, -24, 83, 198, 3, -151, 34, -52, 317, -257, -59, -229, -15, -56, -286, 91, -78, -12, -132, 23, -54, 84, 227, 102, -341, 3, -58, 477, 7, 243, 118, -9, -153, -162, -59, 114, -150, -186, 108, 64, -38, 74, -71, 332, -104, 37, 97, -118, 339, -87, 123, -178, -166, -144, 42, 199, 291, -103, -281, -249, 54, 412, 56, 184, -147, 29, -9, 101, 58, 163, 40, -172, -47, 48, -20, 74, -38, -346, -3, -337, -45, 121, 96, 150, -94, -193, 152, -83, -301, -171, 321, -259, -123, 169, 46, 70, 187, 4, -407, -145, -74, 5, 157, 195, -179, -527, -532, 138, 181, 41, 224, -101, 111, 273, 100]
6511A00qj41L1J12l44L33J1l9j46L0r8j0L18K26k93j8l98N82m13M62k80j93L50
6534A74j48J37K21l36L8k62R9P9J17L4P8J36k77l2Q7j27R6J2l89m0J24O2J56J78
6558B17k37m21L95q6J46M54n87J74k9j21M3j34%K69k23O5N9j60J60K50k87j74
6580b27P7L63j78r5J21k22J06R4J44j1K3J75n78K9j09L59J29o3k03J30j39k18
6602b93K42L04l44k16L4K36j67K9J41J70n46L87J13K5q4k09k29J22L53j15N6J54
6624A63l50j77P3P1Q2K18K21l54p6J8n7L00k09m0K14k06Q3q0q4J93J32k04J14
6647D5J81r1j14q4J2j67J38r3L50p2q1r9r2J78Q3J47k31m2Qk57L74r2Pk57K43
6672fK6J5j39J05K79m11J72j31J70j40K06j54lq6k0K23l3j30J62n31M25R4R2k20
$$ y = [100, 92, -49, -18, 94, -250, 83, 94, 55, -91, -61, -159, -169, 149, 375, 82, 64, -334, 248, -165, 297, 17, -176, 174, 26, 163, 384, 48, 86, -176, -77, 2, 119, 153, 231, 367, 90, 58, 145, 18, 114, 126, -263, -303, -179, -117, 39, 217, -20, -441, -46, -132, 14, 468, -119, 55, 26, -95, -52, -186, -186, 83, -140, -75, -16, -176, -16, 234, -53, -227, -150, 213, 35, -60, 61, -161, -55, 39, 183, 172, 195, 370, -208, -179, -288, 71, 200, 137, -66, 64, -75, -293, -51, 253, -91, -307, -273, -37, -204, -175, -34, 136, -410, -23, 90, 115, 31, -178, -407, -285, 68, -47, 9, 163, -187, -364, -291, -220, -138, 80, 301, -53, -129, -111, -168, 132, -77, -117, 97, -109, -26, -106, -190, 3, 135, -69, 45, 226, 135, 21, -63, -51, -218, -80, -173, 177, 105, 24, -75, -167, 11, 94, 241, 10, -32, -24, -281, 93, 1, 8, -249, -6, 20, 35, -104, 1, 280, -131, 41, -90, 80, -60, 146, -8, -11, -97, -117, 106, 73, -57, 105, -426, -1, 93, 185, -35]
6696c5R5l37L24k9o5J10J16j76j14j40L43JM9j38J70R6j80m1j96J78J17k15j29
6719a96L09k05J46J09j86j41J47j31JM02R9l48J42O3j82j05J01RQ7j04j00K74
6741A91m6J31j92J01Mj35n8n4K8j22qJ1N11o4m25l12J79K33K40l59J71P0m4j25
6765g4P2j08K11J28k46qN8k55J25j26K29l43L29k17K02M8K73j95O2j12J39k88
6787i6K76k75j09O1J24J7j01K90l87O24o56K45K60j37j65J99k65R8N6k12j13J89
6809g7k7l80O15J7Q9n3l63K49K0j44J26J14j33J36n52K78K81k47R9l02K49K42
6831B37j80j51J87j68O8J45l88J89Q4j01j54L42j01k39K27K83j5j71J14k21J97
6852A84J7r5Lj49M4o3j19L63k3j09l3k5O5j60K10J07l29j39K02L48n96L72l40
$$ y = [-35, 60, -277, 47, 18, -47, 63, 179, 3, -111, -251, 92, 93, 142, 4, 174, 270, 90, 49, -147, 31, 148, -67, -196, 113, -92, 54, 163, -23, -164, -17, -148, -147, 255, 354, 6, 148, 211, 29, -76, 25, 34, 121, 17, -83, 191, 145, 276, 84, 185, 189, 54, -4, -58, -30, -152, -160, -149, 362, 298, -127, -439, -260, -27, 213, -146, 25, 95, 51, -74, -2, -110, 101, 229, -17, -25, 33, -222, -97, -223, 6, -337, -8, -225, -23, 25, 298, 103, 165, 53, 192, -96, 180, -95, -204, -143, -19, -2, -103, 187, -200, 424, -232, 13, 273, 136, -29, 170, -95, 3, 59, -153, -266, -77, -104, -484, 131, 148, 237, 184, -179, 70, 90, -54, 72, 186, 53, 189, -363, -85, 196, -51, 48, -254, -5, 237, 57, -94, 93, -75, -7, 138, -250, -61, 23, -78, -232, 110, 9, -230, -3, 280, 265, 94, 208, -13, 184, 201, 106, 109, -40, 4, -59, -178, 185, 162, 53, 20, -5, 60, -100, 110, 217, -112, -251, -49, 299, -297, 75, -265]
6875b65J38K94j78K28O5k69j30q7j8J65J97K4k54J43l25O91n59K92j53K50l68
6896a19K57k44K3J61r4N4J11jK4J16j61N3N6j17k71M40j50j88J67j39j74M9J89
6919D2K19k80J1P0k89L28j78K14j61j48K46M1J15m04L65m01K52k70L3K51k85N2
6941a77J00L64l09k58M97j40n5L2k07N7l17P2M53k73K72k67J33q2M92k70m27L18
6963Hm2K62J1k65r8K87n0j88k0K11L9l41K82k68J44N7k1O3k44K12n1O3K87n46
6987b08j0N67m04qJ11q4J24l52N8M12j77j61O1j16K02m9j0P3j66L01l19j85L22
7010a8m5J7J10n6j35m0J80K70l11N7j98K13o8l47N85l57Q5J55l46L03J43K21k32
7033A86N3n74K92L67l16P6j74Q8p7j93J07N58l49j34j81J35j90K47K53K8j32j98
$$ y = [-265, -127, 167, -11, 217, 282, 13, -117, -204, -222, -57, 140, 164, -90, 53, -272, 419, -140, 152, -1, 249, -119, 138, -106, -83, 78, -16, 38, 149, 148, 172, 288, 127, 180, 236, 119, -152, 288, 138, -50, 117, -22, -196, -147, 42, 261, -19, -8, 62, -227, 101, -77, 137, -24, -172, 74, 115, 230, -174, 191, -210, 42, -228, -195, 56, -229, -177, -77, 287, -22, -280, 217, 77, 22, 54, -153, -96, -413, -341, 112, -161, 111, -156, -23, -105, 387, 117, -310, 8, -34, 228, 239, -26, -124, 163, 113, -75, -95, 116, 155, -186, 96, -172, -28, 29, 8, 71, -173, 39, -12, 51, 338, -208, -218, 349, -55, -63, 48, -36, 88, -264, -206, 206, 29, -132, -71, -187, 15, -34, -44, 29, -137, 164, -155, -340, -18, -63, -46, 64, 8, -127, -167, 13, 283, -28, 29, -169, 44, -24, -371, 214, -143, -58, 97, -249, 54, 197, 418, 186, 239, -335, -43, 324, 8, 84, -90, -2, -79, -272, -165, 393, 44, -90, -271, -136, -326, -79, 174, 202, 70, -128]
7055a28J5K34k58J80p4j00K06l18L22l32R8L03j25j50J32O6Pk0j09M4J17J5M3
7078A68n36K3M4N43j97j08K05j08P6N1k84J78l26M20l08K70j11Q0j88K15k95J47
7100d1q6Q3n0J64N3l55M12j53K4k91J91M11j91l29K3L02Pj84j36M3N3N0j72K48
7124G6P%j4l7n0p6L03l50L57m05R9k2P7K15k55K84k18Q7q9J07m4kj73J42R5p2
7150D2J12k08j04Q8nJ58R5l22J65k9j5q1L02J49k39p9k53Q1K07p6q1J39k34K69
7174H1J7n0j69J72Q8l90K24j46K62J05M1k33j77J87j27K47l51K89k20J24K60j11
7196A23j67K76m63K28L3l22M26j21j72l1J00J25l78N68O9n29L29j05j4J73k23
7217g5j60J95j67K55j00N0P0O5O0o32M08J24p4K1Q0p2N4k37J68jL62m30J34L28
$$ y = [-128, -113, 121, -137, 43, -31, -131, 75, -243, 79, -253, -155, 148, 23, -127, 5, 71, 78, 58, -51, -7, 110, 125, 168, -368, -345, -301, 242, 45, -63, 142, 34, 110, 161, -123, 55, -271, 149, -159, 111, 0, 80, -108, 107, -188, -41, -127, -44, -94, 70, 123, -232, 180, 27, 51, -240, -49, 362, 171, -158, -135, 167, 174, -10, -146, -103, -50, 0, -172, 76, 83, 83, 69, 32, -18, -94, 209, -141, 216, -189, -90, -112, -35, 180, -75, 209, -9, 78, -11, 96, 52, 50, -123, 19, 114, 42, 154, -54, -158, -70, -75, 83, 178, -144, 21, -8, -23, -104, 198, 347, 108, 29, -224, -143, 64, -12, -93, 46, -188, 81, 98, 48, -121, 51, 139, -251, -27, -173, 89, 194, 235, 2, -175, 12, -115, 132, -219, 70, -150, -26, 234, 123, -44, 232, -231, -3, 30, -292, 134, 13, -159, -190, -90, 35, -343, 225, 294, -235, 94, -11, -25, 148, -75, -235, -40, -207, 48, -52, -2, 68, 133, 193, -439, -31, 93, 19, 40, 120, 48, 102, -135, 33, 32, 394, -36, 98, 426]
7241D26m32O1J48j84o5k34K95J56j84K20k29L5n0L48n48L04j16k01M42R9n80J61
7263a28R0k05P4L47J41l89m0k5K92k83k09M89k48j52M77l60M4R4Jj86J64L48l66
7286c0l6L55k43o9m40M42o2q3K30R4q3K36m97K17L2k82K70k03j60N89k01j07K85
7309B54l10m6J59j9RO4j83R8p1p9r1J11n8M36r5p4l99L83k04J56k95J85k42N74
7333B63j11k51N7j19M11k84N8M3J05l06K7L30m24L02k98j13N59n37O34j52j94
7354@o5K2N1j72R3J77K67l26j3J03l16r7J65l3J72r3j73K20l58J96J09K00j5P4
7378A88q3L4M0o3j60M9J57j89K87o0n04L48j99J61j6o1L71j07J97n69J74M49l17
7401A27m2j34p7J03m7M87k18m60K39m9o5r2j47N53Q0l8k96r9L15K5k45Q3j49J00
$$ y = [426, -6, 55, 203, 19, -46, -280, 15, 171, -13, 207, -22, 13, -37, 311, -237, 67, -49, -250, 192, 291, -289, -128, -38, -243, -169, 178, 319, -70, -110, -135, 157, -126, -335, 154, -94, -246, 231, -129, -85, 9, 10, -176, -12, 336, -30, -66, 289, 46, -23, -463, -21, -83, -166, 64, 158, 75, 311, -186, 31, 63, -219, 51, -152, -312, 277, 76, -31, 254, -56, -102, 57, 38, 47, 111, -72, 26, -45, -124, -215, -104, -162, 274, 179, 105, -294, 89, -115, 41, -254, -69, -311, 263, 152, -99, -42, -161, 250, -34, 24, 67, 172, -134, -107, 223, -201, 101, -197, -310, 249, -288, 346, 194, 0, -65, -43, 8, -164, -71, 106, 373, 47, 34, 137, -179, -276, -111, -144, 28, -65, -238, -18, -376, -180, -71, 129, 114, 188, 105, 139, 179, 116, -44, 5, 162, -27, 260, 200, -304, 44, -155, 6, -10, -71, 300, 193, 390, -179, -5, 444, 127, 85, -49, -126, -23, -70, 417, 199, -261, -22, -71, -136, -228, -375, 178, 258, 220, -76, -175, 140, 165, -80, 3, -146, -46]
7425d6N6p9R0k5M2k03Q4J10o5j67J33K00j94n2J87k17l1J67K32l85J40q5l1K52
7449A13Q4l31j6Q4j50J47J92j56k83K73m7k5J2j38K87j34K51j99pL0k7lr3J38
7473BPK20K8j75L0Nk03K20n4j26Q2k44P4K01k83J22J64m47K35O2K86l10k4K97
7497A69k57J80k50O0J93j18o1K66n23N69l08j30P1M08o8l45L01J67l48KL44n17
7519a95L13J19j91J68J9l73J74j36O4k14L54k22L27q5J1M1k62J80j05j59O4J71
7541F3j96J49j90J8L14k02Q7Q6l16J46J87o8J25j36k33L0L1K35kj4r6k13J0K68
7565H3j18K68j43K06m12N2k73N79Ql92j22L69n10L20j57J15N5rK29k48J10j18
7587a08L71l39J94k90K92P5l39K4R2R5p4L8J87k64j1R6k6j59J87l7l5J76k72q7
$$ y = [-46, 10, -69, 21, -4, 38, -165, -81, 29, -36, -203, -70, 130, -64, -116, 71, -146, -177, -10, 222, -163, -23, -108, -139, 113, 197, -134, -150, -66, -216, -69, 123, -33, -316, -43, -90, -115, -103, -241, 46, -88, 163, -36, -43, -13, -40, -43, -136, 2, 9, 229, 257, 82, 112, 117, -86, 134, 80, -46, 36, -208, -134, 67, -216, -94, 70, -377, -142, -80, 206, -104, -128, 169, -88, 92, -158, -98, 95, -23, -84, 182, -341, 228, -80, -210, -139, 269, 201, -144, 157, 324, -24, -22, 322, -195, 118, 237, 46, 214, 233, -140, 34, -102, -38, -252, 102, -120, 207, 122, 133, 174, -88, 92, -13, -172, -108, 63, -133, 16, -174, -156, 158, -44, 43, 129, -187, -41, 146, 78, 203, 67, -166, -136, -105, 130, 128, 114, 18, -195, -185, 83, -35, 233, 90, 296, -116, -64, -337, 242, 250, -142, -264, 105, -405, -85, -242, -127, -72, -81, 148, -100, 10, -108, 263, -76, 118, -172, 120, 195, -144, -120, -28, 67, -7, 31, 218, -46, -57, 39, 13, -146, 41, 4, -31, 145, -127, -214]
7611b14Q2K81n10K31L14L41n27j58K62k67j95K30K04M8k40k6M5J09j39J31K26
7632B28r4j05Q1k1J76k86J5L34k47r9J95k97M53o28K74K09j49L56k44j64J8j02
7654i7P1L10j25j81l3N1K51m70qK61O4k8N4o3j84J75k26K06nl9J68j8q2k11M8
7679a11M5J12Rm1K5j58L01o8j96M03m37P9K17k39O8k2J2L9p2J23k05J38N01o10
7703h7j59J4J03j09pQ9M79k69J86l22K41j84J34j21J02k2j10j60M51k58j36r4
7725b39K69%r6N9lL28k5n19rJ87R6J09j06o0J19j65R2p5j76K04K22m40Q2K02R
7750F5K07l78K09J12k22L81j97o9k14J11L09J47l19k47L08n8k25J09o1J18P0k60
7772a04k65M41j95J21J17P5k19K08j2j59K21j66L63n52L39l50J77j25K50j99o2
$$ y = [-214, -132, 149, -361, -130, 184, 525, -2, -160, 102, -165, -360, -130, 74, 122, -118, -144, -99, 10, -129, 2, 228, 134, 29, 110, 89, 265, -21, -6, 328, 81, -18, 177, -120, 333, -295, -21, 188, 39, 395, 151, -13, 5, -97, -26, 284, 159, -22, -55, -4, 247, -223, -231, 30, 94, 66, 120, 57, -127, 48, -178, 28, 23, -16, 152, 134, 52, -159, -111, -66, 46, 55, 14, 39, -119, 182, 114, -82, 321, -116, -37, 180, -59, 9, -13, -1, 38, -34, 89, -116, 22, 523, -87, -246, -232, -129, -238, -245, -156, 323, 54, 240, -82, 159, -25, 109, -12, 90, 68, -42, -202, 249, -9, -145, -239, 30, 30, -66, -7, -10, 318, 293, -226, -235, -48, 48, 157, 51, -9, 110, -55, 37, -38, -214, -10, 212, -228, -146, 56, 65, 272, -106, 103, 215, -7, 374, 177, 108, -106, 5, 314, 461, 142, -105, 203, 145, -80, 29, -32, 86, 156, -104, -369, 72, -123, -2, 115, 190, -29, 179, 167, 8, 229, 63, 426, -126, 213, -137, 40, -85, 165, -34, -96]
7793i6p8K3K38p8O3m4pK65k0m29J19k9l5K97o1p9j00J97k17jM0n7L34k14j63L06
7819A74O1Lj06J32M9m21Q9m1p4r0K68k37L7K58r2j30K28m6j54j71N10k27j03L6
7843d7K34k99J63n6j93J51m3n0q3J3J50j6q8k32K41M39j46L8j22j9k4K3L7n1M9
7868F9q8J21O9k41J54P8k51L1N8j26j08M06l28J60p8K10j79kl1m25O22J24l40
7891i5J68r8j8q9L11j52J8j75R7j22J41J38k34J96M8k78J48l13K91j43N6L80p55
7914d80O13j50O0k09J46J2Q2j71l00O32m39M13o18K23K19j4k63K40j43j8L54j24
7936F5l1j62J36K04%p21N09k56J51M55k75j08L47p3l73Q8j33K06j12J66r2K54
7958B45j70q4p6MJ6M15n77K27l2J70j74k12M9J05L35j59k03K49J44l71J72j34
$$ y = [-96, -174, -151, 87, 9, 72, 28, 21, 286, 266, -163, -44, -73, -108, 189, 128, 49, -51, 146, -71, -72, -32, -89, 245, 31, -132, 174, 235, 238, 132, 264, 313, -108, -19, -60, -134, -224, 44, -193, -156, 102, 10, -120, 108, 62, -92, -263, 247, 20, -83, -47, 187, -112, 51, -5, -198, -47, -90, -140, -223, -210, -60, -76, -164, -396, -155, 284, 138, 176, 54, 35, 11, 34, 71, 20, 69, -19, 102, 171, -70, 84, 162, -89, -58, 0, -126, -234, 172, -156, 4, -74, 136, -43, -45, -76, -501, 121, 245, -95, 73, -25, -43, -132, 179, 27, 45, -130, -33, -155, -14, 124, -110, 86, 134, -144, 4, -309, -18, -161, -105, 275, -480, 133, -17, 43, -166, -20, -8, 74, -97, -397, 235, -204, 209, -409, -186, 33, 19, -244, -4, -147, -165, 189, 65, 34, -128, 8, 212, 212, -509, 0, -256, -105, 350, 75, -33, 314, 241, -132, -44, -177, 29, -83, 83, -9, 245, 75, -9, -85, -81, -65, 350, -227, 0, -32, 138, -36, -248, -199, -94, 241, 82, -121, 128, 272, -99, 73, -61]
7980f1L21k31j92K59N2K20k72l61L16J9k1J63k58r0J15K89j4j16k44m1L10l19
8002a56M8K46j35n5R8n1K53j37M6Q8j87r6l3O1N2l1J87j81k42K21J91j80r0J94
8026A11j90l2%N9J64J16j00j15j19J15k98L00q6J56J0k72J06K21k21p5m1N5P5
8049f1k18N10P5k86p3J59k25L75j12j20M95j35k94J26l31J08L08j25j39M3q0p2
8071g2n6J23k02M26l77L33j38k2l22J96j29L73p8j44p9K32J90k10j65P2L42j53
8093A40M0j69r4K99m13J45m54N55o3or7L50j28j29P1j49J11k17N4j8M32n35K80
8116EM7j52l03L53j61L64k57o8Q9M6M9J18j40k2l8j23K03J77l22J18K9j14L31
8139B29l05j46K15j02K15q7p3k17M20k60K25M1k33NJ05N1l91L42q9L98n26J56
$$ y = [-61, 260, 29, -163, 96, 148, 368, 96, -265, 51, 70, 49, 212, -46, -136, -21, 268, 254, 138, -106, -147, 163, -156, -108, 138, 3, -52, 46, -5, 248, 111, 157, 245, 58, -38, -71, -10, 42, 11, 198, 17, -225, -4, 187, 7, -83, 111, -79, -111, -111, -52, 112, 228, 128, 13, -106, 9, -289, 11, -75, 81, 91, -181, -75, 146, -75, -150, -191, -136, -61, -279, 231, 306, 20, -53, 106, -119, 256, 144, 24, 519, 384, 90, 216, -115, -7, 301, 176, 37, 80, 0, -72, -128, -5, -207, 219, -158, 175, 37, 15, -307, -111, -240, 133, 55, -89, -168, 64, 254, 44, -121, -49, 293, 140, 180, 11, -83, 216, -197, -52, -506, 49, -14, -20, -117, 233, 105, -24, 47, -102, 9, -208, -154, -172, 260, -275, 5, 52, -100, -403, -50, -211, 153, -104, -172, -83, -37, 12, 130, -10, -32, -70, -193, 10, 187, -135, -17, 12, -102, 229, -76, -222, -7, -109, 106, 19, -54, -271, 149, -111, 114, 155, -78, -73, 32, 83, -308, 34, -55, 343, -183, -27]
8161b7O4Q9m35K80K06j88K04k64K94m20J36n3J75o7j29K26m3j84J94J57j65j48
8183i8o4P9J52l45Q2K42k50M64
$$ y = [-27, 37, 126, -309, -29, 177, -11, 193, -71, 223, -197, -61, -114, 61, -6, -135, 91, 48, -136, 58, 215, 50, -98, -162, -83, 69, -276, -194, 48, -202, 262]
8191B62
$$ Imaginary data points
##PAGE= N=2
##DATA TABLE= (X++(I..I)), XYDATA
0@%%%%%%qJ6j6J6j6K4l2L4m2N3o1P2q8J04j22J43j66J93k22K52k88L28l71M19
30B22m73N32n94O64p44Q30r23J027j139J261j399J550j714J897k104K332k587
47a362K884l222L612m074M625n300O149p253Q758j0937J4397k0761L6290j43456
61a19650k21351K50554K57485K1425j95434r9353N7635J07332K555o0716k8946
72b8464N6478K6266q4506j11362M1619J51043M8102j35218j13435O9638J49473
83F9634K1022j05595o3364P0070R4590j5734j08101m3969R3892J09012m6413j60103
95h5059n6455J37085J51570l4926j68511q2149R0353J30090K2781o9975n3167
106a8363Q405J5835j8521r379N5123P1399k3714j25469q1102P7859J53610M3584
$$ y = [0, 0, 0, 0, 0, 0, 0, -8, 8, -8, 8, -8, 16, -16, 18, -24, 29, -32, 40, -48, 56, -66, 77, -89, 104, -118, 134, -154, 174, -197, 222, -251, 281, -313, 351, -393, 437, -486, 541, -598, 663, -736, 814, -900, 997, -1107, 1225, -1362, 1522, -1700, 1912, -2162, 2463, -2837, 3312, -3941, 4817, -6120, 8277, -12484, 23806, -119650, -341001, -90447, 167038, 188463, -6971, -106324, -48689, 58643, 61198, 482, -28464, 28014, 54280, -30226, -141588, -99969, 51074, 99176, -36042, -149477, -79839, 69634, 90656, -14939, -78303, -8233, 86357, 70623, -37478, -81447, 12445, 121457, 75044, -85059, -141514, -4429, 147141, 112215, -56296, -138445, -48092, 81998, 104779, 34804, -18363, -9958, 5877, -12644, -22023, 33100, 104499, 80785, -44684, -125786, -47927, 105683, 149267]
118A49267j07705j11881J7537J00604M6656m7375n2448J8148M4851j8434p3477
129c4257k6888O9319P6448k6661j04051m8442O9053R6401R073p1603m9184K8993
141a1799N2161O317k7481q145J3419j3274m6506j8274N0930O5202j1749r3548
153d2747p5012L4565J09871O4664m4463r0348l5343M0136N3771J6934j2549j7824
165A655j9225k4690j6582J4488M2143L1174j6222n2977l3872K2878N6329L5089
177D0188j4271l8709k3674L945J5990Q484j935n055q473j8078j9475K175L3276
190b5612L5872k961m3164l1263K8912P0896L8511l7853p1838k4721M2544N2074
202C1397M271l7086l3642j0808n7K686J8457L7325K1373k9387n7977j3816O3203
$$ y = [149267, 41562, -70319, -52782, 47822, 94478, 47103, -5345, 12803, 57654, 39220, -34257, -61145, 8174, 84622, 57961, -46090, -94532, -25479, 70922, 79995, 8392, -40792, -11799, 40362, 46679, 19198, 11053, 24472, 11198, -35308, -53582, -2652, 62550, 50801, -42747, -117759, -83194, 26677, 91341, 46878, -43470, -78813, -38677, 15094, 32028, 19479, 1655, -17570, -42260, -58842, -44354, -2211, 28963, 12741, -40236, -74108, -51230, 5099, 40188, 25917, -12792, -36466, -32521, -16531, -8047, -9982, -15037, -23510, -41588, -61063, -58888, -25612, 10260, 7299, -35865, -67128, -38216, 32680, 71191, 33338, -38500, -63221, -20677, 31397, 35668, -1418, -35060, -45868, -45925, -43239, -24782, 12543, 33916, 4529, -53448, -67264, -4061]
215d061P9276J0274o2648n3214J0321M1913J5180j6734r843Q102m759l7306l1993
228e5492K3423O6778L4272m2443o8595n857O7769O0140j1540n3475k4969K0977
240A0988K6236j111j5158n338Q64j3747k3890J485M1507L9693j7378o2963l1466
253e0278M3586P0653J7442m9237n4318n366L1911K3215n853j2411J405O28k3052
266a1675k7646J2639N7558M2379k6578o8148l2673L6986N9780J7757l4004m1027
278a4652j1353J0194M413k542Q762J6782o125l6149k4776K7059N6177J9912m0546
291G156n0946l71M7228L5718j6090m4137k2660J2956J8198j493q309N107Q536
304i107j2001k6590n26M1512M3908m687n0697m1317J4308N2658L4557j6377m4252
$$ y = [-4061, 75215, 85489, 22841, -30373, -20052, 21861, 37041, 20307, 10464, 18566, 13807, -23499, -55492, -32069, 34709, 68981, 26538, -42057, -47914, 19855, 79995, 68455, 14980, -9989, 10988, 37224, 36113, 20955, 15617, 16481, 2734, -21156, -19671, 21836, 61529, 44151, -18812, -50278, -6692, 63961, 81403, 32166, -22152, -27518, 4393, 27608, 21755, 9344, 10749, 11377, -11675, -39321, -26682, 30876, 73255, 46677, -21471, -54144, -17158, 42622, 60379, 26375, -14652, -26005, -15811, -11398, -13940, -5178, 11604, 5479, -30670, -55446, -28387, 27790, 47702, 7156, -43790, -44161, 3067, 38785, 22695, -21442, -44102, -31146, -12948, -14441, -22750, -17643, -9107, -21108, -47698, -48224, -6712, 37196, 32509, -18188, -59505, -45197, 7461, 42018, 25641, -18611]
317a8611k6455M941J6910J1175R594J2381j734k6948l1235M685M7578M5990n637
330D2634n3511m1911J4265N0834K6284k4481l9314p723J9266J0744q839j202K1702
343H748J5139j9538l3500N148N1631M0293k5864o4971k4881M5601N4440p283n7267
356a2304l3692K1829L2739j984j8238J1355L4152P44m5592l1130M0998P7350J9790
369I6017o6686p4593M202O5557L7507l1665m5677k176K3868l211k8091L974N0052
382B9078L5322l6015o8820r824P0922O7269j9916p9149l8055M0758N3259m886
394C9943m6308j8197K6652J7545k4104k6400K1038M8656N727n4944m5192L0535
406b5049P3822K3241n8062o7270M026N6255L0693k4582l2589O129K1590j0321
$$ y = [-18611, -45066, -40125, -23215, -12040, -2446, 9935, 8201, -18747, -49982, -45297, 2281, 48271, 42634, -10877, -52788, -38523, 12311, 38595, 14114, -25200, -32923, -13657, -2913, -11752, -12954, 8748, 23887, 4349, -29151, -24003, 27628, 67921, 42057, -22914, -47795, -2194, 52246, 44963, -12304, -45996, -24167, 8572, 6588, -11650, -295, 33857, 34601, -10991, -42121, -1123, 76227, 96017, 29331, -45262, -41060, 24497, 62004, 30339, -15338, -17514, 6354, 3143, -24948, -20974, 29078, 64400, 28385, -40435, -50259, 20663, 87932, 68016, -11133, -49188, -8430, 44829, 39943, -6365, -24562, 2090, 19635, -4469, -30869, -9831, 38825, 44552, -10392, -55584, -25049, 48773, 72014, 13952, -53318, -49292, 6963, 37656, 13074, -19515, -13386, 8204, -2117]
418b117l1635N014N5282M0834l5596p7274k3004O2310O9986r306p2202m3521K5316
431c5913M3101k10k8442k895K9248P818l5980l1637L0116O5701J8586n6341n9662
444e6510J3258O6075L0028m1031n2900j47L7074J3189k4933j6452K1371K3093
456A2115j9026m0014L490N8353M5815k8723o9701k4448M9910N9037q72n0181l3507
469c7752J0337K2401J167p501J1721K1199p425l9055k1107L3244N6497J4000m5400
482A2326n1732j834L9365K9773r175k4750j0085N620J733l718P235K2942J3531
495C1231j8297l1311l412L4456L4827o534m1699l0198J0826L4211J5412j6989
507A2523k6549q240R034R711M510Q287J3133K40j9592j9358J0412L7651K6270
$$ y = [-2117, -33752, -28738, 26544, 67378, 31782, -45492, -68496, -6186, 63800, 54494, -17708, -61229, -35913, 7188, 6978, -21464, -24359, 4889, 12707, -23273, -54910, -24794, 40907, 59493, 3152, -56510, -43252, 22823, 52851, 11820, -41080, -41227, -4153, 9036, -15897, -32349, -10978, 12115, -6911, -46925, -43435, 14918, 60733, 32010, -37691, -62139, -12229, 46808, 45936, -4245, -37752, -27415, -5014, -3847, -11348, 373, 21572, 14147, -24908, -46015, -12771, 43726, 57726, 12326, -39406, -41240, -1875, 27898, 18723, -6027, -16112, -10492, -8759, -12477, -5242, 17700, 31231, 12934, -18377, -21789, 12667, 47494, 40960, -739, -30937, -20111, 14100, 29512, 12523, -14026, -22266, -13232, -3521, 989, 9276, 22409, 22649, 3057, -16301, -5889, 31762, 58032]
520E8032j6807m5783k7199J5956L6066J5095j8231k5882j0192K941M882Q563J8165
533A5606J5997q338k9699k0486J6527M0731K0604k3400m1742j5664K1909K8216
545B0261J768j9569j4435J504N267Q0L727J2762R726j0101k4280j1016K0370L2524
559B8588O269l0996l7045k974L1384K6892m713k4571j5004L632R757P236R273
572G728J1364J913k0609k8080m303L2425L5390m476m4556l7552P995L7662K0993
585A5894j2364j9982k125R441J119m774R786K3148P868k6451l5281J09L8501K9737
599C4626j7802m6319j9453K5072L1881J210k1018q512J1410O946q013k570J9081
612F539K0742r772l6344j8801K6130M3542O868l9343l9541L764L4809K1415q753
$$ y = [58032, 41225, -4558, -31757, -15801, 20265, 35360, 17129, -8753, -18945, -16004, -11122, -2559, 15606, 31603, 23265, -6434, -26920, -10393, 30338, 50942, 27542, -14200, -29864, -7955, 20261, 22029, 2460, -11975, -10471, -5204, -5124, -1397, 11365, 21091, 10990, -13290, -24306, -3936, 28588, 34857, 3861, -33184, -36158, -4774, 22118, 17405, -7166, -22170, -18538, -8781, -1545, 7728, 19092, 21005, 396, -27684, -31987, 438, 35828, 31352, -13204, -50756, -42761, -5099, 15894, 3530, -16452, -18577, -9136, -8017, -12791, -3005, 20143, 28011, 1560, -33721, -33612, 4889, 34626, 16824, -29495, -48948, -23876, 8005, 9215, -11803, -20315, -8905, -1959, -9972, -12542, 6539, 27281, 17509, -18835, -37636, -11506, 32036, 38904, -439, -39980, -36216, -1407, 20008, 11255]
625A1255j5354R60M653p027j0177J2722L0765J3028k6632m2424r050L4787L8588
638C6094l053l7939k6902J0011K6730J1087n810l023M868j300j2971o049J6131
651G874K5699J647l1559l1124N078L5950K1849j8645l4527q334K3628K3065p71
664A9830j1933j149Q112k331j3207k080K2987K1355j3470m2742k4597K2923M2377
677B6075J0712l1366l3674Q98K5803J6484m460m999P385L632j6173j8299R935
690h047L3360J5113k8380m2235r580L0268L1149l752k8941j5177J2036J6652q50
703A616p602O468J4150m228k4274j2423K0160K9253p9l3706k9866P763L5299K1022
717B3553j4992k9154p809J6805J5305j389l686O529L536j5469k0231L014K7679
$$ y = [11255, -4099, -3139, 1514, -5513, -15690, -2968, 27797, 40825, 14193, -28231, -37281, -2494, 36094, 33041, -4898, -31800, -21789, 4941, 16028, 10218, 7195, 12063, 10763, -2208, -8257, 7874, 33573, 35220, 3661, -27463, -22385, 13565, 35414, 16769, -17758, -26092, -2464, 20601, 19830, 7897, 6748, 14860, 12529, -678, -2758, 20229, 41584, 28114, -14628, -39225, -16302, 26075, 36787, 5421, -28253, -27355, -1552, 14932, 10472, 5473, 12858, 16490, 317, -17982, -8047, 25313, 40426, 12046, -30189, -39769, -9501, 21648, 17896, -11045, -26222, -14186, 2466, 1616, -5986, 482, 14632, 10404, -13870, -26293, -6133, 23120, 23041, -10665, -40531, -32768, 2531, 23553, 8561, -20593, -28402, -11597, 3708, 2319, -1367, 5162, 8698, -6771, -27002, -23988, 3691]
730C691K2146j3403l7916k0715J8527L6275J3063k0099k2115K349J5520M074n038
743c641N783J5741J08k4852k4125Q388L4155J7944k2168l8247q540K9818K9537
756A9901m290k4169p457J6539J1997o801p330J2094J5591q867k8741j2730K3078
769a185L1034q98l4539k7100J1369L2634J4697j4506j6820K656J0567j690q468
782b249Q423K1587L998k7164k9735K999L4685K5341j2729l4626j7634J6374K5490
795A4760P131j1701o989N029J092r897n042J3942J7816n270k7355j9671J0782
808a5373K8081J2609j7183k5113l436K0092J8456k160j1271j577N931l260j0239
821d443J278J6153R124j6126k9158q882K1940K9209K243k7535k4088O359K5593
$$ y = [3691, 25837, 12434, -25482, -46197, -27670, 8605, 21668, 1569, -20546, -18197, -2677, 1397, -3641, 2142, 17883, 17991, -6861, -30986, -22598, 11557, 29501, 7333, -30914, -39454, -9636, 19901, 15611, -8558, -16015, 524, 12521, 5720, -1610, 10484, 26075, 17208, -11533, -24263, -1185, 29849, 28951, -5588, -32688, -21319, 11315, 26012, 11506, -5314, -2658, 7909, 6219, -2249, 6174, 27761, 31759, 4595, -25140, -22141, 12544, 37885, 25156, -9470, -27104, -10730, 14760, 21891, 10190, 3201, 8230, 9322, -575, -5617, 8325, 26141, 20871, -6484, -26155, -15373, 12708, 25317, 8134, -16979, -20415, -323, 18133, 15973, 4702, 3125, 9056, 5796, -4443, -3165, 12988, 22112, 5986, -23172, -32054, -10114, 19095, 21338, -6197, -30285, -23926, 1667]
834A667J3659o849q186K098P32j0930q063J0624K1976M316k4083k8694k511K7321
848f923K3681n576k3930j2628J0763J4596L532l706L351M631p430j5485k740J6797
862a067J8643m899k6687j8271J0317K7574J2321j3182k0162l117J3916J2751J94
875H331m591l80j520q254r553M229J8555J1298j3126k6144j1166J7288K8127J0538
889B3632j4932k0132l416J2971J2595J560j628N76m629j4137r847R147K2150R079
903B2989j8005k7553o817K3110K6668K624k0714j4275P212J4843K979o102M56
916G415N988l924j6211q523J3721K1013J969k3781k2886N373K9082J9340r976
929A8600k3150p083J1352J0011m21j653L864l25j3632j5816K213K3716J8949r746
$$ y = [1667, 15326, 8477, 291, 2389, 3121, -7809, -15872, -5248, 16728, 21044, -3039, -31733, -34244, -6923, 16758, 11182, -12748, -25376, -14613, -17, 3515, -191, 3160, 7791, 361, -15124, -17864, -1067, 17576, 12677, -14010, -32281, -21964, 5610, 17931, 4749, -15413, -18530, -4614, 8137, 8331, 3740, 3360, 1840, -6414, -15967, -11738, 6817, 18115, 4989, -21155, -32321, -15033, 13094, 23632, 8700, -11432, -14848, -1877, 10718, 12278, 10650, 11226, 6597, -7540, -17387, -8240, 13910, 22989, 4984, -22569, -29386, -6276, 20392, 23016, 2302, -11973, -4761, 10082, 13061, 6959, 7415, 13403, 9479, -6732, -15255, -1534, 19479, 21448, -2333, -25219, -19846, 9236, 28576, 18600, -4550, -11633, -281, 9730, 9309, 7656, 11520, 11195, -2437, -18253, -16040, 7676, 26625, 16879]
943A6879k9279j6577J6465K9774J0296j5563j8379p86R019K919k910K369P661
956A1888j843j8027j6776P386K5850J6122j4784k8690p538K1718K5953J276j8960
969C575j3035N653Q960r22m741L111O522p025k0586r916J7953K8015M028k7158
983e566k5562P340L1619J8204j2241k1198l910J0303L365p165q87J1930O862j7366
997d272k5390q77K9991K7443q505l3159j7186J7797K8009N449j5853j1424L897
1010d080N128n950p075Q589J5602j669k3515j8011J2697L1450J2272k0436k6060
1023b1058r0K3291J6566o513j4557l148N633j122r156k11J4831J1436j2392k5875
1037b2365p008K4412K9226J459k6365k0933P339K3210J0466p859j0983r94Q67
$$ y = [16879, -12400, -28977, -12512, 17262, 27558, 11995, -6384, -7170, 1849, 4768, 1858, 4227, 11888, 10045, -7982, -24758, -17372, 8478, 24600, 9816, -18874, -26412, -4694, 21259, 22535, 3575, -9460, -3807, 5153, 4231, -510, 2601, 9123, 2098, -18488, -28404, -10451, 17564, 21592, -5566, -31128, -23788, 7831, 26035, 13794, -7404, -11314, -1011, 2354, -4811, -5698, 6232, 13094, -4272, -29662, -30539, -548, 26895, 18390, -14769, -31955, -14158, 13851, 19300, 3447, -7977, -4080, 1048, -4902, -11977, -3388, 12214, 10545, -12970, -30981, -18284, 13166, 25438, 5002, -21058, -21148, 2143, 18709, 12196, -2361, -5509, 124, -998, -10154, -10365, 4466, 15902, 3510, -22365, -29373, -4961, 24265, 25724, -641, -21574, -14235, 8975, 19441, 11582, 599, -395, 472]
1050D72o605o722Q072J8889M696k0965k3759M189K9543K1469j0155k5617r366
1063a5859J5393J6795o42j1330k792N487k074j3204n144J5255J8641m753k6531
1076a0758j5863J6817L0492Q530k0777k1708K261J8505R375o607q281J203K258
1089E447q885j1070O108K0917R839j6624k4526l028K3365K2380k227k0107j2505
1102a0916N481J0323J176m501Q98L567m792j4100o007J3783K0424K654j9897j8941
1116b0848M571K3016J4435p456j7866p096O494P369j141l391R53J085p009j0606
1130a7490Q12J5562J4726n110k0232j1004J2154K2284P622j2788j6193k132P675
1143d114M127j940n32M117k320j2488j0278P263K2041J1616j2813k2377m808J8180
$$ y = [472, -6133, -12855, -4783, 14106, 18802, -2163, -25922, -21733, 7810, 29279, 19124, -6493, -15859, -466, 16329, 15687, 4357, 1565, 7052, 4978, -8226, -13370, 1885, 20526, 15773, -10758, -26621, -9804, 20688, 29218, 8441, -13267, -11006, 7499, 16874, 10267, 1986, 3189, 5447, -3438, -14508, -8400, 12517, 22356, 5732, -18794, -21822, 1543, 23923, 21696, 1589, -10916, -5435, 4888, 6064, 1563, 2461, 6028, 1236, -12864, -18871, -5088, 15336, 17990, -1907, -20848, -16277, 6739, 21174, 13718, -4148, -11244, -4750, 2619, 1478, -1913, -960, 125, -6884, -17490, -16678, -1116, 13610, 8500, -11732, -22736, -10582, 11702, 19324, 6536, -9657, -11789, -4114, 13, -1927, -2459, 1658, -662, -13150, -23428, -16165, 5876, 17492, 4679, -17698, -22506, -4326]
1157d326J9261N31j4521j0542K664N486m35j798L771N466m524j2912o070J1938
1171f011J8475L987j5783j5187K577J6454J0561n177j1173m864K577K447k17J148
1185a86N643J721q621j1199J285J6450J5179k429j7964j2729O965J6593Q038o974
1199A1772j2150n265K306K537J156K284N226N46r741r986L246J7782J4017o133
1213A7597j8163r776Q270J5123M255q856r860j968K457k14j435M515P194j550
1227G589j2924q697R235J9313P066j3563j8026k147J3880J2960k859j1818o600
1240f591K593K302k033j94P694O096o758j4817l980J4347J7490N09j7019j4853
1254a5214J729J3697Q594m325q955l019O27q82j955N463J0632L717j1652j4267
$$ y = [-4326, 14935, 15466, 945, -9597, -6933, -1447, -1882, -3680, 91, 5557, 1033, -11879, -17949, -6011, 12464, 16451, 668, -14519, -11942, 4512, 15073, 9896, -1277, -6141, -3564, -1117, -1334, -186, 5457, 7178, -1443, -12642, -11357, 5093, 20272, 17843, -121, -12850, -5885, 10708, 18746, 11772, -378, -5643, -3337, -800, 356, 2640, 7866, 8412, -1329, -11315, -8069, 9713, 23730, 17597, -566, -10342, -2072, 13051, 17306, 8450, -1410, -3378, -921, -1135, -2570, 1945, 9139, 7589, -5335, -14032, -4797, 14516, 21582, 8019, -10007, -12154, 1726, 14686, 11827, 9, -6591, -3998, -1696, -3729, -3923, 3771, 9867, 3109, -11708, -15688, -1341, 16149, 16658, -361, -15214, -13485, 212, 8806, 4481, -4474, -7493, -6866, -7748, -9703, -4240, 6392, 10109, -1543, -15810]
1268a5810J393J7413J3944n144j8445j1018O619J3756L516q753p210J695L184
1281d860l150l385O975J2532J273j4352j3103O380K0416J1032j1313k0358o230
1294a8143J2186J3008j236r847l917M065k02o327J082J3741J1986p323j9880q182
1308a8989J5973K1629J765j7836j6223K902J4105N116o879n052M143L644p142
1321b844p898O628J7917O750j5049j8791P68J9555J4660o954j8712q546Q626J0321
1335F431m52n731k7M687j667r733j682J4222J4866l679k0198j2342J0018K0291
1349A5004O219j3656j5988j535R485N460l264k581N091L481q101j1407L134J9300
1363A0642J2804j0483k2115p453J4933J7376k93j5121j1345L416Q231J68m470
$$ y = [-15810, -14417, 2996, 16940, 11796, -6649, -17667, -11048, 2708, 6224, -2529, -9739, -8044, -4860, -8010, -11395, -4420, 8112, 9385, -4967, -18070, -11690, 8726, 19758, 8445, -11913, -18143, -5957, 7051, 5815, -4032, -7949, -3884, -4086, -10413, -9331, 4410, 16396, 9073, -10807, -18989, -3016, 18613, 20378, 2542, -13681, -10779, 3326, 8442, 1563, -3489, 654, 4298, -2844, -10742, -4114, 13803, 20553, 5504, -13287, -12519, 7036, 21696, 14742, -3970, -12516, -3890, 6431, 5979, 248, 221, 4908, 3241, -6492, -8174, 6048, 20914, 17235, -2963, -15305, -5287, 15004, 21223, 7567, -8421, -9956, -471, 4989, 1725, -856, 4235, 7716, -385, -11792, -8658, 10642, 23446, 12963, -9152, -16605, -1672, 15704, 15411, 290, -11055, -7639, 592, 760, -3710]
1376c710J944Q107p41j2740q096J1191J9944K652j8691j7614L767J8537R522r008
1390E064j4365k757P554M319m184j607Q378O124r124j4689j02J9373J5702p582
1404A2104k1629j0772J0453J6349L685j0246r259L42M207k96j704O115R245j570
1418G024j3868r913Q657J8495O308j1959j6786l057J1145R434j425p387k984K063
1432d253O71l047J481Q877P565n884j3877m549J2627J5434kj5227j3050K388J2022
1447A176P134l845p152j842J916o56j151N008J0052J866j0758j2930J600J6290
1461F708J1306n970j6055q678O263J0542K871m023l409N43j015m058K42R455J0539
1476A5261k521j4863j0210O953J5879O273r663j4059l463P595P514M10l180j405
$$ y = [-3710, -1766, 6341, 5600, -7140, -15236, -4045, 15899, 18551, -140, -17754, -13987, 4550, 14072, 5064, -9301, -12058, -4504, -185, -4369, -5976, 2402, 8526, -598, -15287, -15389, 3984, 19686, 12104, -9525, -20297, -9844, 6505, 10190, -56, -9315, -8973, -4766, -5062, -6766, -651, 8594, 7024, -6844, -16757, -8100, 10395, 16703, 4744, -12042, -15099, -3954, 5480, 4055, -3332, -6316, -4253, -3582, -6629, -5148, 3729, 11294, 5410, -8467, -13016, -389, 15045, 15043, -184, -13234, -10846, 1176, 8310, 4465, -2687, -4529, -2613, -3269, -4420, 588, 10640, 12506, 1748, -11182, -9582, 6708, 18014, 12044, -4011, -12689, -6426, 4116, 6987, 2964, -445, 98, -917, -4975, -4733, 4722, 15261, 12740, -2123, -12333, -5380, 10499, 16772, 7109, -6950, -10413, -2818, 4696, 5106, 1926, 521]
1490E21n79k120k471L850R383M844p504j2874l296R763J0996R46j0259j0035r01
1505i736O753N879O73j509j535k331l391L25O040R244J345j0326j1896n11J1226
1520B50J0420j765j1467r125J813P923M644k44k099j325j670k884N44O642P798
1535I455j037j1207r830K804J2047P395m829j1464n032M539O566K605l54j002
1549F56r32l138l857K371R871O119n558j3597p306Q035J3435L508q536j0258j499
1564a0686O114O012J641l67j82j958l788l245M081R370L869q145j2903k816R242
1579c761J0608P37q676p066K30O055M530J306R7k82k031m887j873O206R168L91
1595A0752j1083j1331J107J1958Q572l601r893n083M230O548K182r80O72J211
$$ y = [521, -58, -2178, -4649, -799, 8584, 13428, 5924, -6950, -10246, -483, 10513, 11459, 1200, -8835, -9736, -2983, 2896, 3569, 2060, 525, -1806, -5197, -4872, 1168, 10412, 11757, 1431, -10465, -10976, 250, 10670, 8905, -2562, -11687, -9874, -1951, 2693, 2449, 350, -975, -2645, -5529, -4985, 1657, 9455, 8418, -2789, -12619, -9815, 2232, 9627, 4798, -6666, -11698, -7159, -593, 2012, 1658, 656, -276, -3414, -7271, -4900, 4971, 11090, 5532, -8065, -15371, -7336, 6099, 9607, 1071, -9187, -10686, -4572, 1440, 3081, 2714, 2532, 574, -3214, -6459, -2378, 6992, 10861, 2716, -10187, -13003, -3761, 6847, 7584, -1092, -8158, -7928, -1873, 2657, 3963, 4060, 3778, 1747, -3140, -5013, 1193, 10361, 10752, -331, -11662, -10555, 1403, 9975, 6374, -3519, -8602, -4372, 2176, 4358, 3378, 4050, 5261]
1609E261l007o556r85R260R207k731j4179r086N216J2974N527o440q444j832N041
1624g74L017L88J088L092n78p556o433L349J1808O226q846j3909l574J0163J0636
1639H097J21q061m944K436L598L41l15K804L572l235r157m543P200J1398J686
1654A0998j2145j1313J300J1019P938k863o776l006K902J862o5J304M298J385
1668F838o335r334q97J0330R567l121j3567p606N772J1054L772n057n613P79K601
1683h17n49j696L089O351M32r823q976K706J2657P455p717j2745l240Q879R065
1698E071j83n609j881K080j80k813M9O606N593n034j2504m360Q974J2488R70j0597
1714a330r344K664R387M375k581l298J183R06l300l482L538Q607K375r095j1419
$$ y = [5261, 2254, -4302, -5287, 3973, 13180, 10449, -3730, -12816, -7600, 5374, 10901, 4461, -3983, -5815, -774, 2243, 2631, 3719, 6811, 6233, -1323, -7756, -4407, 7401, 13627, 4781, -9128, -12702, -2539, 8097, 8218, 157, -4787, -2351, 1247, 1588, 1273, 4077, 7649, 4414, -4743, -9286, -2086, 9312, 10998, -1147, -12460, -11160, -141, 7797, 4934, -1842, -4848, -1946, -84, -149, 1155, 5453, 6838, 503, -8831, -9728, 602, 10169, 7048, -6519, -14125, -8353, 2701, 6473, 1416, -4197, -3418, -817, -1366, -3062, 27, 6378, 6810, -3013, -11989, -9283, 3374, 10829, 3112, -9633, -12873, -3994, 5071, 4888, -721, -2602, -522, -702, -3515, -3466, 3140, 8733, 3699, -8805, -13165, -4191, 8297, 9267, -1330, -10674, -8010, 1377, 5752, 3171, -127, 1056, 1962, -1338, -4820, -1282, 7325, 9700, 605, -10814]
1729a0814m62J1958R689l038j0881n098M953P361K158k241j631J247j480m165
1743b444j108O658O546k264j0484q170M848J1817N275o525r090q64N918M984m65
1758D632j933J090Q44l365n594Q52Q581N764n522j1791n370Q334J1467J684q268
1773A405p137J479N859K238j286r9K182j251o086m329M485R679K785r777j0772
1788a0625N03J0213Q254k565p520l415L569K912L1o07K956J626m860p592j484
1803h604Q615Q561j952j1103q031M588J0121N301m315o603j605L029J966K29J551
1818A748K010r68o359n448K660Q853N229m873j0067l985O182Q705K490m618m623
1833c064j51J962O89J18K774K518k443p999m222M844J0152L489p667j0076j091
$$ y = [-10814, -11276, 682, 10371, 7333, -3548, -8646, -3693, 3668, 5826, 3585, 1954, 3201, 1721, -2444, -3552, 3106, 9652, 7388, -3096, -11266, -6418, 5399, 10674, 4149, -4941, -5805, 113, 5097, 4632, 2699, 3789, 4633, 1268, -4326, -3474, 5107, 10871, 5349, -6442, -11812, -3478, 7989, 9673, 1405, -5732, -4253, 1606, 3844, 2558, 2459, 4641, 3390, -2696, -7025, -2540, 7139, 9924, 147, -10625, -10122, 91, 8345, 5780, -1740, -5155, -1586, 1326, 1357, 750, 3706, 5332, 472, -7120, -8604, 11, 8572, 6620, -4483, -12514, -7926, 2195, 7496, 3181, -3422, -5027, -1998, -32, 197, 1748, 3758, 2790, -3569, -9017, -6357, 2496, 7725, 2852, -7215, -11200, -5018, 3687, 6177, 1559, -3064, -3215, -1253, -564, -446, 2328, 4846, 2403, -5596, -9818, -4974, 5178, 8667, 1000, -9076, -10167]
1848a0167Q733Q104p08n618l248J348J299k27R63L334J793m684p831j771P879
1863h01Q726k2r410p420K995Q335N140k349m120j539kp14k85L235M905q54p806
1880a986p086K390J0104O779l856r891m519M882Q349K314l202l826n80p34p45
1895a607R26M130L026l079p645m851N117R499M189o031q556j657O061O394P24
1910F640l603k454p70j271j203J966N287J968n509q653j980P953R803O80q736
1925A18p246J744P359M060j898l392j379R3k254j253L277N660N31p118p848N50
1941h996J0178P572k980q744m584L914N843J561j639j110n62k946l005R46O032
1956A480M968l162r245m962N500J0201L979o003p668j344M601M481J95j157r75
$$ y = [-10167, -1434, 6670, 5962, 344, -2904, -1556, -257, -484, 479, 3813, 5606, 922, -6909, -8680, -801, 7925, 7903, -1507, -8927, -5932, 2403, 7543, 5194, 1074, -465, -467, -1181, -1466, 1769, 6674, 5820, -1986, -9072, -6682, 3422, 10201, 6345, -3546, -8065, -3183, 5166, 7480, 4278, 452, -128, -862, -1607, -681, 3449, 6475, 3396, -4249, -9100, -3983, 5516, 9705, 3674, -4882, -6539, -478, 5916, 6640, 3037, 583, -187, -1458, -2661, -695, 4592, 6560, 1051, -7602, -9582, -1629, 8174, 8854, 118, -7128, -5384, 1975, 6035, 4137, 745, -634, -541, -2795, -4048, -771, 4889, 5420, -1698, -9546, -8996, 1182, 8754, 5774, -2970, -7554, -3640, 2203, 3764, 2125, 1015, 453, -2493, -5498, -4552, 1480, 6448, 3286, -5959, -10921, -5421, 4780, 8759, 2756, -4912, -6256, -1655, 2826, 3021, 1864, 889]
1971H89j588l368k055K815O443L282n118q601k541P502R119Q60o803n639J58M304
1987c41L140j36n48p42k395l627j237N170O371Q07p417p676J698Q846O672k616
2003E969p219l642K636L994R40j054J5K92l086l946L64O133O163j637q931n226
2019h235M168R108L893m840o625r67K913J773K39R34R81k024m494l085L228P682
2035D649L722m946q399k317O484P731K77n490m180O02J565P77J45J701P74k816
2051B79m807j754M767P683J656o568p606K52P519N588j429n401l008N27J217O53
2067d32J547J392l60m047m183N84O794N554r80q163n495L885P289K846l954m037
2083a760j235J114L24m72K111K669n07n260m125K200P710M836l709q219k904N382
$$ y = [889, -699, -4067, -6122, -3307, 3136, 6418, 1300, -7301, -9842, -2340, 6779, 7639, 836, -4803, -4645, -341, 2799, 2663, 2115, 1373, -1022, -4649, -5886, -716, 5655, 6462, -955, -8631, -6933, 1913, 8585, 5969, -1250, -4892, -2256, 1738, 2678, 1624, 1639, 1931, -1155, -5101, -4737, 1396, 7559, 5922, -3009, -8235, -4067, 5041, 8934, 4094, -2531, -3498, -585, 1188, 1427, 2361, 3342, 1318, -3176, -6261, -3033, 4649, 8371, 3425, -4974, -7291, -807, 6924, 7201, 1711, -2469, -1867, -302, 475, 620, 2321, 3095, 279, -4528, -6282, -1515, 6168, 7824, 1256, -6350, -6098, 1421, 7009, 5580, 179, -2829, -2302, -1085, -432, 1115, 2507, 2147, -1900, -6083, -5499, 1295, 6849, 5869, -2294, -7789, -3904, 3385, 6231, 2277, -1760, -2995, -1881, -1557, -2029, 82, 2751, 2244, -3016, -7141, -4941, 2769, 7605, 3896, -4323, -7227, -1845]
2099a845O039K17l648k960l40N31o58P60K950K093k258n581k331M572P686J730
2115F957n649o612K29N426L692r73l222j078q82o79j80K070L806R00l873n429
2131e497o69O063O991k35o802n200J549M990L265j385k479j894p39k92L93K854
2147I13L001lm660m785J303P164M752k739o768k964L468M403N45j743k147l29
2163e89p74j301O06L694L607j536o176l741L719P979K531n281o390p40M015L310
2179B933l13j852o90l44j727j180J553N103K731l712o883j393N521O790m33n698
2195D06m339M68L492J581k98o27K15j421k764j157L530N799P15n521o369N52P365
2212A627N214k416o378l019K150L362P56j110L16k56j921k228J28N022M166r78
$$ y = [-1845, 4194, 4411, 763, -2197, -2537, -2006, -2664, -1904, 1046, 3139, 881, -4700, -7031, -2459, 5227, 6957, 1308, -5304, -5075, 351, 4043, 3070, -152, -1230, -2112, -2791, -2971, -901, 2905, 3805, -68, -5497, -6166, -103, 6888, 6653, -149, -5349, -3800, 1190, 4455, 3070, 591, -1303, -2042, -2334, -1941, 913, 3914, 3911, -749, -5534, -4231, 2933, 7685, 4946, -1822, -4786, -1318, 3085, 3630, 1887, -260, -589, -1363, -2664, -2058, 1636, 5243, 3707, -2469, -6210, -2491, 5488, 8019, 2738, -3652, -4392, -377, 2933, 2620, 768, 78, -266, -1993, -3173, -1620, 3483, 6214, 2502, -4381, -5774, -253, 6537, 6104, 406, -3933, -3465, 27, 1608, 1310, 683, 898, -523, -3287, -4444, -914, 4885, 5600, 79, -6290, -5738, 1627, 6841, 4425, -1953, -4972, -2822, 540, 1296, 186, 502, 246, -1675, -3903, -3775, 1247, 5413, 4435]
2228D435p017m206L107P433K412m481n344o62K590J598j40L28J239l31l494k993
2244e526K433O766L454m307p778k019N934O201l15n162l647J024J725O42N7J257
2260G39K095k180m426j285M823O149N84o349n570Q92N759L633j872l733j513M07
2276a847N40M01J499K257L25m000l950P84O372M811k476o759l682K929N495K052
2292D751k598l407p38N65L16P51J751K267j088m130k963K339O182K863l390o329
2308b858k415L655M578J131k606k613q75lP34J401K671J611k954m974j638M664
2324d91N693J024n050n718K7M720L646m93l430j920M30J81m41J980K975L91l263
2341B61m752M52N133M403r74n594l783P98M468K356q94k276q45q85m44J206K624
$$ y = [4435, -2582, -6788, -3681, 3752, 6164, 1683, -3661, -4323, -1733, -135, -275, 53, 1292, 961, -2533, -5526, -3093, 3673, 7127, 2820, -4958, -6977, -1043, 5158, 4843, -319, -3966, -2942, -1217, -575, -518, 739, 2834, 654, -3772, -5057, -234, 5915, 6499, 150, -5420, -4528, 1231, 4864, 2992, -741, -2254, -1847, -1307, -906, 593, 2850, 3175, -825, -4775, -3991, 2381, 7192, 4716, -2043, -5725, -2796, 2699, 4751, 2153, -1254, -1992, -1427, -1111, -360, 1391, 3658, 2570, -1560, -4523, -2184, 3998, 6861, 3471, -2858, -5273, -1618, 2960, 4091, 1485, -1128, -2003, -2006, -1272, 129, 2800, 4411, 1457, -3517, -5155, -491, 5202, 6226, 1176, -4542, -4515, 205, 3851, 3358, -72, -1992, -1562, -1381, -1822, 158, 3133, 3524, 261, -4491, -4039, 1094, 5497, 4523, -1071, -4854, -4056, 412, 2768, 1874, -402, -1247, -2132, -2576, -1370, 1254]
2358A254K726j012m793l242J692N666L630l264n498k559K718L927J012j695j625
2373a063Pm57p60O44L649K295j930n350k739L294O350J715m689n508o80L955L121
2390A854K23j631j150Q6j327q31K482M094J162m474n401n33N721N198j273n468
2406a268l570J450L956J216j020o62Q35r25k459l31L580M452j163n149m469K200
2422c327N752L162l055n003j199J933K730L27QJ12k48k296k308K027M535K284
2438E434l017n598j677L575N094O25l582l547K58J760J074L16J208P12j868l012
2454b245j178L586M123P04m298m647l23M019L702P1l591k441J52J539J158Q75
2470A206Q62j93k909k059K26M165L420j301m265l707J276M174K509j171l108j815
$$ y = [1254, 3980, 2968, -1825, -5067, -3375, 2291, 5921, 2657, -2841, -5400, -2682, 1245, 2257, 562, -1063, -1056, -1513, -2273, -1629, 2020, 4315, 2385, -2965, -5704, -2410, 3940, 5655, 966, -4542, -5222, -1267, 1854, 2077, 446, -704, -618, -1945, -2776, -294, 3800, 4962, 488, -4913, -5446, 275, 5473, 4200, -1268, -4838, -3388, 568, 1784, 764, 102, 937, 12, -2447, -2778, 802, 5254, 4091, -1058, -5527, -3327, 2425, 5587, 2532, -2471, -3670, -1737, 993, 1320, 1328, 1440, 1192, -1104, -3412, -1385, 3150, 5434, 2417, -3181, -4858, -1283, 3811, 4436, 854, -2693, -2435, -675, 399, 715, 1923, 2635, 767, -2245, -3423, 163, 4286, 4990, 692, -3955, -4278, -259, 3443, 3514, -77, -2518, -2366, -827, 331, 1206, 2068, 1875, -1034, -3093, -2867, 1298, 4718, 3417, -848, -4555, -3279, 895, 3404, 2233, -875, -2690]
2486b690Q74O40J376J422P75j010l233j746J436M328K135j965m853k258K342L650
2502A223K066j664l015j234M12J483J760Q80K67j666k867j093K260L648J543k966
2518A037m095j675K896L458J252k118k679m33N55J677J205Q06J36k007k520j027
2534c532K839L752J004l942m234j85L698L563r8k779j864m3J158J012P47R32m18
2551A610j661l128J28L729L413r49m620l027J436M478K078j806k246m14K21K43
2567e15J49J669K072j092l673k748J664M904K434k900m847j182K924L516N62k262
2583F75j257L82k1o23O02K362J383k146m235j415L555M135O81l953l612N72L246
2600C31J730n91j113M5j87j175p69J786L240o8l391l989N75M350L481j635l974
$$ y = [-2690, -1816, -1176, 200, 1622, 2397, 1387, -1846, -3592, -2156, 2172, 4307, 2342, -2511, -4769, -2427, 1223, 3289, 1625, -1390, -2624, -2212, -729, 1031, 1911, 2178, 512, -2355, -3448, -1188, 2460, 4003, 1037, -3058, -4733, -1837, 1621, 2873, 755, -1924, -2357, -1802, -125, 1080, 1886, 2022, 15, -2505, -3532, -693, 3059, 4063, 121, -4113, -4298, -600, 2963, 2865, 86, -1778, -1821, -663, 349, 1096, 2028, 1610, -51, -3179, -3051, 678, 4091, 3142, -1478, -4505, -3069, 1409, 3487, 1681, -565, -979, -758, -515, -366, 1303, 3375, 2283, -1390, -4138, -2474, 2430, 4864, 1964, -2883, -4065, -1141, 2375, 2937, 675, -582, -200, -221, -844, -242, 2120, 3503, 1357, -2878, -4293, -738, 3397, 4078, 125, -3487, -2915, 331, 2061, 1470, 357, 402, 215, -960, -1729, 57, 3297, 3229, -162, -4151, -3576, 774, 4255, 2620, -1354]
2617a354k264J933K216J270j058l88M4p14j514J88L048K186j292m132k670K067
2633b434M080J981k748k981n59J341J583P02K31K54r90k201r76J614L626J375
2649C898k881m293p03K906L727K77k659k464N0J572R88O59M71m49j255k049n2
2666b257K244L105l85l089k924N25K843K568k20k300j879n0J079J263J012J97
2682A732q01j897j471O45L065J949q98l604j949O21L444K172q59k746j181P12
2698a066J053P17R29l9p09j940j524J047K869K101j648l234k134J413L864J660
2714C359j516k594j025Q41J015J012O31j1j249k034j140J557L369J215k646l630
2730b846n09K840L477o1k428j835L90R47K43J55J038P96k171k495l79K575L548
$$ y = [-1354, -3618, -1685, 531, 1801, 743, 355, 399, -315, -1829, -1641, 1407, 3593, 2301, -1831, -4501, -2434, 1646, 3627, 879, -2102, -2661, -1320, 263, 965, 1196, 1450, 460, -1741, -2717, -1103, 2523, 3898, 1017, -3276, -3979, -1073, 2654, 2931, 272, -2192, -2142, -570, 418, 1077, 1548, 1099, -156, -2205, -2257, -13, 3092, 2707, -382, -3306, -2781, 62, 2630, 2410, 110, -1769, -1819, -740, 523, 1535, 1732, 931, -966, -2437, -1792, 1273, 3222, 2324, -1280, -3229, -2608, 836, 3008, 2149, -597, -1778, -1066, -13, 704, 1633, 1594, 885, -1055, -2579, -1532, 1337, 3438, 1790, -1444, -3578, -2165, 1699, 3359, 1843, -751, -1776, -935, 80, 1092, 1723, 1712, 463, -1571, -2711, -1154, 2215, 3430, 784, -2846, -3355, -515, 2962, 2901, 473, -1362, -972, -25, 218, 373, 1411, 2207, 36, -2459, -2838, -263, 3285]
2747C285l30l180l242L15L798K060o26k305q78K94J52K24Q20J890l20k795k679
2764c517Q56L429K841j565l776j716J481L366Q24j139j557J49l06o65J86K077
2780I68J995j824l277j860K333L691J282k561l492l01K346K211J26j114n41o37
2796f55l41o01J406K716L86l045l164j4L500K874l37k963k245O83K053J094j89
2813A158k27n84j245j078L11K322K470j170k941k754J724L027K057j224k460j670
2829b284O79J491J206P29p50r20j471q89J577K490Q94j934l041m63J731K337J095
2846B477r47k185j264P80J525J002j1l49j315j659j33J879K260N41k245k943k44
2863b831K059K645J069j736k599p44J103J827N64J99q53j307j093J87J535K243
$$ y = [3285, 2955, -225, -3467, -3152, 646, 2706, 2080, -225, -1103, -809, -657, -433, 387, 2277, 1957, -838, -3517, -2661, 768, 3609, 2044, -1732, -3448, -1967, 1399, 2223, 1084, -473, -324, -630, -1295, -1109, 968, 2963, 1139, -2138, -3998, -1665, 2026, 3308, 747, -2745, -3046, -700, 1511, 1637, 523, -18, -655, -996, -1597, -191, 2525, 2911, -134, -3298, -3312, 188, 3062, 2725, -238, -2483, -1800, 253, 1347, 1158, 931, 347, -898, -1976, -1665, 657, 3127, 1957, -984, -3738, -2014, 1013, 3070, 1846, -614, -2284, -1605, -114, 1092, 1821, 1071, 151, -1320, -2209, -632, 1858, 2752, 818, -2223, -2686, -955, 1382, 2477, 1530, -655, -1919, -1139, 386, 1388, 1377, 1028, -287, -1946, -2079, -200, 2060, 2601, 356, -2587, -2831, -772, 1873, 2942, 1206, -1393, -2137, -1034, 793, 1357, 1556, 703, -604, -1697, -1510, 25, 2268]
2879B268j50k305k533L35K406K577l5k210k173n6J488J289L03j49o53j330j159
2896b087O16K286J607k99l122k152O81L580K099r99l024j449R74J414P82J16k31
2913G92o02j497j210J521K353J509j773l114j147K078K818J308j804k398n90J197
2929e59N66O88K11K58j237j530r65J732L328L44k710l073K16K798K500m73k519
2946d25j397O08R01N60J75N67K10j795k050J60L019K598j031l199k277J582K769
2963I75J053p43j680n81Q4M60L28J039Q01o10k257j934J506L625J369k477k901
2980a943p77K049K287L78j277j344k79Lj62J046J338M94j496k494k03K284K551
2997B455j2k223k121P6J793J500n41m97o14l39n69j1J557J527l57k252j897L27
$$ y = [2268, 2118, -187, -2720, -2385, 21, 2598, 2563, 353, -1820, -1876, -388, 901, 1204, 1055, 402, -928, -2087, -1471, 815, 2422, 2123, -999, -3151, -2470, 1110, 3209, 2210, -814, -2263, -1289, 125, 907, 1023, 792, 190, -1307, -2517, -996, 1357, 2866, 1093, -2021, -3168, -1090, 1728, 3036, 1232, -1166, -1756, -559, 7, 695, 906, 1164, -73, -1603, -2568, -836, 2492, 2836, 126, -2947, -2731, 67, 2567, 2094, -425, -1822, -1214, -313, 247, 422, 989, 1199, -596, -2646, -2486, 533, 3131, 2100, -1099, -3376, -1794, 975, 2028, 1285, -395, -976, -892, -432, -104, 935, 1736, 1126, -1131, -3065, -1559, 2066, 3435, 958, -1943, -2720, -671, 1616, 1994, 717, -627, -906, -903, -1065, -19, 1319, 1813, 317, -2177, -2380, -96, 2455, 2443, 220, -1901, -1825, -32, 1468, 927, 430, -184, -523, -1092, -1103, 454, 1981, 1624, -628, -2525, -2198]
3015b198K929K097p83k492j480P97J539P51J03j148n25p85j75M59J673J230p36
3032A256k551j361J446K189J290r14k206p60Q33J213Q40k29p27o32j044k54J485
3049a26J494P24j761k077p17J554K428P82j852j862j18Q73J105O15l06n74p77
3066e95n74R5J214J057L25j145k360p2J541K483J23k126j458j35J272J546k74
3083I17l85n03j038k74J59J745J255l5k321j593J70K782J425q65j940j086M69
3100a118J229N71l57R0O6r42p66j65K186J501p17k814j226J315K429Q89j243j882
3118i54l85R67P97J06N73m05o77j090n78J084K131O66j676k607m03K218J914%
3136A681j326j229OM65N04M25K67K89j381j415m0J831K109K69k629k265Q55J745
$$ y = [-2198, 731, 2828, 2045, -447, -1927, -1130, 409, 1160, 1263, 115, -410, -1195, -1370, -911, 762, 1992, 1256, -1295, -2656, -1210, 979, 2269, 1355, -851, -1611, -778, 435, 1275, 1046, 319, -313, -1357, -1611, -126, 1368, 2092, 331, -1746, -2463, -909, 1519, 2301, 449, -1413, -1531, -658, 447, 1062, 756, 182, -595, -1169, -1074, 140, 1197, 1522, 377, -1983, -2055, -514, 1969, 2092, -34, -1492, -1627, -355, 1191, 917, 532, 29, -1009, -1283, -1124, 621, 1876, 1841, -480, -2073, -1903, 879, 2304, 1439, -501, -1587, -1118, 111, 682, 325, 415, 481, -461, -1227, -1392, 794, 2295, 1578, -1236, -2462, -1147, 1282, 2171, 928, -954, -1339, -372, 425, 531, 1104, 699, 22, -1068, -1646, -562, 1569, 2235, 559, -2048, -2451, -233, 1681, 1681, 355, -874, -868, -403, 101, 526, 793, 1082, -299, -1714, -1754, 77, 2186, 2455, -174, -2439, -1584, 161]
3154A61J452l22j644p70J03M57M45J025L75m47j839r27N05K113J834j183k338
3171a000j128J231J820O00n14j156l23m24n3P61R05O68p74j683j039J141K438
3188A470R70j433k103r03J526J421L01n38q76n29k36M87P16J210j20j257j622
3205a516l89J726J996J89j795k020K29J353J301K80q61p38p87j48O98J023J113
3222A654m92j723j362K14K432J208j07k062j383J07J545J138K98j231p96m57l3
3239a050O16J424M51p39j886p34J111K019O84m55k456n35N15J669N27k74q08k15
3257a36j087L66O90J478M98j245k218l55J351K070N65j416k184l59J374J525K42
3274A159m49p41r33j80K45J002J653j16j786j811K65J989J662k04j718j495K88
$$ y = [161, 1613, 1291, -353, -1123, -1020, -563, -118, 907, 1282, 835, -1004, -1931, -1426, 687, 2521, 1338, -1000, -2128, -897, 923, 1523, 1009, -147, -470, -894, -947, -186, 719, 1387, 613, -1070, -2109, -968, 1470, 2440, 1007, -1096, -1999, -473, 948, 1249, 711, -165, -694, -930, -443, 273, 1483, 1363, 106, -1516, -1905, -179, 1817, 2006, 211, -1809, -1580, -227, 1074, 1354, 493, -245, -1032, -1180, -482, 541, 1654, 1162, -561, -1923, -1709, 723, 1931, 1824, -238, -1621, -1514, 31, 1169, 1467, 236, -560, -1017, -1050, -434, 990, 1441, 702, -1184, -1918, -807, 1212, 1896, 1441, -1015, -1550, -1035, 634, 1161, 887, 79, -136, -1223, -857, -167, 1311, 1809, 564, -1654, -2009, -658, 1412, 1977, 561, -1623, -1982, -608, 917, 1159, 710, -31, -964, -1144, -899, 103, 1756, 1640, -146, -1957, -1692, 297, 1959, 1755, 37, -1458, -1170]
3291a170R86R61%Mq16l56j113N59J712J081o95j917j396O77K211J231p36j738
3309e15q14N12Q87O67%j87p45p48n75R43K019M04j133k088n49J359K025M97j193
3328G66j859k90P07N03J123j02k09q42q89j53Q93K055J59j936j905J22J870J532
3346A545m6j271j120j5O88L63O53K00n24r21r39O48J369J228n53j967j031L99
3364a294J348J442k77j424p47n5O60P57M20J98p25j237r49J285J556Q27p99k037
3382a051o91Q12J843L44m68j066o61l22J124N58M55J55j031j116m61J346J631
3399A401O8j151j461l04R51J440N61j153p69q67N24M33Q74N44j47j177j475K83
3417a425J569J293M2j763j325K31J469J057J73j383o49N3K55K90O57N94o00j211
$$ y = [-1170, -184, 777, 777, 781, -35, -391, -1504, -945, 767, 1848, 1153, -764, -2160, -1483, 728, 1959, 1223, -515, -1329, -817, 70, 737, 737, 550, -195, -943, -1518, -575, 1444, 1848, 715, -1373, -1922, -563, 1462, 1959, 766, -1093, -1383, -676, -173, 950, 848, 639, -203, -1092, -1245, -352, 1703, 1862, -74, -1979, -1857, 13, 1545, 1499, 228, -892, -907, -219, 144, 797, 997, 473, -448, -1387, -739, 630, 1858, 1305, -662, -1693, -1294, 54, 1496, 1219, -205, -952, -1007, -347, 410, 830, 1028, 303, -934, -1883, -598, 958, 1785, 986, -1051, -1742, -930, 913, 1257, 789, -277, -938, -1260, -136, 422, 877, 1032, 1, -1115, -1576, -230, 1401, 1469, 318, -1143, -1447, -496, 944, 1505, 352, -417, -1284, -760, -327, 547, 1091, 944, -233, -1708, -1425, 144, 1437, 1479, -284, -1609, -1378, 91, 1148, 1321, -62, -711, -658, -403, -113, 544, 1138, 538, -673]
3435f73j126O22K163O73n29j614j204O90J182R82k74q42n95k77N8J151N18N31
3453A436j229j055p40R93J662Q13j461j251p31O78J722M09o11q01o13J79J0Q38
3471B48Q64k31o99j672l1J324J567K02j549j651K66Q21J295K51n06n94n01p7K31
3490d42J018Q86n24j428j365P74J709J100r22r76r55M69P40P13j49o07j99p05
3508h63o6L43J262N76n18j578p18P22J457J029o89j615k94J76J080M23j47r4o19
3527a33q60k2Q98J209M42j360j070m49R19J701k8q45j388K08M05P17L42J12m30
3546C68o83q72M72J139O55K30j220j417o2J615J091k42j119r05L2N13N30M90J55
3565G70n20q30n43O34J048Q01o87j183q87O12J181R88p28q83l69K7K70K90P93
$$ y = [-673, -1799, -1177, 986, 1659, 1130, -484, -1688, -998, 184, 1166, 892, 50, -545, -822, -764, 387, 905, 1436, 207, -848, -1588, -595, 1067, 1880, 419, -832, -1563, -885, 837, 1246, 635, -166, -779, -600, -590, 248, 1112, 881, 182, -1490, -1521, -197, 1370, 1572, 23, -1628, -1362, -541, 754, 1005, 499, -95, -596, -673, -442, 576, 1462, 938, -490, -1855, -1081, 628, 1728, 806, -170, -1125, -656, 84, 797, 648, 41, -158, -863, -929, -586, 676, 1252, 734, -844, -1562, -840, 617, 1646, 957, -658, -952, -776, 304, 727, 580, 486, -133, -993, -1015, -117, 1092, 1534, 174, -896, -1345, -426, 1275, 1247, 402, -986, -778, -373, 344, 686, 798, 368, -315, -1187, -715, 424, 1079, 1309, 89, -1328, -1390, 225, 1316, 1074, -45, -950, -918, -405, 125, 615, 770, 250, -580, -1123, -489, 559, 1360, 673, -510, -1397, -785, 396, 1384, 656, -227, -596, -569, -299, -9, 784]
3584G84J11o76p86n46Q11J132O08p45j643n86Q93J596L7k52q16q68N06J47P16
3603D23K59k9q04r44K52R63R72O8j098j345m3J055J112j15l62p19m13L20J77N61
3623B90N25j67j039p26M11J001R91O7j856p92K39J397N23M2o70r85K06j90P85
3642E2L06N33m85q56m57L32J501M60o78j375o05Q13Q46L88r7p45k42r03Q37K44
3662a31J075Jo55j429l90J480J237J68j009j344k29R99Q60L98n09m06p53j2N67
3681h2J85Q21m60p88o72m6J180Q13j38r84p18j41R11N13K51q7p46m85n11Q45J165
3702H26L41o39j086q19M64J181P20J7j718k81O01J66P20J19k76o44o04M6J069
3721B03K25J079q19j451m25N28J591J05n61r14p22O80M57P41j20M2j183k68J39
$$ y = [784, 895, 219, -567, -1113, -302, 830, 1438, 693, -950, -1536, -643, 953, 990, 738, -78, -946, -440, -293, 423, 682, 653, -151, -1095, -843, 120, 1092, 1160, 62, -1283, -1326, -271, 841, 726, 364, -355, -768, -448, -271, 290, 815, 648, -391, -1117, -706, 295, 1286, 1353, -503, -1295, -1056, 341, 864, 906, 236, -749, -543, -733, 52, 358, 891, 406, -450, -907, -575, 926, 1386, 708, -667, -1272, -459, 387, 775, 678, -67, -309, -1212, -375, -131, 944, 945, 290, -1139, -1529, -49, 1188, 1356, 347, -997, -1226, -227, 633, 1031, 522, 116, -637, -649, -82, 103, 924, 464, -324, -996, -1042, 138, 951, 813, -171, -889, -1030, -119, 394, 645, 558, -188, -673, -1184, -339, 826, 1167, 528, -558, -1377, -913, 268, 988, 1005, -713, -994, -393, -227, 493, 612, 336, -308, -912, -866, 203, 428, 1507, 688, -763, -1188, -660, 931, 1036, 475, -439, -1161, -481, -24, 717, 597, 639, -544, -812, -673]
3740f73J223L92K64j369q38l94J454J011J47j014j042l84R22O92J92o9n42l10
3758c38l71M58P24O91q9j081j205K78O73J487l42m66j262L24m7Q74L78Q4q14r20
3778i64J90N49P17Q18o99j311o07P14R80P66k43r96p02p8R07O06Q7P8q67j029
3798a084L33N66J211K03r77j164n19R43R63O66n79q47o19RO60Q54J52l69p79p72
3818a149L40J085Q13J52j229j139n8R28J051q5m39j016R2J73M29P22R7n52n06
3837b91q28O00J335L67m27j219o50J57J191P10Mq55j063LM32P06Q23j9j070q96
3857i90p5Q42P24P83p70j066l02M35Q05O06m13q04j53o55N84Q00M42j87n42r55
3877h91J41R43P94j59q68r47j29Q08J007L01p85o00m7j55M33Q86j4n7j073m70
$$ y = [-673, 550, 942, 1206, -163, -1001, -1395, 59, 1070, 1217, 203, -839, -1223, -301, 391, 583, 514, -28, -338, -709, -251, 473, 1164, 1075, -6, -1211, -933, -260, 1227, 885, 419, -843, -519, -566, 308, 686, 770, -44, -964, -774, -225, 492, 1310, 611, -700, -1307, -593, 387, 1153, 910, -86, -788, -866, 41, 647, 734, 812, -55, -1084, -751, -185, 1026, 1229, 252, -912, -1431, -488, 475, 1141, 562, -285, -904, -895, -235, 619, 771, 402, -377, -1149, -809, 276, 1089, 1241, 12, -1127, -1185, -257, 794, 709, 270, -746, -654, -481, -52, 670, 767, 215, -291, -1119, -519, 816, 1183, 756, -463, -1113, -956, 235, 945, 949, 94, -969, -966, -534, 172, 995, 976, -94, -990, -1065, -223, 501, 1284, 514, -552, -854, -419, 386, 992, 579, -225, -378, -1033, -449, 351, 793, 606, 64, -891, -750, 193, 987, 828, -40, -987, -1116, -308, 699, 1000, 215, -385, -432, -587, -154, 732, 718, 661, -412, -882]
3897h82L30J033J018p57q71p85K65O25O48N9k83o97m53r6P86Q70N03o89j047o32
3917a055N31Q17P40j49j236n18L95P18M66j29k54p63l14L70L62Q57K46j052q35
3936h03l57R52P05L59o40o69l17J57Q15L03K11n66o62q1J79P97M71q4q71p20K1
3957h00M87J294k25q23n83p6M33N81K7K70n29p88K78J28Q94N20m70j039o69P22
3977c68L87Q51k23j178k61M43m6P86M14j57o65n17K4M98L48M15k08j201m72Q46
3997b84P16M60n34p46l14N2R98K75Q2l69n55r05M74O34Q84M4j023o24k4O05J034
4018H80J2m30o08o60M27M29K14N30k05p07r31K46J048N22q8q71j073N22P75P64
4038G96k94l80l74n19K07P63L33j53k72m48n59K72J046M94m82r13l08L40P14M07
$$ y = [-882, -552, 481, 1499, 742, -129, -914, -649, -24, 624, 683, 400, -297, -750, -846, -60, 810, 1313, 624, -423, -1055, -524, 293, 1033, 884, -352, -870, -475, 243, 709, 580, 326, -437, -751, -381, -19, 838, 1084, 32, -803, -1160, -208, 497, 856, 216, -453, -770, -613, 202, 505, 716, 150, -512, -593, -414, 383, 854, 770, -101, -821, -800, -313, 981, 756, -67, -650, -726, -293, 288, 315, 585, 56, -732, -454, -326, 568, 1088, 618, -421, -1090, -368, 19, 870, 647, -531, -792, -349, -395, 391, 805, 648, -17, -534, -510, -12, 336, 751, 543, -658, -1130, -284, 432, 892, 358, -388, -702, -650, 348, 623, 705, 336, -219, -1124, -650, -16, 868, 912, -111, -735, -759, -154, 880, 892, 462, -146, -806, -379, 50, 264, 794, 589, -118, -1049, -803, 245, 767, 679, -192, -1265, -743, 32, 796, 502, 122, -252, -771, -564, 199, 532, 379, 107, -341, -900, -628, 418, 912, 430, -483, -791, -451, 263, 670]
4058F70j58k18p71j74L29O38O03k90p25p40K0N89Q31J59m55j056r8O97O55L5j50
4079C91n54l08J80k8P43L60m52o24p37L22P46O72R5q99p23P2M81R45k87k51N0
4100A94o14k13N08M03N33k21r62m63M09O30P22k76o24j241N44P88M36J46p38r5
4120a34l40p3N09P92J33o16r66l05P72P18M30l98o28m39L3M90M82K87p43m63m40
4141h99L19O61Q20l04p62o78qQ30O36J21k81j226m2P57J08N99k6n76n18L2j00
4162e37P25P24k72p70q64K47O96Q04N6o56o84l4M88L62J96J06m82j032K58M09
4182b60Q55J05j76j000m61N28Q11N32m45o31o89J96O67M53R3L2n18q67K3N91O89
4203E28K89n50p81j47K17P97N21l62q79l05pR04lJ98k90o36l82J07Q31R84n58
$$ y = [670, 512, 294, -477, -651, -322, 316, 919, 629, -96, -836, -816, -227, 604, 763, 308, -748, -846, -149, 506, 541, 391, -163, -471, -291, -319, 424, 784, 332, -292, -1029, -707, 39, 711, 806, -93, -816, -744, -263, 682, 395, 144, 194, -420, -633, -125, 278, 811, 590, -372, -835, -426, 204, 926, 650, 26, -1215, -671, 117, 553, 699, -39, -134, -474, -547, -38, 754, 887, 271, -695, -1000, -228, 490, 920, 522, -106, -545, -512, -22, 460, 747, 4, -459, -899, -580, 81, 901, 597, -165, -843, -851, -21, 615, 736, 455, -771, -813, -56, 52, 651, 625, 49, -469, -437, -537, 188, 912, 640, -130, -994, -747, -51, 753, 809, 153, -531, -565, -77, 285, 481, 587, 105, -927, -669, -260, 595, 700, 524, -476, -937, -409, 402, 934, 489, -142, -831, -635, 32, 485, 578, 610, 92, -775, -752, -161, 528, 817, 267, -514, -661, -444, 353, 874, 512, -367, -672, -679, 225, 222, 420, 130, -506, -888, -781, 50, 1034, 476]
4224D76o30n90J13M55M06O05n26n13n02M21L94M97n7k61p15j83N54M90O46m73
4244F07p75o44J78N31P07o6q46L3j44M50P25j72j4n58p18k3O49O90M05j174j25
4265b84k36j22J299J31m00o42p6k93K57N39O25m12n34o15N0O44P05J90p29o66
4285e69k40M62Q28M97p32j82m64L1N14N18p3j45p04k69P7O17O69m56k70o34l85
4306i10N30J104l26n33p7l05J30N02K64J48l50p37l27P74M43M46m05r09M3l19
4326h14J344M47l70m69l82k93L93L96K84n3p71l16J0L96P00K50l84r44j12M24
4346b64N07K08p2l01o22O9j35O44Q94n39k65q93m3R70P7K08m75m37k69O59N56
4367D77K72j91r39J81k90M76K91K75l76n36n00K88J075j01ml63m99j0K84L98N53
$$ y = [476, -154, -744, -631, -176, 230, 835, 309, -204, -706, -285, 109, 606, 549, 288, -427, -610, -56, 434, 1080, 607, -168, -812, -634, -103, 604, 538, -308, -275, -419, 31, 756, 584, 570, 12, -706, -729, -80, 610, 1015, -159, -284, -520, -642, 657, 788, 388, -254, -330, -623, -366, 173, 798, 386, -148, -763, -713, -69, 636, 826, 97, -569, -809, -347, 481, 978, 246, 64, -400, -369, 145, 663, 590, 445, -259, -528, -451, 166, 835, 379, 109, -525, -910, -380, 724, 398, -135, -212, -517, -387, 115, 379, 527, 177, -560, -887, -113, 330, 776, 371, -538, -495, -814, 530, 977, 607, 138, -244, -537, -144, 252, 536, 483, -288, -604, -594, -198, 502, 752, 368, -576, -688, -264, 243, 451, 379, 78, -544, -475, -610, 34, 928, 389, 124, -769, -812, 158, 235, 443, -32, -469, -738, -79, 477, 749, 558, -381, -200, -490, -14, 277, 552, 176, -360, -860, -572, 503, 402, 398, 35, -464, -474, -190, 208, 761]
4388G61n01m17l28j25M14O30L59p96m11k12O47K62L5Q5n74o65M07L08M09N19n40
4409B67q36Q3j32M87Q41m57k88n66O3L22P67J61n13m91K4j16M90N20k34m22o03
4430f33j81N53K79N52o0p14j85j6P67L98Q0n08q88k37P81L77K92k20l54n44k34
4451f95L26J073O9l86n83j56K04O07M8q1p9p67j48M26N49K62l4q04k60j99O28
4472@O46k46k76l91m02L99N54K22o8n83l52j59P55kJ30K76n83m74k3Q25O35k64
4494F19n68n66O0M79K17M76n75m35k31N0L15O00J00p26l46m02P32L66K64jp30
4515c02j74N2K36O19K63o81l38n0o1O17J57N4k32l37o33N76O21N3j58n65j80N8
4537d05P07k2l6nn11k05M62n2N44j64k15q27J71M27P19K04p38m11k96M33O49o1
$$ y = [761, 260, -157, -485, -610, -196, 434, 793, -3, -414, -626, 21, 283, 318, 403, -171, -836, -429, -121, 288, 807, 267, -569, -486, -618, -131, 710, 253, -35, -601, -538, -216, 551, 712, 199, -292, -268, -384, 106, 626, 392, -30, -633, -814, -261, 18, 570, 510, -204, -389, -405, 362, 760, 840, 332, -556, -793, -12, 365, 657, 437, 83, -461, -695, -369, 704, 773, 387, -196, -352, -148, 459, 507, 426, 347, -420, -568, -142, 407, 669, 635, -169, -429, -628, 0, 646, 400, 124, -267, -669, -270, 284, 506, 438, -145, -497, -656, 99, 97, 227, 503, -80, -554, -577, 248, 883, 619, 51, -515, -455, 24, 241, 717, 142, -293, -524, -474, -159, 441, 541, -185, -531, -933, -201, 165, 429, 428, -302, -476, -424, -188, 431, 694, 13, -325, -375, -436, 181, 338, 392, 160, -177, -810, -234, 387, 440, 282, -283, -463, -405, 302, 280, 244, 239, -272, -477, -15, -67, 477, 313, 98, -729, -558, -131, 588, 792, 54, -357, -653, -220, 429, 368]
4559C68m48j18o2m9K71J05M00j37n87n02M19O93M9J03n78m70o6N91M81r3j59l68
4581a57j90k08K96Q18j13j31j016L35J96M98J95k32n28m14K53M37M38l18j37k48
4601b26kj53N51N12m77k18m04l4K54L39L48j25p19k34J23Q86M1m57q8l6m82L67
4623b34K81M57j73l32m92M4K57P43K65q18J75l68p1K40M69j47l85l14k1l7Q04
4644C43J27op25n07L77N39qJ44l75l8k50K21L85L52l29m69r6k82O47M71kk10o97
4667c88l8L74L19M23o78p1l37K80L84K33j2oo21m27L17J37M13J81q11j1k60O27
4689B8J88L21k90n40l40J47N31M63p3l38j31k88K94K21M82m57l88m37L4O68K97
$$ y = [368, -80, -198, -260, -309, -38, 67, 467, 330, -257, -759, -340, 353, 402, 505, -73, -543, -609, -18, 463, 370, 211, -157, -347, -555, -259, 559, 446, 315, -701, -366, -170, 328, 523, 291, -237, -651, -398, 39, 477, 159, 22, -226, -228, -381, 170, 682, 205, -13, -417, -451, -197, 142, 490, 365, -354, -588, -465, 421, 462, 5, -83, -119, -601, -234, 47, 504, 331, -1, -493, -449, -192, 551, 816, -2, 173, -195, -266, -26, 443, 296, -89, -403, -424, -461, 343, 470, 464, -261, -768, -391, 148, 140, 284, -91, -129, -379, -158, 227, 579, 250, -219, -315, -597, 50, 521, 519, 309, -388, -426, -52, 267, 690, 12, -59, -396, -116, 268, 501, 489, 483, -138, -565, -248, -111, 302, 483, -328, -339, -599, 28, 216, 537, 247, -293, -633, -486, 45, 508, 435, 97, -34, -322, -28, 193, 675, 218, -170, -607, -573, 95, 392]
$$ [...]
8191d3
##END NTUPLES=NMR FID
##END=
