##TITLE=1H_SA_27.99
 CDCl3, 64 sc, 
 18.1.2019
##JCAMPDX= 6.0         $$ Bruker NMR JCAMP-DX V2.0
##DATA TYPE= NMR FID
##DATA CLASS= NTUPLES
##ORIGIN= UXNMR, Bruker Analytische Messtechnik GmbH
##OWNER= root
$$ XWIN-NMR		Version 3.5
$$ Fri Jan 18 14:22:32 2019 Russian Standard Time (UT+4h)  she@DPX200
##.OBSERVE FREQUENCY= 200.1313
##.OBSERVE NUCLEUS= ^1H
##.DELAY= (6, 6)
##.ACQUISITION MODE= SIMULTANEOUS
##.ACQUISITION SCHEME= undefined
##.AVERAGES= 64
##.DIGITISER RES= 18
##SPECTROMETER/DATA SYSTEM= spect
##.PULSE SEQUENCE= zg30
##.SOLVENT NAME= CDCl3
##.SHIFT REFERENCE= (INTERNAL, CDCl3, 0, 15.7039)
##AUDIT TRAIL= $$ (NUMBER, WHEN, WHO, WHERE, WHAT)
$$ ##TITLE= Audit trail, XWIN-NMR		Version 3.5
$$ ##JCAMPDX= 5.01
$$ ##ORIGIN= Bruker BioSpin GmbH
$$ ##OWNER= she
$$ F:/spectra/data/she/nmr/H-F/1/audita.txt
$$ ##AUDIT TRAIL=  $$ (NUMBER, WHEN, WHO, WHERE, WHAT)
(   1,<2019-01-18 14:21:31.90 +0400>,<she>,<DPX200>,
      <continue with go, POWCHK disabled, PULCHK disabled
       configuration hash MD5:
       00 E9 B6 7A A2 85 ED C7 34 08 36 98 17 FE 4E 26
       data hash MD5: 16K
       CE 6E D0 9D 92 4E 28 DF 6F AC 27 9A 91 B5 69 B1>)
$$ ##END=
$$ 
$$ hash MD5
$$ AF DE 96 9F 8B 0B 40 A3 F3 8D 99 60 31 33 7F 39
##$RELAX= 
##$RELAX= 
##$RELAX= 
##$RELAX= 
##$RELAX= 
##$RELAX= 
$$ Bruker specific parameters
$$ --------------------------
##$DU= <F:/spectra>
##$EXPNO= 1
##$NAME= <H-F>
##$PROCNO= 1
##$TYPE= <nmr>
##$USER= <she>
##$AMP= (0..31)
100 100 100 100 100 100 100 100 100 100 100 100 100 100 100 100 100 100 
100 100 100 100 100 100 100 100 100 100 100 100 100 100 
##$AQSEQ= 0
##$AQ_mod= 1
##$AUNM= <au_zg>
##$AUTOPOS= <>
##$BF1= 200.13
##$BF2= 200.13
##$BF3= 200.13
##$BF4= 200.13
##$BF5= 200.13
##$BF6= 200.13
##$BF7= 200.13
##$BF8= 200.13
##$BYTORDA= 1
##$CFDGTYP= 0
##$CFRGTYP= 5
##$CHEMSTR= <none>
##$CNST= (0..31)
1 1 145 1 1 1 1 1 1 1 1 1 1 1 1 1 1 1 1 1 1 1 1 1 1 1 1 1 1 1 1 1 
##$CPDPRG= <>
##$CPDPRG1= <>
##$CPDPRG2= <>
##$CPDPRG3= <>
##$CPDPRG4= <mlev>
##$CPDPRG5= <mlev>
##$CPDPRG6= <mlev>
##$CPDPRG7= <mlev>
##$CPDPRG8= <mlev>
##$CPDPRGB= <>
##$CPDPRGT= <>
##$D= (0..31)
0 1.2 0 0 0 0 0 0 0 0 0 0.03 0 0 0 0 0 0 0 0 0 0 0 0 0 0 0 0 0 0 0 0 
##$DATE= 1547806634
##$DBL= (0..7)
120 120 120 120 120 120 120 120 
##$DBP= (0..7)
150 150 150 150 150 150 150 150 
##$DBP07= 0
##$DBPNAM0= <>
##$DBPNAM1= <>
##$DBPNAM2= <>
##$DBPNAM3= <>
##$DBPNAM4= <>
##$DBPNAM5= <>
##$DBPNAM6= <>
##$DBPNAM7= <>
##$DBPOAL= (0..7)
0.5 0.5 0.5 0.5 0.5 0.5 0.5 0.5 
##$DBPOFFS= (0..7)
0 0 0 0 0 0 0 0 
##$DE= 6
##$DECBNUC= <off>
##$DECIM= 32
##$DECNUC= <off>
##$DECSTAT= 4
##$DIGMOD= 1
##$DIGTYP= 9
##$DL= (0..7)
0 120 120 120 120 120 120 120 
##$DP= (0..7)
150 150 150 150 150 150 150 150 
##$DP07= 0
##$DPNAME0= <>
##$DPNAME1= <>
##$DPNAME2= <>
##$DPNAME3= <>
##$DPNAME4= <>
##$DPNAME5= <>
##$DPNAME6= <>
##$DPNAME7= <>
##$DPOAL= (0..7)
0.5 0.5 0.5 0.5 0.5 0.5 0.5 0.5 
##$DPOFFS= (0..7)
0 0 0 0 0 0 0 0 
##$DQDMODE= 0
##$DR= 18
##$DS= 0
##$DSLIST= <SSSSSSSSSSSSSSS>
##$DSPFIRM= 0
$$ [...]
##$SUBNAM2= <"">
##$SUBNAM3= <"">
##$SUBNAM4= <"">
##$SUBNAM5= <"">
##$SUBNAM6= <"">
##$SUBNAM7= <"">
##$SUBNAM8= <"">
##$SUBNAM9= <"">
##$SW= 20.0189088683792
##$SWIBOX= (0..15)
0 0 2 0 0 0 0 0 0 0 0 0 0 0 0 0 
##$SW_h= 4006.41025641026
##$TD= 16384
##$TD0= 1
##$TE= 0
##$TE2= 300
##$TE3= 300
##$TEG= 300
##$TL= (0..7)
0 120 120 120 120 120 120 120 
##$TP= (0..7)
150 150 150 150 150 150 150 150 
##$TP07= 0
##$TPNAME0= <>
##$TPNAME1= <>
##$TPNAME2= <>
##$TPNAME3= <>
##$TPNAME4= <>
##$TPNAME5= <>
##$TPNAME6= <>
##$TPNAME7= <>
##$TPOAL= (0..7)
0.5 0.5 0.5 0.5 0.5 0.5 0.5 0.5 
##$TPOFFS= (0..7)
0 0 0 0 0 0 0 0 
##$TUNHIN= 0
##$TUNHOUT= 0
##$TUNXOUT= 0
##$USERA1= <user>
##$USERA2= <user>
##$USERA3= <user>
##$USERA4= <user>
##$USERA5= <user>
##$V9= 5
##$VALIST= <valist>
##$VCLIST= <CCCCCCCCCCCCCCC>
##$VD= 0
##$VDLIST= <DDDDDDDDDDDDDDD>
##$VPLIST= <PPPPPPPPPPPPPPP>
##$VTLIST= <TTTTTTTTTTTTTTT>
##$WBST= 1024
##$WBSW= 4
##$XGAIN= (0..3)
0 0 0 0 
##$XL= 0
##$YL= 0
##$YMAX_a= 2211192
##$YMIN_a= -2670182
##$ZGOPTNS= <>
##$ZL1= 120
##$ZL2= 120
##$ZL3= 120
##$ZL4= 120
##$ABSF1= 10
##$ABSF2= 0
##$ABSG= 5
##$ABSL= 3
##$ALPHA= 0
##$AQORDER= 0
##$ASSFAC= 0
##$ASSFACI= 0
##$ASSFACX= 0
##$ASSWID= 0
##$AUNMP= <proc_1d>
##$AZFE= 0.1
##$AZFW= 0.1
##$BCFW= 1
##$BC_mod= 2
##$BYTORDP= 1
##$COROFFS= 0
##$CY= 11.3945322036743
##$DATMOD= 1
##$DC= 2
##$DFILT= <>
##$DTYPP= 0
##$F1P= 18.9103706918063
##$F2P= -1.10871071338519
##$FCOR= 0.5
##$FTSIZE= 0
##$FT_mod= 4
##$GAMMA= 1
##$GB= 0.15
##$INTBC= 1
##$INTSCL= 1
##$ISEN= 128
##$LB= 0.24
##$LEV0= 0
##$LPBIN= 0
##$MAXI= 10000
##$MC2= 0
##$MEAN= 0
##$ME_mod= 0
##$MI= 1.114404
##$NCOEF= 0
##$NC_proc= 0
##$NLEV= 6
##$NOISF1= 3.799351
##$NOISF2= 2.8
##$NSP= 1
##$NTH_PI= 0
##$NZP= 0
##$OFFSET= 15.70392
##$PC= 1
##$PHC0= -9055.999
##$PHC1= 15.40004
##$PH_mod= 1
##$PKNL= yes
##$PPARMOD= 0
##$PSCAL= 0
##$PSIGN= 0
##$REVERSE= no
##$SF= 200.130013532006
##$SI= 16384
##$SIGF1= 3
##$SIGF2= 2
##$SINO= 400
##$SIOLD= 16384
##$SREGLST= <1H.CDCl3>
##$SSB= 0
##$STSI= 0
##$STSR= 0
##$SW_p= 3612.71676300578
##$SYMM= 0
##$S_DEV= 0
##$TDeff= 0
##$TDoff= 0
##$TI= <>
##$TILT= no
##$TM1= 0
##$TM2= 0
##$TOPLEV= 0
##$USERP1= <user>
##$USERP2= <user>
##$USERP3= <user>
##$USERP4= <user>
##$USERP5= <user>
##$WDW= 1
##$XDIM= 8192
##$YMAX_p= 0
##$YMIN_p= 0
$$ End of Bruker specific parameters
$$ ---------------------------------
##NTUPLES= NMR FID
##VAR_NAME=  TIME,          FID/REAL,        FID/IMAG
##SYMBOL=    X,             R,               I
##VAR_TYPE=  INDEPENDENT,   DEPENDENT,       DEPENDENT
##VAR_FORM=  AFFN,          ASDF,            ASDF
##VAR_DIM=   8192,          8192,            8192
##UNITS=     SECONDS,       ARBITRARY UNITS, ARBITRARY UNITS
##FACTOR=    0.0002496,     1,               1
##FIRST=     0,             0,               0
##LAST=      2.0444736,     0,               0
##MIN=       0,             -2670182,        0
##MAX=       2.0444736,     2211192,         0
$$ Real data points
##PAGE= N=1
##DATA TABLE= (X++(R..R)), XYDATA
$$ [...]
724 95119 555498 291162 -287949 -401713 116277 652439 566915 -52803 -481380 -223642
734 -223642 358260 476880 -77091 -657044 -580536 28829 418926 146575 -408676 -524200
744 -524200 -3090 579973 551578 -21324 -394467 -90262 489699 589942 54364 -507772
754 -507772 -472378 55410 382684 72243 -517554 -653078 -139985 427547 396946 -124415
764 -124415 -427089 -94180 498763 656829 197350 -336816 -321698 179709 482331 145473
774 145473 -458550 -619647 -179444 290788 227969 -251135 -523307 -212727 369543 572068
784 572068 178107 -303409 -244185 287509 602667 278216 -309451 -493324 -121708 294045
794 294045 222926 -272826 -605226 -348634 229073 444957 64672 -373898 -261633 291508
804 291508 619586 349743 -183611 -363388 -10037 410006 325547 -231349 -621785 -380681
814 -380681 173462 337463 -61493 -475987 -362001 168079 528078 344860 -128546 -298237
824 -298237 66187 512754 443985 -106104 -492288 -282889 193198 299022 -107325 -536152
834 -536152 -478008 16358 398356 242325 -221716 -363370 54288 544394 510469 12659
844 12659 -335629 -147523 288782 395623 -4363 -482002 -498295 -44655 309263 112748
854 112748 -368369 -484212 -43892 445952 436292 -2591 -304330 -88525 390182 538431
864 538431 134650 -376326 -407802 34001 347445 102929 -403090 -550374 -160389 309541
874 309541 323502 -92664 -382651 -135943 387597 565410 184208 -285776 -281194 153588
884 153588 434440 178596 -342190 -538238 -200141 249856 253486 -187167 -496909 -246856
894 -246856 293289 498772 170441 -243406 -214305 220298 521659 297092 -221983 -440599
904 -440599 -126579 287623 235695 -247631 -570755 -336635 177514 377284 67988 -327831
914 -327831 -278334 205475 565181 368142 -139944 -331149 6463 402679 318374 -177843
924 -177843 -517351 -331202 128233 294599 -40053 -455887 -398345 115113 487752 294255
934 294255 -180009 -307293 79008 495652 427137 -55382 -404584 -239229 201962 335582
944 335582 -46165 -494195 -456016 24127 357372 164643 -267251 -357040 37768 470264
954 470264 439853 -5384 -321586 -128269 315952 416095 4371 -444299 -413885 15032
964 15032 295084 87355 -337044 -438480 -56762 382363 379471 -29104 -300789 -69600
974 -69600 379570 474570 84030 -333662 -306379 81952 317388 74699 -378223 -497344
984 -497344 -129457 287610 261819 -138053 -373004 -112797 354566 485556 146276 -238249
994 -238249 -202437 189057 421076 163681 -306069 -442348 -114600 239933 169420 -236202
1004 -236202 -462050 -208009 245626 388918 85994 -256570 -185537 233283 485480 252220
1014 252220 -192989 -328573 -30366 288224 200105 -213792 -465721 -260136 150858 279651
1024 279651 -8415 -324908 -235438 188243 448914 249746 -146620 -248808 52542 367945
1034 367945 278665 -141906 -414515 -237533 143676 244003 -68546 -396244 -313389 100565
1044 100565 365223 194448 -163840 -239640 83627 416209 342621 -63597 -322124 -147012
1054 -147012 211878 272105 -75067 -422527 -356749 34960 278865 98022 -255622 -309582
1064 -309582 38644 394350 348700 -17163 -241572 -53143 297455 347830 6434 -340822
1074 -340822 -300817 37386 231773 28249 -326735 -385669 -51972 293162 261151 -71591
1084 -71591 -259501 -42033 327553 399796 87584 -238014 -206160 108338 285645 71912
1094 71912 -300268 -389352 -93741 218302 168651 -158347 -327344 -97957 275476 363694
1104 363694 80215 -209403 -146719 187069 364581 138820 -240464 -334512 -61171 215438
1114 215438 139345 -200251 -383740 -172679 192897 291312 33363 -229699 -142300 209963
1124 209963 398579 189606 -163315 -242867 16494 262983 162255 -193909 -394246 -208198
1134 -208198 131452 213492 -45622 -301708 -203672 157348 365334 192897 -121395 -181261
1144 -181261 81337 330347 236030 -114615 -318980 -156668 139818 180405 -98267 -351375
1154 -351375 -261398 76749 271957 115491 -172740 -209661 80399 357792 282878 -51836
1164 -51836 -235465 -65038 211144 223537 -61840 -321437 -260020 35360 202764 37550
1174 37550 -247935 -270747 33004 308955 238345 -60156 -197857 -8664 267870 287160
1184 287160 6304 -261518 -215003 65793 207036 13178 -281724 -305532 -23555 223547
1194 223547 162535 -92069 -203991 -17907 262654 305126 52140 -194877 -138366 131250
1204 131250 244082 32587 -258928 -291667 -50624 159474 98273 -143482 -259335 -82204
1214 -82204 205349 272895 52713 -159609 -83885 180007 290989 99344 -171947 -220617
1224 -220617 -21971 161132 86089 -174295 -309614 -139190 139153 193414 -17812 -198908
1234 -198908 -103000 168676 301648 147150 -105891 -160620 36205 223509 138517 -140234
1244 -140234 -286553 -135156 105442 132958 -71779 -245502 -159161 105506 253449 122516
1254 122516 -110729 -142178 73933 266947 187555 -78069 -221665 -95925 118036 143576
1264 143576 -63285 -261746 -205858 43814 190006 68173 -144137 -158626 57819 253678
1274 253678 201330 -28754 -162029 -45573 164592 191102 -30499 -247091 -205280 29497
1284 29497 153946 21501 -191649 -210578 -115 208848 184621 -26073 -149710 -18537
1294 -18537 209261 237215 17541 -188035 -146328 60030 156156 12989 -207966 -250336 -52835
1305 -52835 156182 130600 -85732 -195412 -36538 206207 245519 50949 -131844 -92162
1315 -92162 102845 203928 71352 -163987 -234298 -56392 134120 86284 -134756 -236906
1325 -236906 -82659 146320 195832 32952 -131150 -88434 121957 249319 122275 -121270
1335 -121270 -186349 -11408 157598 93607 -127154 -240176 -120108 90080 150899 -2085
1345 -2085 -167953 -119752 110443 247382 123017 -99230 -138287 39744 194593 126551 -94022
1356 -94022 -222735 -121089 83349 132460 -40122 -217960 -162442 74062 210409 96900
1366 96900 -99079 -123654 56626 222933 170834 -47172 -179450 -76445 119066 141273
1376 141273 -54089 -233986 -181318 35144 155889 48194 -138193 -159235 30542 216499
1386 216499 181401 -25464 -142438 -27185 161916 175453 -12489 -187482 -155433 28241
1396 28241 129706 18100 -172635 -197440 -11031 170407 134824 -52009 -142118 -16643
1406 -16643 174415 201730 30511 -142888 -117302 65987 160255 30845 -171904 -200971 -28464
1417 -28464 127899 87506 -85023 -164514 -42555 151626 193270 33636 -126969 -82393 109035
1428 109035 192789 52319 -146295 -175064 -21486 115753 69138 -104577 -196083 -80873
1438 -80873 115894 163499 14096 -126509 -67327 120393 202672 82448 -95904 -131068 3621
1449 3621 131230 81678 -103946 -207440 -99075 86297 118629 -29789 -155082 -91536 90203
1460 90203 186417 95204 -68138 -103649 33762 170522 119986 -70061 -173475 -74358 84468
1471 84468 95862 -52659 -177819 -125353 48256 148074 62714 -93889 -113206 43779 186824
1482 186824 138171 -41327 -132788 -38143 108965 116509 -33993 -172037 -135289 29752 121486
1493 121486 28507 -125236 -131937 27095 164755 123471 -33586 -110622 -15063 133172 144008
1504 144008 -8041 -151318 -119661 37093 114871 13020 -138525 -150690 -4992 127951
1514 127951 99654 -43221 -111791 -12892 139438 155608 14740 -114009 -81026 60487 122311
1525 122311 19360 -133314 -155897 -24942 100544 68392 -75916 -141993 -33868 123064
1535 123064 145897 20849 -91975 -52784 86126 149826 51310 -100767 -130300 -9708 99158
1546 99158 50172 -97847 -159502 -56104 89344 111544 -5271 -107906 -59911 89217 162405
1557 162405 68487 -78486 -100114 20422 118788 64610 -80456 -146525 -62610 67116 86289
1568 86289 -25477 -126142 -77991 71546 142920 55764 -73865 -81002 38710 132609 82020
1579 82020 -57166 -126029 -50813 70761 82206 -35863 -138309 -93754 44910 112057 35585
1590 35585 -77264 -79078 38682 135303 95147 -34122 -97645 -21082 91750 89468 -35380
1601 -35380 -134917 -94933 30998 86977 8628 -100764 -99415 20459 121922 88651 -30937
1612 -30937 -82347 -660 109740 106084 -11966 -105572 -70881 38442 79878 -1135 -110445
1623 -110445 -110223 1636 92175 58417 -49909 -89606 -4790 105232 109118 6143 -78755
1634 -78755 -48077 55469 94691 13952 -92851 -100273 -4575 70920 36236 -62986 -98693 -20660
1646 -20660 81900 92021 2249 -71774 -34046 68130 105142 28551 -72933 -81621 2485
1657 2485 70939 32943 -65625 -106131 -35950 61219 71982 -9181 -73236 -34153 64470 103737
1669 103737 38190 -53191 -60767 20988 82183 40513 -60229 -102461 -38760 47694 53071 -26532
1681 -26532 -88577 -51188 46753 92076 35550 -45051 -48828 30491 92351 57036 -35443 -77624
1693 -77624 -25841 49585 49694 -30164 -93811 -62804 25810 67841 16828 -56642 -56418 23031 90045
1706 90045 64386 -19282 -60375 -11136 61926 63500 -15034 -81398 -59890 18702 54301 3679
1718 3679 -67748 -67593 9642 74410 53356 -21996 -56148 -3536 71474 73476 -2870 -67657 -47819
1731 -47819 25185 55692 4134 -69111 -75392 -3742 58716 40544 -31150 -60504 -7429 67543
1743 67543 73086 5831 -51963 -32103 36623 64989 12459 -62446 -72214 -7521 49128 28311
1755 28311 -40625 -71667 -21011 52529 65288 7532 -45872 -25999 43453 75279 27357 -44168
1767 -44168 -55098 476 48266 25731 -43624 -76928 -32059 37506 49593 -6500 -56084 -32654
1779 -32654 39671 75229 33215 -32602 -42717 11054 60491 37928 -32549 -68797 -29807 31946
1791 31946 38964 -17484 -64181 -40988 27739 62835 25241 -35247 -41329 17488 68566 47091
1803 47091 -23954 -57505 -19886 38270 40671 -16487 -64526 -47879 15457 49627 16230 -41127
1815 -41127 -44653 14221 64405 46477 -16211 -44811 -8313 44803 46885 -8468 -59477 -47372
1827 -47372 12295 43336 7590 -49897 -53456 3912 54199 39031 -13532 -38733 -4848 48363
1839 48363 56546 3516 -46695 -35567 19913 43503 2562 -52012 -55690 -4333 39878 27343
1851 27343 -23003 -47380 -10532 47234 57084 7734 -38695 -23607 29483 51023 12982 -41752
1863 -41752 -49126 -4888 34011 20889 -30539 -54045 -18714 37237 44978 1223 -38145 -21648
1875 -21648 30972 54446 21504 -30379 -41972 217 38227 24013 -27906 -54331 -22819 27196
1887 27196 35720 -3371 -39060 -26064 24536 52035 24232 -24639 -32753 7615 44668 28253
1899 28253 -23004 -50141 -22818 22849 31608 -8118 -46497 -34086 17544 45725 19410 -23901
1911 -23901 -28366 11711 46459 34809 -12571 -39276 -15815 27101 33267 -10420 -49845 -37172
1923 -37172 11082 35246 9932 -30574 -34203 5260 44452 38331 -6585 -34303 -8849 34253
1935 34253 39353 -2967 -40862 -30871 9632 30104 6459 -32697 -40797 -3939 37046 30706 -12875
1948 -12875 -35411 -7233 36698 42211 3694 -31514 -25806 11715 34241 11369 -31905 -43423
1960 -43423 -7167 30920 23165 -17559 -35452 -9276 31578 38951 6713 -26197 -20348 17023
1972 17023 39059 14770 -30425 -40392 -5793 28042 18906 -19853 -39918 -16714 23777 35866
1984 35866 6650 -26250 -19024 20972 42503 18290 -22859 -31408 60 28550 18525 -18660
1996 -18660 -40828 -21080 17831 28687 -1304 -32381 -22976 17280 40233 18907 -16787 -24657
2008 -24657 3987 32586 25853 -11221 -34813 -18040 17291 24546 -5752 -34960 -26184 9602
2020 9602 31618 15805 -17870 -25551 3931 34866 29226 -7434 -30177 -12552 20253 24988 -3270
2033 -3270 -31653 -27648 4813 27176 11372 -21125 -28477 2154 33148 25758 -6897 -24705 -7816
2046 -7816 22646 28134 863 -28275 -26287 5562 26717 8090 -25447 -30191 -1929 25283 20631
2059 20631 -5288 -21766 -6933 22553 30880 6218 -23045 -20487 9390 26000 6493 -23580
2071 -23580 -29456 -7207 17724 16942 -8202 -26100 -11483 20246 30400 8683 -18769 -14770 12746
2084 12746 27132 11337 -16213 -25700 -7432 16158 15340 -11518 -29239 -14867 16136 24583 3519
2097 3519 -19064 -15005 11170 27186 15725 -10617 -22460 -3998 19589 16579 -10077 -27543
2109 -27543 -15161 10778 18429 1211 -19419 -16625 6624 25157 16568 -9426 -19615 -90
2121 -90 21827 18585 -6155 -24162 -14539 7676 16796 984 -20838 -21223 2495 22097 14614 -8673
2135 -8673 -17069 -127 21365 20471 546 -17923 -12408 8802 18217 1649 -21645 -23585 -1383
2148 -1383 17124 10339 -11594 -19781 -3276 18811 22271 3207 -15952 -10113 12401 21637 5565
2161 5565 -17433 -20387 -1357 14714 8352 -12563 -22168 -8975 14582 19565 -982 -17224 -9820
2174 -9820 12881 23192 9184 -12421 -16871 46 17061 11443 -10340 -23478 -10422 11893
2186 11893 15535 -2714 -18323 -10989 9417 21392 10688 -9545 -14754 2018 19330 14145 -8669
2199 -8669 -21325 -9605 10368 14017 -2905 -19132 -14607 5043 18556 10280 -9302 -14160 2298
2212 2298 20442 16182 -5169 -18178 -7778 11135 13969 -2422 -19583 -17024 2095 16113 7425
2225 7425 -12313 -17036 1428 19452 16872 -2132 -14444 -5192 12610 18270 1300 -16321 -16215
2238 -16215 1864 14568 4838 -15034 -19192 -2962 15186 14121 -3033 -14206 -6334 14046 20560
2251 20560 4673 -14723 -13572 3608 15457 6981 -13272 -19171 -6075 12050 12621 -3949 -16791
2264 -16791 -8229 12313 19490 5084 -12317 -11581 5087 17900 9156 -10567 -18549 -5867 11603
2277 11603 12241 -5547 -18587 -10446 8914 17742 4343 -10652 -10596 6422 18444 12035 -7523
2290 -7523 -16196 -3590 12947 11550 -5652 -19550 -12392 6725 14738 2824 -13389 -13662 4304
2303 4304 18578 12694 -5125 -14146 -1430 14634 14390 -2770 -16752 -12058 5130 12455 1849
2316 1849 -15541 -15905 1032 16502 11688 -6098 -13626 -2513 15875 17893 571 -14577 -10836
2329 -10836 6719 14740 2868 -14577 -17363 -1773 13426 9396 -7762 -15078 -3364 14001 16235
2342 16235 1148 -13780 -8764 8521 17419 4909 -13031 -16535 -1625 13237 8797 -8748 -17997
2355 -17997 -6348 11881 16033 1445 -13465 -8530 10021 18058 6893 -10740 -15167 -198 14296
2368 14296 9361 -9736 -19147 -8083 10602 13999 -179 -15417 -10287 8303 18681 9884 -9090
2381 -9090 -12049 2082 16388 11190 -7572 -18163 -8482 9376 11982 -3525 -17675 -12992 6513
2394 6513 17306 6874 -10037 -12978 2589 18652 15028 -4584 -16190 -5868 11765 13998 -2576
2407 -2576 -17333 -13665 4186 14207 4716 -12227 -14790 1855 17227 13106 -5492 -14723 -3940
2420 -3940 13645 15932 -170 -16684 -13437 4666 15556 4506 -13605 -16797 -893 15490 11761
2433 11761 -4711 -14354 -3601 13466 17417 1426 -14632 -11746 5932 15901 4144 -15282 -17612
2446 -17612 -1812 12668 10979 -6218 -15816 -5695 13278 18344 3275 -13358 -9337 8713 16688
2459 16688 5637 -13132 -15943 -2029 13382 9232 -8579 -18839 -7080 12157 15120 -350
2471 -350 -13763 -8883 9540 18753 7702 -9481 -13575 302 14360 10695 -9159 -19225 -7447
2484 -7447 10158 12731 -2522 -15958 -9601 8910 17423 7452 -9761 -13736 1643 17513 12168
2497 12168 -7192 -17248 -6613 10638 12368 -2171 -15922 -11684 6432 15830 6854 -10065 -12304
2510 -12304 2988 17198 11537 -6622 -15057 -5657 11353 13274 -2349 -17230 -13205 5679 15039
2523 15039 3537 -12318 -13690 2453 16173 12519 -3554 -12750 -2804 13235 14955 -1205 -15855
2536 -15855 -10747 5992 12477 1438 -14265 -15289 -1064 14739 10849 -5918 -13965 -3204 14482
2549 14482 16702 1367 -12396 -8425 6994 14163 3785 -13142 -15532 -1511 12768 8472 -8139
2562 -8139 -15684 -3056 13040 14074 617 -12599 -7743 7745 16574 6139 -11418 -15490 -302
2575 -302 13099 8103 -8881 -15817 -4474 9649 12512 -25 -12188 -8799 7323 17681 6164
2588 6164 -11492 -12940 1547 13419 7677 -8147 -16326 -6406 9396 12663 -1593 -15115 -9689
2601 -9689 7953 16886 5884 -10435 -10097 3577 14158 8839 -7031 -14847 -6000 9349 11380
2614 11380 -3306 -17195 -10604 6171 13506 3821 -10183 -10972 2489 16252 12011 -4721 -13169
2627 -13169 -4034 12246 12235 -3566 -15436 -10212 4990 12874 2695 -11397 -12606 1045 14837
2640 14837 10661 -5654 -13546 -2013 13439 14006 -1060 -13224 -9350 5802 13419 3283 -12457
2653 -12457 -13877 840 13481 8680 -6658 -13047 -2895 12205 14197 569 -12661 -8120 7225
2666 7225 14758 2058 -13792 -12827 1314 11586 6929 -7315 -14062 -3897 11072 13909 441
2679 441 -12435 -7007 9130 15473 2768 -11365 -11670 418 11753 6577 -8541 -16328 -5452
2692 -5452 10525 12355 -1706 -13114 -6184 8685 14557 5721 -8750 -10779 1895 13474 8554
2705 8554 -7418 -15986 -4847 9212 9334 -3986 -14329 -7836 6851 13927 4632 -9807 -11183
2718 -11183 2865 15959 10119 -7339 -13676 -2930 10145 9894 -2737 -13571 -8902 5209 12832
2731 12832 3521 -11050 -10568 4052 14656 8046 -6015 -11593 -2070 10565 10712 -2524 -14103
2744 -14103 -9356 6176 12566 1705 -11328 -11825 2787 13709 8172 -4933 -11256 -2123 11471
2757 11471 12722 -1858 -12816 -8138 5896 11409 1057 -11819 -12270 801 11984 8007 -6291
2770 -6291 -13059 -2775 12509 13017 -541 -10625 -5932 7131 12480 3071 -10826 -12102 759
2783 759 11693 6347 -8949 -14267 -3665 10600 10746 -1686 -11683 -6378 7586 14517 5324 -10135
2797 -10135 -11924 1881 13017 6753 -8479 -14098 -3680 8944 10706 -2178 -13178 -7508 7057
2810 7057 14052 3992 -10399 -10597 3532 12750 8026 -7020 -13562 -4827 8474 11109 -2839 -13797
2824 -13797 -8990 7111 14697 3763 -9744 -9733 4184 13641 8438 -6194 -13497 -3308 10449
2837 10449 11147 -3843 -15861 -9717 6538 11490 2964 -10347 -11035 2825 13454 9862 -5959
2850 -5959 -12344 -1938 12425 12429 -3181 -13347 -7476 5815 10853 1593 -12587 -13036 1770 13032
2864 13032 8316 -7701 -12812 -1297 13128 12322 -2203 -12573 -7276 7219 13602 2046 -11923
2877 -11923 -12257 1636 12921 6386 -8393 -12878 -2139 11661 12338 -1884 -12374 -7275 8836
2890 8836 13666 2188 -12534 -12057 2266 11863 6112 -8692 -13059 -2444 11311 12060 -2074 -12219
2904 -12219 -4986 9318 13171 2025 -11457 -10162 2738 12585 6094 -9532 -14146 -2415 10865
2917 10865 9459 -4191 -13195 -5436 8589 13683 3336 -10181 -9318 4330 13745 6691 -8393
2930 -8393 -12635 -2654 10589 8493 -5513 -14492 -7102 7479 12445 1868 -11170 -9441 4308
2943 4308 14879 7859 -7587 -12031 -983 11725 9817 -4176 -12857 -6742 7278 11891 732
2956 732 -12168 -10370 3969 12809 6251 -7344 -11764 -774 12397 10044 -3604 -13279 -5874 7572
2970 7572 11783 -123 -11378 -9543 3563 12723 6031 -7755 -11088 339 12318 10394 -3592
2983 -3592 -12251 -5168 8792 11177 -680 -12403 -10635 3356 12001 4960 -8334 -11430 -638
2996 -638 11756 10856 -2061 -10712 -3789 9271 11526 1090 -11121 -9081 3578 11198 3907 -8988
3010 -8988 -12575 -1056 9543 9045 -4118 -12125 -4155 8978 12359 1930 -9777 -8325 4669
3023 4669 12681 4453 -8488 -12009 -1553 9855 7308 -5293 -12700 -4526 7675 11426 154
3036 154 -10563 -8213 4887 13000 5013 -8665 -11436 -651 10568 7907 -5164 -11652 -4994 7404
3050 7404 11348 180 -9030 -7453 5157 12393 4370 -7963 -10344 388 10021 7221 -4912 -12366
3064 -12366 -5457 6736 10046 143 -11240 -8331 4034 11522 5048 -6994 -8614 1439 10995
3077 10995 8227 -4151 -12459 -4979 8322 8838 -1859 -12161 -9029 3789 9911 3274 -7909
3090 -7909 -9878 843 11372 9520 -2760 -10469 -3300 8552 10308 -1154 -10559 -6964 3655
3103 3655 9628 2354 -9052 -10751 -326 10798 7548 -5559 -10637 -2946 8512 9786 -99 -9545
3117 -9545 -7852 3489 10459 4355 -7874 -10299 29 9508 6487 -4819 -10521 -2797 7891 9485
3131 9485 -217 -10006 -6851 4814 10702 2664 -8936 -10555 -143 9540 6244 -4812 -10227 -3748
3145 -3748 7608 10536 209 -8966 -5808 5481 10143 2987 -7327 -9085 799 8132 5682 -5830
3159 -5830 -11857 -3724 6975 8763 -1618 -9473 -6118 4971 10096 4407 -5804 -7927 1077 10352
3173 10352 7534 -5361 -10325 -3063 7056 7082 -1163 -9156 -5866 3703 8841 3866 -7497 -9036
3187 -9036 877 11310 5968 -4265 -9083 -2046 6795 7682 -381 -9195 -7808 3329 9808 2431
3201 2431 -7662 -8045 1478 8929 5501 -4206 -8173 -2471 7022 8987 -801 -9598 -7060 3733 9453
3216 9453 1573 -6846 -7292 1324 8642 6530 -2945 -7809 -2655 7485 9915 -788 -10057 -4538 5456
3231 5456 8075 1192 -8338 -8485 -494 8078 5421 -4378 -9773 -3405 8088 8441 -898 -7927 -4531
3246 -4531 5045 9044 2856 -6197 -8121 126 8161 5045 -5678 -9875 -2495 7760 6821 -1494 -7995
3261 -7995 -5308 3896 9557 3694 -7222 -7913 705 8866 5701 -4250 -8194 -1982 5843 7500 -1039
3276 -1039 -8233 -5556 5174 9235 2125 -8022 -7384 2325 7839 4440 -4338 -8720 -3107 6788 7954
3291 7954 -1216 -9179 -5919 4935 9109 2049 -6403 -6733 921 8629 6175 -3420 -8738 -2846 8392
3306 8392 7542 -3819 -9486 -5193 3942 7495 1518 -7032 -7463 403 8871 6792 -4379 -8896 -622
3321 -622 8695 7760 -2161 -8540 -4488 4027 8116 1940 -7477 -8570 1038 9040 4294 -6143 -9160
3336 -9160 -580 7405 6522 -1354 -7153 -5258 4234 8950 1946 -7830 -7758 3139 8455 4227 -5135
3351 -5135 -7637 -477 6678 6646 -1407 -8327 -5677 6392 9323 606 -7974 -7035 2582 7676 4222
3366 4222 -4578 -8276 -2840 7335 8097 -630 -8421 -4313 5585 8424 664 -6528 -6372 1984 7781
3381 7781 4341 -5460 -9059 -2865 7702 6971 -3355 -8188 -3851 5331 7789 1541 -6062 -6089 2488
3396 2488 8927 5021 -4294 -7320 724 7981 5217 -3187 -8556 -3677 4559 6851 839 -7862 -6680
3411 -6680 2516 9133 4105 -5934 -7076 301 6783 6242 -1369 -8318 -4175 5162 8380 455 -7542
3426 -7542 -5746 3573 8010 2686 -5223 -7823 -1563 7041 6788 -2287 -9336 -3703 5780 7789 -697
3441 -697 -7201 -5656 2881 7841 3845 -3705 -7158 -400 7667 6724 -2699 -8518 -2112 6770 6791 -947
3457 -947 -6563 -5668 2336 7302 3639 -5719 -7767 239 7785 6038 -2798 -6947 -1513 5728 7053
3472 7053 801 -5450 -4686 2623 8067 2874 -6263 -7450 794 6736 4956 -3375 -7619 -3508 4523
3487 4523 7463 1127 -6984 -5674 3048 8071 2962 -4735 -6466 345 5830 4881 -2725 -7362 -3215
3502 -3215 4847 7119 -1102 -7887 -5188 3552 7496 2204 -5038 -7048 25 6224 4757 -2596 -7504
3517 -7504 -3003 6674 6051 -883 -5158 -3733 4061 6610 2604 -4846 -5835 66 6836 4394 -3918
3532 -3918 -7713 -2509 5359 5628 -1157 -6222 -4598 3068 6926 2366 -4456 -5652 666 6776 4855
3547 4855 -3012 -5880 -789 4648 5674 -581 -6837 -4906 2795 6884 1513 -6159 -6439 72 5459
3562 5459 4639 -3546 -6165 -1873 5378 6078 51 -6219 -3742 3239 6518 1755 -4954 -5665 1234 5587
3578 5587 3020 -3060 -6294 -1751 5301 5484 -983 -6681 -4000 3267 6484 1798 -4195 -5215 1024
3593 1024 6082 4427 -3503 -5074 -1074 4887 5206 -1157 -5050 -3858 3179 5257 767 -4516 -6004
3608 -6004 664 5531 2969 -3703 -5868 -1625 3725 5072 -724 -5375 -3297 2900 5830 1529 -3833
3623 -3833 -4763 1176 5361 3123 -3769 -5718 -1169 4218 4074 -634 -5563 -4003 2322 5005 1389
3638 1389 -4143 -4431 539 5473 2920 -2354 -4872 -1148 4019 4759 -677 -4716 -3638 3358 4679
3653 4679 824 -5001 -4622 1041 4150 2272 -3345 -5328 -944 3974 4706 -171 -4644 -2492 2390
3668 2390 6196 856 -3783 -3687 801 4646 3019 -2793 -4807 -1914 4441 4408 -1029 -5629 -3001 2453
3684 2453 5593 1050 -4129 -4123 760 4565 3506 -2381 -3929 -988 4041 4159 -548 -3856 -2737 2999
3700 2999 3966 1075 -3010 -4133 462 4838 2691 -2809 -5742 -1075 3775 3396 -1051 -3189 -3009 1519
3716 1519 4122 1242 -2928 -3922 1172 5159 2698 -2382 -4430 -591 3218 3150 -639 -4677 -2300 1635
3732 1635 3795 568 -3910 -3980 401 4295 1751 -2242 -3783 -551 3496 4094 -74 -3082 -1677 3351
3748 3351 4761 240 -3817 -3538 1117 3230 1682 -2923 -5020 -1436 3074 3996 -339 -4487 -2166
3763 -2166 2070 3750 1375 -3110 -2145 744 4448 2671 -1994 -4491 -551 3907 3572 -1673 -4101
3778 -4101 -1891 2766 3029 1188 -2744 -3703 571 4285 1739 -2028 -3796 -80 3514 2625 -1023 -2897
3794 -2897 -1884 2137 3489 1172 -3002 -3293 1721 4125 1454 -3029 -3431 -1070 1970 2939 -1096 -3653
3810 -3653 -3253 1873 4658 1185 -2493 -3113 2365 3491 889 -797 -1542 115 2858 3248 -701 -3847
3826 -3847 -1944 2034 2847 -825 -3518 -2655 896 3014 2110 -1902 -3429 -1438 2965 3382 -974 -2908
3842 -2908 -1647 2902 2622 303 -1684 -1998 846 1850 1762 -1869 -3809 -959 3323 2149 -2091 -2779
3858 -2779 -1386 1560 2178 651 -1914 -2583 432 3728 1550 -2468 -2558 662 2882 1299 -991 -2003
3874 -2003 -714 1657 3322 1051 -3003 -3597 1312 3274 288 -3070 -2583 30 1318 1070 -219 -2500
3890 -2500 -1847 1605 3514 369 -2652 -286 1854 3080 629 -2195 -2243 -417 2238 2017 -1416 -3817
3906 -3817 -1986 1936 2398 226 -1911 -1461 892 1885 1618 -650 -2619 -210 2696 2599 -866 -2545
3922 -2545 -130 1316 1411 -202 -1045 -1626 518 2192 1555 -2216 -3159 352 1920 946 -1016 -1636 -950
3939 -950 1329 1714 383 -1956 -2280 1720 2705 795 -1628 -1083 -44 1955 721 -774 -1924 -2303
3955 -2303 1025 2194 -333 -3996 -1626 1413 1932 347 -1932 -807 -26 1354 1771 727 -1368 68
3971 68 2644 2171 -460 -2626 -492 1179 935 -160 -1991 -1776 -946 1717 1756 -1244 -2638 -667 2221
3988 2221 1738 -31 -946 -40 826 1476 1499 -650 -1959 -282 1736 734 -2286 -1974 -17 1279 -18
4005 -18 -276 -1217 -2113 148 1992 643 -1474 -1391 480 1407 719 -760 -440 145 460 1101 183 -1323
4023 -1323 -928 1727 2154 -468 -1593 -1310 582 649 199 -579 -1870 -1781 491 1765 55 -1759 -513
4040 -513 1532 887 369 -336 609 688 1133 915 -1225 -1630 -1060 1307 93 -1545 -2534 -315 -82 -52 460
4059 460 429 -1313 -720 1393 1364 -289 -1140 1095 1464 -274 -888 -328 1 683 456 325 -1260 -478 616
4078 616 1066 903 -1314 -378 -12 117 731 -479 -215 -507 309 1102 -100 -1543 -20 725 984 -157
4096 -157 -286 -200 454 682 637 490 -1128 -992 725 769 -541 -430 -727 482 -280 -76 540 -711 -209
4115 -209 481 995 709 -397 1235 1037 396 -377 -177 -180 -658 -122 -10 -1507 -1753 -1084 126 -29 -745
4134 -745 389 843 -61 597 540 635 184 47 1045 411 -217 -176 367 536 -590 37 -505 61 -367 -439 -480
4155 -480 -769 -680 -118 647 -227 -242 -3 -332 -236 -260 200 161 -445 -235 353 -41 -1325 316 545 -392 6
4176 6 -65 -151 -272 639 641 426 -501 -848 -310 -539 -158 393 1048 303 171 324 1489 211 642 947 248
4197 248 -25 -403 2 -84 -560 -592 -216 -326 -581 -72 77 -15 -259 464 340 25 989 1264 1334 235 -552
4218 -552 577 789 394 -42 -696 -1010 -557 -379 -156 -622 443 -93 147 -241 -624 626 212 -72 534
4237 534 -257 -466 -1099 378 829 -283 -137 -601 -193 689 327 772 375 201 545 384 -391 -1317 -313
4256 -313 583 267 -650 -422 55 128 235 1002 166 -1044 524 1230 891 728 -843 645 270 680 341
4275 341 -256 -541 -523 850 19 -807 -1617 -281 290 -218 -462 -55 615 963 1373 526 -392 -184 200 573
4295 573 459 -775 -865 -1083 -252 -136 -717 -408 -551 651 317 620 -651 -605 6 34 611 -515 -1341 -147
4315 -147 111 765 -455 -1156 -983 484 160 534 -604 -820 -130 494 309 -56 -565 44 404 274 -870
4334 -870 -976 -723 272 856 160 -1109 -633 397 1258 1144 -92 -1042 -7 1013 1136 178 -1539 -1271
4352 -1271 29 1195 221 -1681 -1410 -177 1274 91 -560 -48 385 2008 1039 -266 -995 -323 673
4369 673 1059 424 -693 -502 -895 -185 -22 -730 -1476 -737 1046 785 -424 -1242 364 752 1127 321 -524
4388 -524 -869 868 1597 716 -227 -1446 14 1262 584 -808 -492 -202 543 1070 585 -1020 -873 281
4406 281 675 391 -913 -1208 -140 922 1001 -220 -1159 -579 1254 2148 603 -348 -792 131 1725 912
4424 912 -980 -1768 -701 379 1013 -187 -1747 -1716 328 951 -248 -1476 -956 1541 1840 1649 -381
4441 -381 -662 -359 1694 1287 -265 -1223 -1007 311 354 -621 -1474 -941 487 793 714 -939 -573 156 2342
4460 2342 1544 -662 -1054 -359 954 1447 431 -1125 -1265 153 1058 731 -929 -1447 380 1296 399
4477 399 -645 -888 -466 446 1200 -440 -1916 -1511 137 1605 638 -1076 -1212 -461 1910 1273 73
4494 73 -166 -203 1091 1713 -58 -1441 -1027 608 1206 -928 -2257 -1219 -206 399 1452 -246 -1235
4511 -1235 -462 1531 1857 188 -438 -432 67 776 960 -349 -816 -896 1080 1019 -1109 -2087 -937 456 1387
4530 1387 -264 -977 -32 712 1257 907 -593 -1057 -266 2121 1498 -178 -1112 -1000 288 1117 534 -1190
4548 -1190 -930 767 1732 628 -1005 -1329 18 1887 376 -1191 -1196 -986 629 1315 676 -1894 -2052
4565 -2052 144 2579 332 -237 -1462 -759 1412 1048 -789 -1202 -842 553 1635 -588 -2716 -1555
4581 -1555 1506 1332 830 -622 -948 -659 1303 2001 -43 -1363 -750 1719 2007 -271 -1402 -751 46
4598 46 983 290 -567 -1995 -217 1468 748 -878 -1855 293 1182 1146 -296 -867 -835 792 1630 545
4616 545 -1275 -2052 -857 1017 637 -851 -1442 -163 1090 1444 312 -853 -1449 186 1714 569
4632 569 -916 -1603 137 1596 486 -880 -1395 -1392 690 1472 457 -973 -911 537 1641 1103 -1134
4649 -1134 -1500 -91 1463 1094 -1378 -1817 -921 1119 1624 200 -1361 -944 1410 1265 1545 -547 -761
4666 -761 64 1378 1813 -747 -2237 -142 436 1595 -241 -1784 -1197 -239 988 1041 -678 -2371 354
4683 354 1937 945 -658 -1368 -30 912 1395 396 -1124 -896 875 1459 1149 -1260 -1438 531 2045
4700 2045 222 -623 -444 55 228 2512 257 -1486 -927 -159 1832 632 -1397 -1727 103 1550 1376
4717 1376 -319 -1216 -1208 979 1355 -137 -1501 -1781 347 2070 -146 -896 -1313 -686 1158 1071 -375 -1604
4735 -1604 -1072 1369 1802 377 -948 -298 828 1345 411 -935 -1391 -628 401 1200 -178 -2108 -619
4752 -619 700 1107 16 -915 -865 62 1444 1394 -1154 -1255 -223 1686 1748 -738 -1508 -373 90 1871
4770 1871 81 -1496 -1051 435 1724 544 -1808 -1940 762 1804 1152 -887 -1568 -1404 865 1682
4786 1682 436 -1143 -1338 78 1737 1261 -698 -1594 449 1621 1445 -32 -2063 -665 1514 1339
4802 1339 -184 -1969 -1218 235 1157 460 -572 -1541 -633 1489 1416 -330 -1892 -122 878 734 -331
4819 -331 -1299 -1364 315 1271 509 -2018 -1913 -653 2194 1267 302 -1187 164 1187 1284 388 -740 -1409
4837 -1409 36 1638 263 -360 -1686 -413 1509 1044 -209 -1446 -339 1460 1458 322 -1200 -349
4853 -349 392 1572 759 -983 -968 70 1399 927 -630 -1487 -356 951 1361 -441 -1165 -870 504
4870 504 1694 -36 -1285 -768 -362 1002 718 -484 -2525 -204 779 953 179 -1416 -923 731 2448
4887 2448 797 -590 -803 1 1114 1596 -521 -1474 -822 364 1227 -681 -1072 -1212 365 1109 704
4904 704 -1039 -1611 68 1481 1071 -298 -1000 -814 742 956 -1 -1840 -1467 -33 855 447 -915
4921 -915 -689 -101 1745 1325 -475 -1351 -479 1219 1535 697 -1619 -1247 26 1779 1012 -991 -1479 -407
4939 -407 1236 1656 -77 -1609 -782 1037 1198 576 -1239 -1391 129 1036 596 -565 -1646 -535 903
4956 903 863 447 -1661 -1156 549 1377 602 -643 -1288 670 980 1623 -428 -911 -417 1202 405 -510
4974 -510 -1089 -225 889 477 640 -345 -1473 -65 1451 1191 -522 -897 -105 385 1930 193 -1304
4991 -1304 -803 538 1247 350 -1337 -842 -100 771 826 -842 -1536 -375 1598 1592 -120 -1494 -1127 383
5009 383 1291 -390 -785 -956 375 934 575 -795 -523 -305 479 1367 -273 -1298 -179 709 1406 603
5027 603 -717 -1122 400 614 993 -777 -790 422 703 1601 73 -644 -287 653 1374 677 -1958 -1047
5045 -1047 -90 692 -408 -1214 -1349 -74 400 1419 -449 -1507 -841 608 681 640 -654 -1244 49 558
5063 558 1282 -481 -736 -594 633 1066 -117 -748 -776 205 1341 179 -323 -778 608 1285 262 -164
5081 -164 -1318 -555 980 645 -259 -1147 -1195 631 1575 143 -842 -586 8 1227 1066 -714 -863 -85
5099 -85 962 1103 49 -1491 -576 -183 1682 716 -435 -922 -82 790 1202 -502 -1062 -163 720 758 568
5118 568 -235 -577 332 946 614 -440 -1735 -459 1053 1018 -72 -1199 -270 652 1741 323 -716
5135 -716 -587 -145 812 -294 -1094 -911 -119 793 347 -352 -1266 -593 786 1378 130 -40 -848 607 617
5154 617 534 -84 -1202 -89 671 936 294 -719 -871 756 1235 556 -878 -1565 763 1026 252 273 -737
5173 -737 -395 845 1040 -272 -762 -895 1084 761 795 -613 -811 -241 1450 1126 -177 -841 -198 491
5191 491 647 -202 -1463 -1531 546 966 -266 -941 -607 96 1233 626 16 -1031 -150 1011 770 -8
5209 -8 -149 -907 162 578 1018 -561 -1273 -603 1004 1333 -571 -1255 -791 619 913 280 -1147 -946 138
5228 138 882 447 -518 -1554 143 174 379 -942 -424 -26 277 563 736 -1722 -704 465 1970 1356
5246 1356 -919 -796 -135 767 1237 -588 -1717 -1145 530 1160 412 -535 -821 304 1460 268 206 -1345
5264 -1345 354 70 201 -271 -1129 -1046 334 1284 407 -1344 -745 68 417 731 -442 -266 -636 1228
5282 1228 1214 695 -818 -778 903 1158 221 -835 -1145 -417 1908 1110 -543 -119 207 1309 1009 -262
5300 -262 -1869 -857 737 1271 796 -817 -1578 -356 1179 1181 -1328 -1224 -583 195 1036 238 -711 -965
5318 -965 73 1600 400 -227 -1160 -264 945 1123 -736 -1074 -213 1061 1234 344 -1145 -244 575 1667
5336 1667 917 -774 -865 37 1472 -51 -682 -798 -699 754 1002 393 -1102 -746 971 2256 805 -295
5354 -295 -290 -133 1852 969 -302 -1221 -814 826 1404 140 -1312 -619 725 867 -13 -601 -669 263 1412
5373 1412 1313 -196 -1541 -379 542 1552 -764 -1392 -1611 -772 1420 538 -1573 -1143 -334 1164 880
5390 880 123 -762 -191 873 1252 751 -711 -1561 160 1600 557 -722 -1344 -291 596 825 -731
5407 -731 -1380 -805 211 1198 329 -504 -1312 300 1390 334 -601 -1539 -644 905 710 -419 -673 -464
5425 -464 1220 1617 1224 -698 -792 677 1643 544 -117 -520 -322 1318 758 -1295 -1614 -841 422 460
5443 460 -624 -1249 -916 1115 1340 1266 172 -709 -454 1441 978 -292 -1437 -843 577 996 474 -1861
5461 -1861 -1094 559 898 1190 -939 -1009 53 1250 327 -748 -790 -1028 943 977 300 -1771 -650 127
5479 127 1284 1033 -1014 -1273 47 1959 1580 -490 -2043 -777 631 1527 475 -1053 -2109 471
5495 471 2101 1127 -1108 -1680 -424 632 1500 153 -1479 -614 1246 1781 242 -1219 -1531 562 997
5512 997 788 -692 -1771 -803 1585 654 -326 -1418 -922 1564 1890 789 -619 -1089 573 1298 724
5529 724 -505 -1981 -644 1064 774 -886 -297 -815 253 1015 392 -441 -1172 247 2360 1303 -713
5546 -713 -2127 -1076 1117 1284 -248 -1745 -1437 172 1956 310 -1254 -1997 190 1901 1028 -749
5562 -749 -1585 15 862 1940 -514 -1485 -1023 325 1496 -52 -1577 -1325 1 820 1486 -821 -1245
5579 -1245 -578 1884 1650 549 -1272 -1305 344 1313 430 -2095 -1895 -508 1081 1311 -583 -1818 38
5596 38 1903 2083 -224 -842 -607 1317 1838 304 -1702 -1630 -491 661 285 -641 -1554 -884 1812 1617
5614 1617 186 -1423 -1505 979 1859 1107 -1052 -1398 -10 1572 723 -1125 -1960 -862 1097 1434 -8
5631 -8 -1784 -1012 772 2113 801 -1614 -1229 -178 1978 1304 -516 -1896 -1242 1098 1667 116 -1859
5648 -1859 -1142 378 1744 503 -978 -972 886 1876 1463 -1452 -2355 -941 1277 1668 -739 -2185 -1572
5665 -1572 374 1880 1080 -1928 -1398 119 1715 1724 -700 -1404 -360 1345 2116 88 -1989 -1650 914
5682 914 1875 530 -1426 -1543 57 1652 1446 -818 -1443 -702 1955 2646 1321 -1693 -1382 562 1641
5699 1641 921 -2010 -2194 138 1388 1853 -1344 -2128 -829 1798 2076 240 -1807 -1074 1384 2404
5715 2404 434 -1906 -2769 302 1886 1465 -1017 -2319 -689 1170 1908 147 -1585 -540 1809 2202
5731 2202 819 -1259 -2117 502 1929 1662 -1128 -2932 -1315 1926 1218 44 -1991 -1700 1148 2906
5747 2906 948 -1388 -1716 617 2409 1896 -1157 -2629 -926 806 2354 -501 -2005 -1365 684 2381
5763 2381 1157 -1306 -2270 151 2542 1850 -1020 -2344 -138 783 1693 -43 -2835 -1504 517 1613
5779 1613 797 -1698 -1664 388 2476 2352 -603 -1878 -708 2395 1947 -338 -1892 -1210 1104 2238
5795 2238 66 -1823 -2512 102 1734 2031 -1099 -1587 -104 2077 2822 93 -2759 -1736 709 1947
5811 1947 516 -1783 -2522 -695 2074 1603 -1327 -3214 -187 2291 2532 511 -1969 -1217 1145 2581
5827 2581 1181 -1978 -2033 -779 1265 731 -1028 -2942 -1136 1631 1693 -559 -2369 -1558 1194 3529
5843 3529 1429 -1740 -2189 204 2446 1495 -1443 -2480 -885 1918 1330 -453 -2667 -2515 969 3253
5859 3253 613 -1489 -1909 762 2263 1813 -481 -2566 -1134 1295 2147 -685 -2325 -1757 1875 1968
5875 1968 1352 -1838 -1761 846 2647 2149 -872 -2394 -800 1718 2358 -1043 -2804 -2188 624 2445
5891 2445 891 -1948 -2350 681 3003 2599 -1344 -2028 83 2159 2511 -588 -1950 -2092 1018 2010
5907 2010 628 -2989 -2489 -452 2700 1702 -1576 -2515 21 2513 3230 6 -2361 -1339 1282 3242
5923 3242 317 -2433 -2093 137 2217 1406 -1210 -2182 -745 1359 2307 -83 -1691 -1369 1761 2772
5939 2772 589 -2087 -2233 153 2457 873 -1457 -2975 -1469 1513 2575 -746 -2737 -875 1515
5954 1515 2921 828 -2124 -2138 361 2248 1159 -1303 -2969 -1079 1510 1880 -988 -1737 -1313 2296
5970 2296 3397 879 -1852 -1240 519 3382 1884 -1949 -3357 -515 1763 1770 -1468 -3467 -1337 1260
5986 1260 2175 313 -2159 -2395 1129 2849 2284 -793 -1735 -461 1800 2541 -453 -2932 -1453 295
6002 295 1908 -159 -2119 -2133 483 2513 915 -934 -1174 -196 2876 2455 -7 -2550 -1496 1363
6018 1363 2237 71 -2687 -2860 288 2239 1476 -1636 -2589 -375 2511 2351 138 -2068 -862 1554
6034 1554 2719 -92 -2247 -2420 329 2170 1097 -2078 -2824 -607 2322 2678 294 -1246 -1147 2216
6050 2216 3118 374 -2234 -2342 536 2654 1021 -2074 -2742 -732 1666 1471 -823 -2270 -1730 2136
6066 2136 2310 1143 -1699 -899 1353 3307 1439 -1491 -2594 -941 1796 2199 -624 -2265 -1460 1777
6082 1777 2663 406 -1692 -1543 906 3085 1224 -531 -1955 -353 2345 2515 -1305 -2870 -1457 546
6098 546 2157 -350 -1831 -1369 600 2749 2414 -1660 -2246 -28 2014 1587 -1092 -2727 -1168 1055
6114 1055 1519 -791 -2770 -2365 621 2858 1580 -1038 -1722 537 2569 2472 -381 -1734 -1161 1648
6130 1648 2406 -538 -3263 -2666 398 1659 875 -1906 -2501 193 2752 2678 -886 -1789 -468 1880 3194
6147 3194 -396 -2442 -2571 649 2072 -288 -2181 -3045 -819 2367 1780 -628 -2243 -754 2351 2869
6163 2869 639 -2153 -1006 620 2276 228 -2187 -2938 -740 1860 1456 -423 -2466 -530 2441
6178 2441 2506 585 -1604 -1523 1137 2201 883 -2073 -2491 -348 1612 1513 -1173 -2380 -995 1184 2367
6195 2367 351 -2145 -1999 1052 3036 2029 -1134 -1506 514 2351 1498 -1407 -3167 -1628 1655 1417
6211 1417 71 -2310 -1629 1234 2471 1548 -1502 -2054 428 2378 2096 -617 -3064 -552 1138 1853
6227 1853 -632 -3403 -2139 444 2157 735 -1532 -1563 653 3037 2768 130 -2081 -47 2395 2431
6243 2431 -649 -2777 -3093 1211 1990 459 -1946 -2330 207 2256 2638 -760 -2025 -493 2609 2846
6259 2846 55 -2468 -1748 895 2022 -128 -2963 -3207 29 1703 1621 -1210 -2878 -428 2142 2736
6275 2736 904 -2046 -1223 1537 2702 883 -2922 -2935 -260 2355 1453 -1946 -3103 -884 2220 2208
6291 2208 679 -2161 -718 1699 3480 1254 -2216 -1586 -25 1626 1166 -1859 -3188 -1194 1468
6306 1468 2230 -954 -1937 -1504 1836 3064 1383 -1462 -1772 -267 2810 1703 -1392 -3107 -815 2063
6322 2063 1773 -200 -2787 -2196 1089 2954 1088 -1842 -1594 755 3248 1420 -1286 -2091 -860 2444
6338 2444 1587 -532 -2746 -2310 835 2158 491 -2209 -1230 1181 3248 1993 -1666 -2424 -175 2196
6354 2196 2330 -910 -2941 -1987 493 1891 260 -2871 -2751 625 2282 2000 -1743 -2551 602 3283
6370 3283 2632 191 -2072 -1164 462 2677 -66 -3006 -2347 -210 2642 760 -2211 -2501 -272 2466
6386 2466 3509 141 -2244 -879 2375 2759 690 -2526 -2577 -258 1791 1349 -2370 -3205 -709 2063
6402 2063 3201 84 -2482 -619 1816 2935 1145 -2156 -1689 1223 1879 791 -1754 -2956 -1170
6417 -1170 1693 1517 -966 -2994 -1011 2075 2813 835 -946 -1833 1079 2706 2086 -1319 -2997 -894
6433 -894 1699 850 -1309 -3426 -1234 1280 2614 1532 -1533 -2375 994 3906 2502 -1058 -2084 -217
6449 -217 1602 1384 -1334 -2725 -1182 1001 1788 534 -2476 -1819 757 2795 1160 -598 -2053 -418
6465 -418 2284 2232 -943 -3065 -928 1723 2447 -108 -2527 -2089 377 1854 1318 -1095 -1653 -838 3450
6482 3450 2961 -500 -2108 -474 1353 2688 -449 -2244 -2260 213 1983 811 -2489 -2282 373 2080
6498 2080 2307 -420 -1074 -250 1938 2696 912 -1856 -1679 179 2102 938 -2125 -2860 -412 2116
6514 2116 1347 -1042 -1925 -596 2435 2508 1591 -2452 -1529 1439 1848 1045 -1930 -2385 -1177 1473 1326
6531 1326 -1333 -2509 -997 1044 2636 432 -1930 -1591 1173 2498 2100 -1295 -2241 -359 1785 1272
6547 1272 -885 -2956 -2042 1672 2218 -413 -1553 -1008 674 2433 1652 -557 -1851 -205 1935 2112
6563 2112 -1016 -3010 -1396 1078 1135 -24 -2450 -2376 984 2109 1478 -1409 -2531 -272 2116 1669
6579 1669 109 -2007 -1031 1573 1824 -324 -1614 -2147 641 2255 479 -2439 -1890 488 2852 1952
6595 1952 75 -937 -267 1788 2217 442 -2812 -2308 -132 1483 574 -1493 -2583 -394 1348 1285
6611 1285 -1334 -1377 -581 1525 1762 144 -2124 -1239 1383 1320 205 -2086 -2428 -95 1007 1189 -1038
6628 -1038 -2207 -652 1551 1677 -239 -1351 -813 1272 2857 878 -1241 -2158 -588 2147 757 -1186
6644 -1186 -2838 -817 915 2263 822 -1710 -1284 1205 2853 1120 -1112 -2163 -633 1246 1279 -1437
6660 -1437 -2747 -1855 1574 1801 -628 -1835 -1264 1649 2443 1767 -1173 -1576 546 2312 1301 -786
6676 -786 -2350 -1682 1191 923 -162 -2378 -2044 772 1932 654 -1082 -1491 1022 1587 2396 2 -2198
6693 -2198 -529 1989 1463 -612 -2764 -1904 889 1749 242 -1447 -2266 845 2776 1375 258 -1969
6709 -1969 -452 2031 2424 -548 -1879 -1779 483 893 261 -1445 -2698 -262 1898 2051 -1157 -1925
6725 -1925 171 1760 1750 489 -1612 -1488 951 2203 -366 -1819 -2399 -6 675 894 -558 -1806
6741 -1806 -999 1751 2338 -214 -1081 -1583 1535 2463 786 -1372 -1640 -401 1061 -4 -1436 -2484
6757 -2484 -1306 1315 1771 -203 -2115 -1550 1328 2347 1583 -924 -1946 700 2402 828 -1207 -2810
6773 -2810 -1639 743 1591 227 -1764 -781 1035 2200 832 -1439 -958 853 2248 1170 -1053 -2228
6789 -2228 -978 1687 901 -992 -2814 -1628 348 1880 221 -1613 -729 655 1809 1653 -941 -1618
6805 -1618 -142 2099 1455 -389 -2839 -1999 1301 1489 218 -1943 -1866 1473 1581 1263 -87 -929 170
6822 170 2367 1818 -419 -1603 -861 856 1068 -180 -2172 -1517 817 1762 668 -1396 -1925 33 2144
6839 2144 2348 167 -1243 -386 1380 2042 -135 -1812 -1582 -121 955 1026 -1616 -2037 -639 1242 1302
6856 1302 -107 -987 -566 1573 2203 517 -1046 -1354 -402 1729 1195 -1394 -2690 -956 712 1437 -427
6873 -427 -2195 -111 1778 2315 674 -1242 -1299 982 1716 1128 -1352 -2096 -581 1233 674 -762 -2137
6890 -2137 -1435 2078 2526 -47 -1120 -1417 1040 2860 1331 -1052 -1629 -203 1654 941 -740 -2594
6906 -2594 -1325 684 1151 527 -1409 -719 1467 2232 1626 -618 -1765 697 2356 1387 -888 -1657 -1200
6923 -1200 -165 735 -653 -2166 -852 730 2169 1130 -450 -1343 531 2432 1440 35 -1062 -833
6939 -833 1153 674 46 -1764 -1524 45 1713 1061 -1207 -1467 1025 2124 1016 -365 -1391 522
6955 522 1746 1018 -853 -1950 -1685 638 1339 166 -1415 -2160 325 1101 1388 -732 -1701 -251 2104
6972 2104 2234 60 -1728 -700 422 1043 814 -1251 -1932 -652 1353 978 -403 -1448 -195 1081
6988 1081 2605 1051 -1271 -1098 1888 2399 355 -725 -1837 -707 848 1133 -935 -2373 -1281 1004
7004 1004 2144 530 -1571 -762 986 1813 1308 -828 -1076 112 1514 818 -1281 -2144 -1725 364 1280
7021 1280 -242 -1263 -935 1243 1589 1542 -1765 -1073 173 1457 1239 -1193 -1823 -736 649 1789 -350
7038 -350 -2354 -1753 346 1535 638 -756 -1370 521 2270 1939 -440 -1191 -264 1628 860 -527 -2514
7055 -2514 -1585 185 1452 170 -1013 -1890 639 1229 868 -447 -1209 10 1736 2249 -242 -1708
7071 -1708 -1301 269 868 256 -1760 -1807 -732 1973 434 -422 -1669 216 1599 1571 -23 -1858 -1051
7088 -1051 324 1422 475 -1510 -1799 -466 1248 1848 -550 -1894 -722 1794 2240 400 -1237 -797
7104 -797 481 1537 1272 -745 -1652 -1049 1358 709 -1263 -2251 -2046 442 1671 372 -1402 -791 728
7121 728 2576 938 -408 -1459 275 1727 861 -536 -2086 -1534 -57 1181 -722 -2449 -1823 917
7137 917 2282 1091 -779 -1217 392 1987 1417 -239 -1738 -833 753 1324 -644 -2354 -1445 1018
7153 1018 1917 619 -802 -1580 310 2229 1303 604 -1273 -179 1011 1159 -366 -1495 -1718 422
7169 422 1182 687 -1406 -2426 147 1465 1680 -452 -1444 -71 1785 1944 351 -1147 -1325 334 1144
7186 1144 -77 -1498 -1595 165 1323 1212 -299 -1734 -385 1298 2806 340 -1160 -955 925 1876
7202 1876 526 -706 -1919 -980 920 1000 -1315 -1351 -567 1001 1874 -173 -838 -937 1555 1698 844 -1671
7220 -1671 -1148 -898 1030 444 -1053 -1776 -1048 890 1467 -580 -1137 -848 1382 1931 418 -1185 -1701
7237 -1701 430 1534 1377 -799 -2214 -1174 800 1756 142 -1761 -1267 527 1893 923 -1465 -1055
7253 -1055 868 1926 1668 -1313 -1676 -611 1392 1445 -874 -1983 -1873 1010 659 713 -849 -1632 745
7270 745 1891 1636 -191 -1260 -950 1746 1194 616 -1917 -1123 808 1208 -32 -1878 -1932 749 1971
7287 1971 1194 -131 -740 46 2179 2292 -229 -653 -606 1607 1265 100 -1865 -2078 -154 725 972 -923
7305 -923 -1663 -328 1655 1335 151 -1342 -195 1294 1584 242 -1751 -2361 -236 1247 -129 -1543
7321 -1543 -2034 -708 1593 743 -63 -892 96 771 2063 1076 -1392 -1746 224 659 584 -769 -2017 -746
7339 -746 813 1085 -607 -1005 -690 1038 2324 1583 -926 -1643 407 2328 837 -545 -1719 -1283 631
7356 631 1264 -783 -1811 -807 666 1304 1257 -900 -613 611 1977 1490 -814 -2037 199 851 343
7373 343 -885 -2453 -1330 449 658 593 -1269 -1573 550 1976 473 -153 -1385 282 1702 2122 -543
7390 -543 -1670 -1294 409 1330 -257 -1698 -1318 343 1223 1224 384 -612 -40 1387 1914 554 -1075 -1020
7408 -1020 673 871 -339 -1590 -2315 -64 283 599 -301 -1755 -309 1298 2018 172 -769 -679 1643
7425 1643 1301 1254 -1291 -1820 -302 1039 -155 -950 -1842 -857 1107 1674 426 -1131 -500 1653 2215
7442 2215 659 -402 -1198 217 1293 437 -1444 -1805 -642 632 517 -587 -973 -926 524 1939 1344
7459 1344 -591 -807 634 1674 1307 -711 -1474 -391 840 546 -522 -1972 -1421 618 1588 -448
7475 -448 -875 -880 670 1593 1355 -1449 -1027 -276 1064 1370 -970 -2255 -1031 961 890 -460 -1332 -1007
7493 -1007 83 1741 1670 2 -1085 -645 2019 1422 -127 -1869 -1365 575 1255 -810 -1680 -1558 717
7510 717 1832 1156 254 -707 437 1869 2334 51 -1519 -950 808 1476 -645 -2199 -1765 -328 737
7527 737 423 -1365 -1826 67 1691 1425 106 -1457 38 1519 2170 768 -1615 -911 7 1128 166
7544 166 -1486 -1773 -506 1134 1113 -61 -1124 -134 1136 1725 23 -793 -1188 567 2001 782 -1003
7561 -1003 -2041 -286 324 755 -666 -1429 -735 1702 1728 388 -643 -638 1532 1576 936 -762 -2033 -1320
7579 -1320 1205 -68 -917 -1698 -1172 503 960 528 -802 -1393 520 2677 1505 -399 -899 -233 1611
7596 1611 1691 68 -1764 -180 575 1312 -240 -1675 -876 640 1869 1101 -350 -932 291 1793 1647
7613 1647 -387 -1750 -751 287 771 142 -1272 -2249 -87 1134 75 -990 -1080 -817 1863 1657 258
7630 258 -429 -433 954 1403 451 -2123 -1669 -767 1331 593 -1057 -2591 -652 1800 1208 -9 -1074 -440
7648 -440 1116 2076 120 -1375 -1337 678 1658 871 -1678 -2471 -286 1334 1230 -902 -908 -499 1433 1787
7666 1787 640 -1046 -1490 1048 2206 678 -1080 -2078 -753 1179 707 -1613 -1923 -1059 648 1518
7682 1518 120 -1168 -671 1088 1459 1000 -790 -1144 -362 1414 264 -970 -1765 -1476 1222 832 248
7699 248 -1254 -914 902 1827 1771 -619 -1311 280 1841 1457 -605 -1573 -1629 324 955 -1037 -1815 -1631
7717 -1631 595 1533 1046 -1421 -835 544 1818 1419 571 -1339 -1473 531 1336 -522 -1988 -1862 169
7734 169 1187 1055 -713 -1352 163 1997 2150 161 -966 -328 1201 1998 51 -1553 -1491 342 795
7751 795 462 -1616 -1818 -872 1139 2048 -196 -688 -237 1425 2306 1225 -1472 -1170 55 739 372 -1648
7769 -1648 -2377 -940 1169 798 -551 -1891 -424 1610 1862 1053 -1002 -837 1565 1546 596 -1210 -2192
7786 -2192 -955 1085 1289 -747 -2318 -281 938 832 -127 -869 -699 752 2352 1139 -923 -1839
7802 -1839 -255 1443 551 -1117 -2217 -701 460 1249 47 -1320 -492 853 1914 1057 -964 -1155
7818 -1155 513 2438 1906 -787 -1667 -1341 73 1538 -696 -1896 -1735 533 1560 818 -742 -1571
7834 -1571 603 2534 2232 -393 -1528 -623 1879 1204 204 -1335 -1288 -149 1056 347 -1482 -1691 109
7851 109 1747 2048 -615 -1019 205 2334 1997 -231 -1294 -1340 230 640 -33 -1538 -2086 -634 1400
7868 1400 1087 442 -776 -681 1956 1789 539 -814 -866 444 1629 883 -1350 -2468 -304 726 647
7885 647 -1217 -2069 -1283 958 1944 304 -1031 -1192 886 2202 943 -1566 -1833 56 358 916 -1051
7902 -1051 -2119 -1368 569 838 135 -1598 -1414 896 1672 765 -677 -600 -233 1570 986 -1158 -1889 -1133
7920 -1133 619 799 48 -2090 -1216 636 2183 778 -581 -1016 777 1791 1564 -611 -2144 -821
7936 -821 917 1574 -13 -1792 -907 -104 1087 854 -1520 -1344 -150 1945 2080 -158 -1016 -407 989
7953 989 1473 -679 -1174 -2153 -144 919 -3 -1473 -1704 -299 1217 1785 1056 -947 293 1345 2314
7970 2314 448 -1625 -774 249 1434 -370 -1850 -1994 -862 1570 1214 -188 -1819 -762 2148 2560
7986 2560 902 -872 -379 1355 1227 570 -1544 -2013 -819 292 1489 -626 -1931 -899 1038 1405
8002 1405 189 -1108 -925 1057 1942 585 -1042 -1066 -774 1262 462 -886 -2388 -1288 1065 1187 115
8019 115 -2005 -481 1049 1565 1864 -1124 -1118 113 1893 627 -1124 -1538 -1165 742 1422 -309 -2595
8036 -2595 -1703 476 2143 1235 -254 -939 202 2069 1253 -1033 -1447 -342 1178 1092 -175 -2006 -1578
8053 -1578 200 653 344 -1349 -1462 46 1904 1786 -320 -1186 202 1483 1396 164 -1850 -1256 29
8070 29 1633 -234 -1542 -2196 -270 595 1435 -288 -1353 896 2095 1969 749 -927 -899 251 547
8087 547 -221 -1390 -1536 -773 2163 249 -885 -1823 85 2004 2376 507 -935 -447 1512 2368 1199
8104 1199 -1697 -2363 -936 373 890 -709 -1315 -396 1494 1428 974 -1188 -678 1434 2236 1372 -943
8121 -943 -1112 -309 1538 665 -1425 -1680 -1425 1164 1600 -1087 -1513 -649 972 2215 826 -238 -1341
8138 -1341 686 2004 1582 -858 -2257 -993 940 550 -291 -1793 -2466 104 1623 720 -761 -1926
8154 -1926 1241 2363 989 -961 -1195 -343 1319 582 -1052 -1733 -1865 673 1857 161 -2033 -1777
8170 -1777 315 1861 1696 -1034 -666 70 1147 1816 106 -1301 -1936 58 1087 231 -1785 -1926 39
8187 39 1455 672 -260 -1161
8191 -1161
$$ Imaginary data points
##PAGE= N=2
##DATA TABLE= (X++(I..I)), XYDATA
0 0 0 0 0 0 0 0 0 0 0 0 0 0 64 -64 64 -64 128 -128 129 -192 196 -256 320 -384 448 -512 579 -658 772
29 772 -899 1021 -1158 1310 -1482 1676 -1888 2116 -2367 2657 -2948 3281 -3648 4046 -4472 4960
45 4960 -5471 6031 -6654 7334 -8076 8891 -9811 10801 -11926 13197 -14612 16228
57 16228 -18101 20280 -22851 25977 -29817 34697 -41135 50052 -63250 84895 -126571 236576
69 236576 -1179077 -2670182 -52575 1889408 1656005 -337388 -1198735 -237382 1633665
78 1633665 2067735 511498 -1509844 -1453924 415755 1554477 204551 -1900147 -2219575
87 -2219575 -408140 1285034 1084790 -596935 -1549858 -459267 1614103 2211192 639080
96 639080 -1140670 -873265 963674 1893224 608658 -1384696 -1858862 -462978 1005360
105 1005360 771631 -930147 -1982722 -893150 1219562 1836439 333824 -1172773 -638495
114 -638495 1237831 2088456 890059 -976183 -1486987 -217224 1180071 807427 -1085800
123 -1085800 -2207528 -1135607 777571 1209862 -149209 -1394412 -861989 937144 1980893
132 1980893 1087098 -653859 -1114211 241064 1587060 1061207 -815353 -1856144 -982598
141 -982598 572001 871382 -448288 -1768240 -1370092 443912 1613394 845600 -726144
150 -726144 -982873 466258 1821388 1415563 -253188 -1249545 -549871 819570 1024717
159 1024717 -378513 -1801847 -1509546 151718 1143531 338031 -1085796 -1203398 252008
168 252008 1635905 1419350 -38723 -955655 -212407 1243837 1469411 -5649 -1476754
177 -1476754 -1251197 199581 953526 92311 -1290565 -1490473 -178207 1214603 1129933
186 1129933 -230409 -1044042 -135585 1428292 1667392 262385 -1082439 -869698 429395
195 429395 1092335 203654 -1297502 -1682219 -483596 858642 729291 -602796 -1296607
204 -1296607 -320413 1216890 1529877 387292 -739891 -523901 714417 1404941 554097
213 554097 -989817 -1456480 -365305 793746 474831 -917850 -1591134 -679237 760557
222 760557 1139749 199570 -796834 -536499 790177 1612114 868200 -577673 -981382 34251
232 34251 1020335 607657 -793978 -1565727 -852483 456186 810423 -160387 -1177100 -831874
242 -831874 621613 1509791 838078 -458759 -739384 301664 1315383 976459 -416338
251 -416338 -1299422 -721625 495656 757688 -325748 -1416327 -1097076 314312 1155148
260 1155148 519124 -649961 -792067 348357 1432255 1157491 -160670 -971854 -378866
269 -378866 768960 929154 -220080 -1356640 -1148981 92303 826752 202142 -916268
278 -916268 -1037997 114521 1239469 1057173 -107225 -750194 -77480 1042298 1164316
287 1164316 39704 -1072143 -932221 170786 776678 55544 -1145259 -1319231 -193788
296 -193788 915385 752488 -323948 -849010 -85154 1100263 1301775 286930 -723991
305 -723991 -548842 496631 996490 196660 -1038710 -1272385 -282568 674582 436131 -638012
315 -638012 -1140781 -350905 880292 1151258 234099 -652740 -370356 722923 1238302 479322
325 479322 -703701 -965626 -120705 674092 366350 -711426 -1252677 -566683 556871
334 556871 805638 -24270 -785533 -421789 706058 1269663 610271 -454330 -663519 143865
344 143865 873640 537226 -557716 -1171628 -624166 365165 563962 -242679 -988046 -654296
354 -654296 454519 1074869 545538 -386839 -515631 331705 1093639 781205 -311246 -938078
364 -938078 -429942 474471 563274 -338588 -1152934 -878852 181064 793088 308765 -562109
374 -562109 -642518 262609 1116891 910860 -88075 -655205 -138337 726203 760106 -184091
384 -184091 -1044547 -857072 82691 592182 55667 -830267 -908582 16841 915360 775242
394 775242 -128614 -595958 -14221 893776 991056 111589 -745529 -626318 221342 656485
404 656485 57377 -888202 -1026572 -172816 646060 482710 -359979 -742449 -111479 844113
414 844113 1019451 222055 -578952 -417858 459539 884894 237976 -768316 -972981 -204380
424 -204380 532825 326066 -538384 -949829 -330283 657672 889179 150062 -562913 -303591
434 -303591 628868 1062226 425288 -561262 -776016 -54379 625620 349192 -612597 -1112079
444 -1112079 -523836 460572 668486 -73049 -733425 -405277 572811 1068113 533243 -362067
454 -362067 -540498 178174 846988 542490 -465698 -1010542 -476270 407080 501851 -298368
464 -298368 -966980 -641107 345057 883144 406939 -426080 -522993 289540 1020202 740369
474 740369 -243045 -761965 -258248 537594 557991 -284346 -1009376 -757349 179438 682112
484 682112 161563 -669383 -679049 235347 1001524 729741 -190712 -613997 -56739 747092
494 747092 756241 -125691 -915316 -707701 197980 626087 19990 -836801 -825533 85418
504 85418 826504 569369 -281600 -611499 32104 882754 886476 1027 -738510 -486165
514 -486165 363225 673564 -1377 -873978 -904496 -69145 622691 357886 -468310 -748530
524 -748530 -53922 823476 861787 69831 -543903 -233798 574092 830617 151534 -710068
534 -710068 -778121 -36341 540149 192500 -659741 -933366 -243048 620968 676101 -54751
544 -54751 -590731 -216103 645142 951530 316549 -508057 -551666 168637 663848 236426
554 236426 -636813 -919489 -302043 458269 466738 -246812 -752463 -348542 552515 895350
564 895350 291152 -469569 -423497 338710 818530 391301 -459788 -777629 -252260 431812
574 431812 400200 -342380 -872194 -486896 378919 697212 148684 -494880 -378879 380107
584 380107 876708 517610 -285785 -603158 -90709 559349 460016 -337099 -887230 -548411
594 -548411 228198 497016 -16702 -615325 -502553 254774 804937 528414 -205823 -467036
604 -467036 78505 722223 604075 -189217 -737496 -442331 256490 453536 -118959 -768223
614 -768223 -680210 78571 634760 363339 -334844 -523748 88838 775369 708164 -20337
624 -20337 -532949 -252421 412248 570802 -42108 -729804 -683381 11892 489564 174518
634 174518 -506023 -659101 -39839 656062 642970 -10957 -469069 -152995 536615 711265
644 711265 110095 -576187 -570370 47878 466546 137660 -551524 -748345 -182420 487921
654 487921 483425 -127334 -512656 -137844 568085 760073 220355 -408986 -407298 177726 576918
665 576918 219942 -528255 -781426 -254216 374595 326745 -286482 -645094 -261151 446558
675 446558 691425 237016 -336418 -301132 323003 741710 366515 -393205 -644859 -149633
685 -149633 399637 288112 -360963 -764687 -428040 277518 549726 100347 -464856 -367023
695 -367023 327835 775478 440594 -237276 -439967 14511 511581 394747 -255866 -713953
705 -713953 -454307 198468 423712 -64442 -622782 -490717 216362 665425 379531 -216251
715 -216251 -370754 100443 623377 539804 -104706 -583138 -352676 249791 410228 -112698
725 -112698 -669257 -560516 81930 498731 243777 -310875 -433159 90377 663604 590595
735 590595 -43865 -465983 -182893 393128 495850 -43961 -609609 -560822 6803 391689
745 391689 124021 -451220 -572608 -26420 559975 514503 -42466 -378097 -69172 499894
755 499894 616413 103215 -461710 -439439 88214 410360 77406 -527658 -665104 -165196
765 -165196 378695 356218 -138898 -445615 -130970 472038 649197 196259 -316295 -267850
775 -267850 233050 503235 160289 -419564 -583089 -179988 278371 238678 -254053 -571940
785 -571940 -264719 347477 549349 140551 -309255 -217830 296856 594173 306463 -251388
795 -251388 -459918 -114397 322713 259910 -277516 -631964 -349518 222852 393572 13214
805 13214 -384874 -271648 259947 614843 381770 -165989 -367562 12909 462332 359986
815 359986 -215218 -582175 -344867 148888 289182 -69500 -474894 -404123 120006 518004
825 518004 338278 -161279 -312237 97689 544545 453595 -75381 -429142 -245444 192567
835 192567 315074 -71988 -540225 -518400 -4944 386540 203095 -266900 -379369 44602
845 44602 511672 491988 41523 -295706 -129344 316981 448105 28721 -479776 -479305 -7874
856 -7874 313706 84077 -388049 -501828 -88392 398901 423217 -2488 -321983 -104254
866 -104254 403313 561269 146550 -351310 -358683 70499 355878 115224 -387260 -555083
876 -555083 -180824 294294 306569 -123289 -413558 -150679 379337 553751 184503 -264124
886 -264124 -259572 165071 464091 225843 -312823 -531419 -193121 249188 231438 -211971
896 -211971 -505772 -261027 256134 460681 152304 -252299 -224566 231511 558267 326951
906 326951 -205728 -412320 -87230 308761 245387 -230477 -562661 -356958 148012 356656
916 356656 41018 -369762 -308588 198970 554827 348449 -134927 -295420 34783 417968
926 417968 350455 -135273 -499253 -324396 151889 311314 -63336 -494869 -418759 97706
936 97706 449381 257930 -185261 -306575 59872 485798 450735 -26221 -383586 -208109
946 -208109 241689 352323 -50194 -489874 -442444 17324 329500 140989 -281961 -383963
956 -383963 10727 460899 436846 -13100 -315192 -100229 337025 424844 27379 -408996
966 -408996 -396428 9917 289687 85859 -351654 -462955 -73514 365299 342554 -63655
976 -63655 -304475 -57670 383237 483340 110440 -306371 -288916 104927 347844 96559
986 96559 -372020 -498979 -138365 262533 226632 -165700 -392985 -138162 327466 469733
996 469733 138645 -237032 -184803 218208 444896 182786 -279521 -412507 -96672 243201
1006 243201 170010 -235677 -477201 -238669 217913 366190 60287 -275977 -192682 227259
1016 227259 477972 257087 -167910 -297198 -10657 300016 214916 -197752 -459333 -259573
1026 -259573 150258 265543 -37077 -351113 -253398 167577 431190 245576 -141203 -243874
1036 -243874 59420 382293 300622 -120022 -394625 -219063 154470 236661 -79982 -405036
1046 -405036 -327431 78064 341881 172494 -185939 -251891 82092 422839 352232 -50229
1056 -50229 -303333 -120101 236705 290389 -58780 -412146 -359056 20597 257905 75199
1066 75199 -276079 -328347 15292 367383 326211 -25464 -232242 -33761 314198 365194
1076 365194 29119 -315121 -283526 51395 244122 33471 -330689 -399199 -72813 266417
1086 266417 232489 -93022 -269547 -53331 312374 394827 98755 -223470 -190515 131814
1096 131814 307796 84570 -290849 -377096 -85012 211592 151016 -176914 -345634 -118659
1106 -118659 257712 353791 74696 -214903 -145671 196067 373823 154632 -215286 -312174
1116 -312174 -49253 217598 137994 -205922 -393689 -186005 177618 270016 7664 -247265
1126 -247265 -146681 207099 394388 197080 -145113 -226050 31504 283555 183819 -176877
1136 -176877 -387057 -208763 124858 198230 -65725 -315608 -218067 133578 337626 176026
1146 176026 -126530 -177614 93214 344495 248494 -97966 -295698 -133373 155512 189003
1156 189003 -90967 -353444 -278019 55961 256269 94994 -197781 -222308 77921 344827
1166 344827 266820 -44653 -208666 -47496 221803 244242 -40070 -314930 -260014 44962
1176 44962 206513 17379 -270259 -276382 22845 281892 221155 -57098 -197798 -18201
1186 -18201 271811 306072 21549 -249021 -193173 85119 204917 4228 -273294 -295805
1196 -295805 -40106 198852 152507 -104319 -228351 -30978 267844 307660 47429 -185006
1206 -185006 -112685 145882 245355 49501 -227264 -278914 -63614 151425 99044 -159211
1216 -159211 -284989 -94233 196644 248742 30577 -157660 -73738 178591 291944 121332
1226 121332 -146687 -209609 -8741 184855 98983 -181639 -312649 -139085 123543 170551
1236 170551 -27776 -204744 -122155 146711 294089 150082 -104148 -150468 60334 240839
1246 240839 143620 -128464 -264946 -126372 101143 135126 -69479 -257054 -179048 91161
1256 91161 241917 107446 -118677 -140532 75711 264185 195952 -54319 -202780 -89483
1266 -89483 126724 155192 -60289 -261250 -202352 38930 170978 48805 -154600 -169677
1276 -169677 44146 248468 209102 -23536 -162604 -37283 185777 204779 -21837 -229980
1286 -229980 -190242 24579 142737 19694 -194038 -226645 -15539 202226 173008 -45678
1296 -45678 -156314 -7195 216318 236356 31794 -163524 -134704 64425 173462 32238
1306 32238 -210580 -259407 -52183 153184 109502 -103525 -197478 -46331 180525 231891 62978
1317 62978 -119627 -93734 112368 227610 81171 -165768 -218328 -33686 136200 76752
1327 76752 -132014 -235003 -103621 122653 192661 33588 -145492 -99002 130482 254545
1337 254545 115535 -112651 -160997 928 155093 103831 -108734 -239787 -132107 89973
1347 89973 150895 -20054 -190642 -122232 114231 235352 112639 -88961 -126464 37741
1357 37741 201713 151596 -76327 -222170 -117307 93384 131006 -53765 -225077 -160819
1367 -160819 62806 187670 85412 -101796 -130432 52988 231699 182173 -42013 -170354
1377 -170354 -59637 131467 146703 -45390 -223514 -180758 25578 147172 42006 -152017
1387 -152017 -173480 22472 208344 169264 -26950 -129862 -17752 163412 183557 3001
1397 3001 -175326 -148163 40254 139911 15853 -181584 -201971 -16307 155637 122967 -53680
1408 -53680 -145802 -27930 169974 206991 33085 -140408 -103124 81928 163940 30830 -162000
1419 -162000 -190213 -32879 119940 86706 -89867 -181625 -52430 155636 189776 20771
1429 20771 -128012 -69693 112275 189873 63427 -125215 -168820 -27319 117781 75615 -111012
1440 -111012 -206120 -81090 112141 145517 -2408 -125355 -66892 111215 201121 95375
1450 95375 -85375 -128085 12763 149672 90792 -104481 -200250 -91137 76785 102180 -33079
1461 -33079 -155898 -107537 73475 182374 92153 -77003 -103706 47316 179177 119541 -63419
1472 -63419 -155389 -63748 84035 100684 -44788 -181815 -137876 43629 146211 51251 -106238
1483 -106238 -114416 43214 179199 134259 -32419 -121242 -35169 113093 126478 -28128 -170886
1494 -170886 -131448 34553 116365 17432 -130722 -134677 18852 155576 122599 -32538 -112957
1505 -112957 -16898 138032 151104 -2414 -142267 -108808 40188 110357 12220 -137492 -153541
1516 -153541 -12653 120762 91454 -52034 -117064 -13355 138649 154812 18928 -105276
1526 -105276 -72332 67360 132293 28852 -129820 -155987 -22848 97601 60019 -82323
1536 -82323 -144360 -41395 109588 135931 17571 -92181 -52726 91990 158784 55589 -98630
1547 -98630 -120246 1653 103507 51469 -94355 -159519 -64103 80830 107181 -11999 -115647
1558 -115647 -64957 88083 157466 63765 -73601 -89427 23683 117591 70200 -71380 -144099
1569 -144099 -62459 70334 86035 -34358 -133487 -78364 67980 134409 51022 -70049 -79104
1580 -79104 35337 133919 90908 -48437 -121595 -45420 75465 80680 -39157 -137709 -93147
1591 -93147 38514 102903 28600 -82262 -84306 35507 136336 96697 -33720 -92219 -12960
1602 -12960 96929 93256 -29507 -129143 -92721 28688 83658 6106 -105088 -104400 16061
1613 16061 114449 79860 -35319 -79343 3055 109500 106171 -6691 -98467 -64759 43698
1624 43698 84430 1370 -109239 -110127 -2325 85912 52544 -53452 -92523 -9659 98601
1635 98601 106672 6938 -75646 -41862 60090 96631 16967 -87180 -95027 -4013 69628 34499
1647 34499 -65114 -103131 -25656 79061 87853 -2168 -71559 -32130 67207 105818 32814 -65868
1659 -65868 -77009 4728 71772 33627 -65537 -105153 -37292 56875 64787 -15810 -77200 -36292
1671 -36292 63289 104956 39028 -50890 -56149 24598 85836 44592 -53714 -97149 -38737 45265
1683 45265 50651 -29062 -90779 -55318 40128 84849 31152 -47706 -48311 30908 92264 59834
1695 59834 -29816 -73015 -21660 53029 53210 -27737 -93033 -65240 22623 63885 14444 -59063
1707 -59063 -59934 18350 85604 63336 -18265 -57205 -7441 65271 65145 -12408 -78207 -56320 20120
1720 20120 53416 3342 -68964 -70515 6015 71269 52076 -24751 -56972 -3433 70450 73567
1732 73567 1010 -62480 -44623 26751 57872 5922 -67950 -74167 -4738 55514 34777 -34887
1744 -34887 -61834 -8061 65371 72871 7930 -50016 -30578 39038 69400 16962 -57883 -69141
1756 -69141 -8326 46567 25672 -42194 -72752 -24688 48198 62004 4611 -46046 -24744 43797
1768 43797 75705 29895 -39430 -50634 3523 52112 28546 -42396 -77591 -33418 34568 46321
1780 46321 -9426 -58442 -35320 35446 72171 33900 -31110 -41407 15682 63198 39270 -30639
1792 -30639 -64943 -27043 33561 39048 -17786 -65968 -44672 25409 61521 22687 -38132 -41540
1804 -41540 17917 67097 46326 -19122 -52539 -17530 37801 42168 -12939 -64307 -49454 15287
1816 15287 49238 11714 -44039 -44972 13702 61487 45364 -12977 -42987 -8810 46821 52315
1828 52315 -5455 -58620 -44465 13740 41337 3693 -49652 -52434 -566 48003 38187 -13727
1840 -13727 -41961 -4646 52558 57718 2361 -44562 -29628 22254 43003 5509 -48906 -56099
1852 -56099 -8293 38814 28034 -25816 -51024 -12037 45461 52735 5565 -36128 -20099 29747
1864 29747 51306 15668 -37754 -48197 -3221 36877 20696 -31530 -55985 -19371 34606 42446
1876 42446 95 -37878 -22333 28864 54715 23756 -28640 -39419 2705 39782 23945 -26764
1888 -26764 -52046 -23590 24987 34218 -4005 -42064 -26893 24683 51513 22137 -24583 -31183
1900 -31183 9209 44626 30524 -19375 -48365 -24082 23194 30843 -10665 -47383 -33215 14699
1912 14699 41910 17317 -23522 -29552 10085 48862 38077 -10684 -38598 -12393 30824 33041
1924 33041 -10065 -46802 -36835 7761 33273 10454 -30719 -38190 2212 44171 36112 -8380
1936 -8380 -32065 -5912 34384 38191 -513 -37253 -30608 8706 32821 8532 -35512 -43735 -3055
1949 -3055 36906 27303 -13853 -33598 -7456 32273 41422 7141 -29928 -26547 12991 36820 11044
1962 11044 -33328 -41168 -4854 28071 20511 -16514 -35322 -12120 29390 40902 7785 -27970
1974 -27970 -21382 19268 41220 13836 -28241 -36995 -5261 25472 18102 -18442 -40342 -18188
1986 -18188 23303 34995 3003 -29711 -18870 22043 41454 18818 -20052 -28750 -3 29773
1998 29773 22103 -17788 -41661 -20733 19162 26861 -3616 -34057 -23249 13723 36996 19435
2010 19435 -15332 -24624 3695 34572 26433 -10702 -33269 -16169 17357 23945 -4208 -34367
2022 -34367 -28724 7733 31592 14567 -19558 -27052 3843 34168 27882 -6187 -27035 -11563
2034 -11563 19218 26223 -1994 -32277 -28329 6204 26422 8846 -22691 -26901 1551 29690
2046 29690 24798 -4977 -24395 -9162 23498 31286 2064 -29019 -24307 6090 23393 5175
2058 5175 -23520 -28891 -4283 22301 22192 -5882 -24401 -7282 25042 31996 5105 -21314 -17096
2071 -17096 9407 24565 8805 -20417 -30253 -9508 17805 17145 -10235 -28689 -12041 19609
2083 19609 28427 5996 -17142 -12804 10761 26572 14091 -15031 -26231 -6266 18284 15072
2095 15072 -13022 -29491 -14404 12344 23017 4376 -17291 -15866 9162 27736 16663 -10959
2107 -10959 -21184 -2864 20779 15883 -8940 -25177 -15554 9339 18465 1871 -20435 -18631 6827
2120 6827 25679 15123 -10251 -18046 254 20833 18799 -3382 -22325 -15884 7858 18284 818
2133 818 -22208 -21196 2063 19648 12542 -7992 -16449 -1654 21386 22907 737 -18987 -13159
2146 -13159 10756 19470 1684 -21025 -22328 -1234 15105 9979 -11158 -20706 -6038 18793 22299
2159 22299 1128 -15645 -8556 12810 21612 6703 -15294 -19038 -999 15579 9870 -13101 -24438
2172 -24438 -8968 14470 17687 -1037 -16624 -10212 11734 22635 10878 -10724 -17371 762
2184 762 18030 12355 -11234 -22946 -9126 10872 13863 -2405 -18158 -13277 8441 21981 11137
2197 11137 -9967 -15225 2819 19230 14331 -7229 -20001 -9694 9084 12944 -1500 -19157
2209 -19157 -16727 4725 18949 9286 -10697 -13860 3400 20622 16355 -3723 -16053 -7491 11359
2222 11359 16032 -689 -19529 -17714 2407 15608 5990 -13082 -16966 -190 17617 16905 -1246
2235 -1246 -13601 -5479 14482 19797 2083 -16550 -14914 3110 13779 4769 -14819 -19620 -5361
2248 -5361 14239 14349 -2952 -15442 -6482 13602 20688 5305 -12811 -12444 3526 15468 7500
2261 7500 -11939 -19455 -6137 12221 12401 -5282 -17141 -8255 11116 18375 5613 -11549 -11679
2274 -11679 5539 18341 10150 -9469 -18022 -5480 11860 11163 -6394 -18588 -10457 8162 16805
2287 16805 4687 -12178 -11793 6282 19731 12336 -8101 -15686 -3106 13417 12317 -5029 -19264
2300 -19264 -12995 5071 14039 2939 -13922 -13979 4028 18595 12202 -4378 -13528 -1490 15355
2313 15355 15161 -2345 -16889 -12299 5097 13617 1563 -15833 -17305 7 15312 10695 -6071
2326 -6071 -14424 -3045 15278 16997 1951 -13471 -9225 7158 15119 3739 -14021 -16552 -1792
2339 -1792 13165 8879 -8494 -16716 -4557 13953 16822 991 -13503 -8814 8640 18078 6506
2352 6506 -12841 -16422 -986 13248 8740 -9329 -17951 -6744 11934 15420 -401 -12570 -9007
2365 -9007 9972 18664 7505 -11354 -14427 754 14725 10052 -10274 -19530 -9081 8709 13446
2378 13446 -1221 -15575 -11009 7491 18979 8802 -8458 -12597 2714 17008 12481 -7004
2390 -7004 -17457 -8273 9024 11513 -3241 -18101 -14014 5402 16429 7235 -10585 -13943 2497
2403 2497 18545 14819 -3706 -14726 -5378 11639 13806 -1729 -17251 -13376 4464 14157 3898
2416 3898 -13421 -15423 978 17689 12842 -4787 -14395 -4461 13844 16682 108 -16264 -13541
2429 -13541 4624 14606 4157 -13612 -16952 -511 14676 12512 -5200 -14546 -3589 15210 18473
2442 18473 1241 -15030 -11279 6966 14704 4252 -13782 -18020 -3043 12413 10270 -7968 -16807
2455 -16807 -5426 14123 17286 1646 -12467 -7416 8800 17557 6594 -11611 -15947 -986 13659
2468 13659 9343 -9996 -19376 -7884 11311 14418 356 -13720 -9393 8775 18711 8157 -9728
2481 -9728 -13558 2000 16483 9309 -8952 -17138 -7048 10964 12500 -2492 -16609 -11990 7796
2494 7796 17519 7396 -11160 -13344 3000 16968 10668 -6600 -16413 -6080 9895 12313 -2094
2507 -2094 -16846 -12055 5934 16045 5465 -10096 -12606 3212 16757 11864 -5582 -15337 -5674
2520 -5674 11874 13681 -3013 -17172 -12443 4884 13327 3635 -11522 -13583 1677 15432 13226
2533 13226 -4429 -13354 -2273 14295 15157 -1128 -14597 -10465 5208 13406 2598 -13157 -16442
2546 -16442 -1136 14696 9790 -7337 -14368 -2777 12845 14943 2068 -11655 -8512 6955 15184
2559 15184 3808 -13458 -15713 237 12728 6517 -9910 -14937 -5231 11425 14613 903 -13274
2572 -13274 -9737 8018 16544 5019 -11436 -13283 995 12620 8096 -7632 -15100 -6117 10378
2585 10378 13793 -634 -13413 -8627 9579 16458 4671 -10133 -12513 1574 13330 9482 -7555
2598 -7555 -17035 -6712 9412 12076 -3578 -16003 -9149 7646 15090 5736 -8535 -9920 2850
2611 2850 15632 11311 -6818 -15563 -4996 10566 10793 -5125 -16187 -10401 4060 13404 4302
2624 4302 -10497 -12186 2704 16402 11427 -5188 -12956 -3047 11263 11942 -1903 -14217 -10503
2637 -10503 5138 12667 3033 -13163 -14004 1676 15072 9625 -5985 -13033 -2866 11834 13313
2650 13313 -417 -14005 -9182 6531 13648 2264 -12586 -12682 1127 12915 8259 -6257 -13738
2663 -13738 -2751 12717 14838 -934 -13569 -7199 8755 14302 2385 -11477 -12870 -977 11351
2676 11351 7672 -7240 -14776 -3938 11822 13862 -580 -11356 -5092 9103 14564 4366 -9899
2689 -9899 -12631 806 12935 7425 -10351 -16216 -4353 9690 10275 -2058 -12183 -6810 6908
2702 6908 14524 5455 -9492 -10771 2903 14919 7750 -8323 -13737 -4113 8949 9603 -2521 -13838
2716 -13838 -9602 6253 15005 4138 -11138 -10719 4118 14979 8590 -5632 -12198 -2882 9792
2729 9792 10356 -3609 -14618 -9279 7052 11922 2073 -11524 -10274 3671 13823 8661 -5042
2742 -5042 -12847 -2661 11915 11674 -2715 -14623 -9319 5893 11674 1841 -11155 -11441 1634 12858
2756 12858 8869 -5138 -12038 -963 13670 11108 -1712 -12330 -6881 6113 12311 1264 -11763
2769 -11763 -13162 -55 12518 7523 -6690 -12390 -1538 11721 12163 -222 -11192 -6365 7527
2782 7527 14296 3772 -10501 -11865 1093 11522 5161 -9409 -14516 -3155 10010 11367 -2118
2795 -2118 -12615 -7496 8323 14460 3798 -10121 -9979 3306 11841 6949 -7442 -13974 -3760
2808 -3760 10263 10076 -1858 -14261 -7518 7995 14660 3315 -10391 -10195 1957 12968 8543
2821 8543 -5920 -14306 -4319 10858 11248 -2993 -13990 -7826 6309 13005 2937 -9751 -10147 3334
2835 3334 14935 9770 -6842 -13389 -2257 11293 10334 -3900 -13751 -8871 5222 11239 2027 -11065
2849 -11065 -11441 2799 14733 8928 -5849 -11087 -715 12274 11580 -2427 -13145 -7868 6243
2862 6243 12630 1517 -13041 -12931 2474 12843 6841 -7098 -12736 -1866 12106 12839 -853
2875 -853 -12448 -7061 7564 13422 1393 -12225 -11969 2516 11867 6495 -8374 -13612 -2535 12050
2889 12050 12596 -2574 -12878 -6622 8962 14042 2456 -11877 -11359 2143 12087 5894 -8219
2902 -8219 -13916 -2403 11333 10976 -3046 -12206 -4853 9917 13350 2869 -11106 -10872 3256 13609
2916 13609 6405 -10921 -14480 -2605 9859 9395 -4380 -12881 -6307 8113 13457 2548 -10124
2929 -10124 -9343 5297 14259 6458 -8255 -12397 -1590 10877 9094 -4323 -14656 -7673 7140
2942 7140 11586 1707 -11342 -9788 3593 14233 6980 -7499 -11539 -405 11728 10641 -4587
2955 -4587 -13071 -6110 7325 11302 217 -12348 -10627 4317 12800 5800 -6896 -12329 -821
2968 -821 12497 9711 -3600 -12666 -6594 7880 10917 -710 -11174 -9642 3947 12127 5140 -7757
2982 -7757 -10637 855 13054 10394 -3461 -11329 -5171 8086 11236 125 -12062 -10970 2065
2995 2065 11454 4802 -8868 -11385 -1080 10827 9804 -3229 -10100 -3993 10225 12137 1135
3008 1135 -10463 -8577 3872 11165 3923 -10278 -12838 -3119 10194 8007 -4394 -11841 -5182 8724
3022 8724 12559 1408 -10430 -7977 4011 12298 4514 -8138 -11186 -309 10807 7819 -5388
3035 -5388 -12341 -5557 8166 11203 583 -10285 -8071 5023 13372 5426 -7567 -11480 -922
3048 -922 10239 7681 -4391 -11829 -4428 8118 11575 -177 -9431 -6708 5453 12378 5072 -7336
3062 -7336 -9765 -196 11068 8304 -4316 -13110 -5334 6673 10224 -270 -10823 -8222 4046
3075 4046 11492 5168 -6392 -8797 1138 11367 8315 -4568 -10756 -3813 8379 9411 -1662 -11937
3089 -11937 -8807 3160 10876 3588 -8560 -10432 296 11435 8296 -3707 -10523 -2504 8396
3102 8396 9443 -674 -9947 -7338 4077 9980 3081 -9205 -10856 544 10839 6214 -4416
3115 -4416 -9904 -3682 6968 10079 -273 -10658 -7388 4714 10587 2986 -8473 -8741 288 8894
3129 8894 6863 -4075 -9843 -3641 8588 10308 -14 -9728 -6626 5333 10266 2914 -7947 -10393
3143 -10393 -720 8893 5882 -5033 -10311 -3532 7587 9014 -390 -8693 -4829 6242 11067 4125
3157 4125 -7032 -8415 678 9504 5711 -6369 -10999 -3453 6564 7637 -1368 -9172 -6998 3552
3171 3552 9992 3501 -7138 -8106 1795 9191 6065 -4913 -8780 -2971 7093 8319 -1105 -9567
3185 -9567 -7736 3708 10540 1971 -8248 -7975 1603 9162 5704 -3127 -8775 -3707 6788 8926
3199 8926 -408 -9222 -6574 4718 8608 2240 -7157 -7244 788 8819 6321 -3975 -9392 -3245 7955
3214 7955 8619 -2126 -10314 -6542 4093 7458 1637 -6542 -7830 270 7869 6617 -3627 -8942
3228 -8942 -1281 8434 7624 -1471 -7941 -4713 4225 8828 2841 -7838 -9294 6 8394 5689 -4834
3243 -4834 -9494 -1944 6515 7697 -508 -7310 -5127 4959 9976 3215 -6761 -8071 1629 8906 4322
3258 4322 -5687 -8610 -3965 6152 7755 -1025 -9145 -6739 4691 9648 2692 -6860 -7292 1331
3272 1331 7299 5535 -3958 -8544 -2785 7223 8239 -1184 -9694 -4699 5858 8604 2649 -6499
3286 -6499 -6738 1004 8381 6228 -4821 -10236 -2791 7403 7390 -1839 -8570 -4572 3535 8746 3213
3301 3213 -6175 -6677 1951 9718 6045 -4602 -8721 -975 7790 7220 -2305 -8367 -5971 2228 8043
3316 8043 2537 -7682 -8579 1654 9438 4343 -4750 -6684 -453 7301 6969 -347 -7714 -5186 4986
3331 4986 9036 758 -8727 -7627 2172 8147 3240 -4755 -7729 -2322 6039 8274 -884 -8724 -4849
3346 -4849 6346 8999 268 -7638 -5830 1899 7257 4727 -4022 -8260 -2338 7434 7510 -1684 -9327
3361 -9327 -4727 6035 7880 5 -7078 -7092 792 7896 5063 -4864 -9176 -1814 7884 6522 -2293
3376 -2293 -7351 -3008 5133 8063 1643 -6935 -6655 2728 9425 4023 -5807 -9290 -1056 7450 5534
3391 5534 -2908 -8323 -4688 4061 7670 1992 -7372 -5863 3390 9047 3879 -5744 -6063 404 7688
3406 7688 6666 -2816 -8696 -4272 5014 7515 -294 -7549 -6411 2637 7191 2991 -4697 -7645 -1383
3421 -1383 7667 7150 -2468 -8042 -2743 6280 7331 47 -6877 -5007 2207 8079 4009 -5196 -8011
3436 -8011 -750 8279 6437 -3606 -7811 -3887 4716 6831 422 -7233 -5763 2036 7248 4007 -5586
3451 -5586 -7848 1202 7909 5486 -2120 -7114 -2186 4824 6529 203 -7371 -6754 1971 7935 2788
3466 2788 -6680 -7063 -27 6722 4696 -2060 -6766 -2462 5665 7078 777 -7186 -5167 4282 8145
3481 8145 2035 -5977 -6956 191 6465 5032 -2864 -7764 -3419 5051 7991 192 -7480 -4721 3069
3496 3069 7112 2474 -4492 -5790 177 6760 5247 -3136 -7387 -2501 6746 6620 -552 -6787 -5220
3511 -5220 2814 6782 2914 -5017 -7449 -541 6892 4709 -3652 -7433 -2073 5191 6571 -117 -5715
3526 -5715 -3606 2688 7970 2517 -5894 -6304 1134 7151 3922 -3831 -7251 -2673 4153 5471 -282
3541 -282 -6958 -5321 3526 6421 1445 -5254 -5569 1145 6088 4405 -2306 -6143 -2352 5961 6497 -1122
3557 -1122 -7286 -4544 3522 6204 1363 -5051 -6389 -783 5452 4336 -3167 -6905 -2348 5532 5948
3572 5948 -1237 -5218 -2939 4129 6209 2857 -4365 -5612 1270 6655 3690 -3546 -6849 -1727 4824
3587 4824 4839 -1689 -6314 -3420 2144 5135 1186 -4165 -5263 975 5614 3439 -2751 -5369 -1086
3602 -1086 4712 5431 -713 -5308 -3331 3444 6495 1456 -4744 -5707 311 4937 2876 -2725 -5504
3617 -5504 -2224 4248 4305 -59 -5428 -2968 3395 5895 674 -3890 -4472 1586 5447 2571 -3349 -5277
3633 -5277 -1834 4174 4744 -670 -6049 -4347 1707 4530 1454 -4984 -4991 514 4538 2736 -2955 -5084
3649 -5084 -656 4518 5158 -1039 -4420 -2668 3385 4622 1319 -4336 -4872 12 5097 2382 -2849
3664 -2849 -4709 -1910 3381 4077 -217 -4094 -2335 2947 4475 1295 -2953 -3345 653 4608 2701
3679 2701 -2672 -5061 -999 4420 3373 -808 -4653 -3245 1793 4318 646 -3878 -4990 946 4810
3694 4810 2691 -1713 -3995 -969 3607 3727 -771 -3954 -2903 2389 4765 1216 -3650 -4565 610
3709 610 4760 3019 -2743 -4823 -1227 2886 4015 -851 -4368 -3277 2162 3798 1501 -4112 -3582
3724 -3582 1721 4883 3212 -2030 -3700 -336 3570 4570 -601 -4644 -3500 2839 4898 707 -3678
3739 -3678 -4429 522 3689 2194 -1388 -3250 -963 3641 4010 -104 -3978 -1748 3301 4225 494 -3682
3755 -3682 -2361 873 4679 2887 -3558 -5186 -1119 3032 3559 -1385 -4049 -2178 2022 3150 1091
3770 1091 -3107 -3300 1139 4512 1980 -2683 -3818 -606 4205 3561 -1245 -3202 -2482 2136 3978 959
3786 959 -3315 -3027 840 3210 1838 -1363 -3284 -1122 2948 2606 -268 -3453 -1072 2894 4198 67
3802 67 -2467 -2275 1316 4031 1937 -2054 -3282 -1846 3099 3008 -1109 -4691 -2733 1936 2931 13
3818 13 -2359 -2661 548 2681 1896 -1220 -3476 189 4670 3189 -1282 -4208 -1749 1990 2307 513
3834 513 -3338 -3269 -272 3004 2502 -2032 -3467 -870 3087 2789 -1515 -2025 -912 1244 2710 1170
3850 1170 -2723 -2614 938 4518 2162 -2884 -3004 367 2185 2175 -137 -2768 -2470 681 2979 374
3866 374 -3023 -2571 1496 2819 1011 -2414 -2542 293 1971 2846 -236 -3243 -1868 2992 3391 -160
3882 -160 -3027 -2451 659 2096 509 -1744 -2843 -1749 1664 1650 -1253 -2876 -1219 2323 2774 -448
3898 -448 -1848 -671 1190 2999 1511 -1429 -2430 -274 3112 1786 -1858 -2445 -1386 1735 1246 907
3914 907 -1410 -2045 278 2283 1690 -1812 -2580 1205 2541 820 -1765 -2013 -359 1178 2368 -231
3930 -231 -2988 -3733 980 3123 499 -2169 -2952 -750 1871 683 -901 -2014 -1121 1533 2873 -488
3946 -488 -2299 -1413 1678 1828 1046 -1153 -1056 -277 2137 2780 -263 -3140 -1653 1867 1524 -1684 -2331
3963 -2331 -984 -201 635 -261 -523 -1502 -361 1845 1849 -591 -1551 1036 2772 1644 -966 -868 -1556 210
3981 210 1508 354 -2134 -3347 -174 1966 1095 -1607 -1342 -10 1237 635 360 -1328 -1027 120
3997 120 2614 1086 -2260 -1532 1059 2120 320 -511 -1822 -859 252 1210 474 -1602 -553 587
4013 587 1445 133 -1235 -723 29 -526 333 -501 -1981 -604 1707 1968 -263 -1327 -215 1008 1262
4030 1262 338 173 -1193 -712 1115 456 -1116 -2603 -1034 1300 146 -717 -1214 330 1025 870 198
4047 198 -665 -761 8 1450 1850 -1056 -887 -359 1095 504 -204 -861 -1450 -926 1472 697 -1057 -958 675
4066 675 670 980 193 -224 751 1141 246 440 -652 -1920 748 799 -307 -1089 -1059 291 662 -66 80 -214
4086 -214 -663 40 1576 168 -1860 -187 78 -103 -141 99 -384 572 -52 987 -1 -470 -95 1433
4104 1433 989 -300 -524 110 578 -302 136 -442 -979 -1606 -2 440 -1569 -1427 266 565 383 -200
4122 -200 316 1079 740 1079 599 -330 -880 -256 773 -236 -826 -1490 -580 -584 -875 -96 -852 -761 19 266
4142 266 952 -669 82 770 748 479 -264 -333 -238 -130 583 118 -1184 -345 715 856 329 -171 759 317
4162 317 -684 -449 363 -169 -239 -840 196 -615 -315 499 663 -674 -526 -387 185 936 64 1013 469
4181 469 -329 -55 11 -673 -469 -296 621 -867 -832 -957 -550 -514 -463 528 331 416 814 805 1558 -269 231 1134
4203 1134 -92 -902 -522 -755 -647 -210 -577 -909 16 38 474 496 -402 -351 178 702 480 440 162 -74 -247
4224 -247 588 256 -200 -1137 -550 -41 -489 -1192 -297 -66 26 610 -814 -354 -242 553 188 -461 -1311 -828
4244 -828 666 440 162 -104 -213 -239 348 580 335 -350 531 788 -99 40 37 -421 -95 744 -1253 -811
4264 -811 -667 -240 -164 738 -768 -67 -177 573 1373 364 54 109 427 818 7 -902 178 -199 45 -551
4284 -551 -719 -1610 -83 1064 158 -373 -83 247 1250 1401 70 -418 244 439 900 -293 -311 -266 -178
4303 -178 -120 -248 -242 -1200 -88 750 796 172 -686 -672 9 1179 82 -149 -624 -427 684 246 50 -430
4323 -430 -985 682 -165 20 -418 -313 919 1597 397 -352 -964 -56 512 -33 -842 -1104 -1159 775 1294
4342 1294 -451 -654 -372 1182 1149 394 1232 188 357 1660 1250 -331 -814 -275 5 79 -1216 -1855
4360 -1855 -1398 -186 288 9 -288 -1136 -291 1107 1161 37 -209 415 768 1336 455 -449 -761 64 56 -180
4380 -180 -1098 -729 385 1057 316 -22 -871 -710 501 1739 664 -890 -997 -411 1484 174 -421 -1238
4398 -1238 -586 828 999 -330 -1144 -827 662 1056 573 -1003 -926 533 1123 440 -921 -1387 -839 567
4416 567 701 -403 -1308 -1122 1979 1628 250 -411 -55 870 1531 1287 -1043 -1107 -704 1159 638 -1551
4434 -1551 -2035 -948 1028 302 -199 -829 -690 115 2169 1092 -208 -1245 462 1902 1047 -1108 -8
4451 -8 -606 105 831 -379 -981 -1707 404 1777 957 -1486 -1379 454 1563 1454 -396 -1498 -500 667
4469 667 951 -195 -965 -547 286 1402 83 -1090 -601 461 1115 1116 -613 -1215 -643 806 1604 -401
4487 -401 -1898 -1327 853 864 83 -265 -1072 -16 935 1859 -370 -769 700 1106 1507 151 -726 275
4505 275 259 990 -706 -1144 -2018 -731 1005 1249 -345 -1772 -413 711 1868 269 -984 -837 42
4522 42 1549 1008 -1128 -1575 -344 448 718 -1210 -1542 -774 442 1326 888 -1418 -1611 65 1929 587
4540 587 -855 -908 352 1653 316 -660 -1766 -1273 623 1230 -58 -1255 -1172 917 2125 -32 -813
4557 -813 -704 -181 1182 1421 -487 -1904 -1801 948 1978 -56 -1395 -1119 71 1821 638 -879
4573 -879 -434 1101 1759 1722 -968 -2116 -427 408 755 -347 -1647 -1418 -254 568 223 -446 -1362 -378
4591 -378 1622 1522 -79 -1175 -162 1619 841 211 -312 -1048 -54 1446 413 -1462 -2251 -190 1408
4608 1408 1110 -627 -1845 479 926 1462 1176 -1183 -616 852 1913 534 -1108 -1099 -48 1079 379
4625 379 -726 -2142 -261 1369 1757 -265 -1158 -1550 780 1294 -49 -804 -824 -525 307 976 -476 -1882
4643 -1882 -1247 1063 2037 -202 -1213 -578 1086 1465 986 -998 -1641 -376 1395 302 -1086 -2168
4659 -2168 -1009 1666 1062 42 -1676 -547 367 1499 1582 -563 -1552 427 1610 1181 38 -1014
4675 -1014 -774 794 157 608 -1804 -1907 1 1599 451 -1509 -1581 234 1610 1304 248 -688 -774
4692 -774 974 2090 293 -1594 -1514 270 1055 482 -1866 -984 489 496 826 -317 -1452 -1109 1469 2425
4710 2425 104 -1782 -913 205 1075 529 -871 -1432 48 1248 2070 -139 -1607 114 1624 1605 435
4727 435 -1741 -1342 155 883 146 -2022 -1760 -250 1415 761 -990 -2139 -118 1459 1235 409 -429
4744 -429 -626 231 1614 1367 -329 -1477 144 1902 460 -923 -1922 -933 671 874 47 -1498 -1897
4761 -1897 709 1718 1120 -776 -1506 -305 1566 1449 -73 -1340 -805 157 1788 -119 -2025 -927
4777 -927 127 1679 1542 -1661 -1464 -209 1372 1586 -31 -1110 -1129 1129 1659 -479 -1928 -862 817
4794 817 1366 627 -862 -1201 285 1297 1728 -391 -1537 -559 1044 1203 331 -2118 -1548 304 1967
4811 1967 267 -336 -1905 311 1745 1313 -11 -1150 -321 1372 858 -193 -790 -2100 71 1127
4827 1127 88 -1736 -1694 -822 1328 918 -949 -1764 -1107 84 1532 1068 -351 -1446 984 1407 633
4844 633 -757 -1214 85 1125 1118 -166 -1246 -11 1539 1638 236 -1689 -841 223 1435 471 -1337
4861 -1337 -1383 -250 957 669 -448 -1468 -1371 1017 1309 189 -1445 -1267 558 1619 526 -672 -948
4878 -948 -265 1482 1051 -243 -1358 -681 988 2217 169 -1399 -1778 583 1336 989 -876 -861 475
4895 475 1792 629 62 -1818 -780 1204 742 743 -1786 -1664 77 1238 940 -1202 -1190 -29 1673
4912 1673 930 129 -718 -810 483 1509 1073 -839 -1532 393 980 544 -904 -1118 -578 1051 994 212
4930 212 -909 -521 698 1082 737 -1017 -1229 -199 983 516 -547 -1309 241 1286 982 -619 -1103
4947 -1103 -634 153 1345 257 -827 -1298 424 1282 -171 -849 -1110 -394 529 965 -44 -1479 -207
4964 -207 613 1696 287 -1172 -1144 340 1289 912 -338 -1008 -121 737 1517 437 -1274 -453 437 782
4982 782 -167 -1603 -1245 315 1355 1417 -69 -930 -566 1075 1454 -270 -1536 -419 833 591 212
4999 212 -1258 -1033 -342 1121 859 -419 -789 -17 1162 1168 361 -450 -429 617 1041 231 -795 -1050 -736
5018 -736 1366 575 -828 -590 -20 1137 869 187 -1256 -807 639 373 415 -1202 -942 250 1129 875
5036 875 -651 -842 -520 1283 1691 115 -306 -431 560 745 128 -983 -1443 228 1205 112 -524 -711
5054 -711 -373 376 977 -184 -1301 -568 1032 1341 576 -709 4 21 972 489 -683 -1594 -392 713
5072 713 988 -377 -684 -331 519 627 501 -474 -1183 229 1106 381 -221 -1223 -248 690 746 -454 -944
5091 -944 -656 573 561 475 390 -1001 -202 1150 896 67 -1351 -936 939 331 467 -891 -1211 155 1443
5110 1443 1029 -1161 -681 -526 917 1030 71 -924 -400 845 735 184 -1478 -734 -78 1157 357 -1213
5128 -1213 -1362 67 1177 1160 -77 -834 -686 539 767 89 -527 -395 232 1282 1256 -469 -1225 -325
5146 -325 1099 645 -107 -1233 -468 673 1154 407 -663 -254 877 945 735 -5 -802 -367 702 348
5164 348 367 -1422 -716 699 1274 334 -258 -1510 62 900 1236 331 -1436 -429 762 343 -120 -1293
5182 -1293 -808 252 -103 338 -838 -886 269 1432 1147 504 -1397 -368 486 1233 15 -826 -474 -60
5200 -60 1221 589 -710 -1193 -141 1116 742 -161 -640 -416 641 1147 576 -582 -936 -2 1415 917
5218 917 -117 -976 -712 828 561 -756 -1046 -401 660 1805 358 -1271 -741 460 1028 281 -810
5235 -810 -1225 -981 561 365 -287 -1508 -1115 317 1508 -480 -1274 -714 186 1371 709 -388 -1090 104
5253 104 1258 493 -1020 -1371 -212 561 500 364 -667 -1139 780 566 682 -604 -510 -415 1230 192
5271 192 -147 -1213 -1352 262 1203 320 -781 -724 -39 1579 1140 -206 -853 -181 1388 1615 -322 -886
5289 -886 -110 144 765 850 -364 -1569 -388 831 733 -667 -1062 -358 774 1073 749 -412 -867 636
5307 636 938 496 -587 -1222 586 242 425 -779 -1372 -219 424 1227 167 -988 -617 1056 1561 529
5325 529 -393 -350 -360 1378 907 -643 -1227 -397 490 1308 199 -1035 -125 1257 1367 1004 -471 -973 269
5344 269 787 433 -342 -2148 -780 223 651 -434 -950 -960 451 804 143 -507 -907 285 1576 1558
5362 1558 -905 -1514 -1165 -59 902 -310 -1033 -1349 403 766 1157 -941 -1256 80 1391 954 54
5379 54 -736 -563 1557 1061 349 -985 -830 -296 948 612 -744 -1113 212 1147 1014 -415 -424 246 440
5398 440 1010 279 -1152 -462 583 1480 496 -1093 -781 245 811 2049 15 -1110 -1313 1585 1828
5415 1828 196 -1305 -840 658 1129 936 -1100 -559 74 1012 1020 -68 -1448 -943 912 1295 808 -824
5433 -824 -847 434 1167 998 -103 -1534 -52 593 1422 -574 -1958 -967 635 1228 873 -1064 -775 696
5451 696 1256 903 -94 -814 -149 1507 533 -208 -974 -636 -76 608 74 -736 -787 155 1466 1276 -626
5470 -626 -1212 -11 1102 1225 -967 -1229 -884 236 1139 94 -1614 -1397 106 2071 797 -271 -1758
5487 -1758 -712 1176 1852 -269 -1124 -885 943 1372 1054 -1268 -1292 191 1088 847 -791 -1999 -752
5504 -752 1417 1304 -475 -1739 -1146 600 1958 373 -634 -972 332 1328 362 -1381 -1940 -1157 977
5521 977 946 -69 -1541 -279 834 1991 644 -927 -1500 147 1633 1390 -876 -1553 -1048 736 1359
5538 1359 -784 -1549 -1115 268 1766 987 -1706 -868 242 1450 1342 -597 -1834 140 1538 1613 -216
5555 -216 -2270 -1441 684 1465 979 -1278 -1335 204 898 875 -556 -1003 -26 1437 1543 -125 -2154 -1337
5573 -1337 970 1536 607 -1215 -1084 646 1714 1445 -327 -1514 -598 1634 2446 385 -1750 -1042 376
5590 376 1593 1017 -952 -1516 445 652 712 -323 -1126 105 1762 2700 443 -1045 -690 601 1764
5607 1764 660 -1729 -1993 2 1496 1030 -918 -2156 -797 1281 1403 -726 -1464 -767 1156 2692
5623 2692 1466 -1278 -1455 787 1643 1385 -656 -2248 -513 1653 1295 -55 -2175 -1498 493 1975
5639 1975 1300 -1139 -1557 -87 1621 1093 -626 -2013 -867 1152 1228 -105 -2202 -2244 1018 1503 1197
5656 1197 -938 -1824 596 2412 1895 -634 -1357 -523 1925 1522 -727 -1755 -1784 -325 1486 418 -1314
5673 -1314 -2009 699 2698 1623 35 -1222 -581 1996 2537 75 -2409 -1767 618 1862 358 -2327
5689 -2327 -1838 -386 1498 997 -1504 -1661 -378 1465 2062 64 -1833 -1106 727 2069 -133 -1536
5705 -1536 -2043 -686 1710 1544 -1087 -2424 -791 1792 2323 74 -1411 -720 1396 1899 1122 -1595
5721 -1595 -1940 -39 1595 1612 -1717 -2225 -1355 1526 1451 -12 -1669 -896 1909 2620 1975 -740 -1739 339
5739 339 2342 1304 -1048 -2537 -991 712 1531 -268 -2741 -1945 1117 1615 1042 -1655 -1802 -13
5755 -13 2474 2183 -778 -1594 -460 667 2137 -375 -2211 -1610 889 2275 910 -1451 -2118 271
5771 271 2117 2037 -160 -2300 -473 1340 1992 -378 -2591 -1933 1225 1726 643 -1970 -1596 691 2297
5788 2297 2204 -880 -2007 -530 1996 2337 60 -2211 -1756 685 2114 777 -1516 -2465 -158 1772
5804 1772 1299 -930 -1564 -198 2600 2386 136 -1862 -1123 794 1961 152 -2455 -3269 82 1707
5820 1707 1496 -1903 -2287 -77 2212 2407 139 -1393 -737 969 2916 375 -2256 -2185 184 2707
5836 2707 890 -1748 -2388 -1350 1353 1864 401 -2246 -2046 1570 2401 1003 -1915 -1342 108 1776
5852 1776 1566 -1236 -3321 -994 1722 2364 -247 -2706 -1483 2007 2620 592 -1371 -1711 1175 2600
5868 2600 1738 -998 -2491 -1146 1856 2038 -1160 -3167 -1967 785 2355 654 -1652 -1992 545 3009
5884 3009 1623 -563 -2323 -315 2505 2199 -126 -2553 -2477 967 2126 196 -2292 -2590 542 2783
5900 2783 1827 -733 -1312 -263 2837 3102 413 -2268 -1867 1238 2576 71 -2622 -2909 -292 2290
5916 2290 1666 -2013 -2942 -292 2237 3473 346 -2235 -924 1959 2732 696 -2594 -2474 274 1944
5932 1944 954 -2288 -3018 -174 1879 2116 -387 -3006 -1012 1736 2567 739 -1811 -2049 -1 2675
5948 2675 1370 -2153 -3260 -1039 2696 1615 307 -2088 -1769 1738 2737 1668 -1721 -1788 935 2924
5964 2924 1237 -1350 -2606 -693 2136 2019 -985 -2888 -1550 1051 2990 1175 -2103 -2386 1080
5979 1080 3204 1879 -911 -2574 66 1931 1751 -564 -3272 -1694 772 2217 -2 -2695 -1549
5994 -1549 956 3114 1689 -602 -2311 -80 2420 1924 -829 -2141 -1558 1654 1347 -82 -2414 -2341
6010 -2341 504 2604 1151 -1320 -2524 -240 2464 2813 149 -1935 -1126 685 2025 -410 -2630
6025 -2630 -2454 -933 2338 1057 -1990 -2645 -422 2981 3120 -81 -2444 -1051 1835 2573 621 -2467
6041 -2467 -2886 -58 2427 592 -1704 -3026 -791 1896 2524 -460 -1414 -1564 1886 3017 495 -2159
6057 -2159 -1375 1347 2277 1016 -1810 -2379 -1452 1751 2118 -1283 -3291 -770 2399 3475 548 -1622
6073 -1622 -1362 2051 2736 1315 -1443 -2496 -380 1979 793 -769 -2969 -1381 2324 2608 628 -1710
6089 -1710 -1418 1955 3184 1760 -1666 -2703 -239 3057 2151 -1470 -3114 -1549 861 1985 -358
6104 -358 -2476 -1523 902 3064 1494 -1510 -2224 29 2828 1868 -978 -2688 -1732 1325 1621 -216
6120 -216 -3373 -2574 849 2319 1000 -1356 -1595 264 3057 2569 -18 -2329 -1682 1726 2244 173
6136 173 -3058 -3192 -87 1414 647 -2357 -2439 149 2436 2420 -836 -2622 347 2232 3023 670 -2627
6153 -2627 -1428 452 1840 513 -1597 -2674 -556 2101 1948 -350 -2492 -1189 2273 3063 649
6168 649 -2332 -2258 754 2734 1526 -1775 -2349 -1201 1792 2099 -1714 -2241 -1087 2259 2676 977 -2288
6185 -2288 -1515 901 3161 1002 -1539 -1924 -626 1542 1053 -1690 -2661 -1059 1724 2027 -4 -2537
6201 -2537 -958 1589 3038 1092 -1029 -1769 -754 3212 1396 -1534 -3157 -2227 864 2294 -520
6216 -520 -2240 -2061 1046 2122 630 -1102 -2246 91 2502 2145 -618 -2774 -1130 2247 2300 -957
6232 -957 -2955 -2376 144 2332 501 -1261 -2008 140 3309 2967 -361 -2310 -581 1930 2771 -373
6248 -373 -2263 -2566 47 1812 -220 -1911 -2887 406 2773 1605 -927 -2198 -1450 2184 2486 504
6264 504 -2520 -1227 1432 2869 834 -3249 -2933 -833 1802 1774 -930 -2142 -271 2350 2749 804
6280 804 -1556 -1004 1761 3134 303 -2980 -2330 -201 2016 1100 -2248 -3140 -406 1818 3031 231
6296 231 -2417 -1140 2019 3234 1618 -1271 -2300 42 2512 1363 -1578 -3186 -1111 1472 1459 127
6312 127 -2618 -1381 1352 2864 695 -2069 -1485 628 2164 2119 -1771 -2663 -1459 2050 1729 -805
6328 -805 -3052 -2035 1653 2457 1201 -1436 -1856 851 3704 1787 -1610 -2744 -1292 2867 1773 -881
6344 -881 -2877 -2426 274 2051 951 -1831 -2192 214 3621 2549 -839 -1760 -107 2323 2852 -492
6360 -492 -2488 -2002 1125 1713 -209 -2953 -3276 -231 2889 1690 -1536 -1603 -109 3149 2982 180 -1607
6377 -1607 -1433 1407 2800 530 -3126 -2498 62 1742 237 -2280 -2918 -337 2348 2397 361 -1848
6393 -1848 -1323 2154 2894 1147 -1743 -2397 568 2162 1551 -2292 -3044 -578 1556 1838 -206 -1963
6409 -1963 -529 2021 3026 -5 -2071 -1992 441 2303 938 -1989 -2888 -1229 1257 2004 -671 -2798
6425 -2798 -761 1789 3024 1581 -1384 -1217 605 2966 1929 -1670 -2783 -626 2747 1745 -1338
6440 -1338 -3471 -2811 1330 2349 584 -1939 -1064 1631 3554 1820 -443 -1410 -10 2360 1761 -771
6456 -771 -3047 -2376 1296 1571 -631 -2175 -1780 554 3038 1573 -662 -2056 -240 2801 1728 536
6472 536 -2576 -1057 1155 2775 430 -2557 -1903 124 2743 1098 -1707 -1477 235 3032 2304 -414
6488 -414 -1367 -820 2279 2418 867 -2332 -2309 47 2119 817 -1819 -2557 -14 2407 2125 -271 -1344
6505 -1344 -502 2017 2636 1076 -2351 -1432 557 1627 208 -1141 -3100 -1121 2140 1278 -827 -2590
6521 -2590 -1083 1571 3060 271 -1318 -813 883 2406 1374 -1662 -2409 -996 1497 1263 -1975 -2374
6537 -2374 -1248 1522 2118 850 -1071 -788 932 2963 1511 -1519 -2139 -595 1302 1180 -1280 -3121
6553 -3121 -1419 486 2115 444 -1888 -1881 662 2646 1243 -840 -1646 614 2613 936 -694 -2273
6569 -2273 -2144 698 1700 -424 -1692 -1367 194 2449 1395 -1474 -1149 335 1767 2131 -376 -2243
6585 -2243 -921 1636 1813 -742 -2258 -2907 1246 1792 507 -1571 -2068 225 2460 1719 -256 -1473
6601 -1473 -500 2096 1767 -53 -2222 -2325 1090 1853 631 -1459 -2291 81 2503 1937 -616 -1747
6617 -1747 -68 2776 2309 443 -1476 -1844 846 1574 353 -1699 -2672 -154 1407 980 -1362 -2057
6633 -2057 -1114 1798 2538 639 -1697 -1141 1410 2749 969 -1955 -2660 -358 1159 269 -1443 -1982
6649 -1982 -2114 1060 2115 18 -1319 -712 1475 2711 1445 -1726 -1946 613 1815 742 -1266 -3187
6665 -3187 -1269 1272 913 -165 -2281 -1114 1326 1821 798 -486 -1016 1223 2649 1476 -877 -2145
6681 -2145 -1090 1001 1670 -759 -2654 -1627 199 1139 1414 -1116 -1742 89 2958 1765 -652 -1693
6697 -1693 198 1350 1382 -314 -1983 -1667 -153 1645 -169 -2125 -1625 337 2331 2028 -607 -2167
6713 -2167 -506 1870 1939 506 -2065 -1391 940 1407 956 -2023 -1992 -174 1295 1718 -574 -2196 48
6730 48 1874 2619 -146 -1335 -929 1088 1888 -138 -1515 -2271 -352 1223 684 -1424 -2015 -1175 1319
6747 1319 2015 476 -2083 -679 1407 2841 1083 -805 -2027 -45 781 650 -1838 -2829 -1035 1385
6763 1385 765 -230 -1904 -864 1704 2737 1174 -918 -1763 812 2712 1394 -1807 -1813 -581 86 572
6780 572 -1337 -2610 -1642 733 2125 1180 -1796 -1268 659 2398 1392 -493 -1981 -655 1580 1031
6796 1031 -1289 -2547 -1475 344 1755 840 -1413 -1590 383 2392 1552 -44 -1084 -349 2040 1776
6812 1776 -654 -2732 -1523 726 572 50 -1897 -1855 969 1901 1839 -350 -1214 424 1987 1907 -462
6829 -462 -1942 -827 1167 1933 -377 -1767 -2173 209 1805 1337 -1705 -1670 216 1982 2034 208 -998
6846 -998 -235 1288 1739 -233 -1876 -2161 -447 1736 104 -1699 -2414 -577 1777 1581 -422 -1517
6862 -1517 -453 1617 2360 405 -1519 -1695 492 1731 698 -1962 -2129 -730 904 1189 -520 -1766
6878 -1766 7 1353 2648 1168 -808 -1432 840 2321 1155 -1185 -2214 -513 1412 860 -824
6893 -824 -2881 -1054 1192 2305 429 -1099 -1325 1217 2697 1669 -433 -1688 -14 2014 710
6908 710 -1108 -3019 -1629 1142 1297 -417 -2034 -896 1223 2027 1416 -809 -1484 124 2650 1668
6924 1668 -797 -2071 -916 257 982 -254 -2197 -1444 174 2199 1091 -1126 -1587 577 1739 1698
6940 1698 -462 -1530 -1225 1275 984 -654 -1874 -2284 42 1710 446 -1494 -2139 22 1546 1767
6956 1767 -241 -1034 -601 1355 1660 144 -1421 -1455 -574 1270 47 -1484 -1890 -1044 938 972 -571
6973 -571 -1138 -1105 2493 1786 118 -1182 -955 1142 1708 880 -1654 -1338 -1156 711 728 -1279 -1343 -692 1016
6992 1016 1627 778 -1146 -869 430 2154 734 -1687 -1303 235 1000 666 -1333 -2014 -1282 1140 1849
7009 1849 349 -1112 -1434 1094 2632 946 -551 -1120 561 1131 1086 -818 -2036 -1054 -79 653 -295
7026 -295 -1851 -1885 326 1722 678 -884 -1324 1017 1621 942 -1148 -1645 -1236 256 1213 -783 -1567
7043 -1567 -1635 33 1849 925 -881 -1198 272 1861 1597 -598 -769 -446 1537 1869 -291 -2015 -1281
7060 -1281 -13 808 -130 -1467 -1889 36 2151 1310 139 -952 170 1767 2206 232 -1069 -661
7076 -661 -320 1529 780 -1406 -1859 -475 1437 1415 -1337 -1580 -348 1538 1225 741 -1619 -1200 919
7093 919 1731 340 -1249 -1693 -286 1183 790 -956 -2057 -1140 625 1676 250 -1315 -1023 1156
7109 1156 2258 674 -1346 -1628 -468 1588 1211 -587 -1738 -1348 833 1169 -221 -2389 -277 1091
7125 1091 2031 837 -852 -882 101 890 1056 -707 -2534 -1413 951 1127 -551 -1943 -1173 1540 1750
7142 1750 737 -686 -1126 202 1734 1231 -47 -1463 -673 904 1311 -735 -2397 -1723 -472 1105
7158 1105 569 -1470 -963 326 1948 1867 -306 -1126 -46 1207 1589 -4 -1697 -2009 159 925 -72
7175 -72 -1694 -1895 -291 1088 1367 -366 -339 102 1610 2226 309 -1449 -1133 606 1532 123 -2364
7192 -2364 -2190 -412 845 1177 -363 -1226 -659 2243 1965 240 -1189 32 1309 2283 -208 -1550
7208 -1550 -1848 -728 1117 898 -1201 -1691 -1200 382 1295 764 -563 -749 1267 1611 890 -939 -1363
7225 -1363 -383 1532 1035 -1669 -2608 -1334 1276 1231 426 -1617 -518 1103 1589 499 -687 -722 1292
7242 1292 1461 1024 -846 -1793 -749 1239 1805 -896 -1074 -848 887 2210 772 -809 -1479 311 1945
$$ [...]
8191f42
##END NTUPLES=NMR FID
##END=
