##TITLE=1H_SA_27.150
 DMSO-d6, 108 sc, 
 11.11.2019
##JCAMPDX= 6.0         $$ Bruker NMR JCAMP-DX V2.0
##DATA TYPE= NMR FID
##DATA CLASS= NTUPLES
##ORIGIN= UXNMR, Bruker Analytische Messtechnik GmbH
##OWNER= root
$$ XWIN-NMR		Version 3.5
$$ Mon Nov 11 14:40:19 2019 Russian Standard Time (UT+4h)  she@DPX200
##.OBSERVE FREQUENCY= 200.1315
##.OBSERVE NUCLEUS= ^1H
##.DELAY= (6, 6)
##.ACQUISITION MODE= SIMULTANEOUS
##.ACQUISITION SCHEME= undefined
##.AVERAGES= 108
##.DIGITISER RES= 18
##SPECTROMETER/DATA SYSTEM= spect
##.PULSE SEQUENCE= zg30
##.SOLVENT NAME= DMSO
##.SHIFT REFERENCE= (INTERNAL, DMSO, 0, 15.7039)
##AUDIT TRAIL= $$ (NUMBER, WHEN, WHO, WHERE, WHAT)
$$ ##TITLE= Audit trail, XWIN-NMR		Version 3.5
$$ ##JCAMPDX= 5.01
$$ ##ORIGIN= Bruker BioSpin GmbH
$$ ##OWNER= she
$$ F:/spectra/data/she/nmr/H-F/1/audita.txt
$$ ##AUDIT TRAIL=  $$ (NUMBER, WHEN, WHO, WHERE, WHAT)
(   1,<2019-11-11 14:39:11.21 +0400>,<she>,<DPX200>,
      <continue with go, POWCHK disabled, PULCHK disabled
       configuration hash MD5:
       00 E9 B6 7A A2 85 ED C7 34 08 36 98 17 FE 4E 26
       data hash MD5: 16K
       7A EF 77 9A 4F 12 25 AB 79 EA A0 45 86 63 30 17>)
$$ ##END=
$$ 
$$ hash MD5
$$ CE 98 07 6F 1C 3A AF 0E 41 FC AB D7 1D AF CA F0
##$RELAX= 
##$RELAX= 
##$RELAX= 
##$RELAX= 
##$RELAX= 
##$RELAX= 
$$ Bruker specific parameters
$$ --------------------------
##$DU= <F:/spectra>
##$EXPNO= 1
##$NAME= <H-F>
##$PROCNO= 1
##$TYPE= <nmr>
##$USER= <she>
##$AMP= (0..31)
100 100 100 100 100 100 100 100 100 100 100 100 100 100 100 100 100 100 
100 100 100 100 100 100 100 100 100 100 100 100 100 100 
##$AQSEQ= 0
##$AQ_mod= 1
##$AUNM= <au_zg>
##$AUTOPOS= <>
##$BF1= 200.13
##$BF2= 200.13
##$BF3= 200.13
##$BF4= 200.13
##$BF5= 200.13
##$BF6= 200.13
##$BF7= 200.13
##$BF8= 200.13
##$BYTORDA= 1
##$CFDGTYP= 0
##$CFRGTYP= 5
##$CHEMSTR= <none>
##$CNST= (0..31)
1 1 145 1 1 1 1 1 1 1 1 1 1 1 1 1 1 1 1 1 1 1 1 1 1 1 1 1 1 1 1 1 
##$CPDPRG= <>
##$CPDPRG1= <>
##$CPDPRG2= <>
##$CPDPRG3= <>
##$CPDPRG4= <mlev>
##$CPDPRG5= <mlev>
##$CPDPRG6= <mlev>
##$CPDPRG7= <mlev>
##$CPDPRG8= <mlev>
##$CPDPRGB= <>
##$CPDPRGT= <>
##$D= (0..31)
0 1.2 0 0 0 0 0 0 0 0.06 0 0.03 0 0 0 0 0.0002 0 0 0 0 0 0 0 0 0 0 0 0 
0 0 0 
##$DATE= 1573468412
##$DBL= (0..7)
120 120 120 120 120 120 120 120 
##$DBP= (0..7)
150 150 150 150 150 150 150 150 
##$DBP07= 0
##$DBPNAM0= <>
##$DBPNAM1= <>
##$DBPNAM2= <>
##$DBPNAM3= <>
##$DBPNAM4= <>
##$DBPNAM5= <>
##$DBPNAM6= <>
##$DBPNAM7= <>
##$DBPOAL= (0..7)
0.5 0.5 0.5 0.5 0.5 0.5 0.5 0.5 
##$DBPOFFS= (0..7)
0 0 0 0 0 0 0 0 
##$DE= 6
##$DECBNUC= <off>
##$DECIM= 24
##$DECNUC= <off>
##$DECSTAT= 4
##$DIGMOD= 1
##$DIGTYP= 9
##$DL= (0..7)
0 120 120 120 120 120 120 120 
##$DP= (0..7)
150 150 150 150 150 150 150 150 
##$DP07= 0
##$DPNAME0= <>
##$DPNAME1= <>
##$DPNAME2= <>
##$DPNAME3= <>
##$DPNAME4= <>
##$DPNAME5= <>
##$DPNAME6= <>
##$DPNAME7= <>
##$DPOAL= (0..7)
0.5 0.5 0.5 0.5 0.5 0.5 0.5 0.5 
##$DPOFFS= (0..7)
0 0 0 0 0 0 0 0 
##$DQDMODE= 0
##$DR= 18
##$DS= 0
##$DSLIST= <SSSSSSSSSSSSSSS>
$$ [...]
##$SUBNAM2= <"">
##$SUBNAM3= <"">
##$SUBNAM4= <"">
##$SUBNAM5= <"">
##$SUBNAM6= <"">
##$SUBNAM7= <"">
##$SUBNAM8= <"">
##$SUBNAM9= <"">
##$SW= 24.0689530833862
##$SWIBOX= (0..15)
0 0 2 0 0 0 0 0 0 0 0 0 0 0 0 0 
##$SW_h= 4816.95568400771
##$TD= 16384
##$TD0= 1
##$TE= 0
##$TE2= 300
##$TE3= 300
##$TEG= 300
##$TL= (0..7)
0 120 120 120 120 120 120 120 
##$TP= (0..7)
150 150 150 150 150 150 150 150 
##$TP07= 0
##$TPNAME0= <>
##$TPNAME1= <>
##$TPNAME2= <>
##$TPNAME3= <>
##$TPNAME4= <>
##$TPNAME5= <>
##$TPNAME6= <>
##$TPNAME7= <>
##$TPOAL= (0..7)
0.5 0.5 0.5 0.5 0.5 0.5 0.5 0.5 
##$TPOFFS= (0..7)
0 0 0 0 0 0 0 0 
##$TUNHIN= 0
##$TUNHOUT= 0
##$TUNXOUT= 0
##$USERA1= <user>
##$USERA2= <user>
##$USERA3= <user>
##$USERA4= <user>
##$USERA5= <user>
##$V9= 5
##$VALIST= <valist>
##$VCLIST= <CCCCCCCCCCCCCCC>
##$VD= 0
##$VDLIST= <DDDDDDDDDDDDDDD>
##$VPLIST= <PPPPPPPPPPPPPPP>
##$VTLIST= <TTTTTTTTTTTTTTT>
##$WBST= 1024
##$WBSW= 4
##$XGAIN= (0..3)
0 0 0 0 
##$XL= 0
##$YL= 0
##$YMAX_a= 1427822
##$YMIN_a= -872479
##$ZGOPTNS= <>
##$ZL1= 120
##$ZL2= 120
##$ZL3= 120
##$ZL4= 120
##$ABSF1= 10
##$ABSF2= 0
##$ABSG= 5
##$ABSL= 3
##$ALPHA= 0
##$AQORDER= 0
##$ASSFAC= 0
##$ASSFACI= 0
##$ASSFACX= 0
##$ASSWID= 0
##$AUNMP= <proc_1d>
##$AZFE= 0.1
##$AZFW= 0.1
##$BCFW= 1
##$BC_mod= 2
##$BYTORDP= 1
##$COROFFS= 0
##$CY= 11.3945322036743
##$DATMOD= 1
##$DC= 2
##$DFILT= <>
##$DTYPP= 0
##$F1P= 19.5091578491511
##$F2P= -0.509923556040331
##$FCOR= 0.5
##$FTSIZE= 0
##$FT_mod= 4
##$GAMMA= 1
##$GB= 0.15
##$INTBC= 1
##$INTSCL= 1
##$ISEN= 128
##$LB= 0.24
##$LEV0= 0
##$LPBIN= 0
##$MAXI= 10000
##$MC2= 0
##$MEAN= 0
##$ME_mod= 0
##$MI= 1.114404
##$NCOEF= 0
##$NC_proc= 0
##$NLEV= 6
##$NOISF1= 3.799351
##$NOISF2= 2.8
##$NSP= 1
##$NTH_PI= 0
##$NZP= 0
##$OFFSET= 15.70392
##$PC= 1
##$PHC0= -9442.28
##$PHC1= -6.19912
##$PH_mod= 1
##$PKNL= yes
##$PPARMOD= 0
##$PSCAL= 0
##$PSIGN= 0
##$REVERSE= no
##$SF= 200.130013532006
##$SI= 16384
##$SIGF1= 3
##$SIGF2= 2
##$SINO= 400
##$SIOLD= 16384
##$SREGLST= <1H.CDCl3>
##$SSB= 0
##$STSI= 0
##$STSR= 0
##$SW_p= 3612.71676300578
##$SYMM= 0
##$S_DEV= 0
##$TDeff= 0
##$TDoff= 0
##$TI= <>
##$TILT= no
##$TM1= 0
##$TM2= 0
##$TOPLEV= 0
##$USERP1= <user>
##$USERP2= <user>
##$USERP3= <user>
##$USERP4= <user>
##$USERP5= <user>
##$WDW= 1
##$XDIM= 8192
##$YMAX_p= 0
##$YMIN_p= 0
$$ End of Bruker specific parameters
$$ ---------------------------------
##NTUPLES= NMR FID
##VAR_NAME=  TIME,          FID/REAL,        FID/IMAG
##SYMBOL=    X,             R,               I
##VAR_TYPE=  INDEPENDENT,   DEPENDENT,       DEPENDENT
##VAR_FORM=  AFFN,          ASDF,            ASDF
##VAR_DIM=   8192,          8192,            8192
##UNITS=     SECONDS,       ARBITRARY UNITS, ARBITRARY UNITS
##FACTOR=    0.0002076,     1,               1
##FIRST=     0,             0,               0
##LAST=      1.7004516,     0,               0
##MIN=       0,             -872479,         0
##MAX=       1.7004516,     1427822,         0
$$ Real data points
##PAGE= N=1
##DATA TABLE= (X++(R..R)), XYDATA
0 0 0 0 0 0 0 0 0 0 0 0 0 0 0 0 0 0 0 0 0 0 0 2 -11 15 -39 62 -68 77 -86 91 -97 115 -129 146 -165 187 -211
37 -211 232 -262 299 -315 354 -392 430 -479 534 -578 646 -714 792 -874 973 -1080 1201 -1327
55 -1327 1455 -1537 1441 -588 -4388 95630 846841 1152608 681514 234087 74841 -83904
67 -83904 -523043 -872479 -644270 107451 699996 641071 176456 -67206 16630 -8410 -372493
78 -372493 -622740 -308833 307091 544310 229666 -130073 -99877 105941 25723 -324394
88 -324394 -443528 -81719 363575 362526 -25358 -247413 -46570 188258 36510 -319832
98 -319832 -336502 66470 371249 185123 -193846 -233709 66088 217352 -25164 -309940
108 -309940 -207533 166676 306707 31938 -257250 -156838 162271 202488 -110161 -307437
118 -307437 -78193 256500 217791 -120551 -265398 -22046 235388 127912 -190040 -254700
128 -254700 39585 282933 127971 -203729 -230348 82951 269196 51421 -247557 -183223
138 -183223 146722 264207 10597 -239631 -130301 169163 221237 -45535 -241953 -78303
148 -78303 206924 200113 -88081 -232694 -22026 227962 149149 -144292 -215903 41333 248577
159 248577 103434 -178474 -185947 88850 243153 54221 -202737 -154505 128648 239501
169 239501 16068 -221096 -125103 162894 223756 -33330 -230957 -77689 197612 191350 -81528
180 -81528 -217562 -27483 209106 148173 -116722 -202971 16802 221458 109276 -159637
190 -159637 -188001 68449 230625 57578 -197616 -157315 118118 223947 7069 -214904
200 -214904 -121323 151112 206713 -32755 -225168 -89855 178227 189839 -74672 -228597
210 -228597 -49670 199583 154560 -115165 -216246 -1755 206955 109682 -147817 -188613
220 -188613 40304 205772 66047 -172178 -161425 80647 202865 23196 -195171 -131972
230 -131972 123319 193613 -23483 -211643 -92874 156903 172595 -67618 -214779 -55046
240 -55046 175699 149755 -99064 -209303 -24488 190128 124199 -127713 -199323 14851 200677
251 200677 86794 -156020 -172493 57482 193000 42265 -170380 -138522 90061 182541
261 182541 3970 -184407 -106810 125219 171573 -37546 -197591 -71442 157211 150913 -79950
272 -79950 -197595 -30552 174974 123422 -108670 -185815 1413 181964 97807 -128719 -170993
283 -170993 31878 185869 67161 -150682 -147121 66741 178267 26213 -160365 -111460
293 -111460 96433 158487 -12659 -162799 -75972 117651 139058 -44488 -164316 -44232
303 -44232 141359 121275 -78756 -162125 -6204 159915 92905 -108570 -149023 27998 163367
314 163367 64277 -122423 -130366 50545 160327 40600 -134848 -110506 78465 153813 8834
325 8834 -145184 -80842 103503 135710 -25948 -140981 -43525 119235 110560 -54291 -134011
336 -134011 -11671 133027 88725 -81464 -128605 19771 146340 62978 -108074 -115107 51618
347 51618 147954 33243 -123186 -93758 74976 138547 9631 -127631 -72778 91152 127817
358 127817 -15626 -130634 -49162 107320 109841 -43866 -125913 -17590 116788 79577 -69465
369 -69465 -112082 12466 118573 52403 -89355 -99544 36323 121454 28854 -109218 -88279
380 -88279 62962 121220 -1017 -124776 -70264 83098 110245 -26549 -127483 -48599 94888
391 94888 95578 -47130 -127793 -30527 101165 76620 -67802 -120824 -5095 108106 50873
402 50873 -90623 -106286 23587 106213 21275 -105428 -88401 46215 102405 -2864 -115826
413 -115826 -72505 67913 98914 -26563 -126151 -52213 87656 89601 -50475 -127493 -30484
424 -30484 97924 73625 -67155 -117456 -10447 101012 57702 -76634 -106557 9796 103692
435 103692 39611 -87503 -90395 34035 101528 14345 -97213 -66889 56708 93745 -8813
446 -8813 -100364 -46285 73955 86364 -27699 -101582 -27547 91268 79686 -46133 -101974
457 -101974 -5480 102881 67572 -59614 -94047 14252 106478 51905 -67854 -79675 29779
468 29779 102825 36230 -73763 -65036 46667 99763 15413 -78715 -46952 63334 90283 -4882
480 -4882 -79112 -25038 77099 76416 -25144 -77795 -5187 87086 66082 -39849 -76418 8800
492 8800 93916 53564 -53234 -72397 23008 95235 37998 -62530 -63271 36613 86932 22252
504 22252 -64415 -49329 43781 77704 6165 -65247 -35455 51563 67109 -10876 -67124 -18656
516 -18656 61106 52719 -30919 -65713 -187 65974 38198 -44500 -61212 10076 66617 25243
528 25243 -55303 -59350 21832 67486 12548 -63730 -50334 32439 63558 -1275 -65621 -39441
540 -39441 37096 52096 -13685 -63148 -27372 40048 40994 -23877 -60889 -13957 44216 28573
552 28573 -38072 -55735 1446 48675 14094 -49558 -45988 15896 48024 1308 -54977 -40056
564 -40056 25395 46793 -6104 -59373 -34063 32311 45458 -15166 -61224 -24690 38810 36629
576 36629 -24182 -54026 -11232 39893 25950 -28982 -47426 -2132 40604 18222 -34792 -40560
588 -40560 11425 41741 4168 -44545 -31217 26088 41192 -7520 -47038 -19971 33791 37633
600 37633 -14719 -49025 -14204 39454 36891 -19522 -48361 -8247 45105 32609 -27345 -45130
612 -45130 3063 45478 24239 -30385 -36482 10446 42088 13774 -31075 -28480 19023 40474
624 40474 3721 -37652 -20962 30164 38108 -8812 -40855 -10484 37582 33731 -16869 -40941
636 -40941 -2108 41700 30195 -22845 -41868 1684 45732 27977 -25675 -38394 7408 45576
648 45576 20682 -29550 -31372 14503 40076 10535 -29059 -23996 18033 36104 2598 -30219
660 -30219 -16017 26123 32582 -7049 -32155 -7750 33264 26928 -17473 -33371 1562 36592
672 36592 21292 -23181 -32981 5361 37500 18500 -26189 -32518 8032 38128 14839 -28981
684 -28981 -28673 12835 35520 7917 -29287 -21588 15332 28997 1865 -25477 -13774 18023 22979
697 22979 -5611 -26186 -6751 23165 18358 -13439 -26126 -576 25937 12815 -19813 -24428
709 -24428 4707 26536 9314 -22491 -23892 6772 25941 7100 -22503 -23278 8106 25517 2892
722 2892 -24238 -18317 10227 17541 -593 -20198 -11369 9367 12945 -6258 -16876 -6443 9633
735 9633 7315 -10030 -16925 -1814 14013 3000 -16034 -15781 6095 16250 -121 -19997 -11922
748 -11922 7525 14083 -2680 -19269 -11081 8779 13705 -2095 -17556 -11535 8857 12150 -3531
761 -3531 -15336 -6248 8036 7531 -6004 -9128 -612 7378 2711 -7385 -6241 4641 7771 -148
775 -148 -8203 -3000 10015 11049 -2622 -12309 -2079 13721 13104 -5801 -11414 883 15566 11986
789 11986 -4671 -10778 1630 14698 11074 -3316 -8475 2795 13900 8232 -3222 -4641 6698
802 6698 11222 3777 -4180 498 11546 10017 -1457 -5146 3140 13599 9430 -3395 -7863 3868
816 3868 17312 10337 -7060 -10981 6400 18851 8747 -9199 -10750 6017 16246 8367 -8247
829 -8247 -10705 3714 13574 5046 -8526 -8461 3648 11286 1662 -9874 -4895 6302 8156 -3412
843 -3412 -9455 -1486 6818 3302 -6763 -10659 -1132 8668 3830 -11975 -15081 -1086 10579 3257
857 3257 -15003 -17121 -327 10917 3193 -14246 -16109 -1724 8846 1184 -14215 -15482 -3399
870 -3399 6872 138 -13369 -12704 -1112 4798 -4532 -12355 -9447 616 978 -7054 -11871 -6077 1983
885 1983 -1152 -9863 -13656 -3831 5550 1427 -13085 -14659 -1412 8840 1494 -11634 -13289 -940
899 -940 7339 3397 -9554 -12492 -2268 7988 4863 -7461 -10906 -736 6762 2866 -6654 -5842
913 -5842 993 4374 760 -3452 -1079 2984 2619 -197 -1473 60 4796 4526 -1327 -3403 2880 9891
929 9891 5460 -3766 -3509 4724 10580 5826 -2872 -3335 3479 8877 7869 -99 -2895 2474 10194 9044
945 9044 1190 -939 3210 7113 6758 2597 1206 2947 3846 4155 5317 4315 2230 2121 1714 4043
961 4043 5654 4676 2306 -1230 1005 7278 6906 1546 -1242 682 6487 5809 1589 -525 328 3625
977 3625 5593 2780 -140 -856 869 2156 2054 188 698 -272 -889 -275 3301 2539 -206 -4323 -2415
994 -2415 3503 5955 -749 -6579 -4469 2463 4839 572 -6838 -7034 1623 5758 297 -6128 -6257 616
1010 616 4385 -432 -5539 -4247 -1238 1684 -763 -4274 -3831 574 -57 -2214 -4593 -1313 3298 -985
1026 -985 -7088 -5806 2480 4897 -2911 -8978 -6466 2798 6328 -2074 -10901 -9083 2928 7575 -555
1041 -555 -10280 -9685 2785 7861 266 -8799 -7908 1837 6467 -1261 -7589 -6386 1313 3271 -1948
1056 -1948 -6049 -2814 1535 2134 -3845 -5102 -1121 3196 -24 -6348 -6196 1655 5965 777 -7141
1071 -7141 -6003 2441 7374 783 -7110 -7622 1872 8459 1670 -7745 -8270 1892 7246 1114 -6588
1086 -6588 -6581 1085 6041 1980 -3824 -4340 219 3497 463 -2686 -2627 1913 2533 -1284 -3393 354 4459
1103 4459 655 -3432 -2963 2892 5089 769 -5280 -3230 3382 6593 2540 -4706 -5816 2909 8858
1118 8858 2799 -3355 -5769 1053 6627 3897 -1818 -2159 1868 4259 4809 173 -1615 655 2215
1133 2215 2971 1532 179 934 954 490 958 2480 1375 -317 -1040 1119 3944 2463 -281 -2374 614
1150 614 3399 3784 -8 -2740 -2099 2897 4106 1144 -1801 -1321 557 2404 758 1457 -85 -1114
1166 -1114 -688 1187 2327 -887 -1660 -3234 -618 1318 1231 -1877 -4575 -3285 2320 3503 -1099 -5497
1182 -5497 -3743 2597 3907 -1478 -5843 -3889 590 1736 -963 -4175 -4526 -1437 496 -281 -3763
1197 -3763 -3150 -762 247 -2813 -2535 -621 -570 -2363 -4731 -2691 446 1431 -3219 -6782 -3886 1649
1213 1649 3524 -2444 -7731 -5749 2710 5530 -894 -8411 -5288 2772 6030 377 -6098 -6512 1548
1228 1548 5154 486 -3932 -4197 2824 4970 456 -4648 -2430 3419 4735 -1071 -2269 593 4609
1243 4609 2274 -1972 -1912 2638 6584 2106 -3635 -3161 5176 8914 3519 -4248 -3187 6545 9899 3218
1259 3218 -4868 -3903 6239 10208 4611 -3357 -4230 4772 10693 4681 -2664 -2768 3760 9435 3707
1274 3707 -3038 -596 5197 5878 1840 -958 1106 6447 3443 -171 -1779 3120 6383 3513 -3483
1289 -3483 -3179 4456 8035 3692 -4265 -4230 3422 7530 1551 -5824 -4944 2111 8104 2440 -5394 -5303
1305 -5303 1734 5256 1053 -5221 -4941 2476 4022 66 -3450 -2415 122 250 -3647 -2888 -1945 815
1321 815 -889 -5013 -3063 216 1638 -1199 -6371 -5346 701 2885 -3099 -8190 -5721 1356 2013
1336 2013 -2876 -7039 -6094 -81 1185 -1687 -5297 -5937 -1604 626 -2309 -4636 -3526 -2494 -1230
1351 -1230 -2727 -2875 -1052 -1152 -3469 -4042 -1196 -2 -704 -4123 -4548 -1211 2765 -724 -3380 -5999
1367 -5999 -971 2924 1568 -4457 -5240 -1458 3091 813 -2215 -3197 -1440 2169 711 -1167 -1572 -84
1383 -84 1483 -10 -532 -46 1612 556 -1956 -1074 3524 4461 -1235 -4146 -1123 4479 6291 581
1399 581 -3117 -2479 4388 6613 1609 -4901 -2862 4566 7357 1795 -4517 -2654 3821 6004 1691
1414 1691 -2485 -276 3948 4709 1360 -493 2084 4319 3749 -851 240 2211 4763 577 -3296
1429 -3296 -540 5095 7142 -575 -5443 -1657 5683 7995 936 -6431 -3268 5935 7427 928 -4788
1444 -4788 -2544 4730 6363 704 -3936 -2098 4427 4605 649 -2525 -1029 3376 2882 -1635 -939 245
1460 245 4208 420 -2618 -983 2353 3986 -226 -4055 -903 4744 4513 -661 -4711 -2909 4171
1475 4171 5074 40 -6028 -3095 3249 5617 506 -5439 -3044 1947 4820 143 -2723 -2415 1048
1490 1048 3268 -99 -1683 -912 -157 460 32 -1695 918 654 -982 -2935 -1254 1464 836 -1717
1506 -1717 -2779 -693 1180 2583 -2166 -4454 -1434 1763 2431 -1577 -4195 -2364 1133 3920 -618
1521 -618 -4024 -2413 -369 -18 817 -694 -3086 -1985 787 1250 -1278 -2210 -1530 -904 -497 723 -243
1538 -243 -2459 -2427 -640 548 1299 -1162 -2776 -1431 809 881 -392 -1847 -2941 336 426 743 -1165
1555 -1165 -2161 -1421 -587 62 582 -378 -1026 -1036 1404 1441 1604 -220 -1519 -896 2668 2569 183 -2615 -1713
1574 -1713 1830 3929 1509 -1516 -2496 999 4116 2685 -235 -61 666 2868 1768 -245 -1027 -70
1590 -70 1580 2854 1363 -1150 764 2629 719 714 1998 1993 841 -433 -429 2524 3459 1108 -626 -1956
1608 -1956 2573 4621 1648 -2888 -2400 1376 3778 1755 -3310 -4158 883 3295 2203 -1925 -1983 -1062
1624 -1062 2938 2397 200 -1535 -1414 936 4 -1446 -1822 -752 189 -676 -1638 228 129 -630 -2883
1641 -2883 -1231 1144 1209 -1197 -3275 -3153 237 2103 101 -4008 -4889 -358 2612 953 -2834 -4811
1657 -4811 -1233 1988 962 -1711 -3506 -2512 344 871 -1068 -3410 -3213 -1010 -674 -1016 -3253 -1390
1673 -1390 -1278 -558 -961 -531 -842 223 -1687 -521 1375 1871 -1368 -3148 -2662 68 1747 590 -4073
1690 -4073 -2847 -71 2790 245 -1113 -3164 248 1450 1168 625 -796 -344 791 2211 1998 265
1706 265 -1462 -1144 1046 3075 2260 -363 -565 239 2465 2862 565 -1595 -780 3735 4118 3001 -1
1723 -1 405 984 3064 2648 645 39 1367 3879 1711 3067 540 261 1434 754 2211 1900 1661 -568
1741 -568 1213 1058 3893 1284 89 -33 571 4068 3074 -427 -2424 -419 3951 3760 217 -2409
1757 -2409 -665 2872 3425 462 -1710 -453 1768 3678 1184 -528 -1101 1425 861 -1256 -1378 -497
1773 -497 995 -1025 -278 -1377 881 1626 -2338 -2801 -711 2229 2045 -1941 -4242 -986 1708 1067
1789 1067 -2004 -4878 -2465 1641 2779 -194 -4862 -3831 1137 2095 -424 -4564 -3554 1028 710
1804 710 -547 -3683 -2272 -94 -644 -870 -1672 -1476 -1166 -221 -2521 -2746 251 1299 -2563 -3374 -1710
1821 -1710 1535 772 -2940 -3988 -2196 2093 2672 -1559 -5121 -3471 1255 2128 -173 -4271 -3200 1212
1837 1212 1591 274 -2432 -2819 16 1871 1124 -2324 -2588 274 1131 -504 -1234 -908 -305 760 -395
1854 -395 243 -184 488 40 -2911 -818 1177 2665 -295 -2308 -252 2675 3510 69 -2067 -1550 1125
1871 1125 3372 1295 -2689 -2832 457 2965 1543 -953 -2541 -20 2210 1640 215 -803 789
1886 789 724 1603 1464 272 745 582 2085 1472 557 172 -622 -23 -294 2395 1433 577 -1561 807 2128
1905 2128 3823 1098 -1438 -130 935 3123 1001 -1539 -933 1357 2686 1564 -139 -1045 -260 2104
1921 2104 3123 1250 106 -679 1212 2137 1776 1702 -723 242 841 1836 2040 -36 -1281 21 1093
1938 1093 2294 1295 -1281 -959 687 2033 590 737 -881 4 1607 3014 168 -1108 145 793
1954 793 704 457 597 -821 248 6 969 -1116 205 -1075 -616 -436 -208 1128 179 -2015 -928 1120
1972 1120 1936 -688 -3760 -3210 534 1611 265 -2889 -3323 -399 2620 865 -1702 -1935 -1900 2003
1988 2003 919 -574 -3286 -2649 743 992 -648 -1443 228 324 -749 -1748 -1148 489 584 -1860 -2286
2005 -2286 -552 518 -101 -2243 -2499 175 2342 1529 -1961 -3611 761 3233 2264 -1996 -4166 -71
2021 -71 3404 3475 -1592 -3439 -1136 3191 4192 -876 -2414 -563 3179 2538 -146 -1512 1152 2201
2037 2201 1357 -1538 -339 988 2076 90 -2671 550 2722 1572 -1766 -1900 1064 5455 3690
2052 3690 -510 -3426 357 4710 5183 -1276 -5088 -82 5291 4154 -747 -3767 -1005 4808 4762 -777
2068 -777 -3158 10 3522 2971 -1055 -2549 995 3632 614 -2242 -2147 2199 3020 -1348 -2443 -772
2084 -772 3661 3815 -2916 -3524 -535 3793 3413 -1398 -4524 147 5466 3330 -2476 -6022 -1025 3673
2100 3673 3451 -2428 -5486 -2718 3598 2347 -2715 -4419 -1482 1768 1238 -3262 -3020 1 2848 -200
2116 -200 -3893 -3250 848 941 -1859 -4265 -1459 3204 2541 -2863 -5707 -1137 3389 2029 -4047 -5121
2132 -5121 87 4014 2895 -3593 -5779 -1773 3024 1991 -3554 -4756 -644 2588 1252 -3022 -3373
2147 -3373 -620 1778 502 -3058 -1140 1431 1492 -1525 -2940 -897 1978 1694 -3155 -3760 1418 5633
2163 5633 2116 -3057 -4553 2193 4534 1531 -4037 -4181 2929 6212 2516 -3164 -1571 1227 6158
2178 6158 1576 -3125 -1364 3813 4100 597 -3173 78 4262 2161 -1607 -3493 1694 4626 2460
2193 2460 -2932 -2021 2884 5121 1203 -4710 -3038 4466 6495 1657 -4849 -2001 4135 6132 1566
2208 1566 -4533 -1767 4627 5929 -349 -4972 -1902 4418 5827 -1771 -4830 140 6070 3832 -2364
2223 -2364 -3697 1248 5577 2095 -4464 -2879 3938 6205 185 -6161 -3989 5431 7163 206 -7727
2238 -7727 -3421 6117 7424 -2249 -8711 -3208 7591 6838 -2044 -7308 -2693 6917 6928 -2588 -8169
2253 -8169 -1364 7164 3734 -3572 -6174 348 7202 2536 -5764 -5824 3223 7527 -915 -7335 -4856
2268 -4856 5045 7532 -2495 -8176 -4874 6595 7117 -2682 -9860 -3385 8616 7587 -3751 -8694
2282 -8694 -1517 7804 5732 -4651 -9464 -1301 7168 4028 -4464 -7518 528 5733 3115 -5497 -4926
2297 -4926 3089 6893 429 -7255 -4655 5943 6690 -2760 -9827 -3286 7344 6186 -2591 -9006 -2355
2312 -2355 8066 6516 -4984 -9997 -1489 9173 5699 -7734 -9145 575 9662 4625 -6587 -7705
2326 -7705 1003 6581 2419 -7416 -5956 2902 5631 -692 -7103 -3611 5720 6677 -2772 -7680 -1478
2341 -1478 8429 4805 -4283 -9151 199 8614 5791 -7235 -8870 1350 9447 3626 -7872 -7573
2355 -7573 2438 9402 4016 -7565 -6889 4181 8825 1645 -7531 -3628 5029 8033 -1499 -7020
2369 -7020 -2795 6790 5749 -3473 -7462 -577 9182 3920 -6323 -6009 3352 10167 3868 -7473 -7007
2384 -7007 4153 10397 2762 -7986 -6174 5701 11365 2082 -8593 -5060 6395 9007 -663 -8205
2398 -8205 -3088 7363 7817 -2474 -9683 -1939 7209 4923 -4217 -6345 1537 7692 2964 -6634 -6681
2413 -6681 3578 10705 1685 -9276 -7098 5200 10161 -621 -10434 -4949 7265 10099 -1482
2426 -1482 -10691 -4922 7260 9997 -2946 -10324 -2687 8181 7981 -5337 -10522 -126 8735 4922
2440 4922 -6849 -8391 1617 9335 1861 -9524 -7422 3562 9832 -265 -10237 -5572 6736
2453 6736 9063 -2111 -11709 -4969 8350 9920 -3836 -12190 -3535 9622 7344 -4894 -11619 -1941
2467 -1941 9571 6735 -6169 -10262 89 10048 4720 -8173 -10167 2501 9867 1940 -8228
2480 -8228 -7254 4659 9506 -751 -9455 -4073 6392 9532 -1674 -10497 -2826 9220 8949 -3680
2494 -3680 -11458 -1852 10305 8221 -6016 -12413 -695 11075 6691 -6622 -10122 1507 10788
2507 10788 5444 -7231 -7505 2947 10780 2971 -7734 -5536 6035 8919 -121 -10371 -4173 8365
2521 8365 7752 -3037 -10022 -956 9295 7922 -4774 -9676 821 10694 6419 -7492 -10200 2506
2535 2506 11847 6031 -7899 -8650 2774 11804 3382 -8289 -7556 3803 10103 1313 -8309 -4210
2549 -4210 6377 8182 -2151 -8653 -1868 7455 7514 -4439 -8917 -177 10070 5584 -6558 -9424
2563 -9424 3107 9494 3815 -9091 -8964 2854 10179 2058 -9353 -8382 4335 9536 656 -9954
2577 -9954 -7128 5371 9386 -1510 -8965 -4884 5699 6712 -3903 -10031 -2011 8673 4883 -5575
2591 -5575 -8235 425 9405 3034 -9396 -8109 3305 9797 1716 -10771 -7345 5767 10371 -486
2605 -486 -10966 -5852 6866 10433 -1645 -10927 -6108 7656 8253 -3479 -10283 -2342 8908 6289
2619 6289 -4352 -9410 339 9254 5327 -5801 -9008 1757 8671 3124 -8525 -6851 5467 9788
2633 9788 -296 -10723 -5989 7189 9949 -1227 -10250 -5175 7968 9048 -3932 -10800 -3034
2646 -3034 8767 9621 -3855 -11395 -1920 10449 6047 -4221 -9641 1281 10204 3548 -6913 -7144
2660 -7144 4535 9869 1289 -8023 -7146 5742 10487 -1459 -10194 -4354 8859 10565 -2918 -11781
2674 -11781 -2407 10019 7829 -5263 -11108 -2058 10509 8218 -5186 -9384 -85 10435 5644
2687 5644 -7039 -9342 2100 10442 3633 -7903 -7806 4141 11042 2099 -7610 -5257 6705 8616
2701 8616 -2424 -8328 -3358 7568 7877 -4386 -9439 -2023 8755 6635 -5530 -9839 724 11645
2715 11645 5661 -7501 -9664 2274 10044 3773 -7629 -8730 2301 10752 1431 -8319 -6659 5208
2729 5208 8104 -39 -8365 -3477 5517 6962 -2896 -8257 -1429 7555 6144 -5317 -8272 17 8370
2744 8370 4872 -6569 -8938 1797 9445 4435 -7395 -8530 3510 9109 1711 -6828 -6796 3449
2758 3449 8063 49 -8718 -6220 4279 7336 -559 -7868 -3467 5034 5656 -3316 -8071 -1692 5569
2773 5569 3722 -4336 -7314 1785 7715 2430 -7285 -5803 2356 7699 1522 -7879 -6481 4100 9070
2788 9070 -258 -9045 -5263 5957 8305 -1275 -8911 -3527 6451 6839 -2560 -8223 -1034 5971 4617
2803 4617 -4744 -7239 530 7970 2239 -5012 -6115 2487 6983 1396 -7773 -4371 5179 8196 -489
2818 -489 -8382 -3562 5368 8172 -1661 -9726 -3139 7071 7566 -2145 -8854 -1517 8040 6305 -3984
2833 -3984 -8051 -736 7653 4034 -3467 -6243 1839 7741 2224 -5458 -5094 4063 7001 77 -6711
2848 -6711 -3682 5126 6272 -1919 -6592 -2228 6981 5464 -2565 -8674 -987 8233 6305 -3590 -7751
2863 -7751 181 7956 5130 -5197 -6873 738 7725 3441 -4393 -5514 2193 6984 1534 -5097 -4410
2878 -4410 2328 5142 -750 -6571 -2357 5030 6090 -2269 -6594 -1827 7083 4651 -3511 -7057 -810
2893 -810 6933 4345 -3652 -7262 -356 7137 3662 -5080 -5356 1059 6470 2981 -6335 -6364 1256 6541
2909 6541 406 -6081 -3698 2061 5701 -352 -6462 -2398 3845 4518 -2555 -6120 -1384 5472 3143
2924 3143 -4106 -6466 -373 6971 2168 -5570 -5743 2120 6065 908 -5898 -5979 2242 6015 1961 -4094
2940 -4094 -5234 2111 5965 363 -5378 -4018 2289 4030 -844 -4121 -1954 3666 3543 -2590 -3324
2955 -3324 1293 4496 2262 -3347 -3668 1445 5973 268 -3655 -3855 2283 4986 881 -5450 -2588
2970 -2588 3107 5741 122 -5547 -3109 3477 4976 -1032 -5140 -2374 2643 4092 -897 -3509 -867
2985 -867 3377 2695 -972 -3121 901 4733 955 -1844 -2924 2018 4272 1121 -4909 -2641 2830
3000 2830 4255 92 -4358 -2307 4468 3720 -1206 -4328 -1396 4713 5062 -1091 -4013 -1794 3752
3015 3752 2617 -1258 -3324 -472 3778 1685 -2046 -2388 2052 3801 114 -2717 -2229 2254 3483
3030 3483 -225 -3587 -580 3422 3698 -1563 -4998 -867 4263 2993 -2440 -4235 -747 3711 3093
3045 3093 -2571 -4582 -453 3413 2243 -2445 -3822 -222 3905 1612 -2838 -2337 546 3057 -1077
3060 -1077 -3066 -1881 2539 2448 -609 -3832 -230 2786 2615 -1599 -3870 -1070 3337 1383 -3139 -4721
3076 -4721 504 5486 1933 -2662 -3956 -434 4101 2035 -3158 -3250 -86 3125 1130 -2749 -2805 1877
3092 1877 2698 1205 -2346 -1542 1948 2448 -1267 -3225 -977 1529 1583 -1510 -3730 339 2354 1532
3108 1532 -2675 -3872 513 3270 45 -2500 -2939 490 3305 1061 -2776 -2781 1217 2992 591 -1684
3124 -1684 -1852 675 1300 549 -688 -1574 1500 2317 -1086 -3084 -38 692 935 -1079 -2170 557 1021
3141 1021 412 -2163 -411 1069 3155 60 -2427 -2593 479 1394 596 -2310 -1584 1490 3110 508
3157 508 -3227 -1709 2122 2427 -140 -2065 -1198 -133 190 312 -1941 -502 1933 1740 -189 -104 1063
3174 1063 775 262 -1300 -837 2071 1933 -1215 -2316 -463 2420 2291 993 -2796 6 3221 2416
3190 2416 -236 -2066 -1328 1937 1462 -458 -1999 -1297 1565 745 642 -838 734 947 146 -72 271
3207 271 1272 688 1105 -627 -326 2139 675 -1147 -786 -547 693 715 -1727 -1940 109 1598 1382
3224 1382 -580 -1942 -633 2196 1841 -633 -2128 602 576 280 -801 -145 -555 1448 707 -387 -631
3241 -631 -31 -349 -517 -1884 -743 -11 586 -653 -736 -97 965 -42 -1762 -990 723 2672 -12
3258 -12 -2610 -2421 81 1773 982 -2348 -1690 785 960 1008 -654 -1388 -127 818 -447 -1249 -429 11
3276 11 730 269 -790 455 1961 -354 -536 -934 616 1510 -88 -784 -285 758 1935 607 -2256
3293 -2256 -2393 742 1360 1007 -2507 -1951 562 2954 544 -1473 -851 922 900 926 -1127 235 469
3310 469 120 363 -22 294 -172 198 -616 139 -105 98 126 -819 -606 1180 577 322 -1279 77 1523
3329 1523 534 38 -797 -827 721 965 375 -1332 69 1187 557 767 -1582 -1159 362 609 949 -984
3347 -984 -281 -136 -99 -81 199 -751 -769 -131 -183 384 63 264 -1295 -877 -697 8 768 -1559 -1155 -661 732
3368 732 -532 -745 -1533 -783 -176 313 -1450 -1501 -1980 746 318 173 -280 -939 -625 424 909 1423 -1
3387 -1 -2240 -976 -785 834 -350 -978 722 -1445 762 517 -102 -2101 -580 1397 1183 266 -1400
3404 -1400 -1408 -284 1365 82 -1898 -741 413 -581 884 1003 417 -187 -229 418 253 603 325 -415
3422 -415 -611 317 1299 1236 -347 -66 412 1341 -435 -1322 -707 1040 1831 393 925 -684 106 1326
3440 1326 1527 29 -847 111 46 72 -189 190 212 -51 283 862 318 -926 -131 -776 1368 643 -369
3459 -369 -532 -321 -431 1103 794 1405 -13 -679 15 733 860 223 -706 -317 1188 265 -226 -873 771
3478 771 1060 1567 123 -944 71 592 736 241 -636 -27 -690 638 1757 -179 534 -765 -298 926
3496 926 859 1064 11 307 475 775 -13 -1249 -538 -1080 197 985 -366 -1104 -375 -990 688 592 -552
3515 -552 -190 -697 -657 612 648 -505 -1086 -206 991 302 -227 -1306 -756 -5 956 222 106 351 -473
3534 -473 999 694 -197 253 -1415 -210 1100 -463 335 -952 -1662 451 678 632 -673 -1033 -208 -2
3552 -2 -185 -312 -573 -237 71 1460 740 -158 -422 -454 872 709 -735 -686 -428 1107 985 -96 273 -904
3572 -904 -632 651 863 1634 -1630 -380 127 -206 923 -403 -538 -923 118 670 -651 -847 -237 137
3590 137 358 -329 470 -891 -335 1383 696 -352 399 -552 106 503 562 529 -206 -324 -264 -439 1544 869
3610 869 -971 -1057 312 455 536 -326 -984 141 459 547 -280 -1689 318 168 1112 79 -229 -215 -554
3629 -554 748 1223 540 -424 605 18 511 477 331 477 -517 418 615 710 572 479 313 1339 575 -310
3649 -310 287 -427 535 570 613 -741 -492 -220 1195 485 199 -422 -865 262 -392 740 12 403 -576
3668 -576 1053 1380 -503 -1055 -202 -405 35 156 93 -805 -1327 710 226 -556 -877 52 -302 251 609
3687 609 849 -1280 -33 297 1181 614 166 -837 -830 185 1046 971 207 -439 373 232 620 -1217 -229
3706 -229 20 -771 1339 519 -691 -619 -161 -418 40 -1244 551 -766 -291 295 679 368 -155 -925 1082
3725 1082 367 259 454 -502 -540 932 1081 -458 -899 24 774 406 304 285 -338 -1066 710 650 -619
3744 -619 -133 -1042 485 979 334 -1134 357 95 1174 55 511 -468 -702 -126 1008 -152 544 142
3762 142 160 919 907 -96 396 -861 331 495 623 -659 -1132 234 460 354 62 -576 -24 -319 -107
3781 -107 618 450 -465 715 615 1 1065 -454 -360 -80 693 -95 532 -683 271 1261 1356 -60 -223
3800 -223 -351 -1090 1028 1 -383 1021 -923 -170 581 685 -461 -435 -801 488 -454 955 543 -1258
3818 -1258 -1283 179 1085 130 -1059 -1346 -729 543 1208 -712 -430 219 -182 -65 515 -35 -868 -1143 253
3837 253 989 -697 -118 555 -101 996 47 -174 -1309 -446 941 1044 -496 -1752 281 431 210 285
3855 285 -790 879 -58 473 1210 -556 48 -343 838 -828 227 214 -89 -597 -213 283 1011 -687
3873 -687 -542 -639 1206 586 552 149 -902 -587 481 442 -899 -43 424 1094 545 371 -971 -339 -286 -25
3893 -25 -612 383 -602 168 -198 182 -511 -73 231 -327 34 18 177 46 -977 8 1537 640 376 184
3913 184 530 -70 1007 24 -867 -888 -21 -141 976 -1512 298 146 1018 -583 792 -673 -22 512
3931 512 608 154 -665 -95 -510 -11 -353 -217 -1019 287 -347 -652 330 -1147 531 -895 903 -88 834
3950 834 -75 -608 -958 435 -149 -270 407 103 -365 233 404 72 -1374 13 1073 490 562 -286 22
3969 22 -980 462 400 -178 -1050 -580 852 548 573 837 -356 7 633 870 71 -1043 -58 522 -107
3988 -107 -232 -263 -565 -335 -241 775 16 -899 -1037 -103 907 -345 229 147 -569 -668 1028 165 1682 -557
4008 -557 -142 69 369 -110 -917 189 -214 131 -331 182 -916 17 -641 56 831 -1403 -15 333 383
4027 383 -351 372 273 676 466 159 350 -150 -542 225 546 524 407 -1204 5 326 183 814 -1171 -1156
4047 -1156 630 -95 451 -170 -597 -405 44 1084 700 180 -934 -499 1140 1451 513 -615 -339 456
4065 456 -43 294 -183 -918 814 -88 752 1080 398 653 -527 -782 -271 -167 476 -107 -55 322 -113 -582
4085 -582 -265 896 -107 643 1180 -875 624 515 694 923 -274 -843 -635 423 -166 32 -977 -903
4103 -903 664 608 43 -45 204 -177 -598 707 -125 -210 -485 31 616 51 -374 -1337 211 -114 578 687
4123 687 -175 -1617 -381 -76 1094 306 675 -880 136 755 -336 -171 -393 -872 1321 225 648
4140 648 -1304 -519 -135 54 -182 -896 -382 -913 -508 661 -766 -1515 -358 -697 -264 612 73 -493 447
4159 447 237 349 1543 -327 -905 -416 -121 360 589 -465 -1112 -469 613 6 -529 -1329 -1328 1090 99
4178 99 170 -560 -640 117 377 573 93 -678 -1447 469 623 815 -975 -25 -474 73 485 338 -337 -326 -199
4199 -199 1 687 394 -915 -193 -1313 -1096 1266 -1042 -1432 527 909 338 668 -670 -893 -533 -251
4217 -251 556 -566 -1447 -949 468 792 -743 264 -1108 381 1571 28 -317 -523 -450 208 254 914
4235 914 1014 -263 158 944 -154 -678 -1180 411 1875 627 524 -1041 -126 -627 789 -789 -112
4252 -112 323 561 -435 43 208 -531 -517 227 182 903 -786 -876 -1205 141 155 -606 -60 177 -645 67 931
4273 931 1333 -534 -1812 -877 552 -628 1447 -1162 -958 -158 546 -420 -1282 -147 11 196 548 721
4291 721 -1323 151 405 2059 -180 -347 -281 -202 296 -352 -348 346 -225 229 283 -37 818 -1223 -1493 -73
4311 -73 -36 872 85 -873 73 357 -315 -360 -1457 -468 -155 938 -747 -30 -837 490 1346 1279 -108 -201
4331 -201 -342 483 -594 -406 100 531 -335 -682 -444 -300 -768 -80 -349 -63 21 78 888 -438 -173 337
4351 337 23 -124 -880 -58 584 -111 140 292 539 -148 1075 -510 -1337 -321 164 268 404 35 -344
4370 -344 -618 -18 617 324 -788 -448 -151 884 1193 751 16 -1036 -1042 512 929 -205 -170 -374 845
4389 845 -121 214 -127 -2328 408 -98 262 267 34 516 792 612 916 884 477 270 111 -298 219 388
4409 388 -285 1562 1211 -19 234 -715 -1220 -610 -147 -39 -59 -1342 -798 179 -405 137 195 176 741 133
4429 133 532 -763 22 151 305 453 -426 504 119 309 -244 -140 -562 -439 -425 -175 -520 464 509 -670
4449 -670 -1849 420 1077 -376 -336 15 976 1241 363 -165 -833 -473 215 708 482 -1638 -910 225 -304
4468 -304 -8 21 -661 471 254 811 439 358 522 -192 1353 106 -25 -49 -77 -104 -413 -527 44 -347 -452
4489 -452 223 -529 -319 -36 -187 -259 135 -257 217 -262 206 415 55 1078 693 152 286 921 644 198
4509 198 -1172 -764 630 -522 214 -437 -1046 -141 720 249 -656 -172 305 -116 293 438 -64 -1249 -1175
4528 -1175 900 1417 -305 65 -21 -94 276 720 -420 -1157 -151 521 943 254 108 43 -1009 469 376
4547 376 36 441 -60 1045 1082 -1593 94 162 195 -150 291 407 -70 -597 662 274 -5 760 -246
4566 -246 -680 1006 508 287 -656 -1807 336 161 -152 -800 -685 182 0 329 -15 -213 44 -485 145
4585 145 195 850 -283 606 278 -419 932 241 -607 -755 3 229 829 -83 -1003 70 1547 1207 865
4604 865 -1181 -392 815 618 183 -1188 -685 -812 696 607 -1129 325 148 1253 600 -502 -850 -400
4622 -400 -351 -1401 292 -266 -459 310 -460 -193 -559 461 484 -277 1390 -548 230 72 -683 -1172 619
4641 619 522 987 -307 -36 350 511 990 -631 -266 1048 1776 -701 -55 87 -167 310 -255 -667 655
4660 655 528 -808 -826 -3 62 352 -254 -378 613 577 364 -422 -717 242 2004 319 -275 -1368 77
4679 77 431 488 -1207 -337 -1600 649 495 -458 294 -634 554 -98 13 -663 -848 44 474 68 137 -685
4699 -685 -897 320 -344 1070 409 152 50 -983 -257 -458 472 -688 -1443 358 11 1675 -1778 -1222
4717 -1222 -721 1137 963 317 -750 -740 1268 103 -176 -254 -1237 166 105 -101 -880 -244 491 -34 -125
4736 -125 -366 -106 76 121 -1362 492 687 -508 -945 -1137 940 473 -262 -1007 -782 -246 613 -145 -362
4755 -362 -1324 513 -31 121 -321 -798 -176 409 339 -813 -262 193 1071 153 1112 -593 105 -159 304
4774 304 -675 -471 762 -317 -799 -1640 292 1556 -246 146 -811 405 1298 474 -1397 -1701 633
4791 633 794 385 -663 -524 213 2141 899 -571 -833 -226 119 -46 -616 -823 327 278 265 -345 488
4810 488 710 297 103 -21 652 1954 5 -609 -432 528 1154 626 -132 -1328 488 1077 -473 -1224
4828 -1224 -1179 495 493 237 -124 -244 602 713 -42 222 -205 -451 651 191 -254 943 -388 -312 -1064 -301
4848 -301 209 721 538 -765 -63 763 618 -223 -1047 -376 944 390 339 -504 13 1893 351 -73 -897
4867 -897 50 188 -133 -527 -176 -1130 561 -357 -403 -328 -808 832 -21 -191 -423 -316 718 -48 -1112
4886 -1112 528 -489 2040 -737 -1221 641 800 761 -190 -830 -55 -414 1240 -1220 -2481 -558 1018
4903 1018 1139 -1018 -1043 498 1351 1512 -905 -1440 -99 -317 1132 367 -348 2186 569 1196 -1628
4920 -1628 -253 1015 458 -88 -846 -953 1862 815 -1252 -64 143 1327 771 -1371 -1304 -225 656
4937 656 993 -338 -829 -626 1539 386 315 -1429 540 133 -61 -1174 -243 -613 44 -461 -1706 -204
4955 -204 -964 1087 -71 -2283 778 521 542 386 -598 794 1094 310 -1760 -1894 844 631 1046 -863
4973 -863 -958 -405 743 146 -1349 -541 329 1019 372 293 134 378 358 855 -859 -325 1498 196 -295
4992 -295 -766 -15 371 123 -863 -1509 199 1715 195 -2220 -2078 504 1837 171 -1172 -2176 1476
5009 1476 1000 86 -1030 -1268 403 403 138 -757 -631 -114 1274 508 -423 -110 1025 1271 -447 206 -629
5028 -629 256 1684 -1469 -1289 796 508 -310 -2214 -943 1222 1297 -504 -1265 -579 643 868 -292
5045 -292 -270 -196 975 1009 -87 -954 -927 1095 -86 -155 -1875 374 892 266 -950 67 729 1254 -420
5064 -420 -463 -1179 779 1269 234 -1751 119 1093 328 -348 -2047 -671 634 1538 -566 -912 -401 543
5082 543 1011 -1131 -1256 496 1596 1367 177 -1063 1095 967 321 -57 -1310 64 385 -292 -38
5099 -38 -805 1271 1214 -587 -1061 337 1151 944 -1815 -673 -348 567 992 -661 -485 294 312 484 -176
5118 -176 -2068 396 817 1094 -1402 -1233 673 2077 617 -381 -2609 -41 577 -179 -131 -1737 1219
5135 1219 2176 380 -98 -746 908 758 -229 -1060 468 336 643 -440 -1010 34 1644 99 -2542
5152 -2542 -852 -174 474 1166 -1636 -424 365 1188 90 -803 -47 537 608 630 -1263 -562 1001 124
5170 124 378 351 547 506 1442 -976 -780 407 26 856 -928 -1480 1971 1302 -694 -1496 159 1243
5188 1243 1966 -142 -2567 -1663 489 2821 474 -2100 -594 542 365 -804 -68 -710 473 1572
5204 1572 -1234 -456 -6 1021 526 -423 -1012 -546 754 340 -903 -1437 718 73 -1055 -1873 -693
5221 -693 1509 862 -388 -1829 -1206 649 960 514 -1570 -744 1218 1183 -403 -1565 -998 1145 578
5238 578 10 -1018 -597 -12 543 -859 -845 238 612 -445 -584 -141 250 812 -850 -987 -111 1015
5256 1015 1543 -24 -317 64 1209 1762 -1022 -715 -256 801 501 -798 24 -347 1490 1045 274 -362
5274 -362 -634 979 564 88 -768 551 1207 539 -275 296 1906 982 52 -1092 -150 -506 -835 -1734 -499
5293 -499 735 1195 795 -719 -823 -156 683 607 -770 -638 615 967 700 594 -293 -817 663 752 -467
5312 -467 -748 -262 508 448 -240 307 667 992 -500 -837 -329 1195 783 -420 -646 -272 1729 469 -652
5331 -652 -708 -251 1446 512 -830 -1724 -299 842 164 -477 -545 192 1435 476 -153 -877 423 -505 -922
5350 -922 -908 -2015 69 -244 233 -890 -277 967 -140 -249 -1306 34 368 -1076 -923 -308 347 -133
5368 -133 312 -764 -1149 637 564 -495 -746 -1090 -871 -144 274 -1205 -23 104 -391 -213 -416 -74 485
5387 485 205 -1316 -746 -206 1021 375 -580 -31 47 734 572 -1220 -117 -79 382 702 -1423 -1219 467
5406 467 177 -25 -243 -790 296 1206 25 -557 -173 650 20 284 -1072 240 495 -360 380 -1089
5424 -1089 -561 290 723 -163 -1038 693 1403 -116 -375 -93 1313 -439 -661 -110 -952 -61 903 -53
5442 -53 -970 -336 729 -257 313 -1492 -14 775 596 111 116 -709 -220 173 -662 579 -447 1194 214
5461 214 -774 -994 -362 1677 104 1066 359 209 -107 -376 -570 -475 776 108 -154 -1414 376 600 222
5480 222 73 -632 -176 1033 578 618 -483 -482 1682 644 -15 -658 -621 100 740 -155 -972 641 376 134
5500 134 -764 -7 -346 875 -789 -1007 122 988 711 -654 -119 270 1192 930 -1088 449 683 269
5518 269 503 -1540 -400 758 685 259 -282 -545 356 445 208 -461 -765 190 25 -460 84 91 -267 -483
5538 -483 96 -572 -52 -49 -96 -1032 -1288 90 69 737 -1372 -141 317 705 1570 230 -767 -120 -53 -1109
5558 -1109 -1094 -338 146 762 -232 593 -530 -417 98 664 -833 -113 -203 -364 -799 324 572 347 392 -527
5578 -527 -155 -262 488 -638 -1221 -356 1326 1491 249 -349 -309 385 522 214 -754 617 89 409 247
5597 247 -437 489 497 274 222 -682 -398 809 291 -712 -643 -262 299 861 -600 -657 -261 548 245 -1492
5617 -1492 -462 658 111 122 -1117 -376 378 931 -351 -309 -574 942 952 402 -473 -154 26 114 1025
5636 1025 -739 -318 1030 992 -36 -592 -111 -37 -625 -606 -1279 363 -34 -1007 -486 -285 846 418 -231
5655 -231 386 103 983 832 -588 -409 403 -634 -157 -502 -562 -173 619 698 -42 -533 400 49 -247 -700
5675 -700 -207 241 194 62 -181 113 30 -121 50 722 622 -309 -432 -408 -1093 -324 -576 -1398 -79 -220 -88
5696 -88 -245 396 -1013 -243 185 -8 -195 -147 -223 -356 751 373 -540 328 -88 -81 -368 -659 -71 62 68 -896
5718 -896 238 714 -20 -310 -282 -217 -20 326 -484 -1229 -136 396 376 -227 -878 -731 634 419 -227 -626
5738 -626 490 -328 -114 129 144 692 -341 143 454 213 -488 -125 47 529 452 -4 357 -176 172 -511
5758 -511 721 -176 -553 -426 -746 66 624 779 76 -63 831 471 -527 -481 785 799 867 803 632 263 -269
5779 -269 457 -183 1007 647 -25 -524 55 586 -296 205 399 -429 340 -244 1047 224 -180 330 -22
5798 -22 515 -937 297 -565 365 184 549 -280 1064 624 832 -123 801 -105 -548 290 -291 -1363 -383
5817 -383 581 648 -99 -374 418 -791 -432 207 -223 348 -372 -360 -249 -1037 -260 -926 1036 300 61 1300
5837 1300 -1074 -472 222 142 763 -221 1352 664 127 753 -65 293 95 -548 -434 417 220 778 -338
5856 -338 -5 401 164 -1301 -466 -193 -239 -843 -249 -360 -567 697 -261 1408 -388 -242 374 -334 726
5875 726 248 339 137 -351 -281 -728 150 -1014 172 307 1180 391 68 -446 -111 230 -238 1187 37
5894 37 144 -550 97 -145 -872 -180 -46 -479 312 937 -239 307 388 414 -36 949 -54 521 -670 643
5914 643 458 -570 -928 -433 948 174 -277 -482 -1103 1121 -359 -187 558 -100 -365 276 154 -192 49
5933 49 -708 -216 667 656 -1046 -823 -888 183 93 366 -195 -57 278 382 732 -770 -65 -954 -38 823
5953 823 -370 -601 -643 139 -980 -442 61 -1031 -189 -170 10 -132 -137 -132 382 144 -561 -1128 460 -193 -94
5974 -94 61 -492 226 292 -733 -944 392 706 -9 -1092 -55 -252 -203 -231 -455 -1431 -187 -559 228 -927
5994 -927 -616 523 -46 -461 335 485 1043 -136 610 -92 190 -823 -349 420 273 738 138 98 757
6013 757 -260 -276 -408 -120 -263 -1161 518 -654 150 19 -362 169 482 1197 -331 309 -58 -352 -66
6032 -66 -287 925 -410 -948 -1054 -635 847 331 -901 -188 824 -763 -706 -500 375 461 617 -1368 -502
6051 -502 -1271 914 -380 1052 195 340 804 698 129 248 284 -473 -272 697 -464 -131 461 -320 617
6070 617 -353 -27 -1470 735 -360 199 39 -1188 34 -319 -565 324 283 -373 -156 -888 512 394
6088 394 535 -868 -667 549 203 530 -1416 51 474 4 -76 -985 660 -544 124 280 163 -798
6106 -798 -356 -229 292 723 -42 -217 181 -354 133 -213 -539 526 -1486 -589 -182 -420 1286 -779 -737
6125 -737 214 1129 -144 -986 -281 -136 261 -124 -27 149 -977 1096 -1139 134 391 -97 193 -150 -1242
6144 -1242 -1360 366 -450 711 542 -73 -540 332 -361 -711 409 543 -28 -89 -1057 433 -108 -105 -1376
6163 -1376 235 1615 831 -210 -1355 97 -187 50 461 241 -1215 -180 -1334 -3 -166 -664 -380
6180 -380 -580 -82 578 62 -701 -237 636 -105 276 207 752 135 904 140 -144 -383 -824 -335 735 -268
6200 -268 -101 -49 -459 504 253 537 -338 -539 117 784 -119 614 115 -1120 -373 40 841 -477 -304 387
6220 387 656 -137 -31 124 -330 -757 180 210 317 645 167 212 286 122 522 387 310 49 -698 -151 -963
6241 -963 -390 -493 -645 240 -1389 -387 176 1431 -511 -640 -464 -1456 40 -233 -432 168 -338 112
6259 112 881 728 -45 86 251 333 122 -278 1025 -13 412 1050 740 1573 -1337 -353 -638 510 -910
6278 -910 293 -140 92 41 564 720 1041 -229 -1188 39 -33 16 -958 -309 -186 -269 546 577 82 353 -273
6299 -273 198 -960 332 -189 -88 188 1286 106 -49 25 1425 447 -711 -566 -195 568 -750 677
6317 677 222 714 117 -533 -401 -290 771 -542 143 746 93 445 -63 -35 -570 435 -52 961 -1581
6336 -1581 -619 178 -1194 20 -383 -97 -154 252 346 1363 -677 718 -92 1027 -322 -854 267 -598
6354 -598 341 130 -926 -987 936 56 -254 -519 558 -837 261 -143 656 944 -259 51 -31 250 651
6373 651 -188 -121 -413 -490 -213 -145 239 351 -250 -416 614 -441 -488 -336 -431 -311 473 -165 -926 653 304
6394 304 96 -1537 9 -101 -28 -26 217 -1061 -295 441 -1358 1067 2054 -345 -1098 -472 975 345 -128
6413 -128 -613 -127 685 1296 56 -1161 149 -1081 -944 -135 -925 390 -66 -391 -164 230 141 -441 209
6432 209 1163 154 -865 -224 145 -114 149 202 175 1313 -273 -394 -246 363 -28 -797 -619 96 -128
6451 -128 -63 -96 -829 893 1292 581 -405 784 -30 -615 83 -206 -717 -1250 1316 -341 708 -897 -107
6470 -107 281 -616 484 -130 -624 -941 95 176 459 268 222 -1381 16 561 -624 -740 -1057 -187 -4
6489 -4 55 -573 268 229 394 -319 171 -264 209 635 -456 -604 -542 27 908 96 232 968 61 -235 -664
6510 -664 -566 562 301 171 -1062 -70 472 -135 108 -1256 1136 811 -281 -90 -203 -231 301 333 -137
6529 -137 106 -1065 645 152 208 220 835 362 -114 -19 67 184 -291 -940 207 -613 320 -433 258 -316
6549 -316 -412 548 528 657 206 875 212 1055 5 -53 1022 56 -175 -761 45 539 -95 -63 670 473 -550
6570 -550 -700 -407 1243 -11 362 -465 -345 -338 1074 -472 461 422 51 -189 752 -432 356 277 710 291
6590 291 1163 219 -283 -313 -474 666 -183 -15 -1123 186 303 435 -3 171 -822 -79 420 -595 105
6609 105 94 -83 -250 843 450 -497 -794 -372 764 387 -270 -582 986 688 -170 -104 -396 -455 -143 599
6629 599 362 644 -263 -156 -375 436 -45 -351 -557 -794 -914 -247 -1093 -189 724 776 253 283 -283 -83 -464
6650 -464 546 -539 660 313 166 -755 885 -59 901 448 -363 667 917 868 -419 -146 484 526 -148
6669 -148 -790 -432 -423 184 -896 -584 -1014 -103 -425 646 1457 -83 1558 2139 1396 126 39 -663 604
6688 604 330 -1012 -52 72 92 576 13 276 137 70 -339 487 123 479 -120 -721 -156 -189 261 -113 481
6709 481 414 -937 -515 -167 -193 -655 3 -386 424 171 -84 -253 85 561 142 37 -379 -464 -639 -103 -843
6730 -843 -236 106 -24 966 83 40 -131 -642 247 -434 -253 359 159 266 -156 -192 104 494 -1330 -176
6750 -176 252 -1211 176 -168 -482 -232 627 -392 -240 -736 29 -189 -172 1366 -375 -420 -571 -630 -165
6769 -165 716 -374 106 963 -1528 125 -32 -503 396 4 -459 -304 -504 1119 424 -649 -116 -10
6787 -10 812 -727 118 519 -551 -460 -741 -771 650 -138 379 -615 -656 -398 341 516 -253 -107 -402 891
6807 891 884 137 42 148 731 714 137 2 -767 1125 -673 218 295 -599 100 -298 -542 862 382 -318 -419
6828 -419 587 943 598 -208 427 -264 11 1082 299 -137 245 -140 -222 1434 99 -688 -7 -348 -127
6847 -127 477 -448 759 339 1023 180 71 336 225 -198 -198 -35 -767 436 355 609 -512 655 -677
6866 -677 1083 792 815 -96 -367 297 -334 1557 297 -755 -824 -29 469 963 340 638 225 555 -297
6885 -297 402 -358 -274 834 -887 -108 -142 -829 137 -337 -140 74 506 -75 111 -305 -159 -804 -1162 -986
6905 -986 701 208 656 -76 124 -301 -207 -276 517 85 -4 -60 -727 304 -764 -265 349 414 885 1657 -210
6926 -210 -34 -239 -339 -412 -327 463 -587 -481 667 539 307 396 78 -1155 601 -884 -651 279 -445
6945 -445 824 997 283 105 -178 -653 455 -37 -227 -589 184 750 1078 -288 173 92 9 -104 283 548
6965 548 -403 -348 -401 -12 126 -799 53 -376 -618 164 -170 -520 -541 435 176 891 951 -438 -239 471 -664
6986 -664 317 568 718 -691 -111 -270 279 669 -122 95 84 33 642 -255 -704 325 -289 -11 491 341
7006 341 40 -510 131 -680 929 62 258 433 381 239 -94 427 -626 182 -1123 -875 140 -145 1423
7025 1423 461 -564 533 -673 -701 765 -28 306 248 701 -504 -391 49 33 -205 -630 -506 337 -579
7044 -579 160 -263 -340 1016 -24 97 213 -83 -1359 545 -398 720 193 -240 279 865 -479 259
7062 259 -436 882 415 -532 -549 508 815 601 496 -1052 669 1226 -258 326 190 138 -174 -47 202
7081 202 -51 -304 49 -945 -108 642 651 -65 -231 550 651 598 476 -747 -518 716 873 -621 407 -469
7101 -469 -471 -750 -871 667 -865 -23 -376 314 -866 401 -111 -3 197 -700 56 1133 215 192 -952
7120 -952 314 26 -315 478 507 919 439 255 -894 -231 444 171 -537 297 495 -1003 208 753 -583
7139 -583 759 -622 369 -551 -50 249 141 -15 686 142 -230 763 3 -170 -41 -810 -86 -42 69 -704
7159 -704 -813 123 721 616 333 -221 319 -228 -937 -1849 -249 77 -332 1074 -305 -1 -294 -265 -46
7178 -46 -334 473 507 -547 457 -174 -490 -325 868 20 -1097 794 -273 -127 -66 -331 -116 743 -603
7197 -603 868 133 -239 -392 -409 518 -581 126 -936 280 323 36 -1232 -943 -660 1355 -253 561
7215 561 -258 521 -137 446 -399 439 1443 17 -399 221 246 600 603 -1052 792 -480 -240 1207 91
7234 91 -94 -755 283 186 -36 -604 54 -782 530 -2 -820 -296 -914 491 -79 772 1088 -939 -744
7253 -744 1193 71 745 -170 892 -616 249 366 70 792 -282 538 -410 166 -56 -21 172 -49 -224
7272 -224 302 -1179 172 701 305 807 -625 -361 190 -823 -155 622 518 -256 13 -438 -338 -451 -236
7291 -236 500 802 841 -143 221 1137 -970 124 877 780 414 -99 760 -398 -1001 23 -574 267 192 105
7311 105 -52 435 217 -32 299 236 2035 -453 554 143 -826 347 653 -433 -816 140 82 346 707
7330 707 894 -658 -376 -99 121 260 -1091 410 514 211 222 -313 -281 -363 278 -160 798 -112 1210 -809
7350 -809 647 128 50 -630 97 418 183 -436 -527 795 317 904 -948 -537 30 -230 -84 178 347 -292
7370 -292 148 -272 -21 485 552 -413 -31 -604 -296 -1092 -363 367 81 997 -1004 201 519 458 1011 191
7390 191 -149 591 173 -522 131 327 -591 42 -841 384 -428 -702 953 161 331 -62 -1216 -522 34
7409 34 -195 357 315 -251 108 -849 -651 90 -631 787 -747 941 105 1141 -196 202 -1 260 -492
7428 -492 -352 -391 -246 -191 -623 -22 -41 77 -1074 460 1172 -759 512 -818 160 -609 -406 -318 162 62
7448 62 -1283 114 -372 171 334 -702 583 -922 -781 -700 -326 -15 378 185 -516 530 -230 -363 -241
7467 -241 -779 -657 -277 -272 415 167 77 -148 172 -548 8 156 587 380 -1056 -464 67 -524 -12 159 1661
7488 1661 -168 108 -85 134 749 503 -1158 787 196 -556 585 -502 241 -532 -375 445 282 -237
7506 -237 -314 -97 552 106 101 884 663 1479 -228 -465 -12 -435 608 -422 -231 577 481 -276 617 -227
7526 -227 -856 1664 -131 -336 -296 -175 1116 865 138 -110 53 -47 470 348 -6 -301 1 -284 550
7545 550 -810 -326 -589 217 -262 909 170 76 -96 592 -442 155 72 636 144 1175 277 -240 278
7564 278 105 234 278 352 -209 -140 276 21 277 -1661 -92 -53 673 572 -98 57 222 -743 -486 996
7584 996 -488 13 153 -1080 -430 428 126 -694 -614 315 -677 -317 -579 -820 -214 166 439 -1100 876
7603 876 166 -1009 -187 1410 256 284 -103 125 305 15 -477 -1337 -535 -302 555 554 897 262 288 206 396
7624 396 -252 -257 -290 899 423 302 -7 91 -150 -301 -196 197 -151 149 602 170 -5 -568 -91 -28 -579
7645 -579 -52 -796 -1288 -404 145 -205 1123 -290 56 -327 -105 361 -364 690 -559 -378 317 736 -443
7664 -443 -158 -752 408 923 -627 71 169 -343 -562 172 -241 -6 -695 -255 -1023 -267 -370 1043 869
7683 869 -409 -148 563 -775 -490 140 -529 398 -247 -142 -302 -102 73 -71 875 449 -132 -716 -776 -200
7703 -200 -309 -1373 893 383 316 -72 145 623 914 -629 4 -83 313 -1260 -244 682 349 -305 360
7722 360 -275 -856 -824 -746 324 -346 52 -235 -308 438 -210 730 82 689 202 988 185 -346 -175 -196 -294
7743 -294 -417 200 -77 -184 136 506 214 -1174 -952 217 -339 684 -556 -141 460 -113 -95 -238 389
7762 389 -138 917 188 368 194 242 -441 -362 -474 464 824 -235 85 -843 -497 -817 -115 -644 -554 357
7782 357 277 -414 1017 -484 373 463 878 319 530 551 0 -943 -68 -493 -1016 -452 985 649 1733 829
7802 829 946 1352 543 68 -369 332 -838 -221 -928 1367 -235 -699 -134 -117 71 920 -1070 109 -959
7821 -959 387 -375 189 115 -502 -30 198 109 416 -203 -572 -1172 -979 934 49 530 -216 -133 -385 166
7841 166 -214 -171 569 -908 159 288 -294 -793 -577 -42 394 -109 -288 -267 -1032 566 -943 406 -448
7860 -448 287 500 -663 305 353 -306 495 -95 -582 -547 0 -295 246 -1265 -1465 211 -21 -870 -445 31
7880 31 54 -747 -634 893 640 -34 325 230 84 337 670 -310 740 212 -514 464 602 -46 422 -21
7900 -21 -169 -767 -965 -452 1348 -287 -90 -272 -373 -506 63 -1081 -413 112 -471 175 -13 156 -136
7919 -136 213 -14 -1659 -188 25 340 691 323 927 348 -17 -194 -684 109 156 -52 249 782 -38 -531
7939 -531 561 324 286 -59 -77 -363 314 -56 96 -506 139 756 -83 -271 1133 449 553 562 569 240 368
7960 368 -784 -401 783 212 470 -87 213 -128 -523 -135 -103 560 -27 -4 186 -85 595 -151 228 577
7980 577 -129 -330 -535 -626 42 -286 540 -225 -351 752 684 1009 -130 266 -891 -261 464 -439 187 -308
8000 -308 471 1203 989 -569 -355 -532 -1110 -400 -181 146 -153 1252 420 562 -556 -247 118 -210 -476
8019 -476 402 1398 -147 -379 386 -398 -223 916 -1102 -959 180 695 237 -661 -272 108 242 1100 517
8038 517 -91 -155 -113 -230 297 460 -490 -352 -148 -301 -796 -642 -322 -709 336 608 -1188 495 -915
8057 -915 -117 1080 25 164 360 -55 633 205 205 -292 697 -298 44 71 -183 -670 244 -85 607 -534
8077 -534 490 608 -20 -526 -1109 -257 52 -369 -916 501 660 613 546 800 -249 376 -17 97 626 1146
8097 1146 -323 608 -376 -534 -771 -582 279 32 226 -588 409 385 -421 331 162 -1098 -604 -75 150
8116 150 -494 1194 1176 193 -173 -13 -97 779 -625 -557 -111 -413 64 -383 -144 -277 577 -637 -160 -129
8136 -129 -13 -673 -205 322 653 -1582 -24 981 -1304 260 133 220 234 -158 -344 -240 567 639 657 -15
8156 -15 117 -130 114 1149 29 588 48 1711 9 -557 -468 -887 -668 856 -397 -89 494 878 -337
8175 -337 -822 85 -3 -1173 81 251 -761 355 -280 -687 110 376 54 -212 -251 -856
8191h56
$$ Imaginary data points
##PAGE= N=2
##DATA TABLE= (X++(I..I)), XYDATA
0 0 0 0 0 0 0 0 0 0 0 -108 108 -108 108 -113 216 -216 298 -324 416 -435 540 -648 741 -847 971 -1091
26 -1091 1239 -1415 1614 -1819 2048 -2294 2577 -2880 3220 -3583 3984 -4426 4913 -5444 6026
41 6026 -6677 7386 -8180 9070 -10065 11179 -12448 13923 -15618 17623 -20037 23001
53 23001 -26732 31631 -38334 48163 -64014 93919 -170851 820054 1427822 140714 -346142
64 -346142 -530413 -399707 -590815 -499383 -34750 718541 924375 493429 -196743 -392066
74 -392066 -219449 -106197 -310158 -320220 103337 619046 568001 51795 -339536 -215031
84 -215031 39025 -3971 -262093 -225440 180940 497778 290996 -171964 -328962 -47725
94 -47725 176951 8504 -274704 -176701 233102 402174 82702 -292242 -238447 104215 205081
105 205081 -65657 -278498 -86765 260927 277806 -67878 -302247 -118386 192163 164996
115 164996 -154237 -268887 16361 291514 149028 -204734 -265829 31754 239051 58301
125 58301 -233475 -207658 113019 272304 36732 -265121 -200518 133600 245172 -28995
135 -28995 -277930 -129783 197404 226386 -79246 -272539 -85488 200046 171009 -121322
145 -121322 -248837 -24369 225032 136252 -160943 -231234 24326 230312 81461 -198997
155 -198997 -193109 91931 235725 27644 -225266 -155288 135030 219384 -21477 -235298 -111828
166 -111828 172188 204032 -61019 -241496 -74845 198800 180090 -102952 -236669 -22153
176 -22153 222713 140634 -141922 -211049 29000 223870 94092 -166387 -178307 73395 224208
187 224208 51502 -193406 -150431 121997 221919 -1433 -218339 -107483 168285 201234
197 201234 -52723 -223608 -60962 195184 175676 -91529 -220748 -24416 215259 149373
207 149373 -126176 -211742 17070 226757 110023 -158525 -187347 62205 223236 63735
217 63735 -180155 -152183 101032 208198 15771 -193698 -116190 133696 191067 -27429 -203133
228 -203133 -76625 167166 171214 -73485 -208925 -33484 194640 139863 -114584 -198745 8265
239 8265 205516 108472 -140777 -184804 39970 208949 77925 -164512 -168397 74332 207956
250 207956 37410 -184350 -134374 110720 189960 -6294 -189518 -93888 136099 166071 -45549
261 -45549 -190490 -56873 160672 143470 -86479 -190212 -16618 183229 114666 -122959
271 -122959 -182207 24080 193820 80157 -149284 -161830 56417 190056 48598 -164106
281 -164106 -140965 82989 184501 16204 -175380 -113017 110462 168529 -23080 -177712
291 -177712 -72269 132664 138760 -57490 -167573 -35288 144334 109256 -86108 -158770 -2215
302 -2215 156038 83261 -116767 -148054 34895 165975 50365 -140954 -127347 68633 160593
313 160593 18848 -149484 -102738 89481 149923 -7005 -154584 -79297 109536 136857 -36267
324 -36267 -155032 -46415 127146 110500 -68175 -143685 -10217 134006 80309 -89812 -127191
335 -127191 21395 139665 52933 -110766 -113599 53672 143864 23458 -130975 -90270 85084
346 85084 138095 -8702 -139051 -63899 106390 124215 -31747 -135443 -40420 116760 108265
357 108265 -50303 -129864 -15220 128639 87880 -72343 -116906 19175 130626 57160 -90901
368 -90901 -92988 49177 124881 26555 -100623 -74142 71251 121353 994 -113326 -53811
379 -53811 95618 114982 -26984 -121541 -29185 115587 99489 -51282 -117090 -5553 121109
390 121109 79326 -66813 -109801 13269 124183 60735 -83056 -98676 37168 123346 33388
401 33388 -98384 -80055 61104 112988 1166 -108103 -55100 79593 98345 -25098 -112807
412 -112807 -36056 94848 87552 -50858 -118881 -14518 108754 70493 -75591 -115768 7092
423 7092 111805 48668 -89978 -106340 23023 108294 28225 -98900 -92537 37965 101802
434 101802 8538 -106941 -75153 55284 90735 -18529 -111310 -50738 70321 75053 -43529
445 -43529 -109461 -29030 80349 58265 -62259 -107662 -8841 90862 45439 -80161 -103031
456 -103031 12076 97042 29433 -92979 -91864 30205 96706 11771 -98073 -75425 43119
467 43119 89033 -2962 -98633 -58605 55337 81225 -19272 -96516 -36814 69009 67646 -38972
479 -38972 -90713 -11964 79950 51219 -53305 -80661 9003 86237 36763 -65629 -73537 27612
491 27612 89904 24148 -74627 -64350 43009 90179 10615 -79102 -48061 55273 82721 -1987
503 -1987 -74207 -31959 60891 72182 -12087 -69647 -16279 66843 60589 -26734 -62960 2994
515 2994 73803 43980 -40129 -53669 22932 75403 28509 -48677 -43251 36586 73948 14877
527 14877 -56414 -34966 46880 72900 2454 -60745 -26466 56120 65510 -10475 -61840 -14247
539 -14247 59812 53700 -20029 -53861 -1312 57831 39645 -28315 -48268 8587 57887 25279
551 25279 -38510 -40695 23266 56511 8772 -48500 -29927 35348 50866 -7266 -51452 -20835
563 -20835 42082 46998 -16509 -55129 -14674 48780 40982 -25510 -56229 -5719 51556 31299
575 31299 -34649 -49012 4413 46620 17095 -37640 -40178 11488 43411 7559 -41462 -32651
587 -32651 21720 39356 -6243 -46771 -20199 33230 33131 -20541 -49033 -10656 39235 26451 -29306
600 -29306 -49307 -3583 42873 23210 -34414 -49034 2852 45851 17806 -39960 -43894 10930
612 10930 44842 7707 -40878 -33500 18097 39244 -275 -39623 -24093 24635 33816 -9357
624 -9357 -41888 -14801 32795 29461 -21471 -43057 -1290 39677 22202 -29836 -40254 6965
636 6965 42692 16417 -34428 -39161 12198 44023 13188 -38895 -34716 17545 43682 6549 -39449
649 -39449 -27635 22865 37259 -1784 -36588 -17657 25311 30408 -7467 -34247 -10172 29631
661 29631 24982 -16133 -33360 -808 35164 18266 -24694 -31242 9712 37510 10762 -30384
673 -30384 -27999 14733 38346 8460 -32462 -26779 18445 37805 5953 -33637 -21705 21750
685 21750 34748 71 -31557 -14391 24156 26482 -6330 -27535 -6588 24530 21851 -10385
697 -10385 -24262 561 25863 14431 -17162 -20786 8667 29494 9158 -21524 -18251 14099
709 14099 27651 3239 -23843 -15244 16948 27623 982 -23727 -14013 17684 25955 -60 -23222
722 -23222 -11787 17355 19606 -4783 -18939 -4649 16436 13715 -6551 -15199 -449 13876 6725
735 6725 -10649 -12400 5887 14484 2261 -14892 -9654 9551 15597 -3715 -19218 -7956 13450
748 13450 12920 -7966 -20240 -6298 12449 12502 -7052 -18652 -7515 12127 8944 -8622 -17331
761 -17331 -3968 9707 4790 -9089 -11938 -202 5788 -1405 -10768 -7206 3300 4269 -6441 -11975
775 -11975 -3897 8027 4392 -11053 -14501 -1344 11322 4037 -12837 -14791 1234 11020 3685
788 3685 -11827 -14086 1237 11938 2479 -9782 -10836 1654 10918 2093 -10655 -6109 5311
801 5311 8978 -1605 -8924 -409 9221 5147 -6164 -7031 4407 11772 5109 -7165 -8001 6723
815 6723 15667 5046 -10399 -7649 10015 18259 4880 -10281 -6253 10962 17128 5407 -8740
828 -8740 -5082 10329 15926 6213 -7200 -3175 11346 15894 4187 -5501 1872 11901 11356 -193
842 -193 -3626 6046 14312 7576 -3077 -2806 7810 15211 6721 -5136 -5559 10482 18922 5712 -9829
857 -9829 -5249 12121 18572 4374 -10628 -6589 9587 15232 3178 -10152 -6383 6640 14220
870 14220 1810 -8687 -5767 7699 10504 -1545 -7952 -1941 6163 3963 -4252 -6875 -662 7306
884 7306 1129 -7564 -8274 471 7976 -329 -12100 -10318 1755 8129 -1923 -14714 -10828 1768
898 1768 7044 -1006 -13272 -12528 -473 6521 -972 -13403 -13372 -2370 5242 -2343 -11936 -10375 -2107
913 -2107 858 -4900 -9348 -6671 -2761 -2295 -7357 -7756 -4211 -1096 -3549 -9094 -8027 -1165 2291 -2252
929 -2252 -11004 -8479 -34 4007 -2104 -10507 -7854 1006 2781 -97 -8585 -7569 -260 5282 1246
944 1246 -5442 -7092 -418 4218 51 -2823 -3484 -1187 -299 873 -451 110 -822 439 53 603 1924
961 1924 1671 -1406 -2109 1732 5631 2954 -993 -2839 2715 7246 3778 -1071 -1997 -114 4675 5208
977 5208 1884 446 805 2977 3418 2681 2325 2362 2969 668 2873 4347 4618 1568 -1018 1185 7476
994 7476 6787 -266 -4382 -460 7128 8223 1842 -4121 -967 6247 10405 2132 -3827 -1319 6943
1009 6943 8354 654 -2914 -1402 5586 5349 1040 -2582 525 3731 2749 -381 -788 1784 3664 236
1025 236 -3545 -1954 5200 6386 -567 -5943 -2055 7022 6528 -1959 -8331 -2644 6770 7977 -1021
1040 -1021 -10116 -4838 6158 8626 -1791 -9038 -4003 4330 8150 -1957 -7140 -3467 4179 3457
1054 3457 -1799 -5271 -1320 3826 1280 -2320 -4176 1713 4785 -128 -5924 -3839 3701 4380 -1711
1069 -1711 -8835 -4130 4682 5935 -2008 -8787 -4788 3786 6895 -398 -8703 -6559 3453 7635 -1177
1084 -1177 -8759 -5708 3009 5609 -342 -6411 -5247 1977 3234 -1248 -4154 -3788 1199 201 -2120
1099 -2120 -2567 -478 1094 -429 -4977 -3002 2265 3053 -3289 -5573 -2761 3429 4234 -1122 -6403 -4528
1115 -4528 4318 6073 -707 -7172 -4689 2170 5105 951 -5158 -3844 1372 4125 1579 -1505 -2291
1130 -2291 -222 2135 1625 -455 -1218 127 127 1073 758 2158 1516 -1114 -1905 1618 2957 1707 -1428
1147 -1428 -3066 933 3947 3242 -690 -2888 535 3706 4021 1102 -1757 -759 2892 4664 2258 522
1163 522 300 961 2214 2726 2081 1330 -1217 -29 2365 3356 2387 -1314 -1953 1079 4467 3818 -1439
1180 -1439 -4994 -260 6386 3452 -1258 -3552 -728 4194 4941 235 -3485 -1934 2647 2561 649 -2908
1196 -2908 -1182 869 1822 -1101 -1607 525 -205 -1032 -3991 -1738 1539 160 -3721 -5360 -1592 2361
1212 2361 1592 -3729 -7719 -4471 3940 4590 -3476 -9163 -3983 3737 4059 -4698 -8856 -5477 2858 3299
1228 3299 -3403 -9087 -6249 1603 2448 -4219 -7635 -3949 873 -765 -5066 -6436 -1160 714 -2752
1243 -2752 -5611 -4034 -909 1475 -2485 -6942 -4385 2022 4434 -2288 -9110 -4812 4216 6111 -2881
1258 -2881 -8767 -4894 4185 6217 -1978 -7687 -5201 4875 6919 -443 -6809 -3440 3756 6927 -968
1273 -968 -4605 -391 4868 4106 -539 -2223 1521 4892 1806 -657 -1088 3343 5059 2389 -3206 -2309
1289 -2309 5930 8621 1771 -4580 -893 6914 8764 873 -4044 -1322 8485 9817 3182 -3701 -2254
1304 -2254 6476 9414 3618 -2101 -313 5831 7295 1885 -2264 1605 5032 4223 1197 4 3704
1319 3704 4880 2792 -633 1519 4901 5229 -117 -3136 -175 5595 6925 -368 -4509 -574 4969
1334 4969 5420 -1229 -3579 -1200 2898 4909 406 -3976 -2329 2637 3265 -222 -2942 -1759 304
1349 304 570 -1073 -1482 223 -1086 -1797 -1350 509 77 -2291 -3765 -3668 687 2326 -1830 -5286 -4865
1366 -4865 -294 2653 -1021 -5499 -5873 -72 1563 -677 -4698 -4521 -1337 -291 -1206 -3512 -3573 -2769
1382 -2769 -1227 -1497 -2986 -2082 -618 -3169 -4330 -3451 831 656 -3286 -6110 -1765 3023 2595 -4149
1398 -4149 -7853 -2985 3717 3743 -4542 -7616 -3385 4053 3777 -3127 -6229 -2203 2546 2670 -1486 -3980
1414 -3980 -1331 1972 1755 -1760 -2798 319 2448 1217 -2500 -1522 1312 2858 -1648 -5258 162
1429 162 3955 3975 -3058 -6140 -482 6582 5162 -2575 -6175 -1612 6538 5698 -2228 -6164 -1624 6043
1445 6043 5375 -1128 -5734 -1314 4579 3491 -974 -2476 167 3693 1526 -941 -1152 1723 3781
1460 3781 -595 -2934 -177 3526 3389 -885 -3470 1021 4379 3641 -1427 -4225 -955 6393 6103 -1535
1476 -1535 -5097 -711 5688 4383 -523 -5313 -754 3785 4833 80 -3562 -800 3830 3521 -633
1491 -633 -970 -123 1692 2479 -712 291 359 1481 -165 -1208 1198 1859 984 -1837 -1916 1528 3112
1508 3112 1211 -2088 -2621 539 3953 2008 -1108 -3077 -1718 3282 2826 -1266 -3227 -952 1820
1523 1820 2876 493 -2406 -2076 346 1301 1239 -476 -2206 -1312 -495 818 -67 -390 -1758 -2078 3
1540 3 1631 1435 -1605 -1962 -1136 1026 -198 -550 -2383 -2216 -48 1548 -59 -2690 -2149 -1486 -336
1557 -336 -167 -352 -2146 -1803 -1026 50 -64 -1477 -2139 -2200 -565 1423 -63 -1710 -3138 -2177 1460
1574 1460 1996 -239 -3931 -2553 641 2068 1360 -4676 -2285 -567 2025 1258 -2761 -2478 -527 1203
1590 1203 1235 -1 -1399 -842 740 -76 257 140 1721 166 -1008 179 964 1753 -610 -1759 -246
1607 -246 3247 3492 -188 -2653 -643 1767 4094 603 -2719 -1603 3266 5444 1309 -1768 -2007 2384
1623 2384 4477 2231 -497 -526 2074 3683 3510 945 -357 705 2311 1083 1007 2154 1862 398
1639 398 208 15 2748 3404 367 -1703 -260 3455 4131 201 -2607 -1884 2418 4321 7 -3042
1655 -3042 -2496 2189 3539 827 -1770 -2542 54 3737 1393 -1896 -1529 -355 1265 2114 -261 -1853
1671 -1853 -607 -333 -359 -381 -332 -1223 -3071 -2914 -567 57 -707 -1545 -3612 -2300 -762 768 -2858 -2876
1689 -2876 -3739 252 1782 -1523 -3257 -4662 -723 245 -435 -3262 -4294 -2748 -813 -104 -2229 -2414
1705 -2414 -3498 -1926 -818 -1036 -1534 -3079 -2762 -255 -334 -632 -2441 -3400 -2001 1243 1575 -903 -3604
1722 -3604 -2529 -197 1613 71 -1467 -2385 -876 454 357 -111 -2361 -867 382 386 638 410 -704
1739 -704 -1034 -1417 1601 3308 533 -1169 -232 1340 3309 1330 -94 -1977 1158 4014 2768 -1426
1755 -1426 -1546 156 3027 3753 -289 -1574 516 2665 4145 1555 364 649 3133 3971 1599 396
1771 396 2083 2893 1206 176 -756 2641 2330 -21 -1099 2239 2848 3056 -1085 -2143 820 3999
1787 3999 2439 -766 -3730 827 5117 4029 -1079 -2294 289 3298 3366 -235 -2778 -1288 3697
1802 3697 3911 -807 -2769 -987 2397 2916 210 -1796 258 1552 -170 -603 -165 1398 583 -1777
1818 -1777 -1364 320 1707 1090 -1914 -3706 -1239 2281 1623 -2112 -4748 -1200 3862 2759 -2092 -4833
1834 -4833 -2264 3083 3161 -1293 -3728 -2048 1437 1859 588 -3683 -1337 551 -518 434 -2060 -937
1850 -937 -101 -453 -1615 -1114 -120 -349 -1502 -1845 -690 701 -58 -2199 -2496 -1331 1598 1326 -2373
1867 -2373 -3893 -1175 1881 2267 -842 -3147 -2019 338 1365 -14 -2285 -3669 -725 1810 245
1882 245 -1101 -1803 -1118 -347 630 -908 -1332 -1144 -666 -103 85 -990 -1448 -1425 -358 1043 2180 373
1900 373 -1397 -2083 -259 1405 1280 -923 -1892 -878 1905 2379 168 -1746 -1890 -308 1964 615
1916 615 -204 -2423 147 830 1184 568 -1173 -536 24 1911 690 469 -24 -558 1011 866 500 298
1934 298 -790 -507 1027 1111 -314 -1152 -991 380 1664 764 -798 -1439 -357 1861 2198 17 -789
1951 -789 10 1492 1022 630 151 -1194 423 1815 1835 855 -608 -85 -1235 953 1686 1681 -986 -1390
1969 -1390 332 1235 1698 532 -1615 -859 2332 2210 -510 -3009 -1023 1511 2948 897 -2390 -2452
1985 -2452 1775 1876 1936 -1248 -1419 321 1207 2164 -844 -2058 -169 707 -290 -725 -209 570 -227 -1500
2003 -1500 244 803 554 -1013 -2412 -1832 -10 2995 -440 -3749 -3085 723 2401 981 -4256 -4077
2019 -4077 -393 2895 898 -3566 -4631 -1219 3288 1815 -2925 -2808 -671 2087 1239 -2946 -2705 981
2035 981 1112 -115 -1870 -2157 768 -130 -1151 -1354 -313 2605 1759 -1096 -3465 -48 3787 1087
2051 1087 -2116 -4292 468 4366 2287 -3788 -3426 -549 3959 2523 -4163 -3845 76 3661 2935 -1987
2067 -1987 -3041 377 4358 2100 -1453 -2342 980 2898 311 -1210 -756 3210 2193 -596 -1384 1462
2083 1462 4459 2157 -938 -3413 1155 5297 3173 -2024 -3586 2608 5606 3107 -3067 -3304 517
2098 517 5430 4128 -2259 -3189 877 4543 2768 -1266 -1884 416 4100 1361 -1252 -1248 1649 2996
2114 2996 -47 -1255 -679 3300 1932 -1720 -1956 -373 4718 910 -3820 -3875 1180 4439 1287 -4764
2130 -4764 -4358 393 4125 1675 -3748 -4760 1570 4706 1292 -3596 -5209 446 2902 931 -3111
2145 -3111 -2515 695 656 -672 -2776 -1853 1499 1750 -3250 -3334 -23 2466 -580 -4556 -4213 933 2488
2162 2488 -771 -4870 -3934 1845 3677 -322 -5619 -3003 2423 4114 -755 -5912 -2607 3086 4655
2177 4655 -964 -5841 -2352 2597 3045 -1866 -4962 -525 2791 728 -3612 -3849 1184 3485 694
2192 694 -4571 -2124 2019 4941 -95 -4682 -1418 3795 5901 -1928 -5674 -2661 5592 5875 -1702
2207 -1702 -5595 -1129 5192 5736 -954 -5867 -1623 5215 4272 -2474 -5021 978 5282 2327 -3106
2222 -3106 -3279 3609 5183 1399 -4923 -2524 3823 5432 -1262 -4874 -1620 5151 7387 -1499 -7954
2237 -7954 -647 7615 6163 -4453 -7535 -1304 8478 6423 -4147 -7961 279 8714 4560 -4601
2251 -4601 -6782 1275 7465 3617 -4606 -5816 3668 6800 982 -4391 -3220 4876 5819 -2486 -5992
2266 -5992 -1150 6159 6975 -2908 -7553 -495 7805 6285 -3863 -8670 -244 9621 6692 -4629 -9602
2281 -9602 442 10351 4523 -6501 -7137 1682 9032 3388 -5188 -6756 2935 8507 460 -6114 -4730
2296 -4730 4976 6480 -473 -7406 -1650 7433 6398 -4849 -7446 987 9292 5282 -5190 -8920
2310 -8920 584 8212 4783 -6780 -7740 2339 9529 3121 -8389 -7785 3555 8886 1380 -8547
2324 -8547 -6357 3625 8399 309 -8467 -3848 4737 7166 -3126 -8466 -2541 4987 4656 -4316 -7894
2339 -7894 548 7813 3799 -6391 -8059 2601 8556 2955 -8443 -7679 3308 9487 1606 -9595
2353 -9595 -6951 4919 9152 -359 -9039 -6124 4495 7751 -1442 -8219 -2584 5720 6309 -3085 -7193
2368 -7193 -1483 6898 3889 -6560 -7145 1839 8576 2190 -7704 -5669 4392 8701 216 -8508 -4950
2383 -4950 5539 8710 -459 -9502 -4845 6511 8326 -2178 -11071 -2902 8380 7373 -3116 -9601
2397 -9601 -1480 8061 6201 -4974 -8393 1946 9268 3866 -6194 -6428 3370 7818 983 -7896
2411 -7896 -3349 5297 9430 -139 -9273 -3661 8875 9062 -2786 -9910 -2788 9149 8036 -3756
2425 -3756 -10230 -1188 10484 6691 -4983 -8695 996 9730 6433 -6579 -9278 2207 10275 3885
2439 3885 -7050 -6614 6113 9299 1095 -8114 -4964 6536 8537 -3203 -8914 -2673 9109 7555
2453 7555 -3959 -10380 -1146 10668 7939 -6900 -11151 -283 11340 6713 -7333 -10739 1502
2466 1502 11292 4646 -7321 -9049 2885 9832 2013 -9057 -7621 3737 9646 16 -10365 -4745
2480 -4745 7519 6679 -3445 -11072 -2762 8783 6359 -6643 -10687 -1404 9959 6085 -7067 -11640
2494 -11640 807 11593 5073 -8717 -10886 2710 11236 3793 -8957 -8678 3861 9373 2158
2507 2158 -9870 -8165 5610 8026 -557 -10090 -4742 7040 7701 -2830 -9974 -947 8524 6166
2521 6166 -5555 -9466 2145 10580 3037 -7751 -8884 2812 10885 2867 -10168 -8855 4720
2534 4720 11488 1894 -10022 -7537 7410 11494 287 -9762 -5526 7465 10936 -1026 -8884
2547 -8884 -3171 8535 7055 -3007 -9038 -614 9639 6476 -5738 -7697 3042 10259 3595 -7345
2561 -7345 -7427 5487 11050 1091 -9606 -6090 7500 10293 1021 -11266 -4692 6588 10806 -1538
2575 -1538 -10441 -3868 8741 9313 -2963 -9785 -1833 8478 5647 -4380 -8595 388 8994 3356
2589 3356 -7709 -7171 3792 9209 1525 -9490 -6037 5980 9086 -1602 -11476 -4659 8259 9804
2603 9804 -2950 -11788 -4298 8771 7878 -4693 -11846 -1977 9967 7767 -5860 -11341 -976 9719
2617 9719 5148 -7327 -9126 1638 9046 2740 -8308 -6227 4862 9414 240 -9461 -4812 6118
2631 6118 9272 -2355 -10472 -3269 8338 7792 -3922 -10979 -1393 9550 6980 -6812 -11444 -100
2645 -100 9953 6463 -7664 -10212 795 9926 3532 -8461 -8522 3204 9403 555 -8268 -6763
2659 -6763 6743 9385 -1701 -9697 -3008 7657 7957 -2979 -10714 -1843 9180 7262 -5806 -10753
2673 -10753 169 10719 5929 -7801 -9367 3024 10702 4023 -8220 -8790 3702 10037 2537
2686 2537 -8368 -7803 3999 9849 657 -9294 -5269 5604 7941 -1804 -8634 -4278 7423 8261
2700 8261 -3228 -9040 154 8932 5879 -6359 -8755 2343 10531 4072 -8197 -9503 3878 10781
2714 10781 3587 -8587 -7670 4387 10862 1363 -8950 -6575 6190 8922 391 -8809 -3147 7294
2728 7294 7077 -2415 -8210 -1347 7364 6022 -3823 -7209 87 8175 3360 -7423 -7554 2611 9321
2743 9321 1759 -8014 -5787 3833 9630 1352 -8387 -6104 6209 9827 974 -9561 -4281 6157
2757 6157 7670 -2129 -7708 -3546 7102 6424 -2680 -8772 -1709 8529 3848 -5300 -7437 1233 7879
2772 7879 3063 -6980 -5304 3851 6810 386 -7837 -4343 4971 8832 -1923 -8637 -4120 6926
2786 6926 8151 -3109 -8885 -2959 7759 6535 -4085 -8667 -2242 7934 6078 -4167 -7201 22
2800 22 6936 3365 -5330 -5994 2432 7198 2157 -7264 -4950 2890 6005 -1677 -8398 -3792 6028 5538
2816 5538 -4488 -8012 -1523 6118 5716 -4190 -9383 160 8301 4605 -5354 -9282 548 6733 4717
2831 4717 -6314 -7579 1067 7547 3113 -5655 -5940 3100 6520 1560 -5959 -3092 5200 5593 -706
2846 -706 -7695 -3091 7108 5355 -3293 -6809 1 6724 4732 -4204 -6373 1155 8607 4054 -5766
2861 -5766 -7053 2441 8128 3206 -6163 -6451 3406 8019 2083 -5311 -4596 3897 7617 -409 -6171
2876 -6171 -3052 4615 5055 -1944 -6393 -880 5841 4174 -3867 -5540 963 7016 4292 -4283 -6212
2891 -6212 2278 7595 2623 -5970 -5933 2584 7852 1107 -6014 -5422 3681 7378 1814 -5675 -2905 3257
2907 3257 5425 -913 -5172 -2701 4138 6191 -1679 -5031 -1170 4318 3688 -3235 -5806 1304 4992
2922 4992 2551 -4378 -4617 2630 6623 585 -4899 -4407 3467 5716 173 -6395 -4996 4145 5133 -1227
2938 -1227 -5668 -3134 4851 4975 -2092 -6939 -2397 3764 4668 -2827 -4593 -8 2948 945 -3387
2953 -3387 -4703 1058 3644 1288 -5097 -4033 2700 5133 -246 -5697 -2701 3046 4541 -649 -5324
2968 -5324 -2992 3021 5397 -656 -5328 -1565 5229 4384 -1256 -5018 -746 3844 2446 -2698 -4293
2983 -4293 393 3819 1472 -2892 -3411 1238 2479 326 -3377 -2597 2485 3661 -710 -4215 -552
2998 -552 3973 3917 -2650 -3882 -871 5358 3108 -2024 -3924 50 4580 4030 -2281 -4223 270 4414
3014 4414 2821 -1860 -2136 1075 4959 2325 -3271 -2826 1886 3598 317 -3471 -1161 3625 3349 -1011
3030 -1011 -3246 -90 4361 3424 -1995 -3326 1288 4511 2282 -3381 -3801 479 4599 1971 -3366
3045 -3366 -4068 1522 4867 1158 -2994 -3360 687 3721 1544 -2082 -3115 2287 2857 -1006 -3147 -1293
3061 -1293 3433 1819 -1245 -2471 147 3181 1841 -1839 -3013 965 4678 545 -3034 -4654 1678
3076 1678 4484 1051 -3007 -3848 2272 4336 -200 -4995 -2460 1289 2957 391 -3700 -1987 2910
3091 2910 2340 -25 -2459 -1771 2448 873 -1928 -2117 55 1913 475 -2580 -1680 705 2580 9
3107 9 -2813 -1799 1495 3081 -848 -3213 -2283 2760 2836 427 -4176 -2392 2243 4001 6 -2659
3123 -2659 -1874 947 2172 -770 -3445 -708 2058 2270 -329 -1559 550 606 1117 -1996 -2390 1899
3139 1899 1819 -1321 -2800 -679 1110 2322 -938 -2796 -513 2296 1709 162 -2795 -1591 1912 2353
3155 2353 -1696 -1982 -1702 1826 1883 -317 -3354 -776 1566 1312 242 -1386 -635 1401 462 359 -339
3172 -339 1172 877 -115 -1462 292 981 1737 -2381 -1819 584 2073 1581 -2239 -2699 -1365 1496 730
3189 730 -748 -3401 99 2430 2084 -616 -657 -7 1186 860 -990 -1592 -686 1233 16 -178 -325
3206 -325 1631 399 476 -227 1494 2097 961 -1415 -910 784 2332 -58 -3009 -1055 754 2235
3222 2235 792 -1709 -1955 331 2165 2142 -2912 -1918 364 1572 1673 -1028 -1337 530 441 -370 -864
3239 -864 522 1052 437 412 -620 697 630 -155 -1242 -552 -484 1386 4 -865 -1445 905 1667 643
3257 643 -2402 -706 1418 1502 236 -1824 -2349 928 1721 190 -2353 -302 230 1580 -918 -964 -316
3274 -316 191 1284 -108 -75 -1078 679 -544 -1070 281 146 1218 -1021 -1770 -403 1633 628 -640
3291 -640 -1173 -1051 151 649 439 -938 -754 662 2307 -380 -1527 -159 585 880 260 -901 -1598
3308 -1598 -903 851 -1683 16 385 -310 -105 30 -288 194 -45 311 -323 1101 641 668 540 -574
3326 -574 103 1921 1485 -1284 -1254 626 375 723 -291 -1547 -687 476 1798 -138 -734 -80 325 1538
3344 1538 -61 -1003 93 -396 -100 146 363 -421 -1017 36 759 -422 108 -740 -395 745 1065 1325
3362 1325 442 -1028 -1531 992 804 430 57 -697 787 1265 1765 64 -1815 554 996 515 111 -308
3380 -308 -923 544 1216 -13 563 184 247 -176 1016 666 684 -959 -76 -213 71 1438 -801 -1180 638
3399 638 187 -54 -202 -1766 -1626 995 769 -523 -1661 -422 585 1025 -2 774 -314 -782 -270
3416 -270 132 -412 397 -450 -239 132 21 630 -54 507 261 -477 1684 666 -1371 -905 -215 1435 836
3435 836 -1609 -1482 -51 827 669 -1157 -44 -1089 703 743 790 1445 -346 -316 733 530 -929 -585
3453 -585 -36 -323 -629 409 -1073 -719 -548 -425 315 -985 -212 -674 -135 542 499 -451 -805 -74 283
3472 283 1882 459 -354 -865 95 -215 1452 675 -136 -168 397 416 800 244 -963 78 -158 174 1069
3491 1069 139 -52 301 519 -1434 -65 -1019 -89 133 727 569 -236 -600 -286 -717 576 66 -1078
3509 -1078 -926 -1312 501 502 17 -696 -461 311 1755 877 553 -602 678 1076 354 -306 -946 -247 8
3528 8 472 724 -582 -423 -524 1314 956 462 -1823 -1294 1055 1168 15 -1213 -43 270 584 596 968
3547 968 -458 -778 -351 466 -873 390 243 -892 631 1368 652 252 -986 -752 826 42 682 -508
3565 -508 -1216 -395 816 355 99 -657 -247 460 1147 -525 -1089 -621 -655 -51 41 271 -1775 322 1143
3584 1143 1008 1113 -1013 -689 414 342 495 -1224 -409 63 10 415 -731 -1384 -41 -403 260 710 553
3603 553 54 -696 -588 1965 830 -456 -733 -369 139 22 887 -630 -1385 358 1509 990 -615 -619
3621 -619 221 476 780 575 363 -801 255 7 1294 -201 78 -1347 922 925 687 320 -294 -711 1101
3640 1101 33 507 367 479 -192 640 89 -1234 -571 395 41 409 110 -855 -1031 -180 558 297 -811
3659 -811 -374 -63 1007 1685 -27 -746 402 362 1525 627 -528 -441 3 593 144 -749 -349 -689 -232
3678 -232 935 1363 -294 193 87 -847 314 -83 958 -1193 -860 47 -186 -113 -1104 -185 -146 198 94
3697 94 -157 -786 699 302 1124 573 -906 134 690 724 -272 -235 -162 -254 1215 -319 63 30 -457 637
3717 637 467 629 -11 189 -1735 27 429 -108 -312 -293 237 -102 870 -818 -365 -935 471 516 -542
3736 -542 566 -396 -474 -126 -439 194 217 -768 -1346 113 409 67 199 -1000 333 1021 869 -585 -297
3755 -297 -308 680 629 769 -1214 -298 -543 332 -396 -107 -845 -220 -137 834 1256 -625 -109 -900 818 -517
3775 -517 467 -353 -489 794 822 469 -205 -556 822 436 -131 487 -12 -1258 427 360 601 -836 -1022
3794 -1022 -530 -283 185 201 83 -288 -182 -79 823 -278 -582 465 570 561 649 -667 -729 167 592 330
3814 330 110 -972 -979 1091 624 425 528 -828 -710 944 1420 -26 -36 97 -119 -184 217 -107 193 262
3834 262 903 419 782 -815 -607 725 -524 406 -114 -501 -546 447 601 1133 384 -1851 -553 790
3852 790 -62 -613 681 -980 122 -54 835 -341 -338 957 515 743 1085 948 155 -357 447 242 -376
3871 -376 -543 -464 638 295 1285 444 538 -703 -117 831 928 -500 -526 277 1284 416 -701 -218 -175 248
3891 248 437 352 381 -571 -262 1091 -628 283 -1046 -192 333 469 563 -1469 -975 567 103 892 1142
3910 1142 37 -1263 45 1154 1357 -708 -1280 -921 656 1373 166 -482 -1447 -298 776 349 -597
3927 -597 -951 610 -425 827 683 -909 -1352 479 26 -118 -234 65 -659 -1122 860 918 -167 248
3945 248 -524 889 560 766 -474 -482 1350 1335 920 936 -1092 370 -169 724 -418 -485 -342 -1005 1413
3964 1413 1016 225 -1464 -186 575 1199 -325 -173 -680 -425 1139 -926 647 -962 -181 313 1340
3981 1340 -85 674 620 -85 -193 1056 666 -963 81 550 -363 126 -269 -1002 -1166 418 555 348
3999 348 -305 161 464 11 113 455 -218 -812 -312 520 1038 160 -898 361 529 237 305 -1119 -160
4018 -160 77 -21 981 -858 -939 -327 -139 549 -434 -788 243 775 -603 -473 -467 -294 -1522 1413 372
4037 372 1450 -379 57 -196 894 878 128 -337 -942 -190 376 233 335 126 -836 899 979 193 -432
4056 -432 -200 -9 888 690 105 -400 -312 1277 244 369 530 -912 -766 373 289 -54 -1031 445 106
4075 106 302 -353 -835 -280 356 170 -619 244 -295 115 -170 -596 -110 -621 -46 393 -783 1353 182
4094 182 -271 -566 -772 565 -71 591 -226 -714 -691 873 361 -873 -536 -129 1018 1017 -235 -978 553
4113 553 382 804 288 333 681 -394 274 1453 -547 -466 -996 178 -37 628 27 -310 -785 -231 571
4132 571 734 -258 -784 -1476 -196 814 188 -956 -187 685 674 393 -818 -577 127 461 543 -103 -184 148
4152 148 -225 920 714 384 -251 -372 -689 241 487 -1175 372 -561 -160 158 -113 8 -522 403 1123
4171 1123 1525 208 -823 306 1354 787 36 380 -212 26 98 -939 266 -1037 -406 598 -87
4188 -87 -42 491 17 350 423 351 131 475 -656 353 158 -483 -1061 -635 250 702 684 62 -488 -324 427
4209 427 891 -46 -266 -1593 40 -36 -41 -450 222 -1375 -956 -26 -387 789 482 404 939 975 -394 174
4229 174 -1731 -203 995 4 -469 -1019 633 -893 -353 489 -172 -353 -735 603 -91 -177 6 762
4247 762 -139 468 507 -318 -353 807 735 -98 37 24 110 90 40 277 340 607 206 644 872 -346 461 -181
4269 -181 555 552 92 -413 -688 -577 173 388 658 -153 -766 777 -431 -618 -69 -350 -1161 970 -218
4288 -218 -292 707 -335 -56 -212 502 43 -282 -751 -108 1019 492 -706 706 -821 990 -66 -75 727
4307 727 224 -243 81 613 190 -266 91 419 358 36 -457 -381 -452 -132 742 34 -759 -565 741 -432
4327 -432 182 394 -1305 -1074 314 -267 80 -127 -1156 -47 -43 465 -108 115 -569 43 -36 1429 -127
4346 -127 900 -54 315 460 418 -48 -529 82 828 583 -133 -1025 -724 326 899 -139 -54 -1082 691
4365 691 554 900 -217 620 -109 -339 819 -193 -110 -1166 79 -424 963 126 -121 -341 -100 -264
4383 -264 437 131 -736 -37 -174 -292 -346 677 48 361 466 317 -487 -1456 17 1372 562 951 -1455
4402 -1455 -648 -150 885 869 714 -829 -155 176 243 1217 -635 658 -122 1174 -182 -69 -135 -1176
4420 -1176 882 247 706 282 -126 -662 676 -763 -746 -268 -776 10 290 -344 -205 -1238 -629 841
4438 841 851 -511 -385 -343 -488 297 178 -602 -17 177 -1184 667 1065 -274 -1468 -223 605 180 1230
4457 1230 -1035 -191 -707 178 -34 951 358 -852 273 203 -6 240 72 276 208 378 157 -338 270
4476 270 -33 -468 -50 393 77 -317 574 152 757 99 -287 -378 1105 677 -661 -40 -926 774 1495
4495 1495 -665 858 -1138 5 26 1072 -440 -581 218 -1024 718 866 -516 -372 449 959 -21
4512 -21 -641 302 -256 -466 1267 -279 -116 283 745 -25 574 -566 542 -1136 -72 -4 1162 -50
4530 -50 -926 -805 808 561 409 -139 -168 -3 216 624 -806 301 -400 905 430 -828 -22 819 566
4549 566 777 -336 283 268 -62 68 616 -1136 101 -1010 -799 483 1467 116 -241 -18 -1329 -953
4567 -953 469 387 -826 -1013 88 590 480 -802 -324 -19 397 495 -172 -424 575 414 704 -343 -540
4586 -540 405 304 -1065 -236 -651 -116 802 -858 -1161 521 -220 -277 -665 686 1124 708 -312 -906 -348
4605 -348 -155 895 -796 -729 -982 80 938 -251 -482 -284 -459 954 740 -216 -18 498 341 -131 -414
4624 -414 -863 -551 227 -341 261 -608 -112 -29 285 -578 1104 888 -1548 -220 510 683 415 362 -1443
4643 -1443 570 362 302 -664 -338 89 389 1355 -113 330 693 557 288 -364 -187 -1209 203 -62 463
4662 463 278 -484 -795 -1196 -777 117 406 153 -194 -437 691 224 143 148 -123 -566 469 948 -545 -828
4682 -828 -92 579 689 379 -1107 -684 217 628 -635 -839 37 -321 -417 -371 -323 -623 -188 472 -548 -577
4702 -577 304 -301 -436 284 880 851 834 -283 -739 1199 1793 218 -130 -132 -718 856 -381 -233 -689 86
4722 86 -1 171 -813 -284 -487 914 112 -920 -443 -613 418 360 -598 -461 213 333 -465 -16 114 409
4742 409 446 -994 -1211 784 1034 -238 -956 -296 763 1202 -241 -754 -1712 1200 1469 843 -1341 -1039
4760 -1039 437 527 1260 -1406 -330 720 -59 44 -771 -12 106 841 604 -519 -65 225 410 -595
4778 -595 841 -115 1041 290 -426 -630 1282 1594 -312 -197 -1207 544 1002 389 -1385 -1189 545
4795 545 363 120 88 -243 -368 1179 11 -205 -1552 591 1209 -901 -651 555 67 -116 -907 -342
4813 -342 513 459 -608 332 -461 1466 1041 -700 -1371 -728 1171 1194 -644 -601 -788 1319 856 -9 -1196
4832 -1196 104 481 1071 87 -331 -106 1798 67 -736 -772 -324 258 1297 -664 -1037 -1194 -10 -32
4850 -32 -1648 -995 1352 724 -957 -824 -338 230 1076 -453 -1149 -928 2229 1404 -227 -1220 670 698
4868 698 1133 -396 -948 437 911 954 -1009 274 -556 -270 -122 -728 -424 100 538 -553 -319 53 721
4887 721 582 -118 -1016 -31 1146 -159 -1135 -318 598 250 1061 356 -1196 -81 874 1112 -122 -140 -20
4906 -20 1259 -223 -1541 -764 55 350 -205 -468 37 55 727 296 -898 55 213 1430 418 -1345
4924 -1345 -757 1721 162 -916 -1572 -363 370 -227 -819 -1369 87 1799 169 -259 -371 -400 1034
4941 1034 224 -1038 253 -353 907 -902 -1745 -131 553 727 365 -1313 472 190 535 -777 -175
4958 -175 409 782 -490 -1127 -1033 498 810 1107 -2244 -1249 954 757 1081 -918 -806 874 1653 -249
4976 -249 -769 -1183 843 300 384 -1074 -771 908 505 -563 -110 -737 351 692 -921 -428 228 247 740
4995 740 115 -198 597 1100 -352 -618 -1672 594 2562 -1883 -955 -339 979 713 -228 -856 -87 759
5013 759 1627 154 -477 -983 -242 744 248 -825 182 32 39 -1225 529 -79 73 105 -579 177 434
5032 434 1080 -417 -1710 -670 749 1456 111 -1428 -341 1540 157 -372 -1994 -145 112 1039
5048 1039 -604 -1981 -525 1107 675 -1230 -1303 -907 828 749 -679 -834 404 949 265 -743 -1344
5065 -1344 518 1233 531 -1296 340 1750 469 -160 -1793 143 1399 330 -643 -405 -31 1104
5081 1104 479 -1507 -841 -274 562 569 -838 -640 -113 575 -1 -1001 211 227 1287 1382 -2185 -100 7
5100 7 1357 233 -470 -508 711 301 -1299 -1456 11 1994 337 -1050 -1087 197 809 281 -1397 -1800
5118 -1800 -130 1714 -530 -840 -276 1132 165 -116 -1278 -1654 -739 729 -109 327 -668 324 650 -768
5136 -768 -1774 -683 1148 1181 -906 -916 540 608 757 -442 -1467 311 2195 -171 -1191 358 595
5153 595 1819 -613 -2618 22 882 1416 -588 -1161 -1170 1029 1534 -520 -2041 1015 1205 -77 -824
5170 -824 -112 488 77 -364 -319 49 277 5 958 445 -2 1938 2104 -934 -675 -1465 543 458 24 -1219
5190 -1219 -632 1315 1561 -380 -936 -135 1682 754 -94 -636 -991 824 834 -164 -276 -200 429 -92 -68
5209 -68 -1228 602 1029 -370 -225 -837 1082 394 -1117 -364 -361 1068 41 248 -2431 -103 1823 305
5227 305 -363 -1268 107 271 1412 -549 132 -26 738 -458 -208 -303 285 641 727 -840 -222 423 875
5246 875 -738 -937 -567 959 410 -114 -873 -160 1252 1181 -898 -790 612 1209 953 -487 -1234 983
5264 983 2104 680 -523 -1141 1417 1926 1490 -1446 -1289 -915 -459 -22 -1879 -1339 1029 1334 -346
5281 -346 35 -704 518 1006 -815 -975 558 1508 570 -161 159 490 800 326 -1191 -604 -277 677 91
5300 91 -1017 -640 -277 1885 168 -691 23 482 918 1172 -979 -234 896 -2 80 -890 -961 1072 769
5319 769 -351 -149 946 1339 245 -967 505 -129 -88 -645 -694 -1057 37 220 34 -1018 -791 209
5337 209 1331 205 -779 -249 508 753 -965 -1 -550 214 262 -158 -620 466 352 0 -996 -571 -362
5356 -362 2371 -264 462 -295 -520 989 -277 -1234 -374 795 1246 868 -2065 -1378 318 1941 -1398
5373 -1398 -2090 -1064 400 1144 -1140 -1458 -409 1181 56 -208 -550 311 1106 390 -459 -1025 2363
5390 2363 1482 -407 -365 -1018 163 191 434 -177 248 641 229 -1465 -1263 285 1319 557 320 -289 72
5409 72 332 81 764 -597 -755 193 -181 -450 -536 615 1110 40 -352 -1451 -414 383 -480 -376 -807
5428 -807 827 493 -747 -295 -613 702 338 -517 -300 79 804 1099 452 -1634 286 1015 347 -1145
5446 -1145 -1140 53 1615 489 -454 -706 53 441 244 -574 -637 203 767 996 -69 266 670 1128 132
5465 132 -203 215 2403 1096 308 -430 758 1211 911 -974 -841 -536 708 -564 -403 -673 961 1075
5483 1075 174 150 -9 -7 554 1296 -526 -1091 0 731 -1756 -464 -1052 932 809 692 509 253 449
5502 449 372 -241 -275 386 -405 -755 -104 -684 844 417 376 -820 641 94 816 300 -533 -1082 770 956
5522 956 -985 21 -43 203 -74 883 384 677 -219 532 -135 253 94 341 428 -362 -184 -619 -350 366
5542 366 -293 -976 679 597 -143 155 -1004 1127 622 128 -1608 -619 496 167 -206 -119 -922 685 455
5561 455 244 -1180 -754 934 735 535 -924 -829 -690 845 -316 -8 149 -875 -86 -213 436 297
5579 297 -173 -735 -556 -90 175 20 -1043 -509 696 263 793 -357 -932 -144 421 -1070 -577 -617 -450
5598 -450 580 591 24 -1134 661 -623 185 334 138 1 -79 -121 -814 -710 49 606 67 682 -85 702
5618 702 734 400 -1720 -379 215 -119 372 -1257 -353 174 199 -1391 -404 -317 164 1185 -885 155 278
5637 278 139 704 391 10 900 115 -235 -121 -474 -330 169 210 -399 135 1366 674 -824 -580 19 -321
5657 -321 -1024 -448 -798 679 501 147 -1082 -1609 555 694 -105 -1123 -122 719 132 1196 261 -425
5675 -425 166 21 389 -384 -879 132 484 -719 -85 154 -42 -223 -430 -579 1138 238 -702 -890 -1127
5694 -1127 -1021 1421 -261 908 226 -241 748 -368 628 -1390 20 251 62 425 -687 463 350
5711 350 414 -670 -365 759 1111 171 14 -422 133 -236 -332 -318 -482 657 -623 51 -699 600 -260
5730 -260 -362 -382 -311 -34 394 -587 -708 -116 183 376 -596 118 585 -414 570 72 -93 -141 107 307 -18
5751 -18 -132 758 547 433 -509 -262 626 517 -738 692 -436 1063 87 7 98 468 1249 195 80
5770 80 -242 -764 -108 810 126 51 466 -50 -407 42 -352 -45 0 319 792 -237 456 -1034 -874 102
5790 102 0 2 1234 -510 -1 699 -374 -163 -517 -888 -306 -15 -692 -146 599 34 370 158 472 -866
5810 -866 -533 425 753 44 -49 9 689 -704 458 -49 365 0 159 314 -683 60 -898 231 349 -238
5830 -238 -396 911 -122 -397 354 -232 301 -489 87 -113 -214 457 -633 -234 489 -470 1051 353 2
5849 2 -777 241 1312 614 -109 -498 -233 -355 909 -258 -61 994 -133 406 294 -204 157 418 546
5868 546 32 442 569 490 -253 106 421 -22 327 -1195 348 6 -860 412 -276 723 -519 3 75
5887 75 -644 1069 -223 -521 -42 -394 -45 -219 45 763 107 32 -166 -1095 409 525 -99 -1550 2
5906 2 -23 1253 -191 -543 175 426 1208 599 -346 -598 271 678 -53 -1245 975 -489 73 -426 43
5925 43 -279 -351 -950 -209 749 -556 597 373 -254 226 219 -283 -352 72 498 1392 367 616 -362 154 1089
5946 1089 -2 551 -87 220 -436 -564 -134 -150 -1026 -614 441 -151 543 -605 -43 151 -90 -373 -500
5965 -500 -126 197 574 786 -162 368 -882 474 -317 751 901 -254 627 834 653 265 -341 -69 179
5984 179 -232 -351 445 -680 895 345 271 -227 330 -314 -320 -197 -225 275 -756 -428 -1168 -303 -409 217
6004 217 55 -57 735 -18 -396 -833 -295 436 407 -126 1490 -446 105 -222 -167 295 -37 -349 -1102 -157
6024 -157 671 -568 -520 203 -542 -51 986 163 -76 -167 967 34 -351 74 -1049 -196 473 356 1352
6043 1352 262 -740 -304 -883 660 -198 1065 -1050 149 -449 -611 -241 -648 -428 -516 -670 496 618
6061 618 471 24 -409 745 -667 -250 -575 646 299 -92 -309 9 -453 364 484 660 -271 -479 -1082
6080 -1082 515 588 304 87 -186 689 -120 -245 -96 -440 27 -217 18 -100 -125 1221 -281 467 -313
6099 -313 193 357 -894 -555 139 153 403 513 -477 250 -23 -889 -1285 -30 1915 -276 -426 -179 -880
6118 -880 329 -205 -965 -1128 -126 715 182 778 203 -30 -461 -1089 368 83 -468 575 -83 306 350
6137 350 835 -396 80 451 -832 -593 -388 -73 405 175 636 -313 201 607 -114 449 1008 661 109
6156 109 362 366 -413 -50 -179 -551 964 601 22 476 -485 -834 -356 -430 149 -1105 -81 256 810 442
6176 442 -479 46 313 795 -170 626 512 -237 66 -100 562 704 37 -428 296 286 -95 -638 89 747
6196 747 249 530 181 10 -839 28 -250 -182 335 -587 -632 -45 1078 -234 287 -296 854 937 998 183
6216 183 -14 -636 254 -187 -153 455 293 -1280 49 203 -826 -478 -63 -26 -411 393 -632 -901 -249
6235 -249 694 7 300 -393 853 64 -259 -281 -27 -592 -528 -22 -1109 343 21 -368 -372 -668 196 555
6255 555 -418 -630 -252 454 -137 248 94 -1827 -80 9 -955 345 -279 399 1181 400 -147 -142 113 47
6275 47 875 782 -430 -346 -424 84 42 1165 -337 -265 -618 489 547 -471 -190 136 783 83 -789 -103 -243
6296 -243 -257 -1241 585 -199 -61 -809 -497 -319 397 -384 -336 -894 1078 228 -138 852 -148 -105 -218 529
6316 529 190 490 -12 47 165 -979 -268 39 880 531 -140 676 -337 -304 246 432 -680 644 -166
6335 -166 -45 -1010 905 333 420 -943 843 146 755 -17 -199 1245 322 416 397 -251 -13 -332 233 586
6355 586 -81 633 -790 1025 -705 -632 86 167 -585 760 1071 -793 36 -1541 195 176 885 131 -1358
6374 -1358 -189 -358 945 -121 895 102 150 699 702 -693 -339 178 -110 394 -134 -677 -408 79 -489
6393 -489 -119 20 -906 375 -403 -1311 -1170 -1312 -238 299 297 77 -271 111 385 -149 113 71 -138 -346
6413 -346 -751 913 384 -574 -610 335 -108 565 105 61 -750 856 -10 -297 570 -287 -143 -131 582 29
6433 29 -117 731 57 585 1496 97 409 -163 -201 645 495 -415 -650 634 -478 596 -50 -368 490
6452 490 -516 -278 474 271 -481 679 -365 210 555 -105 -793 346 460 1474 -116 -652 -655 -357 113
6471 113 -145 -1038 9 61 365 282 490 849 206 890 -118 347 554 1073 -129 428 -428 -60 69 567
6491 567 -491 -493 -800 1063 158 572 19 270 -618 442 -587 -155 87 234 1009 9 -160 -615 263
6510 263 -198 187 74 -826 0 -289 163 -488 -542 304 170 -1058 -657 -225 -201 -649 284 55 -703 550
6530 550 301 -323 102 204 -798 -1001 -141 412 -681 -939 818 -131 155 60 -148 -329 420 -107 342
6549 342 654 83 107 1148 -34 104 712 -94 -444 554 395 353 1200 -413 -328 -1128 1045 95 -378 1004
6569 1004 538 401 401 -623 651 620 -269 -764 -464 -450 -459 -443 -616 107 -180 -658 -925 30 -284 -385 -151
6590 -151 16 -68 192 514 -454 -364 285 -56 -211 -624 466 408 560 -469 230 -341 121 -677 -742 829
6610 829 377 273 465 -1176 -157 82 -17 600 -454 566 -391 482 493 -8 299 371 206 1075 -452
6629 -452 1 -1117 -16 443 662 -997 -258 405 -865 478 610 -593 -22 -612 118 706 43 -47
6647 -47 -397 94 248 1275 -85 -461 758 -211 -158 722 -313 29 -597 619 -1027 -2 -751 -444
6665 -444 719 -104 367 1247 -905 -301 867 -314 -1251 -513 359 -24 446 328 1197 -354 148 397
6683 397 -462 -119 -509 150 -284 59 -97 805 -82 -1024 -601 858 -42 -17 574 -1198 557 253 -1135
6702 -1135 -375 100 657 562 -331 -12 99 -127 -306 902 -438 -44 -35 1205 764 -889 -183 138 -1134
6721 -1134 429 52 -81 174 -159 -368 -393 442 1578 -432 372 -183 -23 538 -997 -605 -101 180 -413
6740 -413 -919 -1140 -251 -49 432 -1750 -68 189 391 -372 -1067 -306 327 -1412 668 363 1158 -54
6758 -54 -24 145 -220 -1066 445 229 67 -609 -449 363 -135 -373 -105 1210 -253 -117 42 979 675 242
6778 242 359 245 -306 246 243 114 -649 -671 -603 -839 645 -319 87 -622 -524 241 37 163 162 -52 202 451
6800 451 614 -1130 -781 -23 349 1369 28 -588 -1172 317 -543 300 -312 350 -803 -220 -198 75 142
6819 142 957 -768 -193 504 -255 298 -443 -340 60 -49 -650 -650 -71 506 603 -34 -434 678 9 -392
6839 -392 -1092 -202 -201 -69 -79 -435 340 663 827 -952 471 -232 18 312 186 -615 -906 212 -9 -425
6859 -425 -573 8 -207 -904 -316 -1433 -759 188 256 263 -321 54 49 436 165 1155 688 -588 883 322 -53
6880 -53 352 -329 1174 -108 -22 1412 -864 733 277 907 -940 254 1406 414 -309 216 1347 112
6898 112 -30 -239 1056 1051 88 -83 877 -48 368 958 186 -774 246 -169 383 -528 78 -1326 -388 877
6918 877 97 -71 -960 126 165 379 750 -60 410 -233 -303 -203 193 -200 430 -669 -41 -164 -397 111
6938 111 -557 -57 400 7 -601 -836 -1066 508 114 -339 -632 -1137 229 195 -1305 370 70 659 159
6957 159 62 287 29 184 29 -532 -276 79 -672 1340 -1352 429 -837 -1220 -317 256 748 -198 -455
6976 -455 -1078 308 -551 -380 240 -180 -727 -188 44 272 -285 -504 -3 -148 214 -860 816 -243 561
6995 561 -16 -91 257 100 -32 569 376 794 325 -1509 500 -633 381 341 -572 225 327 -772 -38
7014 -38 798 588 534 -564 785 -279 -1068 376 -14 -40 -1209 -40 -717 -150 936 254 342 -96 -503
7033 -503 17 379 -1208 -169 749 -297 -44 -525 121 429 -232 -359 -669 -72 -1234 -254 -141 -178 887
7052 887 -266 336 -684 36 -686 -556 700 887 -571 119 677 -394 198 1084 400 -300 -147 -1186
7070 -1186 244 10 261 188 -608 51 218 -828 460 18 252 221 -446 174 -125 982 -214 -209 488
7089 488 282 -305 209 955 -1656 -349 -321 613 205 -363 933 -648 -432 82 -31 -462 -506 543 305
7108 305 861 0 618 569 68 161 517 -870 -53 -498 792 296 -22 -265 245 -5 337 -729 -1574 226
7128 226 363 232 -756 899 -26 -225 -31 -90 -31 -34 -472 526 -727 -178 211 999 255 -243 301 -228 -722
7149 -722 410 -730 554 663 -327 -99 -394 -434 572 -771 -899 -276 184 773 -486 65 -351 -163
7167 -163 629 -685 -96 14 -322 55 -21 797 -1027 -131 328 -97 307 -384 -503 78 -277 631 -146 433
7187 433 17 390 -224 -475 524 -448 -787 -151 216 653 -173 747 486 -226 256 568 244 -875 365
7206 365 -1123 -521 469 -736 -432 -718 1058 815 107 -271 417 -52 -231 -211 72 -565 795 308 794
7225 794 184 -384 -138 -531 164 1175 1533 -563 -303 -700 593 356 660 -382 1096 103 -350 -593
7243 -593 -87 -969 -1051 333 -860 388 303 444 329 395 -63 412 -4 -591 -739 99 531 380 -327 -499
7263 -499 -439 -168 1008 -216 -363 -306 -106 -133 -238 -500 487 806 72 109 -32 -420 -392 643 613 -170 -30
7284 -30 224 -553 -792 573 -57 68 44 -1087 648 1133 -377 -227 355 -1468 130 -1386 -801 -141
7302 -141 -165 46 -253 481 87 -904 754 546 -301 -231 -345 -340 229 1428 423 -524 -843 666 -438 -894
7322 -894 -122 474 570 -310 1397 947 -200 795 506 635 521 -146 -728 173 849 -293 -30 491 -566
7341 -566 480 -200 397 570 127 222 -959 793 -1023 -251 742 -9 337 765 686 -172 -217 -861 446
7360 446 -499 -29 1302 356 711 572 24 222 -450 -158 401 1387 -16 581 689 -475 792 -1479
7378 -1479 92 -135 708 -239 -573 -737 21 -435 -17 53 -451 -15 255 412 -70 167 -207 -490 -725 653
7398 653 745 1045 -687 -38 399 639 886 -608 -604 190 1432 1608 531 -107 -94 -3 280 773 -770 -402
7418 -402 511 -433 216 -526 -709 -994 -1027 -299 -819 -281 10 -624 1331 -619 -49 218 -1621 -749 379
7437 379 -882 -123 -291 -397 -308 501 -735 184 -815 185 733 -269 83 -211 -613 -160 1020 227 520
7456 520 -630 -182 -46 450 386 901 -541 52 -462 892 259 212 -583 979 -472 -707 233 -211 264
7475 264 -84 227 -148 -982 -147 183 -262 76 -170 567 309 535 130 8 -283 -818 -252 715 72 505
7495 505 394 99 497 -206 -164 -94 -454 546 -340 246 -553 276 109 -180 34 872 -128 -732 -429 -994
7515 -994 -86 504 -832 646 143 -156 185 -67 -198 -961 330 -481 277 891 152 -731 335 690 132
7534 132 613 48 97 -96 -670 123 -778 -399 -309 85 -235 -97 512 -35 910 -620 242 -625 431 1510
7554 1510 451 -281 -348 424 -869 -33 254 721 -372 -99 -27 -7 -159 4 -1269 -143 -288 101 -245
7573 -245 -279 -223 -923 251 -436 521 361 -76 -303 -183 366 -179 -924 -56 258 -187 -300 68 130 1600
7593 1600 387 -519 -213 62 141 141 -202 -335 695 -110 -570 205 160 397 824 828 -544 -246 -72 1172
7613 1172 1419 843 812 -124 -1138 540 -90 -5 452 551 -819 -216 -558 141 479 -551 176 158 608 197
7633 197 588 532 -559 -423 386 395 336 -216 -145 -272 -240 -330 -286 -541 333 268 -386 1604 370 214 696 92
7655 92 127 403 4 342 -715 716 -212 117 137 687 -544 50 -860 -688 -1069 283 653 -652 -939
7674 -939 21 16 -198 -718 -55 -655 -428 -400 -280 811 314 -92 -933 720 -216 -184 -621 -286 315 -299 -368
7695 -368 472 166 188 -82 330 1174 -319 -614 997 -138 -153 239 -805 -100 -339 -818 -709 -336 -201
7714 -201 167 -304 130 -244 81 -933 -1778 330 -431 -527 -431 -271 503 -708 703 -1635 401 -874
7732 -874 -637 150 -418 -40 -240 456 373 -146 516 -1034 461 1131 -191 6 -255 349 -73 -433 282
7751 282 229 -307 474 -782 79 594 922 -409 410 -873 128 381 -254 -508 393 -709 116 125 -175
7770 -175 404 -129 258 -488 -815 -894 1017 -178 83 -676 260 -616 1018 655 211 -266 -499 350 -328
7789 -328 -51 -282 94 -160 425 -429 13 503 -91 -358 907 560 1016 618 -1612 -230 993 280 123
7808 123 -47 440 445 63 -989 524 1085 -165 -26 15 -240 -81 300 330 79 298 -143 192 -303 -509
7828 -509 -559 676 13 -343 888 -252 -145 870 258 -78 563 -89 -107 -578 -324 267 -13 528 -6
7847 -6 625 -171 -181 -289 -43 -55 -1112 352 -13 706 270 -775 -806 162 306 128 -218 130 33 -320 377
7868 377 168 762 -1135 -61 609 310 367 -440 -427 131 1463 172 -274 -224 -390 570 -606 97 177 -193
7888 -193 -491 730 -402 -353 257 10 179 283 -726 1830 673 -563 -155 186 -629 284 380 235 413
7907 413 739 -1376 -572 286 95 50 -1181 -1189 -188 -222 -269 687 155 -695 424 97 -472 235 503 -164
7927 -164 727 41 -60 413 -855 562 -130 -14 -856 -371 -65 247 -145 -299 347 -242 26 -246 10
7946 10 -410 -554 907 -400 -400 57 -85 -314 297 -1128 713 381 -545 1085 -418 -142 -348 -1069 -157
7965 -157 193 -530 154 -20 91 246 1301 1068 159 -249 -737 629 423 -80 -276 82 -337 992 -384
7984 -384 203 340 -342 235 272 76 1307 666 714 327 127 352 -809 -574 56 158 945 709 -184 18
8004 18 -107 61 400 59 -239 -127 -171 154 558 -803 680 -1208 656 629 -319 -335 -519 -356 485 -139
8024 -139 219 935 885 290 407 44 -993 4 461 70 32 283 120 506 453 215 92 30 331 395 -39
8045 -39 82 -862 -1493 -56 -379 -230 404 42 78 147 654 482 -80 -453 -258 -35 -83 362 -37 1932 -905
8066 -905 1200 685 -349 1502 654 -721 -442 1388 200 -487 -110 -243 -517 326 -460 -156 554 -71
8084 -71 494 -940 -718 914 187 -867 -410 -108 -858 -257 43 178 -246 -104 976 -445 556 1219
8102 1219 141 -336 446 -319 84 -712 -102 264 -288 175 -718 79 398 14 547 -802 -590 43 -217
8121 -217 291 -7 301 323 -171 -884 -469 147 466 328 222 1180 402 -146 929 -372 342 208 -742 719
8141 719 215 76 -338 -215 -316 507 133 107 475 -435 603 -819 457 700 645 -200 949 238 -108
8160 -108 -263 -462 368 629 374 260 23 -188 -178 -30 -287 -370 221 -446 24 180 50 273 167 -630 -359
8181 -359 -723 140 145 891 -328 -648 -117 54 478 -82
8191h2
##END NTUPLES=NMR FID
##END=
