##TITLE=1H_SA_27.144(amide)
 DMSO-d6, 8 sc, 
 24.10.2019
##JCAMPDX= 6.0         $$ Bruker NMR JCAMP-DX V2.0
##DATA TYPE= NMR FID
##DATA CLASS= NTUPLES
##ORIGIN= UXNMR, Bruker Analytische Messtechnik GmbH
##OWNER= root
$$ XWIN-NMR		Version 3.5
$$ Thu Oct 24 14:48:37 2019 Russian Standard Time (UT+4h)  she@DPX200
##.OBSERVE FREQUENCY= 200.1315
##.OBSERVE NUCLEUS= ^1H
##.DELAY= (6, 6)
##.ACQUISITION MODE= SIMULTANEOUS
##.ACQUISITION SCHEME= undefined
##.AVERAGES= 8
##.DIGITISER RES= 18
##SPECTROMETER/DATA SYSTEM= spect
##.PULSE SEQUENCE= zg30
##.SOLVENT NAME= CDCl3
##.SHIFT REFERENCE= (INTERNAL, CDCl3, 0, 15.7039)
##AUDIT TRAIL= $$ (NUMBER, WHEN, WHO, WHERE, WHAT)
$$ ##TITLE= Audit trail, XWIN-NMR		Version 3.5
$$ ##JCAMPDX= 5.01
$$ ##ORIGIN= Bruker BioSpin GmbH
$$ ##OWNER= she
$$ F:/spectra/data/she/nmr/H-F/1/audita.txt
$$ ##AUDIT TRAIL=  $$ (NUMBER, WHEN, WHO, WHERE, WHAT)
(   1,<2019-10-24 14:47:38.82 +0400>,<she>,<DPX200>,
      <created by zg, POWCHK disabled, PULCHK disabled
       configuration hash MD5:
       00 E9 B6 7A A2 85 ED C7 34 08 36 98 17 FE 4E 26
       data hash MD5: 16K
       85 CF 8E 37 1C 9A 2E 86 03 FA 8A BC 99 BB A4 9F>)
$$ ##END=
$$ 
$$ hash MD5
$$ 20 AF CA 4F C0 B9 B1 BF FB D1 8C 2A 47 99 6E 95
##$RELAX= 
##$RELAX= 
##$RELAX= 
##$RELAX= 
##$RELAX= 
##$RELAX= 
$$ Bruker specific parameters
$$ --------------------------
##$DU= <F:/spectra>
##$EXPNO= 1
##$NAME= <H-F>
##$PROCNO= 1
##$TYPE= <nmr>
##$USER= <she>
##$AMP= (0..31)
100 100 100 100 100 100 100 100 100 100 100 100 100 100 100 100 100 100 
100 100 100 100 100 100 100 100 100 100 100 100 100 100 
##$AQSEQ= 0
##$AQ_mod= 1
##$AUNM= <au_zg>
##$AUTOPOS= <>
##$BF1= 200.13
##$BF2= 200.13
##$BF3= 200.13
##$BF4= 200.13
##$BF5= 200.13
##$BF6= 200.13
##$BF7= 200.13
##$BF8= 200.13
##$BYTORDA= 1
##$CFDGTYP= 0
##$CFRGTYP= 5
##$CHEMSTR= <none>
##$CNST= (0..31)
1 1 145 1 1 1 1 1 1 1 1 1 1 1 1 1 1 1 1 1 1 1 1 1 1 1 1 1 1 1 1 1 
##$CPDPRG= <>
##$CPDPRG1= <>
##$CPDPRG2= <>
##$CPDPRG3= <>
##$CPDPRG4= <mlev>
##$CPDPRG5= <mlev>
##$CPDPRG6= <mlev>
##$CPDPRG7= <mlev>
##$CPDPRG8= <mlev>
##$CPDPRGB= <>
##$CPDPRGT= <>
##$D= (0..31)
0 1.2 0 0 0 0 0 0 0 0.06 0 0.03 0 0 0 0 0.0002 0 0 0 0 0 0 0 0 0 0 0 0 
0 0 0 
##$DATE= 1571914058
##$DBL= (0..7)
120 120 120 120 120 120 120 120 
##$DBP= (0..7)
150 150 150 150 150 150 150 150 
##$DBP07= 0
##$DBPNAM0= <>
##$DBPNAM1= <>
##$DBPNAM2= <>
##$DBPNAM3= <>
##$DBPNAM4= <>
##$DBPNAM5= <>
##$DBPNAM6= <>
##$DBPNAM7= <>
##$DBPOAL= (0..7)
0.5 0.5 0.5 0.5 0.5 0.5 0.5 0.5 
##$DBPOFFS= (0..7)
0 0 0 0 0 0 0 0 
##$DE= 6
##$DECBNUC= <off>
##$DECIM= 24
##$DECNUC= <off>
##$DECSTAT= 4
##$DIGMOD= 1
##$DIGTYP= 9
##$DL= (0..7)
0 120 120 120 120 120 120 120 
##$DP= (0..7)
150 150 150 150 150 150 150 150 
##$DP07= 0
##$DPNAME0= <>
##$DPNAME1= <>
##$DPNAME2= <>
##$DPNAME3= <>
##$DPNAME4= <>
##$DPNAME5= <>
##$DPNAME6= <>
##$DPNAME7= <>
##$DPOAL= (0..7)
0.5 0.5 0.5 0.5 0.5 0.5 0.5 0.5 
##$DPOFFS= (0..7)
0 0 0 0 0 0 0 0 
##$DQDMODE= 0
##$DR= 18
##$DS= 0
$$ [...]
##$SUBNAM2= <"">
##$SUBNAM3= <"">
##$SUBNAM4= <"">
##$SUBNAM5= <"">
##$SUBNAM6= <"">
##$SUBNAM7= <"">
##$SUBNAM8= <"">
##$SUBNAM9= <"">
##$SW= 24.0689530833862
##$SWIBOX= (0..15)
0 0 2 0 0 0 0 0 0 0 0 0 0 0 0 0 
##$SW_h= 4816.95568400771
##$TD= 16384
##$TD0= 1
##$TE= 0
##$TE2= 300
##$TE3= 300
##$TEG= 300
##$TL= (0..7)
0 120 120 120 120 120 120 120 
##$TP= (0..7)
150 150 150 150 150 150 150 150 
##$TP07= 0
##$TPNAME0= <>
##$TPNAME1= <>
##$TPNAME2= <>
##$TPNAME3= <>
##$TPNAME4= <>
##$TPNAME5= <>
##$TPNAME6= <>
##$TPNAME7= <>
##$TPOAL= (0..7)
0.5 0.5 0.5 0.5 0.5 0.5 0.5 0.5 
##$TPOFFS= (0..7)
0 0 0 0 0 0 0 0 
##$TUNHIN= 0
##$TUNHOUT= 0
##$TUNXOUT= 0
##$USERA1= <user>
##$USERA2= <user>
##$USERA3= <user>
##$USERA4= <user>
##$USERA5= <user>
##$V9= 5
##$VALIST= <valist>
##$VCLIST= <CCCCCCCCCCCCCCC>
##$VD= 0
##$VDLIST= <DDDDDDDDDDDDDDD>
##$VPLIST= <PPPPPPPPPPPPPPP>
##$VTLIST= <TTTTTTTTTTTTTTT>
##$WBST= 1024
##$WBSW= 4
##$XGAIN= (0..3)
0 0 0 0 
##$XL= 0
##$YL= 0
##$YMAX_a= 60275
##$YMIN_a= -77380
##$ZGOPTNS= <>
##$ZL1= 120
##$ZL2= 120
##$ZL3= 120
##$ZL4= 120
##$ABSF1= 10
##$ABSF2= 0
##$ABSG= 5
##$ABSL= 3
##$ALPHA= 0
##$AQORDER= 0
##$ASSFAC= 0
##$ASSFACI= 0
##$ASSFACX= 0
##$ASSWID= 0
##$AUNMP= <proc_1d>
##$AZFE= 0.1
##$AZFW= 0.1
##$BCFW= 1
##$BC_mod= 2
##$BYTORDP= 1
##$COROFFS= 0
##$CY= 11.3945322036743
##$DATMOD= 1
##$DC= 2
##$DFILT= <>
##$DTYPP= 0
##$F1P= 20.1720416913024
##$F2P= 0.152960286110954
##$FCOR= 0.5
##$FTSIZE= 0
##$FT_mod= 4
##$GAMMA= 1
##$GB= 0.15
##$INTBC= 1
##$INTSCL= 1
##$ISEN= 128
##$LB= 0.24
##$LEV0= 0
##$LPBIN= 0
##$MAXI= 10000
##$MC2= 0
##$MEAN= 0
##$ME_mod= 0
##$MI= 1.114404
##$NCOEF= 0
##$NC_proc= 0
##$NLEV= 6
##$NOISF1= 3.799351
##$NOISF2= 2.8
##$NSP= 1
##$NTH_PI= 0
##$NZP= 0
##$OFFSET= 15.70392
##$PC= 1
##$PHC0= -9573.494
##$PHC1= 15.00082
##$PH_mod= 1
##$PKNL= yes
##$PPARMOD= 0
##$PSCAL= 0
##$PSIGN= 0
##$REVERSE= no
##$SF= 200.130013532006
##$SI= 16384
##$SIGF1= 3
##$SIGF2= 2
##$SINO= 400
##$SIOLD= 16384
##$SREGLST= <1H.CDCl3>
##$SSB= 0
##$STSI= 0
##$STSR= 0
##$SW_p= 3612.71676300578
##$SYMM= 0
##$S_DEV= 0
##$TDeff= 0
##$TDoff= 0
##$TI= <>
##$TILT= no
##$TM1= 0
##$TM2= 0
##$TOPLEV= 0
##$USERP1= <user>
##$USERP2= <user>
##$USERP3= <user>
##$USERP4= <user>
##$USERP5= <user>
##$WDW= 1
##$XDIM= 8192
##$YMAX_p= 0
##$YMIN_p= 0
$$ End of Bruker specific parameters
$$ ---------------------------------
##NTUPLES= NMR FID
##VAR_NAME=  TIME,          FID/REAL,        FID/IMAG
##SYMBOL=    X,             R,               I
##VAR_TYPE=  INDEPENDENT,   DEPENDENT,       DEPENDENT
##VAR_FORM=  AFFN,          ASDF,            ASDF
##VAR_DIM=   8192,          8192,            8192
##UNITS=     SECONDS,       ARBITRARY UNITS, ARBITRARY UNITS
##FACTOR=    0.0002076,     1,               1
##FIRST=     0,             0,               0
##LAST=      1.7004516,     0,               0
##MIN=       0,             -77380,          0
##MAX=       1.7004516,     60275,           0
$$ Real data points
##PAGE= N=1
##DATA TABLE= (X++(R..R)), XYDATA
0@%%%%%%%%%%Pj5J6j6J6j9K7l2L6m4M9n7P0p9R0j04J18j35J56j76J98k23K49k80
34a48L12l48L88m30M78n31N89o52P22q01Q86r82J089j211J351j511J700j926K200
53A175k539K974l554M376n642P861j2904M8947j7231q4292Q228N1902N0205j3500
67C6006l8175k5984R275J3256J1068P735J0368j0978l0851k2630K3840M9166J8911
80E1007m1337n2585l425N0593M0880j2557m5407k1217J9337K7064L741j2375m208
93d89L974o146j3751L394K6662J8291j9997l9328r073L5925L7487p227m1785k3490
107c5553K0798L3799M561k3053j5391R082J2361n295j0292O859J7349j339k4691
120a0805j5996J9021L2273K740l2608k6084J4036L4243J0272k4341k3427O811
$$ plain form
0 0 0 0 0 0 0 0 0 0 0 0 7 -8 8 -8 8 -11 16 -16 20 -24 25 -32 38 -41 49 -55 63 -72 84 -92 106 -117 132 -148
34 -148 164 -184 204 -226 252 -279 310 -342 380 -421 465 -517 572 -639 712 -799 901 -1025 1175
53 1175 -1364 1610 -1944 2432 -3210 4651 -8253 40694 23463 -60829 -52601 -699 49506 36006
67 36006 -2169 -28153 -18878 -5622 5446 13181 23549 12571 -18280 -40910 -17070 32096 51007
80 51007 9670 -42915 -46340 4253 45133 32576 -12831 -34048 -14711 12353 16094 3719 -489
93 -489 3485 -2661 -16412 -13018 13644 31935 11938 -27390 -36463 -538 36949 29722 -12063 -35553
107 -35553 -14755 19044 23605 552 -14839 -5757 6604 1309 -8983 -2124 15225 13886 -10805
120 -10805 -26801 -7780 24493 27233 -5375 -31459 -17423 16820 27092 2751 -20676 -13865
132a3865K2246M765j5584q663J2131J1433j0045j8103K715K3872J1842j9314k6055
145b2625K774K9349J6050j7672k6745k97K3905J4046j3633j8143K941J7385L818
158A1153j5567r707J2467J7482n848k2029p297J9710K0017p501k5475q593J9767
171a421J9729o318k2391n744J6765J3411q800j6638J604J6903O421j5040j4757
184a6276Q444K1042K752k0007j5235J1270K2208K004k0295j3762J1508J9127k81
197A2499j8227q562J3151J4422n985j7351k769J7048J1232j1289j8320J443J9512
210F804J0274j3434j8526K913J9500Q091j4289j5259N298J7558L444j4917j0524
223a3067R112J5655j602j6487p480J3201J4737n170j7946n151J4790J3942p124
$$ plain form
132 -13865 8381 13146 -2438 -11101 1030 12463 2418 -15685 -12970 10902 22744 3430 -22625
145 -22625 -19851 9498 25548 7876 -18869 -19166 4739 18785 5152 -12991 -10050 7335 11153
158 11153 -4414 -14121 -1654 15828 9980 -12049 -19346 364 20381 12880 -12595 -21188 -1421
171 -1421 18308 11990 -10401 -16145 620 14031 5231 -11407 -9803 7100 13521 -1519 -16276
184 -16276 -7832 13210 15962 -4045 -19280 -8010 14198 16202 -4093 -17855 -6347 12780 12499
197 12499 -5728 -14290 -1139 13283 7298 -10053 -12822 4226 15458 4169 -14151 -12708 6804
210 6804 17078 3644 -14882 -11969 7531 15622 1333 -13926 -8628 8930 12374 -2543 -13067
223 -13067 -3955 11700 10098 -6389 -13869 -668 14069 8899 -9047 -14198 592 14534 7410
236G410j7363k599J5185J0784q964j5152J205J5277O540j1288j3094N185J5511
249H637L458j4105j1334P955J6212R96j5677r787J0273J4695j569j5038o590J1503
263c71J1908m935j4601k883J3154J0248q011j4324M33J3986Q183j0395j3721L149
277h180J4774N539j2181j1454N301J4074K146j2289q941P736J3062r70j3192o372
291a0947R817J1687l498j3706l957J1676R966n719j3087j507J1685Q387p768j1686
305h657J061J2193N605r253j0626L757J1977K961j0635q721O346J1691O56j1536
319c181o660P464J0911j664j1854m649Q971R695l777j1870k281J0682P571o390
333B968j0709R3J1392N441p766r964J994J1769L551q990q979M575J0772J644r930
$$ plain form
236 7410 -9953 -12552 2633 13417 4453 -10699 -9494 5783 12323 1035 -12059 -6874 8637
249 8637 12095 -2010 -13344 -5389 10823 11819 -3858 -13645 -3372 11323 9754 -5284 -11874 -371
263 -371 11537 6602 -7999 -10882 2272 12520 4509 -9815 -9382 4604 12787 2392 -11329 -8180
277 -8180 6594 12133 -48 -11502 -6201 7873 10019 -2270 -11211 -3475 9587 8617 -4575 -10947
291 -10947 -1130 10557 7059 -6647 -10604 1072 11038 5319 -7768 -9275 2410 10797 3029 -8657
305 -8657 -7596 4597 10202 949 -9677 -5920 6057 9018 -1617 -10338 -3992 7699 8355 -3181
319 -3181 -9841 -2377 8534 6870 -4984 -9633 -662 9033 5256 -6614 -8895 1787 9358 2968
333 2968 -7741 -7648 3744 9185 1419 -8545 -6551 5218 8769 -221 -9200 -4625 6147 7791 -2139
348b139o605O044R575o57j0156m405P299Q814k641j0136l192Q901P334m295j0083
363f342p05R048N621n472q915P36R544M037p012p945L262Q981K136p808o407M086
379c155Q654N30q613m937N895Q030j391r083k878O883P075l292q340j621P700
394A457N359m224q161k2Q126M249n791p240J938P932K680o408o431L373P682J075
410E594p116m873M557O980j99p689l387N499O353j937p356j755O090N512l561
425B712p236l01O999L847m512o307P49O991K792n025n914K030O687J964n987m726
441e237L135O329J67o007l441M209N521p75o501j997M747M737k171n871j139N163
457H69M179l304n491q7N766K827m278m671J030N929K157m984m215K071N085J212
$$ plain form
348 -2139 -8744 -2700 6875 6218 -3938 -8343 -1044 7770 5129 -5007 -8199 702 8036 3741 -6342
363 -6342 -7047 2001 7622 2150 -6765 -6029 3515 7552 540 -7405 -4143 4838 6974 -834 -7241 -3155
379 -3155 5499 6029 -2584 -7521 -1626 6404 5013 -4070 -6948 -65 7010 3718 -4622 -6243 1457
394 1457 6816 2592 -5569 -5591 2535 6784 993 -6247 -4309 3623 6303 -105 -6536 -3163 4519 5594
410 5594 -1522 -6395 -1838 5142 4943 -2746 -6133 -634 5719 3782 -3574 -5329 761 6273 2712
425 2712 -4524 -4825 2174 6021 1509 -4798 -4049 2942 5734 709 -5205 -3175 3512 5476 -511 -5237
441 -5237 -2102 4227 4394 -1613 -5054 -845 4676 3901 -2600 -4597 150 4887 2716 -3155 -4294 869
457 869 5048 1744 -3747 -3834 1932 4759 481 -4190 -3160 2769 4926 -58 -4273 -2202 2883 4095
473D095n230l481L158N386m04n617k049L756M645j836n119j380M605L577k231
488A875n077k50M654L008l276m654Q37M649K121l731l595J164M592J061l907l156
504c685K207M282j10m074k296L007L319o10l998j334L268L140j396m188n91L859
520H00K335k035l690N0M221J390k626l311O42L927J161l113k897J278M268M4l360
537i16k339K262L325l72l325j611K596K869r67l241q36K975K377j521l193n00
553b417K870K104j989k952O58K765J845l053k492J158L011Q22k907j718J301K832
569A838K74l071j550J853K804o86k765r13K298K090j078k847l4K436J562j353
585H58k749N09J889J967k008k580R56K166P92k084j346P25K554J19k037j257J014
$$ plain form
473 4095 -1135 -4616 -1458 3928 3524 -2093 -4142 -386 4259 2423 -2696 -4076 529 4106 1875
488 1875 -3202 -3452 1202 4210 934 -3720 -2883 1766 3887 156 -3439 -2275 2317 3378 -529 -3685
504 -3685 -1478 2804 2694 -1380 -3676 -669 2650 2040 -1958 -3292 -24 3116 1720 -2468 -3059 800
520 800 3135 1100 -2590 -2540 1681 3071 445 -2866 -2224 1703 2864 -249 -3146 -1868 2400 2444 -916
537 -916 -3255 -993 2332 1960 -1365 -2976 -380 2489 1522 -1719 -2555 420 2797 1276 -1917 -2417
553 -2417 453 2557 568 -2384 -1726 1039 2884 -169 -2661 -1503 1508 2330 -577 -2295 -994 1838
569 1838 2112 -959 -2509 -656 2148 1462 -1303 -2216 82 2172 1094 -1753 -1787 649 2211 858
585 858 -1891 -1382 507 2474 466 -2114 -1158 1008 1800 -284 -1630 -905 1649 1768 -269 -1526 -512
602e12J839K8j903r20J397J677m63k129o76J753J566p74k047j73K311P21j137
619E58k142P35J610P32j278j530M74J948L23j589j269Q28J854K92j752j106J199
636a13J442n08r81r76J089J246l99j719k46J357J164n83j761J6J786K05q72j258
654a111N80J408J23r46q86N28J167K97j116j069N89J336m7j273p14Q05J485n32
672F24j347j90O99J256n71j183j70J136N61l99j147j8J154J15m60r16L49J273
690G66j27r67k96L58J018j34r71m97O18R04j89j012m92O69R97m67j041R1P71O79
710F78m47o21j52O90R3l9q02j03R63K95q16m41M13M05O8p17M16j99O19J31j101
731f67j61Q79J66Kn68k15O53K12j76n99O1N05L33k75m44P1M77K44m53n34J39N60
$$ plain form
602 -512 1327 1355 -548 -1468 -71 1606 1143 -986 -1662 91 1657 883 -1164 -1337 974 1695 558
619 558 -1584 -849 761 1493 215 -1315 -841 1107 1430 -159 -1428 -600 1254 1546 -206 -1312 -113
636 -113 1329 821 -160 -1136 -47 1199 800 -919 -1165 192 1356 773 -988 -972 814 1019 147 -1111
654 -1111 -531 877 1000 54 -832 -304 863 1160 44 -1025 -436 900 853 -420 -1134 -329 1156 624
672 624 -723 -913 -214 1042 471 -712 -882 254 815 416 -731 -749 405 520 60 -856 -507 766
690 766 639 -328 -624 -266 752 618 -353 -850 -232 672 483 -529 -1021 -352 645 178 -863 -772 -1 678
710 678 231 -390 -542 148 241 202 -600 -703 260 555 -261 -702 -289 116 184 -533 -117 -316 303 434 -667
731 -667 -828 51 217 219 -349 -564 89 301 125 -474 -413 92 425 150 -294 -223 254 498 45 -489 -350 210
753B10K79j083K2N60L49J39o93N0j17N22j16k65k94N26L05k45m58r6L59L09L4
774B97m26K5J20L49k40j98k17L90L90n75j57L8N43R7m02N4k79K75R3K7m71J27
796a40J9M52n7m59R0O58m00l32O5L09j22K26j07n94M93O8O3j71k30j79K82J92
818A26l99Q6K88K3J11k44Q1j91K03l4l17L81qm4l6k5N6k7J89rl4l10Q9K68l04
843h1J53j21NJ72l01j56J13J20J95L4j58j24M19o8L0k13j1K24k2k47j47K66J8
866A00k9k48O5lo8K13j16r7K3Ol4l88O43O4k77O9N8l88L40r5K37k77M0K29l2L41
892C76p05L16J34r2o3k09M42j66K51k15j54l3K30j37k4j7j43L68j89l65J90L19
914A14p6K58k65Rm14M43j59J12j44J32K02k09k31J0j8L88l92J93r0J79K7j00l4
$$ plain form
753 210 489 -594 -572 -12 337 476 -217 -167 -284 238 122 -143 -437 89 394 149 -309 -405 -46 263 297
774 297 -129 -104 16 365 125 -73 -290 100 490 -85 -242 -204 339 436 34 88 -191 84 177 204 -267 -140
796 -140 -121 331 274 -185 -95 563 163 -169 -104 205 83 309 202 -392 101 169 232 61 -169 -348 -66 126
818 126 -273 -187 101 124 235 -9 72 -119 84 50 -267 114 106 62 26 1 57 30 219 210 176 -134 -45 223 -81
843 -81 72 -49 -44 128 -173 -329 -216 -96 99 133 -25 -149 270 202 232 19 8 232 210 -37 -184 82 100
866 100 71 -177 -112 -115 -183 30 -86 -183 -160 -154 -188 -576 67 131 -146 -77 -19 -407 -67 -162 75 -202 -162 67 35 376
892 376 -329 -13 121 29 -34 -243 199 33 284 69 -85 -118 112 -25 -49 -66 -209 159 -30 -395 -205 114
914 114 38 296 31 40 -374 69 -90 22 -122 10 212 3 -228 -218 -236 152 -240 -47 -137 42 69 -31 -65
937f5j50N3K89o5nl90M02K07n16L61J68j41j35L65k88L6N2l4r3J67q7j17L3j13
961f6MJ64R8p4r5J61J96n20K24l16K22J22j35j3M8P2j4j74l2J19j32L64j57k00
985a34J75r9Q9j19J86j29L10j81q9j14J02M76j91j45l17J80K32m14K56j82Q5K25
1007B02l31k8kM60j59j56k23L45K28j82k46M8l3n4M6L13l12K2K28j81K8k29L93
1030A77p0k7m8n4J0K3J13k59K66n18M03j02j5r5O65l29j15J17Q2j31j00J51k24
1053h0k1k59L54l9P1J37j31l11M36m33M37k69L0j04l6L55N5L5l06J31j49N7rJ7
1077c2m5M49l36J05k49o8K31k3k26K74l1J08j07m85M76K51q9k74m5K22J97l39
1099c6j05j71K43KR2r1Nk7J50L2k69J14R8J32k22k02O9K03K71l71r5L47j64R9
$$ plain form
937 -65 -215 -162 127 62 57 -333 69 276 -240 121 289 148 13 378 90 126 178 144 51 218 131 14 47 -66
961 -66 -62 102 200 126 31 192 388 -132 92 -224 -2 120 -15 -28 20 92 78 -96 -128 -9 -141 223 66 -134
985 -134 41 -58 31 -88 98 -31 279 98 9 -105 -3 473 282 137 -180 0 232 -182 74 -108 -23 202
1007 202 -129 -157 -159 301 142 -14 -237 108 336 154 -92 -44 -77 -131 -85 228 -84 -62 166 -15 13 -216 177
1030 177 107 80 32 -22 -12 11 124 -135 131 -387 16 -86 -101 -196 469 140 25 142 224 93 -7 144 -80
1053 -80 -101 -360 -6 -45 26 163 32 -279 157 -276 161 -108 -78 -182 -218 137 192 227 -79 52 -97 -40 -49 -32
1077 -32 -77 372 36 141 -108 -176 55 32 -194 80 49 157 50 -435 41 292 203 -71 -116 106 303 -36
1099 -36 -141 -312 -69 -67 25 -66 -61 -88 62 94 -175 -61 37 169 -53 -255 -186 17 288 -83 -178 169 5 104
1123A04l21J34j54K40J1M3L0k10O8qO1k3J31l9j2K5K2Oj66Q8l12r1N48J00k90
1148a5l8L1K59l1j80q4p4M79N6n71q1L57n7j81L89j13m09M16p0j03n3MK43J46
1172C20n28N2L19J85m81M45l29J66j6k16K4K48J41j67j76P8O1j97M66l75q2L74
1194C12n0p2k20j15J18J59j82J4mk94M61M1j54j66K83q2k39J56O1K50l71N5N1
1217A2L57m34K92m53J89K30l14J96l52O5L43J73k84k73N6M00J84k64m41M73L99
1238E54o69l6K6L4K42R9n11L60m06L28k6k77J82K64J58k94m93K74M33j92p4p3
1260i7J00j14M00o03L12k36N16j69k71k99J98N38l75k18J84K91J84k62k18k09
1280c48K87R8j12k57K15K03J91m27l76L00o2L17j89P8k3M70j38l55R1L6J58j82
$$ plain form
1123 104 -217 -83 -237 3 14 57 87 -123 -55 -63 -2 -25 106 67 55 80 102 108 -58 30 -282 -373 175 275 -15
1148 -15 -53 -22 237 206 26 -58 -132 347 403 -168 -249 108 51 -130 259 146 -263 153 83 -20 -73 -69 174 320
1172 320 -208 -156 163 348 -133 312 -17 149 133 -83 -59 189 330 163 -13 65 126 -71 395 20 -62 312
1194 312 262 190 -30 -145 -27 132 -50 -36 -40 -334 127 168 14 -152 131 49 -190 -34 27 277 -94 -39 12
1217 12 369 -65 227 -226 -37 193 -121 75 -277 -212 131 304 20 -253 -197 203 387 123 -318 155 554
1238 554 -115 -151 -125 -91 151 250 -261 99 -307 21 -5 -282 -100 164 322 28 -465 -191 242 50 -24 -97
1260 -97 3 -111 289 -314 -2 -238 278 109 -162 -461 -263 275 -100 -318 -134 157 341 79 -139 -348
1280 -348 -61 37 -75 -332 -117 86 277 -150 -526 -226 -288 29 -160 -82 -105 365 227 -128 -37 -1 157 -25
1302b5j32k9J12L57j08m21K08J26o8n3P3j74J07L62l06j75K53QL5q3K0J2K59k59
1326I9k83J52k46N87l5k75k1p4L23J36l50M3Q3p3r5J29J8N6jq2j97N0P2L08m12
1351h8k35K5N09O9l32l1P8L03P5n15p5L94j55j2M0j88K64R7j12k79l5M36j67j32
1375f6j9Q0p9O51m25n26L81J88M8m48n9J13J51J27l74J67RK82n1k81P2J49p1R6
1399A15k81j63M68Q8j14k58K0P6J63j30l24J93L73j01n6m8J66k83N60n98K4J01
1421iP0k25j42K00J07Q9j62k85L57M08l43k95m2J08J53P4p9k22L56k46J05o3M2
1444d4rK79Jn60N42k99p6N93l52k00J62J87j85l36K06L2J27Q2l28J82j3L21j1
1467C01m07J35J1L29k14m60N57j58k12k07J78n4k11O41k89k14J74Q8J36k54L25
$$ plain form
1302 -25 -157 -186 -74 283 175 -246 -38 88 20 -33 40 -134 -27 335 29 -146 107 115 150 67 87 99 358 99
1326 99 -184 -32 -278 309 274 -1 -22 -96 227 363 13 56 139 66 -29 100 118 174 173 91 -106 -56 16 324 -88
1351 -88 -323 -298 211 280 -52 -83 -5 298 373 -142 -217 177 22 10 50 -138 126 223 111 -168 -203 233 66 -66
1375 -66 -85 -5 -84 567 142 -384 -3 185 233 -215 -274 -161 -10 117 -257 -90 -81 201 150 -131 -59 90 19 115
1399 115 -166 -329 139 227 113 -145 -125 -49 114 -16 -340 -147 226 125 69 21 187 -96 464 -134 -110 -9
1421 -9 61 -164 -306 -106 1 90 -72 -357 0 408 65 -230 -272 -164 -11 63 -16 -238 118 -128 -23 -86 -44
1444 -44 -53 226 227 -333 209 -90 -166 427 75 -125 37 224 39 -297 -91 -59 68 150 -178 4 -9 312 301
1467 301 -106 29 40 369 155 -305 252 94 -118 -325 -147 -201 -412 229 -60 -274 -100 -12 124 -130 195
1488A95k24M55k57l97J05J08r4L22j20m5K70k19m24K99M3j08J74j44l6r9J51k02
1510b47N5LK94m2J49m00L65n8j32J25l10J83J17j29J04l74K1L26K42m28j11L17
1532G0k0j46O1l88N34l5p1k05n6J83K94j06p7p0J42%k73N6j25J05J62O8k11l8
1556a46j16M01k49j26L26J08j23k23J75R2R5J56k33l02L23J55n87M74k27k05K57
1577B5Q1j7K6N3l63L43j05j5J02k1p3j84J80K40k60k4l70J68J44m9Q5k86M43J09
1601B32Q1k28K3j90K69K15m54j91K50j4M7q7Q9rk43M11l60L83j03k02R9l03M20
1624A35R4k68j70K65k53j8K52k65O5N9J3j62j19M38j86j2oK42k37J76j15j4L15
1647B29n15M09o7j83j29j33M54k17J32J95j44l0n4Lj09K87j26j0j56J06K02L1
$$ plain form
1488 195 -29 426 169 -228 -123 -15 -109 213 93 48 318 99 -325 -26 17 -91 83 -61 -97 -196 -45 -247
1510 -247 -192 -189 105 63 212 -188 177 119 -13 112 -198 -15 102 -27 77 -297 -276 50 292 -136 -247 70
1532 70 50 -96 -35 -423 111 76 5 -200 -256 -73 221 115 38 -32 110 110 -163 -107 -232 -127 35 103 -108 -146
1556 -146 -262 139 -110 -236 90 198 75 -148 27 119 214 370 137 -165 158 313 -274 200 -27 -232 25
1577 25 106 89 115 168 -195 148 43 28 130 109 36 -148 32 272 12 -12 -382 -214 -70 -119 -34 -320 123 232
1601 232 313 85 108 -82 187 402 -52 -243 7 -7 40 -47 42 33 -210 201 -159 224 121 -81 18 -285 135
1624 135 229 -39 -209 56 -197 -215 37 -228 -163 -104 -91 -253 -372 66 -120 -132 -138 104 -133 43 -72 -86 229
1647 229 -286 123 56 -127 -256 -389 65 -152 -20 175 31 1 -53 -50 -159 128 2 -8 -164 -58 144 175
1669A75j82nj42J42J43k33J95r2L04j62k89K69o8m7l74K64l3k17J86j01J60K11
1691A04oM4K7k26K51N6k09r9K40j41q6q2kp4K81k8R2k68n1M02l55K86j06j66K71
1716A55rR6l81NN18k57j41k36J39r4J26pR1k48J28L1K28k68J00K27M5K21m74p6
1740h1Q5l2L4j91M28j23o0j12k15J35K84j56O8K00j86j76J56l98M49jJ08k71q4
1763a39J82N2j88J5K7J4Ql77K81L8O6j1o9N8K34j86O5o8k4K70o38L90j76j4K90
1788A00k9K29k75K38m67K53J71k41L20k73R8j37N9k78J72r2J91j35J74q2L4K7
1810E7J03k98M15j98k45K19j89L87m1k75L89l6j54Ql04L1j70M53j96L20j35l78
1832b37M72k96j38J04Q2K6%J43k46O39m50%k86O2m4KP2L91k29j28L18m72J34j06
$$ plain form
1669 175 -7 -12 -154 -12 131 -102 93 1 305 143 -146 123 55 8 -366 -102 -135 -352 -166 -267 -107 104
1691 104 98 142 169 -57 194 250 41 -58 182 41 -45 -127 -129 -203 78 50 142 -126 -177 225 -130 156 50 -116 155
1716 155 146 242 -139 -134 384 127 -14 -250 -111 -205 -79 -86 5 -243 -115 -84 144 -124 -24 203 248 469 -5 -81
1740 -81 4 -28 6 -185 243 120 60 -52 -267 -132 152 -4 64 264 78 -98 58 -340 109 108 216 -55 -139
1763 -139 43 95 -93 -78 -51 -37 -29 -406 -125 -87 -21 -32 -101 -43 191 5 70 2 -22 248 -390 0 -176 -190 100
1788 100 71 300 25 263 -204 49 220 -21 299 26 124 -13 46 -232 -60 -152 39 -96 78 -4 30 57
1810 57 160 -138 277 79 -166 53 -136 251 210 -65 324 288 134 142 -162 -131 -301 152 -44 276 141 -237
1832 -237 235 -61 -199 -95 -13 13 13 156 -90 549 99 99 -187 -125 -169 -167 -95 296 67 -61 257 -215 -81 -187
1856a87J25J08J79m10O6K96j32j44K68M5j19K22m23J03Q9J55k43j60K23mp9j03
1878a25N5k42J71N2J05k18K73n4k22K55j34o9L89l71K50j1p4m8K06k54m6j85L13
1901A6j63n7K35J55p7l57L39Qr2N4k60M88j57l9L8j65J32j06n4j10L22m35L44
1924E9j61K4J46K81l51j69J60L08r1k40P9j05j1K33j94J60j1k70J51k60K11j01
1946a52J10J5l5r1K11R1k19J63k85K61J5n0l4l7j39K94k74J33J53j28k16M88l09
1969c5J29l26L60j38M9K42l79l5J51O9O7l39jJ75m5K2j40R7J43lj57J45J67k61
1993d3N5j86L27j5k17K91l6n97O57k28RJ32m43L34k03Q8O0l70L08L60j57m6P6
2016A56Rk23j0R8j69K05L03m55J94J83p48L16K10j76J14J06Q1j19l9j46J05n4
$$ plain form
1856 -187 -62 46 225 -185 -119 177 45 -99 169 214 95 317 -106 -3 86 241 -2 -162 61 57 -22 -125
1878 -125 -70 -312 -141 -89 16 -202 71 17 -205 50 -84 -153 236 -135 115 104 30 -18 188 -66 -112 -297 16
1901 16 -147 -204 31 186 109 -248 91 99 7 61 -199 289 132 93 131 -34 98 -8 -62 -172 150 -285 59
1924 59 -102 -78 68 349 -2 -171 -11 297 206 -34 45 -60 -71 162 -32 128 117 -153 -2 -262 -51 -152
1946 -152 -42 -27 -62 -153 58 149 -70 93 -192 69 84 34 0 -37 -176 118 -156 -23 130 2 -214 274 -35
1969 -35 94 -232 128 -10 39 281 -98 -133 18 87 154 -185 -186 -11 -56 -34 -174 -77 66 63 -94 51 218 -43
1993 -43 12 -174 153 138 -79 212 176 -421 236 8 17 149 -294 40 -163 -75 -15 -385 -77 283 126 80 156
2016 156 165 -58 -68 30 -139 66 369 -86 108 291 -457 -141 69 -107 7 113 194 75 36 -110 -5 -59
2038e9j87L14k22K56l9j14j44N03l66OJ06k9k56R8J94p8K4j73K03j50J13J08n
2061A03j39J49O4m39M39n6l16K71J94o46N40k50Q9j66M69j68J9l27J89J30n5P0
2083A64m87L03L36j85k42N2L65q9j43j04N8J62J64n61r0L20J91J6K4o0j93J78
2105A79J05l61R1j86K49O2lj94J46K5J14m50R4j18M17P8m41M07l52M27n1k99P0
2128IJ06k13J5O9J32PR7k26k67J72J95j54J06l26L29j80L67k52j12J85J46rl35
2151a39J25j01M24l93j09K33j59P0q4q5O8K65k86R1N1j78L84K08n69K46m70O32
2173B24m00P3k42L84L99l62j03r7j15M85k02m28L41l4k9J4l68J50L70K65k89m07
2195c71J81J17P7o8Rl21N31j26J12k11P9L80j20j69m98K27J08J66k27K9J44K25
$$ plain form
2038 -59 -246 68 -154 102 63 -51 -195 308 -58 -52 54 25 -231 -133 61 -17 7 -166 37 -113 0 108 103
2061 103 -36 113 177 -262 177 121 -195 76 270 -376 164 -86 3 -163 306 138 157 -170 19 149 94 164
2083 164 -323 -20 316 131 -111 -59 306 217 74 -30 28 190 354 -207 -297 23 214 230 254 194 1 179
2105 179 284 -77 14 -172 77 139 136 -58 88 113 227 -223 -129 -247 170 248 -193 214 -138 289 238 -61 9
2128 9 115 -98 -83 -14 118 125 222 -4 -271 -99 96 -58 48 -278 51 -129 238 -14 -126 59 205 196 -139
2151 -139 -14 -115 309 -84 -193 40 -119 -49 -133 -218 -150 115 -171 -80 -29 -207 177 385 -184 62 -408 224
2173 224 -176 -103 -345 39 438 76 -27 -124 -239 246 44 -384 -43 -77 -106 -92 -460 -310 60 325 36 -371
2195 -371 -190 -73 4 -64 -55 -376 155 29 141 -70 9 389 269 100 -398 -171 -63 103 -124 -95 49 274
2217B74m66n3Rl8P36n25n7lK25j45J75k64K4r2K61l3k77J52L06j50j09J80o7j15
2241e2J87k61J16J34Q8m29K35q6J89o7n0R3j32K6Qj12r0L35j74J2N54p42K17L52
2265C51k02n6M3l07Q3L48m45l63M67O18m75j65o7K11K56j74l34J02K90N6R0l77
2287e0l91M95J30m16P8j44P14j00k58l97K78R0K29k09k81J38J29j40p9Lj18O55
2309C56l36j11k49L72P4M8k76k07O81k11m2m97M92J56R7n01m4J18M08j54k64r6
2331a86J13K28k14K4j31j19L32j05k10j44K94L41p2k91J05J80q9J28n39L68J12
2352A25Q7k04k42N7L00k30K64m47K49qJk02J24k5N04k56j10j88Q3K24K3k93k97
2375d61P18k69O8k04n1K41j1R8k26M2J80J26p5l66J53J8K29k47o2K68k7lj15j69
$$ plain form
2217 274 -192 -245 -236 -274 462 -63 -120 -123 102 -43 132 -132 -108 -200 61 28 -249 -97 209 59 -50 130 63 -52
2241 -52 135 -126 -10 124 212 -217 18 -68 121 54 4 97 -35 -9 -1 -113 -203 132 -42 -30 524 -218 -1 351
2265 351 149 93 136 -171 -88 260 -185 -548 -81 537 62 -103 -170 41 297 123 -211 -109 181 237 327 -50
2287 -50 -441 54 184 -232 -154 -298 416 316 58 -339 -61 29 258 49 -232 -94 35 -105 -184 -181 -299 356
2309 356 20 -91 -340 32 106 154 -122 -329 352 141 99 -398 94 250 347 -154 -198 -80 328 174 -90 -186
2331 -186 -73 155 -59 -35 -166 -285 47 -58 -268 -412 -118 223 151 -140 -35 145 56 184 -355 13 125
2352 125 212 8 -234 -177 123 -107 157 -290 -41 -49 -48 -250 -126 -151 353 97 -13 -201 -118 106 129 -164 -461
2375 -461 257 -12 56 -148 -199 42 31 129 -97 -55 125 251 176 -190 -37 -19 210 -37 -99 169 142 139 24 -145
2399a45p0M96k68j98o7J37jL58l56p3K56J47l01k99K19J72R1J20l96J7K73k16
2421a04o9k04L66J43J31k93j27J12K44J46o44K81K20J34k7m54k35K25k9K38lj44
2443i3L11P6k43l78K76P9L93n69k32K09M01j31k35J5l6L26J9J75n18K96l7O8l74
2466b02l6M08J5l18rl3K88J6k8k88J48j65M93l18m07K33M59k6k82j96J92Q4J22
2489A50l67J01m5L65j64k25j6K02K69j30j92l31O69o7j8l36o5K17M46p2n42j25
2511b76J82M33o24k36N43J40J05n09L0K36j9K69m36n7L39l4m2j70n0J99J09j07
2533B5J14l70Q8M91n21j06j10K00N42k73j17QN34m65N9l37J62J96j04k26k55K80
2555a85L72J46q37K61K97K72k31l71q6N26q2J37m08K77j69R1l12J42J88J18j13
$$ plain form
2399 -145 -215 281 13 -185 -252 -115 -116 242 -114 -187 69 216 -85 -384 -165 7 98 218 -178 -161 112 -104
2421 -104 -173 -377 -11 132 263 -30 -157 -45 199 345 -299 -18 202 336 309 -145 -380 -155 -184 54 51 -93
2443 -93 218 294 51 -327 -51 28 421 -148 -380 -171 230 99 -136 -121 -157 169 188 363 -155 141 104 172 -202
2466 -202 -238 170 185 -133 -142 -175 113 129 101 -187 -39 -204 289 -29 -436 -203 256 230 -52 -248 -56 28 150
2489 150 -217 -116 -161 204 40 -185 -201 1 270 140 -52 -383 286 219 201 -135 -200 17 463 391 -151 -276
2511 -276 -94 339 -285 -521 22 162 267 -242 -212 24 5 274 -162 -219 120 86 44 -126 -176 23 132 25
2533 25 139 -231 -143 348 -173 -279 -389 -189 353 80 -37 -29 505 40 99 -238 -76 120 16 -210 -465 -185
2555 -185 187 333 -504 -243 54 326 95 -276 -362 164 82 219 -189 88 -81 10 -302 -160 28 146 33
2576C3l3j17O6K47j26k24k75L83J51k77J56j12O9R9J51p4l77L02j44J16k52j65
2598d03N36K47n37l2l8M31k70j21O0R0L07j05j42K5J11k24J62j69k04L29J79m2
2620A90j85m63M81M03m42K56l81L04kj09j79k5R0L05k25l59P9L20J91O2l91K59
2642A79j41K77l44Pk07M55p9k21LL3L01k25j40O8Rj35M63k47k63L42M5j62k22
2665b04pM48l66K19k79J53J96K7k44j55Q9K65p7k44L56l75N66j56k55m33O03J3
2687A40j02j22J52N15l96J05k84l65L11J93n09J17N12j19o1k41l3K1K11p2l0J3
2709d4j02J50L51n87q9L01N23q4p03j6M16J10l5l59NJ76J65k34m1k08K23J31j25
2732g6k0j54N74O6k29l84J70L74k78k51j83M99n6m1j2j03J37J7P4l26K96J15q7
$$ plain form
2576 33 0 -117 -51 196 70 -154 -429 -46 105 -172 -16 -128 -59 40 191 117 -260 42 -102 14 -238 -403
2598 -403 133 380 -157 -189 -227 204 -66 -187 -127 -37 270 165 23 48 159 -65 97 -72 -276 53 232 190
2620 190 5 -458 23 426 -16 240 -141 163 161 52 -127 -152 -62 243 18 -341 -262 58 249 311 -80 179
2642 179 38 315 -29 -22 -229 226 147 -74 -71 -38 263 38 -102 -34 -25 -160 303 56 -207 135 180 18 -204
2665 -204 -211 237 -129 90 -189 -36 160 187 -57 -212 -123 142 65 -179 177 -198 368 212 -43 -476 127 140
2687 140 38 -84 68 583 187 292 8 -357 -46 147 -362 -245 267 148 87 -154 -187 -166 45 -27 -57 -44
2709 -44 -146 4 355 -232 -321 -20 503 419 -284 -300 116 226 191 -168 -163 13 178 -56 -97 -305 -82 49 -76
2732 -76 -96 -250 324 390 161 -223 -53 321 43 -208 -391 108 52 11 -1 -104 33 50 124 -202 94 209 122
2755A22K75m62l21N72j22o7j21L1M3L87k21j91M9J65J0n10K49J75J35k55L2j87
2777b12M37j94l1R4j52o3K46k18k9P2J13L0j20r2N7J63J26l15N5j36O1j42L44
2800I4k39j35R3L96k43j34M27n02J47j20j44N01J05l38L5l7J79j01k17J01j27
2821b59L47J53r4k70J41q9L51m65M13l54L60j02rn0p6J5N5k38L4J13k6K51k28
2844b7J90r8p0j0j28R3K28o6j93r2K18P7Q1o10kM01J69k04M1k36J99J83p9l7k33
2869b05K5M58j56l74J56J75K42m49j92J69M11mO6k77j29K27J25m06J75j82L15
2890A70k58Mk03J29K26J6o9J0J14k99M17m90M01j42L29k08k88j1Q5p3K71k07j65
2913b41J88J51K9k25l84M91K10k89k43k6N97j83k63J50L3K65k30j42n3L27o1l25
$$ plain form
2755 122 397 -65 -386 186 64 -3 -124 -93 -50 337 116 -75 -26 139 149 -361 -112 63 198 -57 -25 -212
2777 -212 225 31 0 94 -58 -121 125 -93 -122 -50 63 93 -27 -119 -62 101 227 -88 -33 -169 -108 -250 94
2800 94 -145 -280 -187 209 -34 -168 259 -243 -96 -216 -360 141 246 -92 -57 -94 85 -16 -233 -132 -259
2821 -259 88 241 147 -123 18 -71 280 -185 228 -126 234 132 123 73 -3 12 67 -171 -137 -24 -50 201 -27
2844 -27 163 65 -5 -15 -143 -50 178 112 -81 -173 45 122 203 -407 -409 -8 161 -43 -2 -238 -39 144 65 28 -205
2869 -205 -180 278 122 -252 -96 79 321 -128 -320 -151 260 256 322 45 -84 143 268 -138 37 -145 170
2890 170 -88 -84 -287 -158 68 84 15 25 139 -160 257 -233 168 26 355 147 -141 -152 -67 -140 131 -76 -241
2913 -241 -53 98 127 -98 -482 9 219 -70 -313 -339 258 75 -188 -38 -5 260 30 -112 -165 162 101 -224
2935b24J12Q3j17K34M0j93j96J88K19l32L58k83RK13k55K13k81L89l3k26J64k35
2957a53o0K68k00r5O54k23n7l89K03K57l3j17j5q6J27k3M3l93L48MK3j53k58N25
2981A97j69J17j35k70K58N1jJ95M5m54M03p8l36L62j0l56K95k39k0L25j49J28
3003A59k40K44k30K30j27k53j77O99j69j07J10m8m5j15m8J53j51R8R5M4j94O5
3025gK56n69L15j18Q0K21j25j15k5O6J5J52j00j33J35J34r3j25j73J29j78K06
3047e2l6N0J58r3L07m91p6l2K2J09J29Q1l64Q7J58R0N7k03J15k04K38M4J7m06
3071b95J46L40j96j48J33m16K40M56l28K48l03j66M50m42L38j2n2K0j80K31r7
3092c3Q9J5q8M4J48k7J37j00n12K94k31J51J78o9J22j16J69k68j35K73j9L9j81
$$ plain form
2935 -224 -112 -29 -146 88 128 -65 -261 -73 146 -186 172 -111 -102 111 -144 69 -212 177 144 -82 82 -153
2957 -153 -213 55 -145 -240 414 191 134 -255 -52 205 172 55 40 -46 81 58 101 -292 56 60 83 -70 -328 197
2981 197 28 145 10 -260 -2 49 48 243 288 -166 237 159 -177 185 175 -181 114 -125 -145 180 31 159
3003 159 -81 163 -67 163 36 -217 -394 305 136 29 139 91 46 -69 -117 36 -115 -17 78 122 -72 -7
3025 -7 249 -320 -5 -123 -43 178 53 -62 -87 -21 -6 146 46 -87 48 182 89 -36 -209 -80 -258 -52
3047 -52 -88 -38 120 27 334 -157 -233 -265 -243 -134 -5 76 -288 -201 -43 47 104 -99 16 -188 50 94 111 -295
3071 -295 -149 191 -5 -153 -20 -436 -196 260 -68 180 -123 -289 161 -281 57 45 -7 13 -167 64 -33
3092 -33 56 71 -17 27 175 148 285 185 -327 -33 -264 -113 65 -4 118 2 171 -97 -232 41 22 61 -120
3115a20K00k12R9l29M98O2k42P%kK70n19L24J83k58J56l9j15J93j48J23j9k48
3138a36j64K08Q4j18K4j8R8j2l8J55k56J83o5M94j93o40K70L06J14l84n7J40j17
3161a22M61k62P8j60O4J55l6j02J14l06P1J22p4J2M0p5m9J62RO3l31j19J93J97
3185A05K25m75p8J77J38J6q6l16L16P7j19j00NP4M0j9K27k32rj00L43l90M5J75
3209C9l75M39j72J36k18R4J43q1QJ69K16m15L0J71k57k11K77n3J78r2r0J10R5
3232A41l32J44J9m3J58k85R6r9L99k61J75p4N4k36Q8K0Q0o7p2J80j99j04K25J07
3256A14k11J0l3J57j29L2K81M0m15J44J75k39J92k38J59k21K24J75j42p4j40J88
3278D9j97J11K81j62j57L09k77P2M2R3k17K9j83J75JJ77K45n79J98l4R0k34K97
$$ plain form
3115 -120 80 -132 -33 -362 136 198 -44 -37 -37 -39 231 -288 36 219 -39 117 78 -37 156 8 131 112 -136
3138 -136 -300 -92 -8 -126 -102 -120 -22 -34 -72 83 -173 10 -55 439 246 -394 -124 182 296 -88 -145 -5 -122
3161 -122 339 77 155 -5 59 214 178 76 190 -116 -45 77 3 15 55 -20 -69 93 102 165 -166 -285 -92 105
3185 105 330 -145 -223 -46 92 108 22 -294 22 99 -20 -120 -115 -41 -1 -20 207 -25 -34 -134 209 -181 -136 39
3209 39 -336 103 -69 67 -151 -57 86 5 13 182 398 -17 13 184 -73 -284 -7 -60 118 26 -64 46 141
3232 141 -191 -47 -28 -71 87 -198 -102 -201 198 -63 112 38 92 -144 -56 -36 44 -23 -95 85 -114 -218 7 114
3256 114 -97 -87 -120 37 -92 -60 221 261 -154 -10 165 -74 118 -120 39 -182 42 217 75 1 -139 49
3278 49 -148 -37 244 82 -75 234 -43 29 71 164 -53 -24 -207 -32 -31 146 391 -188 10 -24 66 -168 129
3301A29j06r5k07M77j41m06J55L43k99N2L33o9n2l02K28R0K5m23L67j45K49l75
3323a72L16K11l90j02M1J62k34K04J21j60j71L91j12j85J18l70N36j40J40j30
3343G4K33k11j50Qj0O5j99K44N7j57j4K0J60m9j3j18l6l0P8r1L58l22J92K1n2
3368E8K23j94J1q0q4L08k45j10J40l5q6J95j33pK5k0R1Pk44P8M32j21j21k29N41
3393D00j78l14J69j37j0q9N2J59l8P6k05K47j39l9L95o60L27k84L48r2J96j36
3415D8r2o0j19J50K31l53K05k89L18j61P0n6K96k28j36K6K48jk3K90o22J96oJ74
3439A06L1j76N4K08j75k36N92o77K14K26k08j8R1j28K28j14l0O1R5l30j52L60
3461B2n7m4o8K93j12J0k46K30m4K4J35l35J83n4J75j19M4j17L39m65M8O5q0K39
$$ plain form
3301 129 23 -72 -279 198 57 -349 -194 149 -150 -98 235 166 114 -188 40 130 155 -268 99 -46 203 -172
3323 -172 144 355 -35 -137 -96 66 -168 36 157 -3 -174 217 105 -80 38 -332 204 64 204 74
3343 74 307 96 -54 -46 -56 9 -190 54 111 -46 -60 -40 120 71 58 -60 -96 -126 -48 -139 219 -103 89 110 58
3368 58 281 87 98 18 -66 242 -3 -113 27 -8 -94 101 -32 -39 -14 -34 57 64 -180 -102 330 209 88 -141 400
3393 400 222 -92 77 -60 -70 -159 -107 52 14 90 -115 132 -7 -46 349 -311 16 -268 80 -12 184 48
3415 48 -44 -104 -223 -73 158 -195 10 -279 39 -122 -52 -108 188 -40 -176 -150 98 97 74 364 -258 -62 -68 106
3439 106 137 -39 15 223 48 -188 404 -273 -59 167 -41 -59 32 -96 132 18 -12 49 144 -186 -338 22
3461 22 -35 -79 -147 146 34 44 -202 28 -16 8 143 -192 -9 -63 112 -7 37 -80 259 -206 -158 -93 -173 66
3485F6p5J82o0J16k84O0Q0L08n32m9M14k29Q1k61K8L05j43K92n31K97J16j05r9
3508b3k35M79j28n4j89L73m52J92q7L78n00K83j37l11P5L15j3J28l8n3o1K2L26
3531B90l05q3k08L35l65K07N3K4r9J87j57J31j28O5L0JK36m57R7N02m12J74m54
3554c36O68j95j35J56j52k79K09K48m24Q5J83L13k20j10k55K42N3J01l76L6L07
3575A19r8lp3J55q8j60K3L22l27J36J3J86Q2k04M6n1k44l1L57k55P5j39q6J95
3599e0J06j29qJ15J0lj21n5K92j15J52k28R9k65K84j46R6J50j52r5m9L89j39l52
3623b14M02j36j59J22k4K35m72L29j00L17l01N9o9J27l12L41m36J97J39KJ16j6
3645A47k97J01J14k68J14n8R4k30L38r7m1oJ2m0M2L0J66j68M5J66K37l81Rk2k7
$$ plain form
3485 66 -9 173 113 229 -55 5 85 393 -139 -188 226 -3 78 -183 -155 150 7 299 -232 65 181 76 -23
3508 -23 -258 221 93 39 -150 223 -229 -37 -124 254 -246 37 -100 -411 -336 -21 -34 94 56 3 -58 -36 290
3531 290 -15 -98 -306 29 -336 -129 -76 -52 -151 36 -121 10 -118 -53 -23 -22 214 -243 -146 356 -56 118 -336
3554 -336 332 137 2 158 6 -273 -64 184 -240 -155 28 341 121 11 -244 -2 51 152 -224 -188 119
3575 119 21 18 -55 100 12 -148 -125 197 -130 6 19 205 287 83 129 78 -166 -197 160 -95 -20 -159 -245 -50
3599 -50 56 -73 -81 34 44 41 -80 -135 157 42 194 -34 65 -200 84 -62 34 184 32 -63 -112 277 138 -214
3623 -214 188 52 -107 15 -9 226 -246 83 -17 300 -1 58 -11 116 -196 145 -291 -94 45 47 163 147
3645 147 -150 -49 65 -203 -89 -147 -53 -283 55 -42 -83 -89 -77 -117 -75 -45 121 -47 -2 164 401 20 29 7 -20
3670b0R7j99Q6p8J7j08qJ71K66Lj07j51o7J97O5j57l7k03K58k8m6P3M7O3L2k56
3696i0o8L09j40j86p5J76j94K58M8J15j71L2j04J14n7l5m0o6Q2P1n1l9q7J49J45
3721I6oj55R7ml42L72N6J17j17P1p6j77N1j64J03J16j10K42n9j50o2K10q9l8J49
3746A31m7k72N25n10L20q4k57KJ11K93k27J05n6k57J29J0Q3j45k72M74r0M47k99
3769A14m4J66j58p9o4K60k19J3K02k08k89J54k0K58m49K23K93j89J38q3P6J20
3791B15k22M7L0Q7q8k31K85n4m7L8J18j70J55m0j55J79j64m5k13j12K07M22l12
3814g0P7J88m11K16j89L44j93j38J79j61K24j09k93L26p4J11j20K56o5L2j03J6
3836D3o8J11k8j4J11j81%J37j12K33p1j7m58L98k29L02q2Kqk02Q1J47J91lk45
$$ plain form
3670 -20 77 -122 -36 -114 -97 -205 -213 -42 224 227 120 -31 -98 99 164 7 -30 -233 25 -3 -49 24 71 134 166 -90
3696 -90 -158 151 11 -175 -250 -74 -268 -10 38 153 -18 14 -90 24 -33 -68 -108 -174 -92 -21 -72 -111 -198 -49 96
3721 96 90 -65 32 28 -314 58 114 231 114 185 109 -68 -17 -181 -78 38 -72 170 111 -39 -101 109 20 -18 131
3746 131 84 -188 337 -173 147 63 -194 -192 -81 212 -15 90 34 -223 -94 -84 -1 -146 -418 56 -34 413 114
3769 114 70 236 78 -1 -65 195 -24 -11 191 -17 -306 -152 -172 86 -363 -140 153 -36 102 19 95 215
3791 215 -7 40 70 157 69 -162 123 69 22 60 178 8 163 123 -32 147 -17 -62 -275 -387 -180 242 -70
3814 -70 7 195 -216 0 -189 155 -38 -176 3 -158 66 -43 -336 -10 -84 27 -93 163 98 130 27 43
3836 43 -25 86 58 44 155 -26 -26 111 -1 232 161 144 -314 84 -145 157 75 77 69 -133 -52 95 286 283 38
3861C8Lp8J74k66J97L20m48N3m0J1K11j24p9L77j44j2l22J08j74J3o5J76K4J48
3885A01k1L0k60O1L5K04j68o2M04m14K31r0o9m0k4J85l9j21j09J82J95m20N4R9
3909e6J07k55J02J12l11J69o8L27j55p6O3J21k34M68l93K13P4m4l13K63j80K3
3931d3J44K39m05k7J09k69K67j31M15n99J98J31L0l4R8j79j14Q9O5M18n48L18
3953A72j08m8M48o68L43k94J5J44K63m07j76L56J39j92p4O9K59l24j9K5r1J66
3975bJ45j53J08k12J27M11o46L15M1k41L14j96lR3k27J96k69K59k01J70l6J6o6
3998e7Q9P7Oj2k43J63k34L17j02R4k27J35n1K05n03J68o7k11M68j29j11L94j54
4021A5J06j16k13K88L21m10k87M12L6j20K12l28k36J34L10o9k38L58l47L95k64
$$ plain form
3861 38 41 -37 137 -129 68 388 -60 -7 -47 -36 175 51 -28 349 205 193 -129 -21 -195 -182 -247 -71 -47 101
3885 101 80 110 -150 -89 -54 150 -18 -80 324 -90 141 51 -18 -58 -82 103 64 -57 -166 16 211 -209 -155 -56
3909 -56 51 -204 -102 10 -301 -132 -200 127 -28 -104 -41 80 -154 314 -79 134 208 164 -149 114 -66 -43
3931 -43 101 340 -65 -92 17 -252 15 -116 299 -300 -102 29 59 25 123 -56 -170 -81 -16 402 -146 172
3953 172 64 16 464 -204 139 -155 -140 4 267 -140 -316 40 179 -13 -87 -18 241 -83 -102 -77 -168 -2
3975 -2 143 -10 98 -114 13 424 -222 93 134 -107 207 11 8 101 -126 70 -199 60 -141 29 -7 9 -57
3998 -57 32 109 115 103 -140 23 -211 106 4 98 -129 6 -45 160 -343 -175 -242 -453 15 -114 -225 169 15
4021 15 121 5 -208 80 401 -9 -296 116 152 32 244 -84 -320 -186 124 55 -183 175 -172 223 -41
4042d1j95r4L87J22k99L33j18R3q5j45j10J2L72l95L68n8P3k39j75J79K60k90
4064d5M6%K1j62J45j08k2K88j22j6j02j96L06j05k15N29l22nL0K25l46JK41l1
4088C5K4j23j77K29M00o34K20J7L38l58l09K49J52j00k33L03N3q2j49L07j55j54
4110a47J02m8j20K71k31J17L29l55l5R6J35j89K95k10M0r2o9l30L66o4K02p1k43
4133b51K85M0l7k03L46L0k8j97j57M10l82Q2J07j5Q1j56K05j53Q7J8P1l54J39
4156c2L2M5J02n14L89l12K30N8O1r1j32l1K6J6J20P5l43J24K13k7L8j42o8j3K95
4181A19K01l25J46j07j18J90m2j4J13K29k68m16L54q7N9n8L65k13m6J7q3L33j69
4204A80l15L05j95j11M39l22N2J88j67q3J88k1j12j39m2K48K20k08Q6l75L40k31
$$ plain form
4042 -41 -236 -330 57 179 -120 213 95 188 103 -42 -152 -140 232 -163 205 147 220 -19 -194 -15 245 -45
4064 -45 1 1 22 -140 5 -103 -125 163 41 25 -77 -273 33 -72 -287 242 -80 -85 -55 170 -176 -175 66 35
4088 35 59 -64 -241 -12 388 -246 -26 -9 329 -29 -338 -89 63 -37 -270 33 86 4 -145 162 7 -147
4110 -147 -45 -93 -213 58 -173 -56 273 -82 -117 -21 114 -75 220 10 50 -42 -111 -441 -75 -139 63 -8 -251
4133 -251 34 74 37 -166 180 210 182 -15 -172 238 -144 -62 45 30 111 -45 160 7 94 112 183 -171 -32
4156 -32 0 45 147 -367 22 -290 -60 -2 59 -32 -164 -195 -169 -153 -33 42 -301 -177 36 9 47 -95 -163 -176 119
4181 119 320 -5 141 34 -84 106 64 50 163 392 124 -292 62 -25 34 -24 341 128 82 99 16 349 180
4204 180 -135 170 -25 -136 303 -19 33 221 54 -29 159 138 26 -113 -155 93 313 105 191 -184 156 -75
4226g5K44j74N4o2j71L03n2k2k03M8J91o4j82K28L4o2O3k3j26M11k33m18K71M17
4250C97m73j70K90n9l0j58K51nk67L70J28j39M5p5j5J34m09M60k03L9j94O8j08
4273a23L86N5k56j89k3J38K9j66M8L0J91j61k4O1j20R4j21j94K41l9K16l73K88
4296a2L2n7PO8o5j9K70l10O1N2n4L0q1J24r9o9K7L41l11J23j98J6J08L25k83o1
4322c5J51q5o6n4J12p6J19O1p8Q6m8k7L7l15P7K40j8j96l3K94J27k73K51j37k44
4347a30L37j79k17L23k76K96L10n95K86k04rl5k55L93k65J67R2J39k41J45J45
4368B27l15K64j44q5J16R1l14L54l02Q5j70J95j73L35j96J80l71L02Q5k64K67
4389A67o5l16K93n0j92J80J47j50j56J12N7k11M25j10k53P9k01J77L9j47P2J74
$$ plain form
4226 -75 169 -5 49 -13 -184 119 67 45 -158 -110 81 17 -165 63 97 35 98 75 -51 360 127 -291 -20 397
4250 397 -76 -246 44 -15 -45 -203 48 43 -224 146 274 135 180 105 90 224 -185 275 72 111 -83 -15 -123
4273 -123 263 318 62 -127 -150 -12 17 -149 -101 -71 120 -41 -65 -4 -124 -30 -151 -345 -104 -143 73 -300 -12
4296 -12 20 -37 -30 38 -27 -46 224 -86 -25 27 -27 3 -78 46 -53 -122 -95 246 -65 58 -140 -124 -16 309 26 -35
4322 -35 116 31 -35 -89 23 -53 66 127 49 135 87 60 97 -218 -141 99 81 -115 -148 146 273 0 251 114 -130
4347 -130 207 28 -189 134 -142 154 464 -131 155 -49 -58 -93 -348 45 -220 -53 39 178 -63 82 227
4368 227 -88 176 32 -53 63 154 -160 194 -108 -23 -193 2 -171 164 -32 148 -223 79 164 -100 167
4389 167 102 -214 79 29 -163 17 164 14 -142 -30 27 -184 241 131 -122 -43 -244 -67 -28 -175 -103 71
4411G1j90J12L3P6Q1k97Q3J04Q5l14J73J43k96K10jp9k12J36P8j42j94M00j06
4434d6N7M08l08K39j98j23R3l42K39j25p6O7O1K78k82qM0m2NK06k60m4K21K9l08
4459b19L72J31j63m9k25J08j21J14J57Q1l90j73L17K0j10J24p8R4K16l89L95p4
4481A38J05l30J53P4K5k68j2K80j17m26M85m5qk55J89j14N2N4q5M01l75k0J24
4504B5j07j77M03M3m4j51J22n1j02p6K35k95J25lK82q4k96l8J30O4k14j1J48J47
4528G5k9R8K03j53M7l28l7j2R1P7k23N74o04K72J91k98kM3R1R3k20K27j20J33
4552A89r1k62K42j11P3k43J44J11j82K12J5L5l53J64j7n9M82k84P6k12k8R2K80
4575B73l03k53M1K08J36p4l9j72J70j45J77p3K41m45J46K59k58K14K27m14l0L25
$$ plain form
4411 71 -119 -7 26 102 183 -114 -31 73 158 -156 17 160 -136 74 73 -6 -218 -82 -4 -146 -340 60 -46
4434 -46 11 419 111 350 152 29 122 -220 19 -106 -182 -115 -54 224 -58 -66 -26 -68 -63 143 -117 -161 60 89 -219
4459 -219 153 284 121 72 -153 -45 -166 -52 105 186 -204 -377 -60 -40 -150 -26 -104 -10 206 -183 212 138
4481 138 243 -87 66 140 165 -103 -115 165 48 -378 107 62 54 -201 -12 -126 -74 -20 -105 296 -79 -99 25
4504 25 -82 -259 144 187 143 -8 114 63 -39 -115 120 -175 -50 -53 229 145 -151 -189 -59 5 -209 -220 -72 75
4528 75 46 144 347 194 241 -87 -124 -136 -45 32 -191 383 -221 51 242 -56 -58 -15 76 169 -51 176 56 189
4552 189 98 -164 78 -33 40 -203 -59 52 -130 82 97 132 -221 -57 -74 -133 349 65 141 -71 -99 -7 273
4575 273 -30 -283 -242 -34 102 28 -11 -183 -13 -158 19 -54 187 -258 -112 147 -111 103 330 -84 -114 211
4597B11n90N02l34L00kN0k47M1j48j10L80l99N77l22L8r7L11k56K00l60J28K19
4619I2j23O8J48r6Rk4j9k7o7K07l35J7J58k6J56l55M51l22q9l5q5N23j45m9j42
4644a10L27m04J96K30j30j37k36L80p9k59K00j06J98J7j7l6j53L35j45M2m1j47
4666g5J48k32K80m01K49N0J73J4k55L19k72K06j96J26n80L30J71p4q9J43R5n40
4688d10N21k83J2R3j08M08l39K39m4q9N9j05K4R1J51m56K65j02J88l30K67Q4l8
4711I8j76L86m5j49j05rp5pJ61rn1R1k06M2m6K32M2j53L3k05j8L34k64L36p6m5
4737A16j29K6J15j05m81L07J69k08J40r6L69k64P2K16j86j82N7R3k18K93J18l69
4759a47K50j70J13k22K73k50R8K62r9k01Q6J7j04J94k99K0l7K89j01Q8r7K5J81
$$ plain form
4597 211 -379 123 -211 89 87 137 -110 -69 -217 -327 53 -346 231 -91 -53 -150 161 -95 105 -255 -127 92
4619 92 -31 37 185 89 98 74 55 28 -39 168 -167 -150 8 -18 138 -217 234 -88 -177 -212 -297 226 81 32 -110
4644 -110 217 -187 9 239 109 -28 -264 116 37 -222 -22 -128 70 87 70 34 -119 216 71 113 72 -75
4666 -75 73 -159 121 -280 -31 19 192 206 -49 270 -2 204 8 134 -446 -116 55 -19 -108 35 130 -410
4688 -410 111 -172 -160 -67 -175 233 -106 133 89 0 59 -46 -22 69 220 -236 29 -73 115 -215 52 136 98
4711 98 -78 308 263 114 9 0 -75 -82 79 70 19 110 -96 -54 -100 132 174 21 54 -151 -169 165 -99 237 161 116
4737 116 -13 13 128 23 -458 -151 18 -190 -50 -146 223 -41 31 247 61 -121 -64 29 -189 104 222 -147
4759 -147 103 -67 46 -176 97 -153 -55 207 108 -93 -7 10 -94 100 -199 -179 -216 73 -28 60 -37 -12 169
4782A69jl66K72j54k4J27M7r7N7J10K47l92l16R5J19J40m7K30l40J35j52L30k31
4805d2J92k98J76J55k79j0J95k69M6J32j06L1K6K56l78K6J06J08O2k52J59j53
4827a17J2J00K40l67J56r8K0j03q7N38l04r3J08J04j9q8j62%J87J82k03l9R7j03
4851c9L4P8k18K42j48k90L03K48l1k15l3j53K33o6k8J07J10l39m0K33j00J58m16
4874c70K51J89j04J08l46K36nK97m20K7J24j36J26K2r8J76K1j65j22k2P9r1L47
4897A24Q0j79j07K28j83K1o4r5oM85m63J43Rl4J59Nk41K48q1j40j51M1M44m31
4921a88k9L99k05J41q8j28P19n62Lq7R9N4k25m6M57p5k10j54P5j03q2Q2P3K03
4945A23k45K63n8M7j26O9j80Q6j66L48j8m37L28j02K55p2J98j14m0l0k00k08L39
$$ plain form
4782 169 168 -198 74 -80 -104 23 70 -27 30 140 387 -5 -321 -226 -107 33 -14 216 -124 11 -141 189 -42
4805 -42 150 -148 28 183 -96 -106 89 -180 -134 -2 -108 -77 -51 205 -173 -147 -41 67 129 -123 36 -117
4827 -117 -105 -5 235 -132 24 -74 -54 -157 -244 294 -10 -103 5 109 90 2 -160 -160 27 209 6 -33 64 -39
4851 -39 -5 73 -145 97 -51 -341 -38 210 179 -36 -69 -222 11 -55 -83 24 134 -205 -245 -12 -112 46 -370
4874 -370 -119 70 -34 74 -272 -36 -41 256 -164 -137 -13 -149 -23 -1 -99 77 98 -67 -189 -211 -132 -223 124
4897 124 204 25 -82 146 -37 -16 -80 -175 -181 304 -159 -16 -7 -41 118 123 -118 130 49 -91 -242 -201 243 -188
4921 -188 -217 182 -23 118 30 -98 621 59 62 -25 74 128 -97 -143 314 239 29 -125 -50 -153 -235 -153 -80 123
4945 123 -122 141 83 130 4 73 -107 -21 -187 161 143 -294 34 -68 187 115 313 199 159 129 -71 -279 60
4968F0p2M2J77n43M88L4K6m6J0j62k98J65j35J59n5J95j97J03N8q8qP0o6j40N9
4993a64J13K00o3j07L08k64p9L5J55l57M25n2Orm75N84k69r3J46k24L08Qj95K48
5017A85l20KJ03J83J38n2o3j12l55M13l7r6O5L7o8k96K16j15J76o4k1k40K79K75
5041B33l99J8%K84l22J49n0K87q1Q3j63m8j97M93k96J0M1M5J3k29O5NR4k9O0p6
5067a0Q4J45k27J20j8l37J12L39n53J43M05m52J0J34j65M87j94N2N3O8o3q8J88
5090B33j61j05J59J69j34k22J11n3L24lm27R1n9K34j24K02l97m9K81K2J46j53
5112H5Q1j74K9J03K5Q8lo7q6l09J79K73J23l20j40J82l6J66j01j66Q0J16Q3l70
5136a59J58J9k48L83r4k96J05J96k85K69M0j86L01o06M82j4k41j39J55k8M28j34
$$ plain form
4968 60 -12 30 207 -336 152 186 212 166 176 14 -284 -119 -254 -95 -150 45 -152 -49 9 -79 -87 -17 -83 -223 -164
4993 -164 -51 149 86 -21 287 23 -56 -21 134 -223 202 150 156 147 -328 256 -13 -106 40 -184 124 132 -63 185
5017 185 -135 -133 -30 153 291 239 176 64 -291 122 85 -11 54 91 23 -273 -57 -172 4 -60 -81 -321 -42 233
5041 233 -166 -148 -148 136 -186 -37 -87 200 119 202 39 -9 -206 287 -9 1 42 87 100 -129 -64 -59 35 6 66 -10
5067 -10 74 219 -8 112 94 -243 -131 208 -345 -202 203 -249 -239 -105 -270 217 23 75 128 196 133 45 233
5090 233 72 -33 126 295 161 -61 50 -3 321 318 -109 -18 -77 157 33 235 -162 -211 70 92 238 85
5112 85 166 -8 21 124 149 237 234 167 81 -228 -49 224 347 27 -113 69 33 199 98 -68 12 128 211 -159
5136 -159 -1 18 -230 153 59 -237 -132 64 -221 48 88 -98 203 -403 79 65 -176 -315 -160 -188 240 106
5158A06k82l0K09j05J07m7n0j81K61p2L1L65l46O5K18q3j51J3j73L23m07L12k64
5181a81J11J44j63J57P2j68J44j67J35J3l1J12j19J15r1m2N4j89K06j31K81k27
5203C5K39k98j03N0K59j95q1J19p6L67ml85m1j8k4J94n0K40k93kLn0k26M39N0
5228A49p7j34J29K6p4L28m08L07j24q5pj47K9m4L79n02K54j58L01p8j25O5J24
5251A28j05J72N4N4m44OJ01R6j14k1K08j82L36k15k3j38P9m7J51l28M04k18m5
5274i1J2K86On70M67j04k44J46J25l1J76p8k88K65Q4j7j02J71l43J48L10l14n6
5297d2k19M95l4j09l7o7J12j90J01K14n60M76j95Q0Q8j99N20n25J17j12m1q5K51
5320C9%j30K82j49j6M3p4r8J47q6K0l4L03l46o7K12K5j15P1J29kL9l81K41o3o3
$$ plain form
5158 106 -176 -206 3 -102 5 -42 -92 -273 -12 -84 -53 312 -34 31 249 166 15 28 -145 178 -229 83 -181
5181 -181 -70 74 -89 68 140 -28 116 -51 84 97 66 178 59 174 83 41 95 -94 112 -19 262 35
5203 35 274 -24 -127 -77 182 -13 -94 25 -51 316 312 -73 -114 -132 -156 38 -12 228 -65 -67 -64 -114 -340 99 149
5228 149 72 -62 67 93 19 347 -61 246 122 37 30 -117 -88 -132 247 -255 -1 -159 142 64 -61 4 128
5251 128 23 195 249 303 -141 -135 -34 62 -52 -73 135 -47 289 74 51 -87 -8 -55 96 -232 172 -46 -91
5274 -91 -79 207 213 -357 110 6 -238 -92 33 2 178 100 -188 77 161 144 42 213 -130 18 328 14 -42
5297 -42 -261 234 200 91 54 -13 99 -91 10 224 -336 140 -55 25 113 -86 434 -91 26 -86 -127 -212 39
5320 39 39 -91 191 42 26 69 -5 -103 44 -42 -22 -56 247 -99 -166 46 71 -44 27 156 154 193 -188 53 -10 -73
5346g3k7M16k02k11J89k1k05K55k26P8j45QK64j38J25m0k70J91Q8k78ML18k31
5369a31K47J56l97K51o4k51K66k8j26O27n83j11J9k11N83j27j17J45L8M7J09n12
5391a70N3n4J25k01M58l84L8k04L09l23L64J67k42J31K02m9k86J3m8j7J09K4m1
5414b6m3l33KL67l3Q7J4rJ19j51K06k85K71j56J19Q2k66P9k26M9K5q3P32n52j10
5439a21J84l33K85K37k84n8J15j3K6j70J76j72j7l6M26l33kK77j96j06K39j02
5461B2p8p5J6l1J46M8p3N4o1j44N9jk90L22L41k01k95J85J10j80j70N10l33q2
5485b01N00j90l35J39j76M04k48K26O5l74P4M1Pr8oP5K92k59J02m5k73m7L70m52
5509d09M45K17l28J50j00K6n0J74pJ32l65O8J40l76L51k12K02M7K26k67k26J9
$$ plain form
5346 -73 -100 316 114 -97 92 71 -134 121 -105 -27 -172 -164 100 -38 87 47 -223 -32 56 -222 -218 100 -131
5369 -131 116 272 -125 126 62 -189 77 49 -77 550 -33 -144 -125 -336 247 120 3 148 186 233 342 -170
5391 -170 -117 -171 -46 -247 211 -173 -135 -339 -30 -353 11 178 -64 67 269 220 -66 -53 -101 -118 -9 15 -26
5414 -26 -69 -402 -400 -33 -66 21 35 26 145 -6 200 -85 186 30 149 231 -35 44 -182 -133 -108 -191 541 -11 -121
5439 -121 63 -270 15 252 -32 -90 25 12 38 -132 44 -128 -145 -181 245 -88 -90 187 -9 -115 124 22
5461 22 -56 -131 -115 -146 0 48 -25 29 -32 -176 -117 -118 -408 -86 255 54 -241 -56 54 -126 -296 214 -119 -201
5485 -201 299 109 -226 -87 -263 141 -107 119 184 -190 -116 -75 -68 -166 -172 -97 195 -64 38 -7 -280 -327 43 -409
5509 -409 36 253 -75 75 -25 1 -49 125 118 250 -115 -47 93 -283 68 -144 58 105 331 64 -162 -143
5531a43L38L8k23N3k48L09o4k36K54n2j38J23j65Q8M4p3j4K23J66n20K41N3l1
5554B3k35J34K23J50n09K26mj43J16J9R1j96J30J57j72R8j09J69j24J95q6o6K41
5577C28k27j66J52k0K27l36j11N2j6K36k31J12J28j67j67N2O6R5j8j14L87k87
5599b5r7J44k4j16J87j96K06q8j52K78r8R0j04j21J92L99n14r2O7R5l43L64j39
5622h7M9K34k14j67pJ41m2k24Q1N73l28j16J91j0j28J16r7P4j30Q0k9j26M9J92
5646G5j37P1K54k51P2l98J92MJ05J37j55J07Pp6n8R2l90O77l62J0P4n9k56L99
5670A34j11l5j82K29p5L1j22J82j22K15K62k15j32j63L43j61l7j42j53L29j12
5691c7L0k5J15j14oL0Q8j96J18J44q5r4n5K62k35j59L38l31Q8L53J8l50L45k52
$$ plain form
5531 -143 195 233 10 63 -185 124 60 -176 78 26 -112 11 -154 -66 -22 -95 -109 114 280 -240 1 54 23
5554 23 -212 -78 145 295 -214 12 8 -135 -19 0 91 -105 25 182 10 108 -1 168 44 239 153 87 328
5577 328 101 -65 87 67 294 -42 -153 -101 -117 119 -112 0 128 -39 -206 -154 -88 7 -11 -125 262 -25
5599 -25 -122 22 -2 -118 69 -127 79 -9 -161 117 19 109 5 -116 76 475 -39 -131 -64 31 -312 52 -87
5622 -87 -38 196 -18 -185 -192 -51 -93 -317 -236 337 9 -107 84 74 -54 62 -35 39 -91 -11 -40 -166 -117 75
5646 75 -62 9 263 12 84 -314 -122 -118 -13 124 -31 76 83 7 -51 41 -349 328 -34 -24 50 -9 -265 134
5670 134 23 -12 -194 35 -40 -9 -131 51 -71 144 406 191 59 -104 239 78 41 -101 -254 75 -37
5691 -37 -7 -32 83 -31 -37 -7 81 -115 3 147 62 -32 -87 175 -60 -219 119 -212 -124 229 247 -103 242 -10
5715a0q2J70m0j43J34l9J29J2K3k15J10j39L07J3l12J98j8L0j73j52R6K08k59
5738a52K6j12L43j1n4J42k46j74J27K7M06l97j9O3j55M02J3p1j52j25M16k88M
5761A3n4L12p0k53J30qj79J92m25L00K08l37K97k39J18J5K07l49O9l35L30J93
5783A35mk65Q7M7j9N2J77m67K31J37j24Q9k27K10l43M29k05q7J51N9L4k63o1k
5807b29K04J44r9k54K90j18K19j64j58o9K50k02K15K27l20J30j53J82j88j54K01
5828d6Q2P5j15j79L16j21m0j72J61K71q6m64M78j9j26j4m7l5J11K01l34l0J63
5851C0J69j19k53p8J29K72J25l61q8K60k04M7J66k90j7J85o8j4L71k45J7J7o5
5874a4J15N0n9j68K77k34m3J28l2k16J95m4R6M2m3j36K15o8j89O5K8L89k14l4
$$ plain form
5715 -10 -92 78 38 -105 29 -10 119 131 154 -61 49 -90 217 230 -82 116 98 128 -45 -197 -101 107 -152
5738 -152 -126 -238 105 94 40 182 -64 -238 -111 -84 322 -75 -94 -31 -186 216 229 158 6 -119 297 9 13
5761 13 -41 271 201 -52 78 70 -109 83 -342 -42 166 -171 126 -113 5 20 227 -122 -53 -388 -58 135
5783 135 131 -134 -47 0 -19 33 210 -257 -26 111 -13 76 -151 59 -284 145 -60 -147 4 63 97 -166 -227 -229
5807 -229 -25 119 20 -234 56 -62 157 -7 -165 -234 16 -186 29 256 -64 66 -87 95 -93 -247 -46
5828 -46 36 111 -4 -183 133 12 -28 -200 -39 232 146 -318 160 141 15 1 -46 -81 30 231 -103 -133 30
5851 30 199 80 -173 -251 -122 150 275 -86 -174 86 -118 -71 95 -195 -212 -27 -95 -109 262 17 34 51 -14
5874 -14 101 151 92 -76 201 -33 -76 52 20 -196 -1 -45 51 93 50 -86 129 61 -128 -63 -35 354 140 106
5898A06n6m2K12k37p1J9L44l94j44L82k79P2J00M2l4K04k54m3r5J47J17N0j81
5921c5L1J3L61n73K35l07M70J03l34N8j75ML28L9k55K95l08Ln5Q0J50l47J36q
5945i1L42k91J78N1Mj58j42L83k23j51J68P4k19J48K47k09%J25l32K96m42R6M95
5968C49n22J84mk12R5o0J10j13J50J35l10j01J61j91L07K24j94k84L60J24j54
5989E4l4k4J00J40l01L07j87m3j45J71%Q5J15k70l7J40j7k90K81l3J66k15K06
6012A69k12L49o50M79k05k03J57J56m6L4m3j68J26J94k57k18J92L18K7r7k66J55
6034iJ69k75K70p2nk63K85j48J74J00k71j07J96j40P2j11L16j39r6J4j3oJ47J7
6058A05l78k40P88l78P6j39K28M26l83j98M35l63K20k27j5J69o4R2o2L6R0j43
$$ plain form
5898 106 50 8 220 -17 -88 -69 275 -119 -263 119 -160 -88 12 54 20 224 -30 -73 -168 -21 96 146 -35
5921 -35 -4 9 370 -203 32 -275 195 298 -36 22 -153 -149 179 218 -37 258 -50 -47 -102 -22 128 -219 -83 -91
5945 -91 251 -40 138 189 193 35 -107 276 53 -98 70 144 -75 73 320 111 111 236 -96 200 -242 -146 349
5968 349 -173 11 7 -205 -110 -170 -60 -173 -23 112 -198 -299 -138 -329 -22 202 8 -276 84 208 54
5989 54 20 -4 96 236 -65 242 55 12 -133 38 38 123 238 -32 -69 71 54 -236 45 12 178 -37 169
6012 169 -43 306 -344 135 -70 -273 -116 40 -6 28 -15 -183 -57 137 -120 -338 -146 172 199 102 -164 -9
6034 -9 160 -115 155 83 78 -185 100 -48 126 226 -45 -152 44 -96 -24 -135 181 42 -54 -40 -53 -59 88 105
6058 105 -273 -513 275 -103 -27 -166 62 488 105 -93 342 -21 199 -28 -43 126 62 154 92 128 218 75
6080G5m35O41p6l92lK76k83K14j56J67j91K74j79P8J56Jkj72r9j88L62k98M10
6103A80l28Q5m5n7P5K15k11Q5M2K8k65J76o0J39J62k79Q0O2j0j24m1K00Q0j74
6127A5L08k30Q2M3l97p3L57k86K49j39J14R9k1j99j30O1K52m41M46q5K25m37j80
6150c67M59l58K55J12j62J84k34k82J84K13Qr5P3J75J91l63N2p7R2k2J2m8l3J1
6174b0K30k05L06m08Q9q4Q7k61L97n4k1O9l15L04rk47j05L43m0j14K66J74l81
6197Al15K69K01l44J57k8J16J12l10J12K74l02J87j24J96k55j64J54r2L53k8j4
6219A56k04j31J9K22Ln7O8J99k10r6J66q1k06j54M44m4j75L05j66k25J70J44k01
6242e4k39K65o0m3J46n4j63M26k74O8m22L56q2M02l82J47J10k74K63j46J51Lm9
$$ plain form
6080 75 -360 281 205 -187 -190 86 -197 17 -139 28 -163 111 -68 10 166 167 165 -7 -106 -294 68 -230 180
6103 180 -148 -63 -108 -165 -90 125 -86 -1 41 69 -196 -20 -80 59 221 -58 22 84 74 -50 -91 109 189 15
6127 15 323 93 175 218 -179 -252 105 -181 68 -71 43 142 121 -78 -208 -147 105 -336 110 25 250 -187 -367
6150 -367 92 -266 -11 101 -61 123 -111 -393 -209 4 12 -83 -10 165 356 -7 45 -32 60 38 50 2 -31 -20
6174 -20 210 5 311 -97 -8 -92 -5 -266 131 77 56 125 -190 114 105 -142 -247 96 56 -58 208 382 1
6197 1 -314 -45 156 -188 -31 -59 57 169 -141 -29 245 -57 130 6 202 -53 -217 -63 -155 198 170 156
6219 156 -48 -179 -160 62 65 8 76 275 65 -31 135 54 -152 -306 138 94 -81 224 58 -167 3 147 -54
6242 -54 -293 -28 -88 -131 15 -39 -202 224 -50 18 -404 -48 -130 272 -110 37 147 -127 136 -10 141 144 95
6265I5k87J70j5K69j3p8j89Ll40N50l01j27M05k64j9Qk7R2J1o5J16l2J87j66%
6290a7K61k37N8Q0k51J47L31p1r1l86Q9L55p23O83j01O8m9k58J04j28J48j16j71
6313b75K07l4J98Q2j87K69k53J7j93P8J09o2j03K73j03j07n4J24k03L14j19K37
6335B15j06j94J61k60L49l46P9l8J50l4O8j18j71M19M7j98K54m84L74j99R5q9
6357b6j30J77j22P5k98K18L37nn06L91J34j36k49K3l1K11j83l1N00j97k67j14
6379b29L58j51L05K4k26l2M8k08q2L87k55k1n2J04j47J09J96j67J13R6l93K30
6401Gp5o6L18k76J22l0r6k81K14M0R4l05M74N6k88L80n96K97L3J05k39l6L03N2
6425B07l08M9J27J89l01j56K29l76L30K4j97J00j46K32l65J84N0N0J67p3R9l1
$$ plain form
6265 95 -192 -22 -37 232 219 141 -48 -45 -385 165 -136 -263 142 -122 -141 -133 -160 -68 -57 -122 -6 -38 149 -17 -17
6290 -17 244 7 65 145 -106 41 372 301 210 -176 -87 268 -455 228 127 195 146 -112 -8 -136 12 -104 -275
6313 -275 -68 -102 96 178 -9 260 7 24 -169 -91 18 -44 -147 126 23 -84 -138 -14 -217 97 -22 215
6335 215 109 -85 76 -184 165 -181 -102 -140 10 -24 44 -74 -245 174 221 23 277 -207 167 -32 63 -26
6357 -26 -156 21 -101 -26 -324 -106 231 226 -280 111 245 109 -140 -117 -148 63 -120 -151 349 152 -115 -229
6379 -229 129 -22 283 307 81 49 97 -111 -193 194 -61 -82 -134 -30 -177 -68 128 -39 74 170 -223 7
6401 7 -68 -134 184 -92 30 0 -96 -377 -163 -123 -29 -334 140 196 -92 288 -308 -11 22 127 -112 -148 155 207
6425 207 -101 -52 75 264 -37 -193 36 -340 -10 14 -183 -83 -229 3 -362 -178 -128 -78 89 16 115 84
6447H4k72K26j92L31M4j20j10J58j89P7j46l17M46j19L2J18l71N53m5k72r4M44
6469B66l6l13o0K8O2m4M2k0ML7j83R8K81k02J95k26n4O9K78k96j57K69J69j31
6493G6j62j19q2p2M93j99j64K09l03J81K52K1P1o7k43J70j29L10k54M8OM6k05
6516a16M8p8K58r1q8J78j91L13Kl29J07Qq4J03o0M9m6jK2j03J79n9r1j94M99l22
6542h7n3J80k00r1L9L35k68r1P7k6O5K28p2ol16O16k54J94m56K29k44J54n7J41
6566C7k33L31m2l81M19r5R7K7j83l09N67j79kk8p4l37N11j54J25m24K61J07J50
6589A91k32K30J25n40K44m4N6J41j04k56k25M33j06r1J04J22j65J18J5J08k22
6610i8R9k39M47j75J8J28j18K6j50O5K00k38j25q7M44k64m4N0q9j9L79j69j7j55
$$ plain form
6447 84 -188 38 -154 177 221 101 -9 149 -40 37 -109 -426 20 -99 -67 51 -320 233 188 -84 -178 266
6469 266 230 -83 -143 -115 -53 -97 -55 -75 -71 -34 -217 -119 162 -40 155 -71 -125 -56 222 -74 -231 38 207 76
6493 76 -86 -205 -287 -359 134 -65 -229 -20 -323 -142 110 131 202 135 -108 62 -67 243 -11 37 43 89 -116
6516 -116 -68 -146 112 21 -67 111 -80 233 235 -94 13 21 -63 40 -20 29 -17 -18 4 -99 80 21 -70 -264 235 -87
6542 -87 -140 40 -160 -251 -212 123 -145 -236 -159 -185 -120 108 36 30 -286 330 76 270 -186 43 -201 -47 -104 37
6566 37 -196 135 93 -288 131 36 133 160 -23 -332 235 56 54 26 -48 -385 126 -28 97 -327 -66 41 191
6589 191 -41 189 314 -226 18 -26 30 171 67 -189 -414 19 -87 -178 -74 48 -117 1 16 124 -98
6610 -98 1 -238 209 34 52 180 62 88 -62 3 203 -35 -160 -247 197 -67 -111 -61 -150 -169 210 41 24 -131
6634a31M8J65O4m43L14O0n1R1K9mP9j80L0K96l46l0j07M2k36L02K33l30L9J72
6658A06m5q4j58p4J95j9J38l73L70k17q2M52j87M0l34K71J98k93o2L71j14m0j27
6681f8J72R2l27R7J65j33Q6k51qQNK62N7p9p3j99K53N3j41M07k62j76%o7J17J43
6707A33m13J62L82j07j23M3l55J74J99N9k02q5j2q3L39l72L92j15J81M4j38j7
6729H6j98K19k53J40K5L31n29J40k8K08k71J93j62J24j63K11N9m67K45Q7N6K4
6751G7q3n5j11K86l7m59N79l31J22k39K68Q2k64K44jp6nk62K91J93Q1l26k82K71
6775c7k6r9L08j73J64j70J3L5r5K52r1j75l8j53K52l55J13K55k49K25rK7J69l8
6799A05k12J08n7Q8N5j72J68l71M42kj34k9j2J8L30Ko5l63J98O1J8l76M3M16l55
$$ plain form
6634 -131 -83 82 146 -297 17 77 26 117 146 142 221 41 71 367 21 -9 -116 -74 -310 -8 225 -105 -66 106
6658 106 61 -23 -181 -255 -60 -79 59 -314 56 -161 -243 209 22 62 -272 -1 197 -96 -158 213 99 59 -68
6681 -68 104 196 -131 -34 131 -2 84 -167 -175 -167 -162 100 157 78 5 -194 59 112 -29 378 116 -60 -60 -127 -10 133
6707 133 -280 -118 264 157 34 77 -278 -104 95 154 -48 -133 -145 -228 111 -261 131 16 197 241 103 86
6729 86 -112 107 -146 -6 19 350 -179 -39 -67 141 -130 63 -99 25 -138 73 132 -335 -90 -3 53 77
6751 77 -6 -61 -172 114 77 -382 197 -134 -12 -251 17 99 -165 79 78 2 -3 -265 26 219 300 -26 -308 -37
6775 -37 -63 -162 146 -27 137 -33 -20 15 -80 172 81 -94 -132 -285 -33 -388 -275 -20 -269 -44 -53 -26 143 105
6799 105 -107 1 -56 32 87 -85 83 -288 154 152 18 -11 -23 -5 325 327 262 -101 97 158 176 -200 -157 259 -96
6824i6j41L81L77n53n6K82k55Jj28p8K85J2l4k61K72NQ1L3j57n5K7J98l44K58
6848E4j2r2J1l8M5l8M52p11L24l3J15q5P5j49o3L3K28j38j69K36j1q7lL08m5l84
6874a77K98M4J67l14K31m47j34N40m61L24J53l15j2J46j28J36k48J73j82J94m5
6895e7r2L03l43K48q7j0K47k93n4m2J51j28L21j55k03L18k67J25J86p3K9j98N8
6918a6J59j28l28L06n4N5k6j95K71N3l19M03J20l54l7J39n4O4k47K83J05j35j33
6941f8Q9p4l93N34l47L64N0k87k25O09N5j21m48L10k8o0jk0Q9l72N08j28J39j01
6965G4m9j49O6J46J14j64j25J29k25j5J0n1M15m28p7R9L17k43L04o4m4o9K1J33
6989A25q6K37l87j31K55L4M2J09k63Qp0L7K13k5P2l60K19l9j78K8K6R4P5M39k08
$$ plain form
6824 -96 -237 144 521 -32 -88 194 -61 -60 -188 -266 19 31 -3 -264 8 13 94 127 -30 -85 -58 140 -204 54
6848 54 42 -50 -39 -77 -32 -70 382 -329 -5 -38 77 -8 67 -82 -145 -112 116 -22 -191 45 34 -53 -56 252 207 -177
6874 -177 121 165 332 18 249 -198 -332 208 -253 71 224 -91 -103 43 -85 51 -197 -24 -206 -12 -57
6895 -57 -149 154 -189 59 -28 -38 209 -84 -138 -180 -29 -157 164 9 -194 124 -143 -18 168 95 124 -74 -16
6918 -16 143 15 -313 -7 -61 -6 -32 -227 44 97 -222 181 301 -53 -90 49 -5 59 -188 95 200 65 -68
6941 -68 21 -53 -446 88 -259 105 155 -132 -357 252 307 186 -262 48 20 -40 -41 -61 28 -344 164 36 175 74
6965 74 25 -124 -58 88 202 38 -87 42 -183 -198 -188 -239 176 -252 -329 -230 87 -156 148 84 40 -29 -8 125
6989 125 39 276 -111 -242 13 47 89 198 -65 -57 -127 -90 123 98 170 -190 29 -10 -188 -160 -134 -40 35 474 266
7014B66k34j61J25M3Pj59m3J48j1L60l74K30M5k0k38j29P7Q6j23M12p0k3k55o3
7038a04q1L10p7j64J68KLN1J68l39M5r5R0RKl1K95j88k03J43R4j55K5k58L89k09
7064a10N1j31M02k26J08k59L6L5N7k0rO8J1k44J63kJ08l08K11l8K0K37R6m03j79
7089c26N63l47Q7kJ94m22L73l10K31J05j29k15L06k05J18m3J06J26k23M7r6L9
7111b3j0L67l77Q1p5M6p8j23J90J29Ok97R2j1KJ99N2n45L35M28m80O0J83j40l7
7136b6J78J11k72J47j21j20mK49j25R1j26o2L39n03J23j3l07M67o5J98m77M16
7158I8k22P5K6J51l3k06K85j20Q6j99L4R5q2k69M82j96k04QJ59j64J14m03O42
7181A57m0k22O8K03p1j24J39j41n01O64j48m2k6r4J30K38m95L86j98n7N5J35k62
$$ plain form
7014 266 32 -129 -4 39 46 -113 -156 -8 -19 341 -33 197 242 222 -16 -145 -68 18 -105 307 237 214 -41 -104
7038 -104 -185 125 48 -116 52 54 57 108 276 -63 -18 -113 -23 -14 -12 -43 252 64 -139 4 98 -57 -32 -290 99 -110
7064 -110 -59 -190 212 -14 94 -165 -129 -94 -37 -57 -66 2 13 -231 -68 -70 38 -270 -59 -97 -77 160 256 -147 -326
7089 -326 237 -110 -23 -25 169 -253 120 -190 41 146 17 -198 108 -97 21 -22 84 210 -13 34 -62 -23
7111 -23 -33 334 -43 38 -37 9 -69 -192 -2 127 133 -164 -72 -83 -81 118 170 -375 -40 388 -92 -32 151 11 -26
7136 -26 152 263 -9 138 17 -103 -107 142 17 108 -18 -80 259 -244 -121 -134 -441 26 -39 159 -318 98
7158 98 -124 -49 -23 128 95 -111 174 54 140 -59 -25 70 -12 -281 201 5 -199 -191 -32 -196 -82 -485 157
7181 157 117 -105 -37 166 95 -29 110 -31 -532 132 -16 -58 -84 -178 -48 190 -305 81 -117 -174 -119 16 -246
7204b46j18L65L9n0P5j50L05j13k89L1K6L78m50J93K08j5m61M18j05m0n17N20
7226DJ28k62L88k82K8q7K54k67L56j37j5l14K64l64N03r3j66O8J90l51j44J03
7248a96J17j9N2J02l15J41k21J31J17j74K43P4r9j0QQ0K94k20o4P5j78J22l75
7271c15M64l16L07l27M05m71K27o0J32p7J84n4j19j11j65L20m8J15k48q4M08k57
7293i0J74J5j23j34n8J9J61k17J21K3k51N47m5l32R1J32kk37K48J63j54k13K70
7316A08j79K62j40P0j3l91J88P7K81m1p3k18j11J06N9J9J36j89J74j78Q2j11L4
7339d8J39j07L7j23r6K31m29K24J44Q9No2K02k60K41k49j9K65k68RJ74L00m52
7362e3J07o4J9l4K16k86K48k02J97l3j50q8R5j93J57j32j56L47q7J84q4J93l11
$$ plain form
7204 -246 -364 1 40 -10 65 -85 220 107 -182 -151 -125 253 -197 -4 204 189 -272 146 41 1 -516 4
7226 4 132 -130 258 -24 4 -83 171 -96 260 123 108 -206 58 -306 197 104 -62 6 196 -155 -299 -196
7248 -196 -79 -98 -46 56 -259 -118 -339 -208 -91 -265 -22 52 -47 -57 -49 31 325 105 41 116 -62 60 -315
7271 -315 149 -167 140 -187 218 -253 -26 -86 46 -31 153 99 -20 -131 -296 24 -24 91 -157 -241 167 -90
7293 -90 84 99 -24 -158 -216 -197 -36 -253 -132 -109 -360 187 142 -190 -99 33 31 -206 42 205 51 -162 108
7316 108 -71 191 51 121 108 -283 -95 -18 263 222 149 -69 -180 -74 -15 4 140 -49 125 -53 29 -82 -48
7339 -48 91 -16 21 -102 -198 33 -396 -172 -28 61 66 4 206 -54 187 -62 -81 184 -84 -75 99 399 -53
7362 -53 54 -10 9 -25 191 -95 153 -49 148 115 -35 -123 -28 -221 -64 -196 -352 -5 -92 92 8 201 -110
7385a10J97L0m05L67J35l99J58R4j05P2j71K19O0k36j33M75k68J4k2m4k12K43
7407d1J39pj48K04l92K67p1J86jl1k78O5L07l75M03p0j51l7J95j80l5J02J06o6
7431I1l82N12k42K13m94q7L92K1j27J64j18p3J3K16j81k52J86L01n7O1k88L06
7453A75r0q9J45P6l7m94L27J1J89k30l6K88j61l59M72n1N7n54N01j63o5L7l2L9
7477d4j2J04L9l68M55o1l82K96K50j58rj65J35N8JJ0o1j14J46j94P6J78r4J82
7501B68j27R8k92K47l39J92l03J83o2J8L06j25j03J99r8o3K32l05Q3J93k74J45
7523G3j44Oj31J81L68m35K1l29O92l75L6K71p1k72J85l61M7J55J46j01J58j64
7545d4Q5j35lJ53j03j2Q6J17q7j84J66Q9j26q4p3o7K44j99J52J46m7J1O5j9m07
$$ plain form
7385 -110 87 117 -288 79 214 -185 -27 67 -38 34 -137 82 142 -94 -227 248 -20 -6 -28 -72 -284 -41
7407 -41 98 91 -57 147 -245 22 -49 137 136 105 -173 -108 199 -176 227 157 6 -31 164 -16 -51 51 157 91
7431 91 -291 221 -21 192 -302 -389 3 24 -103 61 -57 -130 -117 99 -82 -334 -148 153 96 157 -131 175
7453 175 85 -4 141 217 180 -314 13 24 213 -17 -53 235 74 -285 187 136 193 -361 140 -23 -88 -51 -83 -44
7477 -44 -56 48 87 -281 174 113 -269 27 277 119 110 -55 80 138 139 149 88 -26 120 -74 2 180 86 268
7501 268 141 239 -53 194 -145 47 -256 -73 -135 -117 189 64 -39 160 62 -1 231 -74 9 202 -72 73
7523 73 -71 -65 -196 -15 353 -82 -61 -390 302 -73 -37 234 163 -109 76 -285 -238 -83 63 -38 120 -44
7545 -44 41 -94 -97 56 -47 -59 27 144 57 -127 39 128 2 -82 -155 -222 22 -177 -25 121 74 85 150 131 -276
7570b76L18k07j59K54M3L18l59p4K7j4L48l60M86l59l67L12J37j45L6j04M69k13
7592A11k14r1K30J92j64M4j71j59J49J46l11L59n43O55k25Q2j95L26k39j03J08
7613a3P7L05l69l2J76j22k02J48J43N5Jl87J05N7j74J76J30J42m54P8L07n3mj68
7637g8q7J3L11l10M5J84l86M44k87L64J58m00k9N9j64k7M24l10J67j01k26J98
7659c8l9J04O1j49O1j90N46n60M35l18j1o2l4N39k16j87J20J9j55J04o0K17k45
7682e8J58k8q6n5J63j57J0on2N4L2J08j26N0J9J3K5Jj76k5J91m98M63l55M41m82
7708c76M21l63P6J32Q0j05K53k93n2K45l59J58L11o9j72J94l0r9r6L05k1m7k49
7731a56J73Q2m35N93Q9m03P2n7l42L58j46P0J73K51k10k73L22m9m17M33M8k33
$$ plain form
7570 -276 42 -165 -324 -70 -27 291 -68 -142 -115 -129 219 -141 345 -14 -381 -69 68 -77 -41 -145 324 111
7592 111 -103 -194 36 228 64 108 -63 -222 -73 73 -238 121 -422 233 8 90 -105 221 -18 -121 -13
7613 -13 64 369 0 -32 144 22 -180 -32 111 166 167 -220 -115 -58 -232 -56 74 216 -238 -160 147 94 90 -78
7637 -78 -165 -152 159 -151 -106 78 -308 136 -151 213 371 -29 -58 1 -163 -190 234 -76 91 -10 -236 -38
7659 -38 -77 27 88 -61 0 -190 356 -204 231 -87 -98 -160 -194 345 129 -58 62 81 -74 30 -30 187 -58
7682 -58 100 72 -14 -69 94 -63 -53 -59 -111 -57 -25 83 -43 7 26 39 64 65 -111 -136 55 -443 20 -335 106 -376
7708 -376 45 -318 -242 -110 -30 -135 118 -175 -227 18 -341 -183 128 59 -113 81 51 -48 -144 161 140 93 -156
7731 -156 17 99 -336 257 346 -57 15 -42 -384 -26 -172 -102 71 322 112 -161 161 112 -305 128 176 -57
7753e7j3M67l45o4j32L82k07Qp2P1lk35K41p4J77k50K16j73r0k72M14l47K75J29
7777D6L35k60j70j93K61j7N0l6k34M76k35k32J10k4Q1J89j45J95J55m09PJ21r5
7800b4L6j2L67m25K39m12L22J9m0K4n1j17J70l31K09j17K57j98oJ41p5n6J4K23
7824A57k34m1L05k53J11j16p0K03J3l2q6J31K07l27l01R7N30l67M1N3o1m0Q6O4
7848G0N1j76K43k05l04L94K94l76n9j50L33k82j3J00J82O6j97p0M09k46N4j83
7870f5J17j54M6o8n8j50L07l58L60J93k30L4J01n2k1k83K4L41k46J07j38J85j23
7893a31O1r9J23r6K52j17M9P8J49k44l4k06M12k59K3K97k51P4L8j23p6J36K3J10
7917A89q1l17J53J76k33J97n1k22%L24L5p9l27N36k33p6r9K04l3m1j91J73k04
$$ plain form
7753 -57 -70 397 52 -12 -144 238 31 39 -33 38 35 -200 41 -33 144 -106 110 -63 -153 -425 -11 -358 -83 46
7777 46 381 121 -49 -242 19 2 52 16 -218 258 23 -209 -99 -123 -42 147 2 197 352 -57 -50 71 -24
7800 -24 12 0 367 -58 181 -231 91 110 70 94 43 -74 96 -235 -26 -143 114 -84 -90 51 -24 -80 -66 157
7824 157 -77 -118 187 -66 45 -71 -141 62 75 43 -43 88 295 -32 -333 -236 294 -73 -32 21 -40 -80 6 70
7848 70 121 -55 188 -17 -321 73 367 -9 -68 -218 115 -167 -180 -80 102 168 -29 -99 310 64 118 -65
7870 -65 52 -102 -56 -124 -182 -332 -25 -383 -23 170 -60 -26 75 23 2 -281 -257 84 -162 -55 -193 -8 -131
7893 -131 -70 -169 -46 -142 110 -7 42 120 269 25 -9 -215 197 -62 -39 258 7 81 119 -4 -80 56 79 189
7917 189 108 -209 -56 120 -113 84 33 -189 -189 135 170 91 -236 300 67 -9 -108 96 63 22 -169 4 -200
7940b00K20J61l1j95K37k29P4J5J4p7l7j45j99N10m81L08k33M93M0n11K31k28
7962b63K28K52k43M3k17K45J40k84K79j11q0N9P5Nl39M68k68q5J10m3J35j07O9
7985F8L6p6M8l3p4k15K37J95l0j07J14J58k30k40M4K57O8k82k7j02K67J08k88
8008a04J76l59K46L25n13L18k51K9O8J20l6ll7j31J74R9l52K09P9J4N9m33J02
8031b01K70j21m0J2M5J44j41RJ41J79q5k53J38L4j81l9o0K17O2L2j29j23K40m0
8055A10n16K90j27K14J72o3J01m00M4J60p1mK1K73j70m38M10j4l45L79j11J36
8077E1K41l74K41m48N15n24N86m83J41J98k30L37k9m67J66K38l11J75k8j13J9
8098i9J18r1K54j98M5l7j55M85l84R1p9J86k72J63l55K18O0J43j61O8L43n80L55
$$ plain form
7940 -200 20 181 150 -45 192 -37 37 52 66 -11 -48 -193 -392 118 -363 -55 -288 205 245 -266 -35 -263
7962 -263 -35 217 -26 17 -200 45 185 -99 180 69 -11 48 123 128 -211 257 -11 -96 14 -29 106 -1 68
7985 68 104 28 76 43 -31 -246 -9 186 156 49 163 321 91 -149 -105 152 220 -62 -89 -191 76 184 -104
8008 -104 72 -287 -41 284 -229 89 -162 -133 -65 55 19 16 -21 -152 22 121 -231 -22 57 71 130 -303 -201
8031 -201 69 -52 -92 -80 -35 109 -32 -23 118 297 212 -41 97 131 -50 -89 -149 68 130 162 33 -90 150 110
8055 110 -406 -116 -243 -29 143 80 181 -219 -175 -15 -86 -90 -69 204 34 -404 6 -8 -353 26 -85 51
8077 51 292 -82 159 -289 226 -298 288 -195 -54 144 -86 251 222 -245 -79 159 -152 23 -5 -118 -99
8098 -99 19 -72 182 -16 29 -8 -163 322 -62 29 -50 136 -136 27 -328 -110 -50 93 -68 0 343 -237 118
8121A18m84K33J38q3m2M7R7M4j80L16l49P5J15R3O6l51qJ38K0J35k45m8P0O2K17
8146A94m3k17R0R1k50M91j50j94j2L2J03rO6K02m00j00l8L2K59j08j95J34M26
8169D04n47M71k90o2K54n75K37k4L65j62k01M7k03J69J95K7K1k50K13oj47K94
$$ plain form
8121 118 -366 -133 5 -78 -120 -73 24 68 -112 204 -145 -70 45 138 204 -147 -155 -17 3 138 -107 -155 -85 -23 194
8146 194 151 -66 24 115 -135 356 206 12 0 32 135 126 192 394 -6 -106 -144 -112 147 39 -156 -22 404
8169 404 -143 328 38 -24 230 -345 -108 -132 233 71 -130 -83 -286 -117 78 105 126 -124 89 83 -64 230
8191B30
$$ Imaginary data points
##PAGE= N=2
##DATA TABLE= (X++(I..I)), XYDATA
0@%%%%%%%%%%%%%%jRj6J6j6J6j7K2k8L1l3L8m6N2n7O4p2Q3r2J01j16J30j43J59
38H4j76J94k15K38k63K90l23L60l99M44m96N57o29P15q21R54j129J371j723K291
58A324l358O033k3826n7553L8078O8881L0696l7190m8033j2951K5100K2871O764
71A6836k843l091j4576k1937m170L3038L8659m655n0721l8726K0910N7125K5153
84E1002l3706m8092o619L3880K8277n871k0816o327N607q10o731P204K1331O084
98B4413k6468l1281P117M1554K5671k3782m3457r443L3070L1760p091l0110j2030
111b0077J5283J4754n644j0656O532J2684n644k1988o136K4067K5188r661l4958
124a6256j5205K4818L2451j279l0643j8889J5214K4439J17j8922p574J3300R626
$$ plain form
0 0 0 0 0 0 0 0 0 0 0 0 0 0 0 0 -1 8 -8 8 -8 8 -9 13 -15 16 -17 21 -25 27 -30 34 -38 45 -47 54 -62 68 -75 84
38 84 -92 102 -113 125 -138 152 -171 189 -210 234 -262 295 -334 381 -440 514 -615 756 -967 1324
58 1324 -2034 3999 -19827 -77380 -39302 29579 60275 23085 -24948 -37899 -12799 10072 16836
71 16836 13993 10902 -3674 -25611 -29781 3257 41916 37261 -13460 -52186 -31276 25849 51002
84 51002 17296 -30796 -37415 -3535 24742 18871 -1945 -8272 -2665 -3475 -10206 -3002 18329 24413
98 24413 -2055 -33336 -26219 15335 41006 17224 -26233 -35676 -2606 29154 22063 -8047 -20077
111 -20077 -4794 9960 4316 -6340 192 12876 7232 -14756 -20892 3175 28363 18702 -16256
124 -16256 -31461 -6643 25808 24529 -6114 -25003 -9789 14650 14767 -4155 -11729 1571 11197
137A1197j1001j4472P392K1653L761k3147j9722J2322K9283P500k5072k3242Q741
150a4807K7153Q237j9352j7784Q329J8404P2j6603n993J4448J3254r992j9988
163a4622o89K2514J3784j4428k3919j069K4225J4925j3393k2144q7J9866J0484
176A5447j3096j5427N163J7507K287j6836j0479J2695J8241l379k1427r662J7200
189a766J9182m759k2434q259J6342J7186n865j9397m375J6021J1995r655j6901
202a2685K268J7893O991j4694j5700P113J9786M169j7240j5097R035J9422L092
215A4353j7975j1908J0455J6465o34j6883p135J2379J3527n716j6386k834J5506
228C214J1229r510j7182J64J6963J0178j1297j6514K111J6961P076j2504j3301
$$ plain form
137 11197 196 -14276 -6884 14769 18530 -4617 -24339 -12017 17266 24766 -306 -23548 -14807
150 -14807 12346 20583 1231 -16553 -8224 10180 10252 -6351 -12344 2104 15358 5366 -14622
163 -14622 -15311 7203 20987 6559 -17360 -18429 5796 20721 7328 -14816 -14903 4963 15447
176 15447 2351 -13076 -7913 9594 11881 -4955 -15434 -2739 15502 12123 -9304 -18966 -1766
189 -1766 17416 12657 -9777 -18036 -1694 15492 9627 -9770 -14145 1876 13871 4216 -12685
202 -12685 -10417 7476 14467 -227 -15927 -8814 10972 15141 -2099 -17196 -8161 11261 14353
215 14353 -3622 -15530 -5075 11390 10756 -6127 -13262 -883 12644 6928 -9458 -12292 3214
228 3214 14443 4933 -12249 -12085 4878 15056 3759 -12755 -10644 6317 13393 889 -12412
241a2412N113J5744K794j3891j0288Q804J5283j022j5806p762J1693J4300l822
254H728j6476n474J3250J2748n716j5950k606J4001R882q525j3750Q90J4189O899
268A2090j0974j2275L866J5520L322j2965j0972P062J4625J296j3639r113R136
281c021J3219j282j3940n977J0489J1425m502j3357k703J1547R459o828j3300
294h771r5J3185P194r402j1628K205J2973M827j0209j0274M425J2778K180j1054
308a666q523P002J1757p96j1800n903Q782J0496k819j1997m055J0092R053m688
322D935j1926j638J1195P081o284j1160Q73J1190N107q465r827L373J1286L235
336H975j0076q131N179J1028N32j0371o603P171J0218j302j1058m275Q147Q949
$$ plain form
241 -12412 -7299 8445 11239 -2652 -12940 -4136 11147 10125 -5681 -13443 -1750 12550 8728
254 8728 -7748 -13222 28 12776 7060 -8890 -11496 2505 12387 3862 -9888 -8998 5191 12090
268 12090 1116 -11159 -7293 8227 11549 -1416 -12388 -5326 9299 10595 -3044 -12157 -3021
281 -3021 10198 8916 -5024 -11001 -512 10913 6411 -6946 -9649 1898 11357 4529 -8771
294 -8771 -8866 4319 11513 2111 -9517 -7312 5661 10488 279 -9995 -5570 7208 9388 -1666
308 -1666 -10189 -3187 8570 7774 -4026 -9929 -1147 9349 6530 -5467 -9522 570 9623 4935
322 4935 -6991 -8629 2566 9647 3363 -7797 -6924 4266 9373 908 -8919 -5546 5740 8975
336 8975 -1101 -9232 -4053 6975 7507 -2864 -9467 -2296 7922 6620 -4438 -8713 -566 8383
350H383l413j0661k094R031P032n191r730m05J0077N232p047q603J903R685L499
365G698p784p690L500R270J747q449o113N103Q746k33q986m330O463P883k189
380D636r077k840P655O586l828q526r46Q101N136n004p989R56Q307L585o381o791
396f420K339Q336J980p320n738L927P827M96p726m412N335O854j096p504l384
411f506O067O431k212q208j195O631N214m002o997j45P077L657m368o965J656
426c865P171K101n535n562K501O896J455o627m051L641O206j48o758l066M844
441g97O031k100o595j517N326M925k977n910q82O132L378l516n821R96N883K663
457E219m873m736J492O100J430n198m188K740N884K01n330l524L878N269j085
$$ plain form
350 8383 4970 -5691 -7785 1246 8278 3087 -6643 -7048 3029 8261 1214 -7389 -5486 4199 7698
365 7698 -86 -7776 -4276 4994 6741 -1708 -7821 -2718 6028 5795 -3191 -7521 -1058 6825 4636
380 4636 -4441 -7281 374 6960 3132 -5394 -6340 1761 6897 1893 -6096 -5140 3167 6752 371 -6420
396 -6420 -4081 4255 6235 -1085 -6823 -2896 4931 5427 -2299 -6711 -1376 5478 4382 -3122 -6506
411 -6506 -439 5992 3780 -4428 -5623 1008 6222 2220 -4777 -4922 2155 5812 1444 -5521 -3865
426 -3865 3306 5407 -128 -5690 -3189 3707 5162 -1465 -5516 -1875 4331 4183 -2575 -5641 -797
441 -797 5234 3134 -3461 -4978 348 5273 2296 -3614 -4496 1636 5014 1498 -4323 -3327 2556 5219
457 5219 346 -4390 -2898 3202 4632 -566 -4754 -2014 3870 4071 -1259 -4783 -905 4364 3279
472C279n663j787M118M419j888n351p43M606L379k739n022l5M839K914l630m422
488c726J292M789J600l944l989K276M519P87m620k766K856M258P6m768k314L489
504a85L652q44m757j306M114L164j968m469l61M059K293k474l718K55M210J849
520C514l257l510J181M147J083l456k687J964L318K99l652j863K260L448o87l416
536a314j325K545L017j264l715p38L212K271j979k950j03L248J922k702k929Q68
552a936L533O30k492k494J284L389L61k890k405K123K858j29l045j696K595K268
568A954o62k759l28J890K140j310k962K01K546J348j506k732O24K563Q73j733
584A47k086N53K512R31k334j657Q54K554J45k256j340J539K016n30k026j027J967
$$ plain form
472 3279 -2384 -4171 -53 4366 2478 -2873 -3616 990 4369 1630 -3392 -3427 1412 4326 696 -3726
488 -3726 -2434 2355 3955 11 -3978 -1702 2817 3604 -1016 -3782 -926 3332 3408 -1360 -3674 -185
504 -185 3467 2623 -2134 -3440 674 3838 1870 -2599 -2960 1099 3392 918 -2800 -2545 1665 3514
520 3514 257 -3253 -2072 2075 3158 -298 -2985 -1021 2297 2596 -1056 -2919 -659 2789 2102 -1314
536 -1314 -2639 -94 2923 1659 -2056 -2794 418 2689 710 -2240 -2343 905 2827 125 -2804 -1936
552 -1936 1597 2227 -265 -2759 -1475 1914 2275 -615 -3020 -897 1961 1832 -1213 -2909 -314 1954
568 1954 1292 -1467 -1795 95 2235 925 -2037 -1836 710 2058 552 -2180 -1556 1007 1880 147
584 147 -1939 -1386 1126 2057 -277 -1934 -1080 1474 1619 -637 -1977 -438 1578 1048 -978 -2005 -38
601c8J947j087k235j54J532J884j198k400J64K431O18j117j930M65J943Q03j955
618c27j224R87J676K50j585j243R02K204m04k178n20J411J468o01j423q14J502
635H1J175n62j623l72J771R69j112j380r0K056O72j213j515K75J784K94j361r82
653a133N41J428J74j013j333R74J583m39j328k28J021R09n82j272j68J014R12
670A060n92j111r7R75R52p74j265K34R79O82q43q70L93P68K09q62p36R19N52J64
690G37j183k85O01R50nr76l32P45L92m42m98l90Q76M42k85q70k64Q72L24k65q18
711f74Q3J065Q7p33m96M04Q59l02m03o51O61O66j46p04l66M39O67K0q11J70O4
732a01M66l37k93j56L82M10k81r11L83N27M16m62o04K04M88j22m8n39N26K08j44
$$ plain form
601 -38 1909 822 -1413 -1567 -35 1849 651 -1749 -1585 846 1464 347 -1583 -1118 825 1628 -327
618 -327 -1551 -564 1112 1362 -223 -1466 -564 1640 1236 -942 -1462 -51 1417 816 -607 -1421 81
635 81 1256 694 -929 -1301 470 1439 327 -1053 -1143 913 1585 372 -1143 -868 916 1210 -151 -1133
653 -1133 -592 836 1010 -3 -1336 -362 1221 782 -546 -774 247 1156 574 -698 -866 148 1060
670 1060 468 -643 -740 235 1187 413 -852 -618 361 1043 200 -670 -277 491 700 -162 -898 21 573 737
690 737 -446 -731 -130 820 815 -161 -493 252 644 202 -296 -686 190 632 347 -523 -787 85 409 144 -674
711 -674 -591 474 561 -172 -668 -264 595 293 -110 -761 -100 566 420 -284 -650 -211 456 476 -335 -165 -101
732 -101 365 28 -265 -421 -39 371 90 -821 -438 89 505 43 -561 -357 131 9 -39 -578 -52 156 12
753A2j13j71K46J72j7k49QQ9K92n5n72NJ37L72k29l18J22P1M96l69k06l0O14R5
777D02k36n63J79n1O07m10k28J51K11J54l06q7j18J44M98k51k56K7L38J14k58
798F1l35K17r5K16k43L9K42Pj39K27j98J00J71l2j77j98R0K82Qk97l1k4M75n53
822a87nM04J62l8k18o5j1p9K90k9l52p6K25L0j95J49n5L47l84K0L14k96K23K16
846C90m91K34r0l6K41l06J9j42M95k16j62p6J2L53j31l44J32j64K74m9K00l9j86
869h2K40j26j61P1J53J43k35r7n2K44J76j94k7q5J37l38M2K26R1l6p1j82Q7q4
893a60J74J2o2l0M1J78J0N0j56M9Qn7k08N4P3LO9k86J94r8L33n2j26k35K82q1
919b1pJ01l84M40p0k87k4j46M40k64k12L45k6L69r9m43J26J75j40r6M2r1L9L59
$$ plain form
753 12 -101 -272 -26 146 129 -120 -112 -23 269 214 -358 -353 -216 156 -73 -391 -269 -198 298 -71 -277 -307 307 402
777 402 166 -397 -218 -269 338 -72 -300 -149 62 216 -90 -177 -295 -151 347 96 -160 -133 205 319 61
798 61 -274 -57 -152 64 -179 -140 102 109 -30 197 -1 99 270 238 61 -137 -47 235 243 -54 -85 -109 366 -187
822 -187 -192 212 374 336 118 53 42 -37 253 224 -128 -204 21 51 -144 5 -50 297 -87 -67 247 -49 174 390
846 390 -101 133 43 7 248 -58 -39 -181 314 98 -64 -140 -128 225 94 -250 -118 -282 -8 -57 143 104 -82
869 -82 158 32 -129 -58 95 238 3 -94 -146 98 274 80 53 -32 105 -233 -191 35 126 90 19 -163 -76 -160
893 -160 14 26 -36 -66 -25 153 163 213 57 106 114 57 -151 -97 -24 -21 48 -238 -44 -142 191 139 13 -222 60 -21
919 -21 -28 73 -311 129 59 -228 -252 -398 42 -222 -434 -89 -115 254 155 -288 -162 13 -127 -223 -181 -272 -233 126
943A26J12j52k74J42P1m30L05J31lm9j01J40oP4k93r1K40rL94l97K9n5J81k85
967b00k2L76q7J19J2j85J05j68j44N93k52k68L0K10Nk06pK56M8j37Q7k46j1J68
991G6o1l3J82Nq7j59L98o42K74l7J50O5k88K19Jk2j42L94k0j89J41j90n1J10K
1016I6j58J76R2j9Mj77or9J80o3j64L83k88R4L2R1k93K42n0k30L4L05j97J00J03
1041A88l04Q8j93L70k81j10M34j41k32J04L6J52K66k03J56n98N07j64k9j73L03
1062A76K70j14m79J41J33J93k82k57J38n8Q7j0N4l9J39k19J94l19M52J7k47N8
1084B8j30K51k28L23j31m36LJ80o2J55j33P7J93M6k24l9L2L15l00K3J52l7n4Q4
1108H8j80J03J20k70R5j22l9M89j63n05K71rK58n5m61O48l02K05o6r4j43K99j10
$$ plain form
943 126 238 86 -188 -46 25 -405 -100 31 28 -21 -122 18 12 86 -207 -298 -58 -67 327 -70 -41 -96 85 -200
967 -200 -222 154 67 186 198 13 118 -50 -194 399 147 -121 -91 119 124 -82 -89 167 215 78 165 -81 -92 76
991 76 15 -18 164 169 82 -77 321 -321 -47 -84 66 131 -157 62 63 41 -101 293 273 84 225 35 -16 94 96
1016 96 -62 114 206 187 191 14 8 -91 89 26 -138 245 -43 51 83 174 -119 123 73 -157 -123 182 -15 85 188
1041 188 -116 -28 -221 149 -132 -242 192 51 -181 -77 -41 111 377 174 330 -268 239 75 46 -127 176
1062 176 446 332 -147 -6 127 320 38 -219 -81 -139 -52 -62 -8 -47 92 -127 67 -252 200 217 -30 28
1084 28 -102 149 -79 244 113 -323 -320 -140 -202 -47 -180 -103 90 136 -88 -127 -95 220 -80 -57 95 58 4 88
1108 88 -92 11 131 -139 -44 -166 -205 284 121 -384 -113 -122 136 81 -380 268 -34 171 105 11 -132 167 57
1131E7l6k54n5K20J16j49o1P4P3K72j83k49J71j46pj28K9J46K35k46j00J8J02
1154a01N42n26M4j07J40K7J74k45OMr1K70k16J5K25k10j21jK70J34l00J19k25
1177a73j04M16K31j84l41K01j10L57k75j30L47R3l58j95K24K03P4j93k46P4K98
1198B09J14l04K5j91K70J5k16l70K24L68k83n5K51j13J93j4p2P0k54M89k00j91
1220c5k85N28N9l87rO8o3L43j38l33J85j18J62j60L8L70K82l50k97m4J9K39M0
1243A14l57k28M98L08j92j39j15K77j17j6k05q5L80n1J9k84J41M72m03k8k79L11
1265B1L76l26j46j52R1M4j99J47j71J57K18k41j34L95p8K94l34k17Q8L87j65k64
1287b09k15M03J39l59J40m64O67J04k01N9k52L6K67j37m9O1q5jL3l78L13M41p6
$$ plain form
1131 57 21 -233 -288 -68 48 -101 -162 -88 -15 257 74 -175 -4 -150 -157 -285 -256 -110 125 -121 -221 -203 -101
1154 -101 441 -85 -41 -148 -8 19 193 -52 -46 -42 -133 137 -79 -64 161 -49 -170 -171 99 233 -67 52 -173
1177 -173 -277 139 370 186 -155 46 -64 293 18 -112 235 328 -30 -225 -1 202 276 83 -163 -89 209
1198 209 323 19 44 -147 123 138 -78 -448 -224 144 -139 -194 57 -56 137 123 51 121 -133 356 156 -35
1220 -35 -320 208 267 -120 -129 -61 -124 219 81 -252 -67 -185 -23 -183 -145 225 507 157 -140 -184 -165 74 114
1243 114 -243 -471 27 335 143 4 -111 166 49 33 -172 -257 123 72 91 -193 -52 420 17 -11 -290 21
1265 21 397 71 -75 -227 -136 -92 -291 -144 -315 -158 60 -181 -315 80 2 296 -38 -255 -167 220 55 -209
1287 -209 -424 -21 118 -241 -101 -565 102 206 5 64 -188 -152 115 -22 -71 -10 -95 -96 -63 -441 -128 313 237
1310B37j66n12M93J73q9k61n5K75J44J41l93k14J65J55K43l38M5k86L36K46j66
1331A73l18M77m17J24M1j75L37j43k30o8k92N77K38m04k8K58j18q1J46m65O52
1352B84k59P9j51j5k51L84J02j45j0J97R0l62O1j11J5J78K6k21k48M04k9p9l46
1375d07L37K07J36l96l2R5K13k2k63m9J17L78l50k72P9L95j0m6j35l6p6K27k21
1398a31p4K09N7L56m47k32Q8J34K43k65j96K36P1mj13O5n3K87k07p6k49l8O08
1421B69j49Rl36j40N22J26k47j37P6K60m10J68R1k95L01r8l29M68L3j67l31J27
1443a89M15Q5K3m92Q1kL65l2k76k78K53p7J67m87M08J47M32m20j60j43L48Nr2
1466H1Q6j52n4J62j75j22k61M93N9j71L09l21O3J8J98j64j73K62j39l23J74q0
$$ plain form
1310 237 71 -441 52 225 136 -125 -180 95 239 380 -13 -227 -62 93 336 -2 43 -243 93 339 173
1331 173 -145 332 -85 39 80 -95 242 99 -131 -199 -491 86 324 -80 -108 150 32 -49 97 -368 284
1352 284 25 104 -47 -62 -313 71 173 28 18 215 305 -57 4 -107 -92 86 112 -109 -357 47 18 -61 -407
1375 -407 -70 137 273 -123 -155 -60 153 131 -132 -181 -64 314 -36 -308 -229 166 156 110 -25 -61 -137 90 -131
1398 -131 -205 4 61 417 -30 -262 -174 -40 203 -62 -258 -22 49 45 -68 -3 -56 231 24 -52 -301 -339 269
1421 269 120 129 -207 -347 175 301 54 -83 -7 253 -157 11 102 -193 108 10 -319 149 182 15 -316 -189
1443 -189 226 311 334 -158 -77 -79 286 254 -22 -300 -47 -124 43 -444 -36 111 543 123 -37 -180 168 173 81
1466 81 167 15 -39 123 -52 -174 -435 58 117 -54 255 -66 -3 15 213 49 -124 138 -1 -324 -150 -230
1488b30K38q5O8L0m4R0m7n2K0K37Pk29j44j81N87k79k7k23J01N72k35k86j12K31
1512GJ62k28jj77K74q8M5k1l00K72K99j14k50L8N96l83l38m2L11N9j06m5j60L6
1536a54N5Qj5K26j40K62p2l24Q2n6J47l38M94j40N2j9j58q4L59k02K61k48j67
1559a71K46l3R2k05k65L82L29l27J72l78Q9K50j13j2j1J89k73q6J04L50l33J13
1581A09j54MJ82Q0j39Q3j71m3O2j45MK44j28J94j61l03M55j85M7k52PJ39K65P0
1605B64n14L32j80J10K79k88rK62o1l1k54j32K45j23J28P2n05L47l4J57M4P2k52
1628g1Q0J17J38k90L78l55j13L25l24j9l1K69k57L77m32K03J28k44L15k01R1j30
1650d6j44j36M87j32j14l6L36l35J9J01P2K87k50k17%K85k65M69n27J4M5j28J45
$$ plain form
1488 -230 8 -77 -9 21 -23 67 20 -32 -12 225 232 3 -141 -322 265 -14 -41 -264 -163 409 174 -112 -224 7
1512 7 169 -59 -60 -237 37 -51 -6 -27 -327 -55 244 130 -120 -82 514 131 -207 -249 62 121 15 -30 -190 -154
1536 -154 -99 -91 -106 120 -20 242 170 -154 -72 -128 19 -319 175 35 87 68 -90 -174 185 -17 244 -4 -171
1559 -171 75 42 134 -71 -336 46 375 48 220 -158 -69 181 68 56 45 234 -39 -125 -21 329 -4 109
1581 109 -45 -41 141 221 82 165 -6 -49 13 -132 -128 116 -12 182 21 -282 173 -12 35 -217 -210 -71 194 264
1605 264 -250 82 -98 12 291 3 -6 256 195 164 -90 -222 23 -100 28 100 -405 -58 -92 65 109 181 -71
1628 -71 9 126 264 -26 352 -3 -116 209 -115 -134 -165 104 -153 224 -208 -5 123 -121 194 -7 84 -46
1650 -46 -190 -326 161 29 -85 -121 215 -120 -101 0 72 359 109 -108 -108 177 -88 381 -146 -132 -87 -215 -70
1673g0j12J32j58J11K03j36j8j46L44k99K46k05l9J95J1J97J1o3k41J77k16K05
1695A29j77k22M1L22Q5L5l99J00J7J7J1Q1P5PN0j88J93m6k30J17N3M3k81L75j55
1720E3l84M15j26k5R2j3j18N4k30M48J4l58N1L01l32J62N7K32k20q9LJ46l70J14
1744a23K41j24j4q6J58J6j4k84N7N9J14j93J98j6J52l52j25L72n8m9k20M32P8
1767B19k78P5M8j35P1J93k72P2l3j80L77o0Lj50j13N3N2J6P8n9Q0m7L00m00j4
1792a04k7J08j99m8N20j58p6k08L03j62K86k76R7M1n6J06k26l2K36J2j62J54M9
1815A78O8j45k32j6N6K46j91J14J49l42O2k49RM62l15J44m0j07K21N2j44O1Q8
1838A29j00O8J30m64M4L8K85j69L4K8r2j23P4Q0jj15J73k27J74k23j00M53r3J71
$$ plain form
1673 -70 -182 -50 -208 -97 106 -30 -48 -194 150 -149 97 -108 -147 48 59 256 267 204 -37 140 -76 129
1695 129 -48 -270 -229 93 178 213 -186 -86 -69 -52 -41 40 115 122 172 -16 177 131 -99 18 71 114 -167 208 53
1720 53 -331 84 -42 -67 25 12 -106 -52 -282 166 180 -178 -127 174 -158 4 61 293 73 -16 -13 133 -237 -123
1744 -123 118 -6 -20 -106 52 68 54 -230 -173 -114 0 -193 5 -11 141 -211 -336 36 -22 -71 -291 141 219
1767 219 -59 16 64 -71 0 193 -79 -7 -40 -220 157 97 100 -50 -163 -110 -58 -42 36 -23 57 10 310 -90 -104
1792 -104 -131 -23 -222 -270 250 92 16 -192 111 -51 235 -41 56 97 41 147 -79 -111 125 137 -25 129 178
1815 178 246 101 -131 -147 -91 155 -36 78 227 -115 -53 -302 -293 169 -146 -2 -42 -149 72 124 -20 41 129
1838 129 29 97 227 -237 -193 -155 130 -39 -5 23 -69 -192 -118 -38 -39 -154 19 -208 -34 -257 -357 96 3 174
1862A74l45K3J44Q9j27J13l35J93N6J18p7j59L14K04n62K9L47j70K5l24L90l37
1884b17J02J26j25m8j36N18l33K56j52J51k30Q8J86j36j0j07J60l7K7p7j23l7
1906a54J39j59K88j80j66M20m9l43J76j09K70n8l9k1j51O7r9J55j0J29m15K41
1928f8j81L38Mk40J4J70j69K97j61r2J67O3k6o0j63J63j32l20K83J12K5J16l48
1951b08m5K31J66k33K05j90j33L08j42J64l72O25p5j00m01M28k13k38l5J07L16
1972A65k76K74k74J39k41K13j71K99j31j57J31O0k21L31j55J69K03l14j74Q5l06
1993c51M97R4n24M43l87M40k30L8J35r4l47P5L0J63m0K13j07k13K21p3n4p6L6
2016a11L4Q9l55L15R0om5L2J28o2j11j7Mk94K98L19j14m9m53K89J78Pn5ko4j48
$$ plain form
1862 174 -171 -148 -4 85 -42 71 -264 -71 -15 103 26 -133 181 385 -177 -148 199 29 54 -270 120 -217
1884 -217 -115 11 -114 -162 -298 220 -113 143 -9 142 -88 0 186 50 40 -67 93 56 83 6 -117 -154
1906 -154 -15 -174 114 -66 -232 188 139 -204 -28 -137 133 75 36 15 -136 -69 -168 -13 -23 106 -309 -68
1928 -68 -249 89 93 -147 -133 37 -132 165 4 -88 79 142 116 56 -107 56 -76 -396 -113 -1 24 140 -208
1951 -208 -253 -22 144 -89 116 -74 -207 101 -41 123 -249 376 301 201 -200 228 15 -223 -258 -151 165
1972 165 -111 163 -111 28 -213 0 -171 128 -3 -160 -29 31 -190 141 -14 155 358 44 -130 -45 -351
1993 -351 146 240 -284 159 -228 212 -18 20 155 61 -286 -211 -181 -18 -58 155 48 -165 56 -17 -71 -147 -111
2016 -111 -77 12 -343 -28 62 56 11 43 171 109 -2 -19 -15 -309 -11 308 194 145 -308 -19 159 166 111 109 45 -103
2042a03M8j41K68J21k18m77M96Q2k71K93k30rK65lK16j32M3Q4l07%p0KmM02k76
2067G9Nk29J07K28l18o7J7M27J19m52K1n1L75K36p04K39k40K37j18j66N1M73l11
2090d2J45k89M1K61jj94O4k29J85J77j87K45l87L87k2J36n03mK14K02k00j78j02
2113b81N47k67p3J04k0j54K5J52N7o6J72k18k8j96M26J4k60P3m55N15L2j91j63
2136b55R7J72L19j48k77K33r0O1j18J70j2k8j07m2j79P9P5J82l25Q8L60l48O8
2159b5l74J37L71J08n77K49O1J21j79J30J4j6K48j67r8m4J81j84J21l17J44j22
2181b18L98r0l71K13l4K55On65K32K48M43p38QJ22K62J54k60o6J52K4j38l8j77
2204a78J81K43k07k22J77p1K9J96j11j18J37J8o8l89O21k66L78l87J34l95N35
$$ plain form
2042 -103 -55 -196 72 193 -25 -502 -6 76 -195 98 -132 -141 124 121 337 205 248 332 25 25 -45 -43 -47 355 79
2067 79 84 -145 -38 190 -128 -195 -178 249 368 -84 -63 -114 261 497 -207 32 -208 29 -89 -255 -204 269 -42
2090 -42 103 -186 -145 116 115 -79 -15 -244 -59 118 -69 176 -211 176 154 290 -213 -217 -3 199 -1 -179 -281
2113 -281 266 -1 -74 30 10 -144 -119 33 90 24 196 -22 -50 -246 180 194 -66 7 -448 67 99 -92 -255
2136 -255 -158 14 333 185 -92 141 51 112 -6 164 152 124 17 -25 -204 -125 -50 132 -193 -105 255 -93 -25
2159 -25 -399 -262 109 217 -360 -111 -50 71 -108 22 36 20 268 101 3 -41 140 -44 77 -240 -96 -218
2181 -218 180 90 -281 -68 -102 153 159 -406 -174 74 517 -221 -213 -91 171 325 65 -1 151 175 37 -1 -178
2204 -178 3 246 39 -183 -6 -77 -48 148 37 -81 56 74 6 -383 238 -28 350 -37 97 -298 237
2225B37j63q9j70J84O1J91l13k93O3K92j7j61j61L46L54n36J54j90K39J96J91
2246D15n40L1K84L19n57K5j60K75J69m50p7J44J84K81m68k90K32J77R4l20p1K72
2268c1J08K60l83j07n2J14j54KQ9M20J21l61j82k26N66j77K10k91l02L60J80l1
2290A33l22J4L94r2l9m63M77J19l92P9J24J96ol92R2p5K95J5j7k28j25J55K30
2313A72k70j36j36M41J94l83n9J81M23j62j44n25L69J9K25l52l7R3N0K88l35L7
2335d7K95J56o93K76R0J0K73m05M7l25M75k00l0q5J58N9K18l81n2L3J38q4l0k28
2359c32L17m6J37m42M63M4m8l75L22k48MK98N6q2l48L80j67K99m80K94J58Jj81
2382B4k85N3N78l13M0l47J78L13k18p9k20J8N05k14m63M41K5Mj50J13m18N74K58
$$ plain form
2225 237 74 -15 -185 -1 60 251 -62 -355 -292 0 -17 -178 -339 7 361 -175 -21 -211 28 224 415
2246 415 -125 -94 190 509 -48 -23 -183 92 261 -189 -266 -122 62 343 -125 -415 -183 -6 88 -232 -303 -31
2268 -31 77 337 -46 -153 -205 -91 -245 -243 -154 266 387 26 -156 -382 184 7 217 -74 -376 -16 164 133
2290 133 -189 -175 219 127 88 -375 102 221 -171 -92 32 228 222 -170 -78 -153 142 157 140 -88 -213 -58 172
2313 172 -98 -234 -370 71 265 -118 -177 4 427 265 121 -404 -35 -16 209 -143 -180 -87 -37 251 -84 -47
2335 -47 248 404 -289 -13 77 87 360 -45 2 -323 152 -48 -78 -163 -5 54 272 -109 -161 -128 10 -74 -104 -332
2359 -332 -15 -61 76 -366 97 141 93 -282 40 -208 -204 94 150 68 -280 100 -67 232 -248 46 204 205 24
2382 24 -261 -208 370 57 97 -250 -72 241 23 -56 -276 -258 247 33 -430 11 36 40 -110 3 -415 159 417
2405D17k34l20PL95j50p8k79j11R05k46m02j2J95K8J7o2J42k36J78L57n04j23
2427a16p3N34o2l07j47L08J29k06l29j62J88M22m9l99L9L97O0k99j1J29j09K42
2449A79r9k44J28L38l11j6j1q5L61J26p16M8M67N3j32k78J58K09j15j86o3O4J34
2472IJ90k14k81L51K50m93P0k05J05K23l5N0k14K28J89j28j1l20j9N69j57m54
2494b97J47j67M29j83l7k25O00j82l94j16O47O0k45j00l32N30L14k6n37p9J83
2515a0K24o3m58M2L41K41j61k55o5K55K0K06m71J03K51j4j36l07l13P85O6m96
2537b15J75l9M37M3m31l72L48J07q4l73K68nM05l73j94J74K18j47J33k1k25L78
2559B07K21j24o12L21J76k0L4k39j21K92j4l48J60J41o4J21j34j47J39L78m92
$$ plain form
2405 417 183 -137 -130 265 115 37 -242 -353 552 306 -96 -108 87 115 132 70 212 -24 154 511 7 -116
2427 -116 -189 345 283 -24 -171 137 266 60 -269 -431 -243 179 130 -269 -230 167 227 -72 -83 46 -63 179
2449 179 80 -164 -36 302 -9 -25 -36 -121 240 366 -350 -302 165 218 86 -192 -34 175 60 -126 -189 -125 9
2472 9 199 -15 -296 55 305 -188 -118 -323 -218 5 -30 20 -194 34 223 95 84 -236 -255 314 157 -297
2494 -297 -150 -317 112 -71 -108 -333 267 85 -309 -425 222 282 37 -63 -395 135 449 423 -114 -193 -10
2515 -10 214 151 -307 -265 76 317 156 -99 -164 91 111 317 -154 -51 200 186 50 -257 -570 215 281 -215
2537 -215 -40 -79 358 401 -30 -402 -54 53 -31 -404 -136 -141 264 -109 -303 -129 89 -58 75 54 -171 207
2559 207 428 304 -308 13 189 169 203 -36 -157 135 121 -227 -67 74 10 131 -3 -150 -11 367 -125
2580a25l3J65K06J09k17l27J67J13OLm40J23L74L30n13k61J93K79K8K58n22J57
2602G3J35p1m7k16k1K69M0n31J69J90K05j83j45r8K05J81K05n05lQ4J95Lk74r4
2626b34L71qO5l23j9L40k3k94r7L11j88J88Q5m16J67J06P3k77P4K32k33Q3m29
2649d46K50L07K12k76k02j86J89J78j55j75J79J36K43k83J81k43L76j40l73J01
2669a27p5P19l75l08k53M04Q2j17P9p8K00J89m91L01n29L96K36k27J05k08J31
2690E4J3K6l10M9L70k40M3k45n5J45N1K34k39j95L91Mj88l00N06j35K35m00j14
2713c00K99J51q5j75O2J47m9k33J09j19L21M05n60j60j28L12L6j45j83N6M17N6
2735B34k31j6J8j2J79j07j24QK71j52j69j35J85K65j12p49M23M33k07J25m52M32
$$ plain form
2580 -125 -158 7 213 322 105 -222 -55 58 64 67 -373 -250 124 454 -59 -320 -127 152 180 438 -84 73
2602 73 208 137 90 -126 -147 122 162 -369 -200 -10 195 12 -133 -231 -26 155 360 -145 -148 -64 131 134 -140 -234
2626 -234 137 129 194 -129 -148 192 169 -125 -222 89 -99 89 174 -242 -75 31 104 -173 -99 133 -100 -17 -446
2649 -446 -196 111 323 47 -155 -341 -152 26 -129 -304 -125 11 254 -29 152 -91 285 145 -228 -127
2669 -127 -202 517 142 -166 -419 -15 67 -50 29 -49 151 340 -151 150 -379 17 253 26 131 -77 54
2690 54 67 93 -217 -168 202 -38 5 -240 -295 -150 -99 135 -104 -299 92 96 -92 -392 114 -21 214 -186 -300
2713 -300 -1 150 65 -110 -48 99 50 -183 -74 -193 128 533 -27 -187 -315 -3 33 -112 -295 -239 178 234
2735 234 3 -13 5 -7 172 65 -59 -51 220 68 -101 -236 -51 214 102 -647 -224 209 2 127 -325 107
2757A07N0N6k12j49K99j7j7l39mL12J90k41j92n3K16K34r1M9k16j65K63J61j71
2780G0l10K39j58L8k00L10L58l48K3J39j38L4J3k64k5K39K01j58n7j5q1P3K70
2803B53l45p4K2L85l77J01l10L00p5R8Q1m1J0K64r3k34k9L43k83k6j46J01J56
2826H1K9J4k66O5K5L13j09k75J2M49j25k49P8K5j25N4N0n0j26K97j02n01J43L58
2850F5J1k01K71L6m9J68l72j08L18J7pj68l47K14K31MQ2k92P2L94l87j39J96j38
2874a29M5O6j27K52p7J20j3k17R9j21J66J8l4j56L14j16j67o6j3K27J9J82l95
2897a23O9R0J38o4l68J78L5J05P3k93m6K29P3k14QJ39L9R4j95K20j0n3p7j14Q2
2922A5Q5k59L2P3j09L38K1q1k07L18j36K9j20J83k84K10k54L7N1q6J62o6j61J50
$$ plain form
2757 107 157 213 1 -148 151 134 117 -222 -226 86 276 35 -157 -210 6 240 149 198 -18 -183 80 241 70
2780 70 -240 -1 -159 -121 -321 -11 347 -1 22 161 23 57 70 -194 -219 20 221 63 6 -9 -90 -17 253
2803 253 -92 -166 -144 241 -136 -35 -345 -45 -120 -22 59 18 28 292 199 -35 -64 279 -4 -30 -176 -75 81
2826 81 110 124 -142 -77 -52 261 152 -123 -111 338 213 -36 42 67 -58 -4 46 -4 -130 167 65 -436 -293 65
2850 65 76 -125 146 182 133 301 -71 -179 139 156 149 -19 -366 -152 79 83 165 -127 -55 339 -48 -187 9 -129
2874 -129 -84 -18 -145 107 30 150 137 -80 19 -102 64 82 48 -108 206 90 -77 -143 -156 71 90 272 -123
2897 -123 -54 36 174 110 -258 -80 -45 60 133 -160 -206 23 96 -118 -110 29 68 162 -33 187 177 124 47 -67 15
2922 15 100 -159 -127 -54 -163 175 196 115 -92 226 90 119 -1 182 -102 108 -146 -109 -58 -144 18 -48 -209 -59
2946e9M14n01K0N6j3K44k05J58j05r5K36J25Nm91M66j71P5j78R0p3j65L52k13
2969b8K04j47J16k55j82L43J14k05j8k46J42j58L08j4j25J6j37K47K02l3j10k8
2991Fj76K35m6j35Q2J94k12j63P0r7M30K0k67J55L7m76J01O5p4M88l48p9nR5M16
3016C16m98K36K4o2L0M8P7m46M46j90j21J45N6K35l74n7P9Q7Q7J20l68J82o9K40
3040B23n07L25p0J4J35j34J9K68k65K60k97o5l1j0K17k19l5K73o0J31j85K6j27
3063a14K08M2m1m4q5K13j77j25K1J44R7j26l6K14k48N7J80j83j70K16l8%m31L67
3087e9O3n8l0PK2K81k60j37J53j99K37M2j61r5M10l05j0p2MJ75k02J66J26j31
3111c3o3J60n8O9%k43m1M37m52L95j15O2qJ69l19O4l7k63M87l6k88jk08L97k3
$$ plain form
2946 -59 355 -146 -126 -70 -83 161 -44 114 9 -86 150 275 280 -211 255 84 159 -19 71 -2 -167 185 -28
2969 -28 176 29 145 -110 -292 51 165 -40 -58 -304 -162 -320 -12 -26 -151 -135 -272 -25 177 144 34 6
2991 6 -170 65 19 -116 -34 160 -52 -215 -145 -242 188 208 -59 96 133 -343 -242 -177 -251 237 -111 -190 -195 -100 316
3016 316 -182 54 78 16 46 94 171 -275 171 -19 -140 5 61 296 -78 -135 -56 31 118 238 -130 52 -17 223
3040 223 -284 41 -29 -15 120 -14 5 273 8 268 -29 -94 -125 -135 82 -137 -172 101 41 172 -13 13 -114
3063 -114 94 136 95 51 -34 179 2 -123 -102 42 139 13 -23 191 -57 0 180 -3 -173 43 5 5 -426 -59
3087 -59 4 -54 -84 -77 -55 226 -34 -171 -18 -217 20 62 -99 -194 216 -89 -99 -171 -167 8 -194 -28 98 -33
3111 -33 -96 64 6 75 75 -168 -209 228 -224 171 56 118 110 279 -40 24 -13 -276 211 175 -113 -114 -322 75 52
3136E2l89K49j00l1M76m09q0L29L3Q5k9k19j62L54j22L24l69J2K9k74L36k57O2
3159a00J9J6J95oj28l5O2l9k1r6J70j77J46k3J50q5j2m0J50J01P4j04k49L8K1
3184B7k02K82j97Q3n6K17j83k8r5J84j3%J41q5p0J53l7k07rl95Q59p81N23j42
3208c1K47l93J49k92j32L74j8J10l44K54JJ58j63l3r0K22O0nk88J65K74j49k45
3231a69N8J27K69m28K04l9Q2l40M30k42Q5j9R5m6j88L4K82k96l8L67J69k61O0
3254A96j80J61l17M62j94k11o8OJ75o9J07k4k5j02M8o1J47M2j14j54L54j33m9
3277cK59n55L05q0o3P2J83K26l02n2O1q8k41L05m2j34L11k63Q7j7j16L8K6M5J4
3302b4j80N08n37J59K38N6j47P2j22J25P2j76MJ11mL3j22KQ7j3l38M74R4n99O9
$$ plain form
3136 52 -337 -88 -188 -219 257 -152 -232 97 130 215 186 -33 -195 159 37 361 -8 4 33 -241 95 -162 -100
3159 -100 -81 -65 130 124 -4 -39 23 -16 -37 -133 37 -140 6 -17 133 48 36 -4 146 247 321 217 -32 6 27
3184 27 -175 107 -90 -7 -63 154 -29 -57 -152 32 19 19 160 75 5 158 121 -86 -95 -490 369 -412 111 -31
3208 -31 216 -177 -28 -320 -452 -78 -96 14 -330 -76 -75 83 -80 -113 -203 19 79 74 -214 -49 225 76 -169
3231 -169 -111 16 285 -143 61 22 104 -236 194 -48 37 18 113 67 -121 -87 195 -101 -139 228 397 136 196
3254 196 16 177 -140 322 128 -83 -151 -145 30 -39 68 44 19 -83 -35 -96 51 93 -21 -175 179 46 -3
3277 -3 256 -299 6 -74 -137 -65 118 344 42 -10 51 -37 -278 27 -15 -149 162 -101 -14 -31 -147 -109 -83 -38 -24
3302 -24 -204 304 -233 -74 164 220 73 145 23 148 220 44 48 159 155 188 66 68 155 142 -196 278 372 -227 -158
3327a58J76K08n43L22n4k34M69m5j71J49o7l22K37j17J47J66m33J08K32j46j14
3348a90O7j82M19j71m0N1J86k23K50k56n6K50o4q8K6L4o3K46k93j41q3r4M95p9
3372AJ9K12l46J24j72J60j95K93J78l68M3o5N7o2QK37k40K26k81L46j26j06J49
3395I2R6l01K77l35L37L2j37l3P1m4m8J11o83M63K19j10L55n55L07n1o3K83k64
3418A9l61K84K02j58qn2K02j60K80q8k28J87L6j21J13k21K09o4j32M17k50l8M8
3441A16m38K80J70k41J17J88m61N17j40O2r2j73J5o2Q6r2J30M55n42J35J03j96
3463f3j68O9O25o50J93j5K57m18J43k18J52K02j64J49M8p2j32N0P8O6J07m22J17
3486f6Q0l7k62L32l85L38o5j7j21K01j2J18j05m3R1Q4l79M75J55n50R5l62M83
$$ plain form
3327 -158 18 226 -317 5 -49 -283 186 141 -30 119 52 -270 -33 -150 -3 163 -270 -162 70 -76 -190
3348 -190 -123 -305 114 -57 -97 -46 140 -83 167 -89 -145 105 41 -47 -21 13 -50 196 -97 -238 -321 -415 80 1
3372 1 20 232 -114 10 -162 -2 -197 96 274 -94 -51 -116 -59 -121 -113 124 -116 110 -171 175 49 -57 92
3395 92 188 -113 164 -171 166 198 61 28 99 55 7 118 -565 -102 117 7 362 -193 114 63 0 283 19
3418 19 -342 -58 144 -14 -22 -74 128 -32 248 160 -68 119 155 34 147 -74 135 71 -61 356 106 68 116
3441 116 -322 -42 128 -113 4 192 -269 248 108 170 78 -95 -80 -142 -56 -148 -18 437 -105 30 133 -63
3463 -63 -231 -162 463 -187 6 -9 248 -170 -27 -245 -93 109 -55 94 142 70 -62 -12 66 132 239 -183 -66
3486 -66 14 -23 -285 47 -338 0 -65 -82 -203 -2 -14 104 -1 -44 47 131 -248 227 382 -168 -73 -435 48
3509D8l06K19L35j54J9j57J43j80J89l43N54n80jJ76M7O4m1k68MK43j4n4Q2j17
3533i2k8K64l17o7J24M32m27J24J14k91M57k61N6mk3L7r1k55M15r3j61J20K12
3556B45k68L90k62R9r8J01j75j41J1J68p2J56q0L1j25J24p7j23p0K24p1q7K82
3579A82j15j77q7j02J90J33J0o5J4j7k2R3k07J35k8j63Q2J91J18m7j48K9J3k95
3603b83k2K53J66p4j00k49L36P1J2K99m01J34j84J59j51j81K86j64N8l2J25l1
3625B7j74K06k22J43J27P9l91J77r3L39j66m5j20J96p2K19k9j48k94j9O4J83o5
3648g8O1l6j36R2P4K05n05K36O1L28j69k57K19k16O0P4j99K63r3J02M8m7J41k76
3672d8L06l40J16q1J01l1O5J7k08N15o34L48l05N66l44J77k24q0M79k22l16J56
$$ plain form
3509 48 -258 -39 296 142 161 4 147 -33 156 -187 367 -213 -214 -38 9 73 32 -236 -232 11 -3 -57 25 -92
3533 -92 -120 144 -173 -240 -116 316 -111 13 127 -164 293 32 88 84 61 98 7 -248 167 74 -87 33 245
3556 245 -23 367 105 204 106 207 32 -109 -98 70 -2 154 74 105 -20 104 27 -96 -166 58 -13 -100 182
3579 182 67 -110 -197 -299 -109 24 34 -31 -17 -34 -56 37 -170 -35 -63 -226 -144 47 165 118 -30 -1 12 -283
3603 -283 -305 -52 114 40 -60 -309 27 98 110 409 8 142 -42 117 -34 -215 71 -93 -35 -67 58 27
3625 27 -147 59 -163 -20 107 186 -205 -28 -121 218 52 7 -113 83 11 230 201 53 -241 -260 -196 -13 -78
3648 -78 -17 -53 -189 -97 -23 182 -323 -87 -26 302 133 -124 95 -121 -61 13 -186 77 -16 86 134 87 228 -48
3672 -48 258 -82 34 -47 54 23 88 105 -103 412 -222 126 -179 387 43 220 -4 -84 395 173 -143 13
3694A3l6K50q0l26Q1k80N0L18j46m5K66j12J37j22l1o6K10r7q2J48pJ07Jj22j30
3719a01R5J60r0k37K73k05j45K37J82l00L11k35J34k03J9J34o3J29r5K08k03J1
3741A6l14J62J83k10J20J57J06k82k3J37Q0j26k35K72L1k36J16J58l5j09L6M5
3763D9o3o0Q6K72K2k29q9N1j35l8J56j05K44J16l09J58J64m53J07R1q9Nj47m4
3787b40O1J9K22J07J39r1n37L85j53l3R0K30l71N3K03pj72j19J55K1O0p1R1k09
3811a67K79k18J34J96l21J33k21j4K72j95RK23j36J10k17J32k49M1Q2N7J07Rm8
3834bM9q9J14j22R5j80j10L62j80L0j68K01j90J11J42q4R9j53J15lK92q0l7ml47
3859a39K47J11l75J02qj56J38J5m2J45k33K23j04L77l43L19l45N3j68M9j11J80
$$ plain form
3694 13 -23 227 147 -179 -98 -378 -328 -10 -156 -201 65 -47 90 -32 -63 -129 81 -16 -98 50 43 150 151 29 -101
3719 -101 -6 154 64 -173 100 -105 -250 -13 169 -131 180 -55 79 -124 -105 29 -34 95 0 208 5 16
3741 16 -298 -136 47 -163 -43 114 220 -62 -85 52 132 6 -229 43 74 -162 -46 112 77 -32 4 49
3763 49 -14 -74 12 284 306 77 -12 39 -96 -134 22 -83 161 277 -32 126 290 -163 -56 35 -54 -49 -196 -240
3787 -240 -179 -160 62 169 308 217 -320 65 -88 -121 -31 199 -172 -119 84 77 -95 -214 -59 -38 22 -49 42 -167
3811 -167 112 -106 28 224 -97 36 -185 -199 73 -122 -113 110 -26 84 -133 -1 -250 -209 -127 -70 37 46 -2
3834 -2 47 -42 72 -50 45 -135 -245 117 -63 -33 -201 0 -190 -79 63 -21 78 -75 40 37 329 249 212 208 -139
3859 -139 108 219 -156 -54 -62 -218 -80 -65 -107 38 -195 28 -76 301 -42 277 -68 -15 -183 -134 -245 -65
3881f5j39K08n4lJ30l0j63M46k04J9l09M56l51n6O5k9M7J89L2l17Q5r3K11o5o4
3906e4j77M40l96N74m29k28O7J11j80K72J34m8J09m23M36k15R9j47l9J6J68l7
3928E3j36l23M11l5l7k3n3Q4J90j78k1K40k30K3j6K77k86j20K84l15K85J8r9M9
3952D2J50j38j72J15J5J2J46m2j35o2L9J5K46k32j52K91m82N44l83J88J03r1r7
3975h0J9m5J99J5r1k03K23K7k24K00r7j43PK98j82O4J28l09k1J19M86m51j85K04
3999d2J95j47r0J44k9m0J9n5j60L24L2l74L4K81k09J87j3J06K03m50J17l1k15
$$ plain form
3881 -65 -204 4 -50 -53 77 47 -116 330 126 145 -164 292 -59 -115 -50 -79 -32 157 189 -128 -43 -136 75 10 -54
3906 -54 -231 209 -187 387 -42 -270 -203 -92 -272 0 134 86 195 -228 208 -7 92 -55 -94 -78 90 53
3928 53 -83 -406 5 -30 -67 -90 -143 -59 131 -47 -68 172 -58 -35 -51 226 -60 -180 104 -211 74 92 -7 42
3952 42 192 54 -118 -3 12 24 170 128 -7 -69 -30 -15 231 -1 -153 138 -344 200 -183 5 108 17 -80
3975 -80 -61 -106 93 108 17 -186 37 64 -160 40 -57 -200 -193 105 -77 -13 115 -194 -215 -96 390 -61 -246 -42
3999 -42 153 6 -84 60 31 -9 10 -45 -205 119 151 -223 -189 92 -117 70 57 163 366 -84 33 2 -213
$$ [...]
8191B44
##END NTUPLES=NMR FID
##END=
