##TITLE=1H_SA_26.118
 CDCl3, 8 sc, 
 31.5.2019
##JCAMPDX= 6.0         $$ Bruker NMR JCAMP-DX V2.0
##DATA TYPE= NMR FID
##DATA CLASS= NTUPLES
##ORIGIN= UXNMR, Bruker Analytische Messtechnik GmbH
##OWNER= root
$$ XWIN-NMR		Version 3.5
$$ Fri May 31 14:22:53 2019 Russian Standard Time (UT+4h)  she@DPX200
##.OBSERVE FREQUENCY= 200.13155
##.OBSERVE NUCLEUS= ^1H
##.DELAY= (6, 6)
##.ACQUISITION MODE= SIMULTANEOUS
##.ACQUISITION SCHEME= undefined
##.AVERAGES= 8
##.DIGITISER RES= 18
##SPECTROMETER/DATA SYSTEM= spect
##.PULSE SEQUENCE= zg30
##.SOLVENT NAME= CDCl3
##.SHIFT REFERENCE= (INTERNAL, CDCl3, 0, 15.7039)
##AUDIT TRAIL= $$ (NUMBER, WHEN, WHO, WHERE, WHAT)
$$ ##TITLE= Audit trail, XWIN-NMR		Version 3.5
$$ ##JCAMPDX= 5.01
$$ ##ORIGIN= Bruker BioSpin GmbH
$$ ##OWNER= she
$$ F:/spectra/data/she/nmr/H-F/1/audita.txt
$$ ##AUDIT TRAIL=  $$ (NUMBER, WHEN, WHO, WHERE, WHAT)
(   1,<2019-05-31 14:21:31.43 +0400>,<she>,<DPX200>,
      <created by zg, POWCHK disabled, PULCHK disabled
       configuration hash MD5:
       00 E9 B6 7A A2 85 ED C7 34 08 36 98 17 FE 4E 26
       data hash MD5: 16K
       D3 26 9B 6A 2D 48 F5 C4 47 C2 83 3F C4 6D 36 15>)
$$ ##END=
$$ 
$$ hash MD5
$$ 64 63 F5 C3 47 89 C0 06 CB 79 0C 84 D5 0A B1 A1
##$RELAX= 
##$RELAX= 
##$RELAX= 
##$RELAX= 
##$RELAX= 
##$RELAX= 
$$ Bruker specific parameters
$$ --------------------------
##$DU= <F:/spectra>
##$EXPNO= 1
##$NAME= <H-F>
##$PROCNO= 1
##$TYPE= <nmr>
##$USER= <she>
##$AMP= (0..31)
100 100 100 100 100 100 100 100 100 100 100 100 100 100 100 100 100 100 
100 100 100 100 100 100 100 100 100 100 100 100 100 100 
##$AQSEQ= 0
##$AQ_mod= 1
##$AUNM= <au_zg>
##$AUTOPOS= <>
##$BF1= 200.13
##$BF2= 200.13
##$BF3= 200.13
##$BF4= 200.13
##$BF5= 200.13
##$BF6= 200.13
##$BF7= 200.13
##$BF8= 200.13
##$BYTORDA= 1
##$CFDGTYP= 0
##$CFRGTYP= 5
##$CHEMSTR= <none>
##$CNST= (0..31)
1 1 145 1 1 1 1 1 1 1 1 1 1 1 1 1 1 1 1 1 1 1 1 1 1 1 1 1 1 1 1 1 
##$CPDPRG= <>
##$CPDPRG1= <>
##$CPDPRG2= <>
##$CPDPRG3= <>
##$CPDPRG4= <mlev>
##$CPDPRG5= <mlev>
##$CPDPRG6= <mlev>
##$CPDPRG7= <mlev>
##$CPDPRG8= <mlev>
##$CPDPRGB= <>
##$CPDPRGT= <>
##$D= (0..31)
0 1.2 0 0 0 0 0 0 0 0 0 0.03 0 0 0 0 0 0 0 0 0 0 0 0 0 0 0 0 0 0 0 0 
##$DATE= 1559298090
##$DBL= (0..7)
120 120 120 120 120 120 120 120 
##$DBP= (0..7)
150 150 150 150 150 150 150 150 
##$DBP07= 0
##$DBPNAM0= <>
##$DBPNAM1= <>
##$DBPNAM2= <>
##$DBPNAM3= <>
##$DBPNAM4= <>
##$DBPNAM5= <>
##$DBPNAM6= <>
##$DBPNAM7= <>
##$DBPOAL= (0..7)
0.5 0.5 0.5 0.5 0.5 0.5 0.5 0.5 
##$DBPOFFS= (0..7)
0 0 0 0 0 0 0 0 
##$DE= 6
##$DECBNUC= <off>
##$DECIM= 24
##$DECNUC= <off>
##$DECSTAT= 4
##$DIGMOD= 1
##$DIGTYP= 9
##$DL= (0..7)
0 120 120 120 120 120 120 120 
##$DP= (0..7)
150 150 150 150 150 150 150 150 
##$DP07= 0
##$DPNAME0= <>
##$DPNAME1= <>
##$DPNAME2= <>
##$DPNAME3= <>
##$DPNAME4= <>
##$DPNAME5= <>
##$DPNAME6= <>
##$DPNAME7= <>
##$DPOAL= (0..7)
0.5 0.5 0.5 0.5 0.5 0.5 0.5 0.5 
##$DPOFFS= (0..7)
0 0 0 0 0 0 0 0 
##$DQDMODE= 0
##$DR= 18
##$DS= 0
##$DSLIST= <SSSSSSSSSSSSSSS>
##$DSPFIRM= 0
$$ [...]
##$SUBNAM2= <"">
##$SUBNAM3= <"">
##$SUBNAM4= <"">
##$SUBNAM5= <"">
##$SUBNAM6= <"">
##$SUBNAM7= <"">
##$SUBNAM8= <"">
##$SUBNAM9= <"">
##$SW= 24.9336996594482
##$SWIBOX= (0..15)
0 0 2 0 0 0 0 0 0 0 0 0 0 0 0 0 
##$SW_h= 4990.01996007984
##$TD= 16384
##$TD0= 1
##$TE= 0
##$TE2= 300
##$TE3= 300
##$TEG= 300
##$TL= (0..7)
0 120 120 120 120 120 120 120 
##$TP= (0..7)
150 150 150 150 150 150 150 150 
##$TP07= 0
##$TPNAME0= <>
##$TPNAME1= <>
##$TPNAME2= <>
##$TPNAME3= <>
##$TPNAME4= <>
##$TPNAME5= <>
##$TPNAME6= <>
##$TPNAME7= <>
##$TPOAL= (0..7)
0.5 0.5 0.5 0.5 0.5 0.5 0.5 0.5 
##$TPOFFS= (0..7)
0 0 0 0 0 0 0 0 
##$TUNHIN= 0
##$TUNHOUT= 0
##$TUNXOUT= 0
##$USERA1= <user>
##$USERA2= <user>
##$USERA3= <user>
##$USERA4= <user>
##$USERA5= <user>
##$V9= 5
##$VALIST= <valist>
##$VCLIST= <CCCCCCCCCCCCCCC>
##$VD= 0
##$VDLIST= <DDDDDDDDDDDDDDD>
##$VPLIST= <PPPPPPPPPPPPPPP>
##$VTLIST= <TTTTTTTTTTTTTTT>
##$WBST= 1024
##$WBSW= 4
##$XGAIN= (0..3)
0 0 0 0 
##$XL= 0
##$YL= 0
##$YMAX_a= 208154
##$YMIN_a= -232592
##$ZGOPTNS= <>
##$ZL1= 120
##$ZL2= 120
##$ZL3= 120
##$ZL4= 120
##$ABSF1= 10
##$ABSF2= 0
##$ABSG= 5
##$ABSL= 3
##$ALPHA= 0
##$AQORDER= 0
##$ASSFAC= 0
##$ASSFACI= 0
##$ASSFACX= 0
##$ASSWID= 0
##$AUNMP= <proc_1d>
##$AZFE= 0.1
##$AZFW= 0.1
##$BCFW= 1
##$BC_mod= 2
##$BYTORDP= 1
##$COROFFS= 0
##$CY= 11.3945322036743
##$DATMOD= 1
##$DC= 2
##$DFILT= <>
##$DTYPP= 0
##$F1P= 18.9103706918063
##$F2P= -1.10871071338519
##$FCOR= 0.5
##$FTSIZE= 0
##$FT_mod= 4
##$GAMMA= 1
##$GB= 0.15
##$INTBC= 1
##$INTSCL= 1
##$ISEN= 128
##$LB= 0.24
##$LEV0= 0
##$LPBIN= 0
##$MAXI= 10000
##$MC2= 0
##$MEAN= 0
##$ME_mod= 0
##$MI= 1.114404
##$NCOEF= 0
##$NC_proc= 0
##$NLEV= 6
##$NOISF1= 3.799351
##$NOISF2= 2.8
##$NSP= 1
##$NTH_PI= 0
##$NZP= 0
##$OFFSET= 15.70392
##$PC= 1
##$PHC0= -8502.436
##$PHC1= 20.00023
##$PH_mod= 1
##$PKNL= yes
##$PPARMOD= 0
##$PSCAL= 0
##$PSIGN= 0
##$REVERSE= no
##$SF= 200.130013532006
##$SI= 16384
##$SIGF1= 3
##$SIGF2= 2
##$SINO= 400
##$SIOLD= 16384
##$SREGLST= <1H.CDCl3>
##$SSB= 0
##$STSI= 0
##$STSR= 0
##$SW_p= 3612.71676300578
##$SYMM= 0
##$S_DEV= 0
##$TDeff= 0
##$TDoff= 0
##$TI= <>
##$TILT= no
##$TM1= 0
##$TM2= 0
##$TOPLEV= 0
##$USERP1= <user>
##$USERP2= <user>
##$USERP3= <user>
##$USERP4= <user>
##$USERP5= <user>
##$WDW= 1
##$XDIM= 8192
##$YMAX_p= 0
##$YMIN_p= 0
$$ End of Bruker specific parameters
$$ ---------------------------------
##NTUPLES= NMR FID
##VAR_NAME=  TIME,          FID/REAL,        FID/IMAG
##SYMBOL=    X,             R,               I
##VAR_TYPE=  INDEPENDENT,   DEPENDENT,       DEPENDENT
##VAR_FORM=  AFFN,          ASDF,            ASDF
##VAR_DIM=   8192,          8192,            8192
##UNITS=     SECONDS,       ARBITRARY UNITS, ARBITRARY UNITS
##FACTOR=    0.0002004,     1,               1
##FIRST=     0,             0,               0
##LAST=      1.6414764,     0,               0
##MIN=       0,             -232592,         0
##MAX=       1.6414764,     208154,          0
$$ Real data points
##PAGE= N=1
##DATA TABLE= (X++(R..R)), XYDATA
0@%%%%%%%qJ6j6K4l2M0m8N6o8Q4j04J20j36J60j91K21k54K91l32L80m35M94n59
30b97O30p06P94q91R96j112J239j378J529j694J877k081K305k550K824l133L477
47A829l865M310m824N426o141P006q081R457j1291J3876j7823K4670l9888J34622
61A09283m3480j54125K24293P2183j46577o2544J52703o288j49170Q573J68864
72A73715k4194j66366p254J42873m256j13907R96Q1214l8244p3376M6153O9644
84H6998o6230q3011M7535Q1207l7235p7371J4020N9027j3742m2972J8250L2234
96A8710l6024l1702N0784M2541n2773m8461M6222N0295k6650l0798J9412R649
108A1205j8372J4898L8443j6972n0045R155N2234O060l0409m271K446j6084J7383
$$ y = [0, 0, 0, 0, 0, 0, 0, 0, -8, 8, -8, 16, -16, 24, -24, 32, -36, 48, -56, 64, -72, 88, -103, 118, -136, 155, -177, 203, -232, 262, -297, 333, -373, 421, -470, 526, -586, 653, -725, 804, -890, 987, -1094, 1211, -1339, 1485, -1648, 1829, -2036, 2274, -2550, 2876, -3265, 3741, -4340, 5117, -6174, 7702, -10121, 14549, -25339, 109283, 65803, -88322, 135971, 208154, 61577, -967, 151736, 145448, -3722, 4851, 173715, 149521, -16845, -24099, 118774, 114518, 611, 1607, 82821, 44577, -28799, 17354, 86998, 20768, -62243, -14708, 66499, 29264, -48107, -34087, 24940, 11198, -31774, -13524, 18710, -17314, -49016, 1768, 44309, -8464, -56925, -10703, 39592, 12942, -17856, 1556, 11205, -7167, 7731, 46174, 29202, -20843, -11688, 40546, 46606, 16197, 11926, 14372, -1712, 15671]
121A5671M5841j9148o6980O513O2041l655m4801J2056K1028m0887j8528O2682
133C1833K4386p6743l9568O7809L9487n9386l0222N1517R109n8288R074P0530
145C9538j8784q3938K0271R0349j4325q4474J2336P4371j2074n8513K4626N4800
157D4183l5486n5897M7772O9274m6958p5971M3270P8000l4111o5183L6480M9478
169E4851m7580l8199O4963L8909p7768m9057P7162N6478o8464n4105N6664L5986
181D9840n8601j8330O8010N427q3442o039Q7361Q725q1215r397O5653m49n2778
194b5235J4551M8218k5821n0155L0916N4348k6773n1893K3605M5304j9314l1719
206a3968K3345K3123k6443j2892L2690J1172l2934q578L2146R958k4945o038J9239
$$ y = [15671, 61512, 42364, -24616, -18103, 43938, 40283, -4518, 7538, 28566, -12321, -30849, 31833, 56219, -20524, -60092, 7717, 47204, -12182, -42404, 9113, 18222, -40066, -30992, 39538, 20754, -63184, -42913, 47436, 33111, -51363, -39027, 35344, 23270, -35243, -10617, 44183, 8697, -47200, 572, 69846, 22888, -53083, -9813, 68187, 34076, -31107, 5373, 54851, 7271, -30928, 34035, 72944, -4824, -53881, 23281, 79759, 11295, -42810, 13854, 49840, -8761, -27091, 40919, 46346, -37096, -43135, 44226, 52951, -28264, -37661, 27992, 27543, -25235, -10684, 37534, 11713, -38442, -7526, 46822, 20049, -31844, -8239, 37065, 17751, -13968, 9377, 32500, 6057, -6835, 25855, 37027, 4093, -4485, 27661, 37619, 12674, 6636, 25875]
219B5875N50j4789Q432J6370j5614k1479J9144K3473j8777k1784J5753J2599j9007
232A0746k106K3369p785l2673Q487L5806q489l5553O199K8945j2394k5608K0167
245I111K4203l0447k8631L5214L1748l8010k9940L7040K3971l8825j5926M2122
257B1630R783m5974n095M9108L499m9042j161M9077k40m7981N158M7427r678m5806
271a9295J6967M5408k2459m3619K7308M2780k9129l8970K9850L4178k9965k7341
283a4287L1911K3431l5764k0711L9196K0297m0482j8955L9165J4833l7968p787
295g121L7217N58l8307L904L8289o478l6401P154L2227r416k9990J2970K7713
308C2319j7953k7646K0886K6024k4031k3486K6057J7524k9485j2389L1025P684
$$ y = [25875, 26425, 11636, 20068, 36438, 20824, -655, 18489, 41962, 23185, 1401, 17154, 29753, 10746, 8640, 32009, 24224, -8449, 38, 35844, 27355, -8198, -1999, 26946, 14552, -11056, 9111, 33314, 2867, -25764, 9450, 41198, 3188, -26752, 10288, 34259, -4566, -20492, 21630, 31413, -14561, -19656, 29452, 32951, -16091, -17252, 31825, 31585, -16396, -11238, 36189, 26511, -19295, -2328, 43080, 20621, -22998, 4310, 47090, 17961, -21009, 8841, 43019, 13054, -14287, 17624, 41055, 5291, -15420, 23776, 44073, 3591, -15364, 23801, 38634, 666, -7121, 30096, 30654, -7653, -3749, 34540, 28062, -8339, -1185, 31042, 21626, -8364, 4606, 32319, 14366, -13280, 7606, 33630, 9599, -13887, 12170, 29694, 209, -12180, 18845, 26529]
320B6529l2066m345L0523N2k9019L456K8442p884k8787J0447K9012j2763k7503
333a3906J6406K4723k0701k1292K5293J8513k8228j5604K9112J2120k8008p234
345h806K7111L598k8175n97K9933j032l1263K233L1078n489k9327R585K7957j5012
359A1794k7149J8387K5567k0915k2876K1119J8924k2740j5397K3958J3319k5996
371b005j2405K6585J0868k7856p391K8167K826l0028J750L1037n720l0670P999
384f843K8086j0486k4744J2998K2067j6305k1645J8401K1260k0074k0224K1396
396C887J7045k4001j3599K6620R770k9523o736K9914L019k8507J85K6777l937
409A0914k6286P100K5964q168k6309R732K5473j1684k2811J5274K0484j9128j8047
$$ y = [26529, -5537, -9882, 20641, 20693, -8326, -4870, 23572, 15688, -13099, -2652, 26360, 13597, -13906, 2500, 27223, 6522, -14770, 10523, 29036, 808, -14796, 14316, 26436, -1572, -8806, 18305, 21903, -6272, -6869, 23064, 22032, -9231, -6998, 24080, 18591, -10736, -1151, 26806, 11794, -15355, 3032, 28599, 7684, -15192, 5927, 24851, 2111, -13286, 10672, 23991, -2005, -14410, 12175, 23043, -4813, -12204, 15963, 18789, -11239, -9489, 21548, 15828, -14842, -6843, 21243, 10757, -13987, -989, 21078, 4773, -16872, 1529, 22789, 2715, -17509, 3887, 20932, -3069, -16668, 9952, 19722, -9801, -16537, 13377, 16396, -12111, -11926, 14851, 10914, -15372, -8272, 17692, 9524, -16785, -7053, 18420, 6736, -16075, -801, 19683, 555, -17492]
422a7492K2274J6621k2923j3554K2981J0288k2456n920K2864M267k3970l095K4624
435A4509J582k4229Q30K3281m935k3393Q727K2950j2759k2819J4415J8960j6008
448A111j6167J6725J1608j9621j0193K1175Q400k2650p615K2517M535k3250r58
461a4383K3978k859k4926O732K5508r273k3406J2909K2230j4699j9150J8072J8902
474A9635j8478j5930K0443J5252k0539j1788K4915J0181k6950p908L0440O407
486B5680k9762l072K8283o59k7469N308K6877q687k9153Q997K8938r974k8232
499a2925Q723K4449j2954k2763J5558K0471k1049k1878K2280K0113k3169j8509
511b1653K0555J4874k1000j1038K1297Q992k3076o939K4649P878k4696n784K5081
$$ y = [-17492, 4782, 21403, -1520, -15074, 7907, 18195, -4261, -10181, 12683, 16950, -7020, -10115, 14509, 16091, -8138, -7308, 15973, 11038, -12355, -3628, 19322, 6563, -16256, -1841, 17119, 1111, -15056, 1669, 13277, -6344, -16537, 4638, 13038, -9612, -17227, 5290, 9825, -13425, -14383, 9595, 6736, -18190, -11458, 14050, 4777, -18629, -5720, 16510, 1811, -17339, 733, 19635, 1157, -14773, 5670, 20922, 383, -11405, 13510, 23691, -3259, -11167, 19273, 25680, -4082, -7154, 21129, 20470, -6999, -1691, 25186, 16499, -12654, -3657, 25281, 15307, -12925, -4202, 20247, 7293, -15470, 88, 20559, -490, -22368, -88, 20025, -3144, -21653, -1098, 13776, -7224, -18262, 3035, 12027, -11049, -17988, 6661, 14539, -10157, -15941, 9140]
524I140N487k1736p86K1417j050j8398P361J8993q310j6472J0701J7296p779j3996
538A868P759J1663o993o418J0548L016j3603j952J5761J999j5241k002J0091k587
552A3909o396P273K693j4182n467J5639N712j6005p375J0899L025j1264J280J1939
566A1680p065j8413Q253K2292q437k4655P020K1686q120j7857J2494J4409j8071
579d784j4340K3491J7674k4953k0661K4943K2303k1931j8820K1606J4839k4130
591d763q886L1028O284l6413o441M0065Q615l7328r468L2660O688k8696oK8639
605B1978o678l3303R626L9068p957m1631M029L7803k751l0512O198K3012j3350
618E532k1275J9801K3955k1410k8583J7571K9290j1723k5850Q170J8531j0520
$$ y = [9140, 14627, -7109, -7895, 13522, 12472, -5926, 1435, 20428, 12118, -4354, 6347, 23643, 15864, 1868, 9627, 21290, 14297, 7879, 18427, 21443, 7840, 5888, 21649, 23648, 8407, 6405, 16496, 13909, 7513, 14786, 17479, 3297, -2170, 13469, 19181, 3176, -4199, 6700, 9725, -1539, -259, 11680, 4615, -13798, -5545, 16747, 8310, -16345, -9325, 12361, 4241, -13616, -1122, 13287, -4784, -19124, 4367, 22041, -2912, -23573, 1370, 23673, 1742, -17078, 4528, 19367, -4763, -13649, 17379, 23663, -12750, -19191, 20874, 29489, -7839, -17307, 15353, 22041, -6655, -6661, 21978, 15300, -18003, -8377, 30691, 22734, -18897, -14868, 22935, 20184, -10328, -4130, 18882, 5532, -15743, 4058, 28013, 6603, -21980, -4409, 24881, 13158, -12692, -4522, 14009, 3489]
630C489j2546J6122J0098k1981j2978K2670J6136j8703j7713J0578J3102n545
642B729o888L844O7r062J383J3331P21j5917n764J1025P817l397n228m854j084
657a1277P699P500n600q716J491M490O09M337M702j0109j2092J1383K1129m325
671A1221k3398q61K1009L151j3354L045J1806j2579j3939K1714K1627k2632k7510
684b0700J8785K8005j2281k3080J0615J5270j5721j0830K2894J2863l1337k0116
696b5633L2511K5638k9715k7416K3214K1117k1463j3189K3571O056l1082o337
708b2728L7255J0918l9180j6608L5444J8115k9258j2645K6227M161k7767M082
720a1984L4494n581l9112K850L9897L175l3059m986K5327J072j8324O468J9019
$$ y = [3489, -9057, 7065, 17163, -4818, -17796, 4874, 21010, 2307, -15406, -4828, 8274, 2729, -4159, -315, -248, -9310, -7927, 5404, 6125, -9792, -15556, -4531, 3286, -111, -5339, -10193, -11277, -3578, 3922, -1678, -10394, -8903, -4413, -3804, 533, 5235, -4874, -16966, -5583, 15546, 11221, -12177, -13038, 7971, 11122, -2232, 813, 12619, 40, -13899, 7815, 29442, 6810, -20700, -1915, 26090, 13809, -9271, 1344, 16614, 893, -9937, 12957, 25820, -5517, -25633, 6878, 32516, 2801, -24615, -1401, 19716, -1747, -14936, 8635, 14691, -16391, -22728, 14527, 25445, -13735, -30343, 5101, 23216, -6042, -18687, 7540, 11701, -16066, -11984, 22510, 16929, -22183, -19333, 20564, 23739, -9320, -14306, 11021, 12093, -6231, 237, 19256]
733A9256j3642k3364J4822K8666j1414k9088N047K2126j849j3658L761N860r296
746b773n688J2848J0060j3498j5211P312J6883m82j2538l513M935L194J725K638
760E892k840o091Q92O898O592p11p328n727P555J2851M1j0930l118Q648O405k569
776A6460j621M048l093p222P474J5731n578k1769J237K3599K748k0643l505J5046
790B2912k979j3897Q558J5155j5053k2602J3088K5431j1751k8422P205K2080r403
803A0322j8895J2529J4022k0663j6458K4306J8319k5159k1588K0915K0626j7027
815A249j6349J6271J1136j7678p028K3571Q093k5511r093K7186J3249k2731j0754
828h389J9886Q817j6147k140J8701n71k0316J091K4329J843k3759l783K0265M021
$$ y = [19256, 5614, -17750, -2928, 25738, 14324, -14764, -9717, 12409, 10560, -3098, 663, 6523, -2773, -8461, 4387, 14447, 949, -14262, -6950, 9933, 9451, -3087, -6600, -1665, 1529, 3254, 5892, 3052, -3039, -2147, 4751, 11343, 10632, 3304, -2423, 5132, 17983, 18024, 7094, 3976, 12624, 19029, 16460, 14839, 18887, 15794, 8572, 16046, 31777, 26199, 4430, 5667, 29266, 32014, 11371, 7866, 22912, 19933, 6036, 14594, 29749, 14696, -7906, 5182, 30613, 18862, -9560, -2355, 19725, 10322, -8573, 3956, 17978, -2685, -19143, 5163, 23482, -1677, -23265, -2350, 18276, 1249, -15100, 1171, 12307, -5371, -12399, 11172, 19265, -6246, -15339, 11847, 25096, 2365, -8389, 11497, 20314, 4167, 2027, 20728, 20157, -159, 932, 25261, 27104, 3345, -438, 19827, 23848]
842B3848j7002j028J3152n029j3752P379J3985r842j6797N948J3969n477j1575
855b221J780N124n123l860O250J605j0347m448R194L116o961l003L041r98j442
870h293N038L8o960p34Q032J116n151L34M030j718k369O236M421o714n601Q189
886a06Q635o867p205P438O295p446k960J0033J860j1887j342J3726K893j4011
900i44m097J2648L600j1780k737J1283J30j3819J011J5735k692j8056J711J7693
914I686l286j6562M066J3854o714j3551Q438J3382j0207j4204J0674J4147j0735
927a012j2858J0972J1728j2194r081J4203P062j3994m905J5075M095j3811k166
940f886J2883K390j1534m0J1259m61j0893K477J1506k664j0982L529J0645m159
$$ y = [23848, 6846, 5818, 18970, 13941, 189, 7568, 21553, 11711, -5086, 862, 14831, 9354, -2221, -441, 4683, -440, -4300, 1950, 3555, -6792, -11240, -2046, 1070, -5891, -8894, -5853, -6851, -8293, -3255, -3217, -10177, -10911, -2879, -1763, -6914, -6580, -2550, -4268, -6637, -401, 4020, -2694, -8295, -106, 8529, 1662, -5543, 1895, 8190, 744, -2216, 7817, 9677, -2210, -3552, 10174, 13067, -944, -5041, 7607, 11207, -573, -3310, 7973, 8103, -5716, -4705, 11030, 8338, -9718, -8007, 9686, 6400, -10162, -6096, 7758, 1044, -12507, -4069, 9313, -894, -15098, -4424, 9723, -1012, -13870, -2898, 8830, -3364, -12445, 1758, 8820, -5174, -10079, 4996, 9091, -4720, -6886, 5997, 8387, -3147, -3187, 8072, 7611, -3282, -805, 10701, 8037, -2945, 584, 11229, 7070]
954G070q555M589P104n574n929O439M260o742m582O802L950p197l847O225K564
969F577p848j332Q030o90r416J839Q562l256q730M459O749n565n867N821M945
984D278o846m469P705L911q295k940Q932K647r575q79J0379j24r987J978R974
999F689l741q642N532Q659n692p561O425O950o098n693O323N935p505m931Q265
1014D915M762r246l735R256J952r169j586R597o27r377R08Q493j692q678J603
1029b624P674k034q955L058Q569m558q550N093P845o351o871O979N670p778m488
1044g321Q657L492q516k427Q278K687q340j481R298P50r527R96J0157j776r486
1059d559L284R565m992p466N696O751o024n962O098N294o400m649O422L560o698
$$ y = [7070, -1485, 3104, 10208, 4634, -1295, 5144, 9404, 2662, -1920, 4882, 8832, 1635, -2212, 4013, 6577, -1271, -2603, 5427, 4737, -4679, -2840, 5722, 2466, -6264, -1805, 4944, -621, -6488, -667, 4278, -2568, -7037, 668, 4579, -3716, -6656, 2276, 4923, -4652, -5531, 4848, 4724, -5263, -3285, 6689, 2948, -5694, -162, 8497, 2805, -4756, 1669, 8619, 2521, -3172, 3151, 9086, 1581, -3350, 4915, 9677, 431, -3304, 5952, 7904, -1265, -2851, 6746, 6119, -3258, -2350, 6143, 4451, -4227, -2624, 5050, 3016, -5939, -2881, 5688, 1130, -7420, -2327, 5518, -833, -7704, -725, 4945, -2833, -7321, 1336, 4828, -3688, -6115, 2163, 4850, -3490, -4971, 4327, 5077, -4450, -3454, 6703, 4927, -4559, -1275, 8290, 3298, -4168, 1528, 8279, 2255, -3707, 2391, 7685, 1285, -3364, 3058, 6618, -80]
1074h0l730P637K173q247j401P991m4q308J101P486j964p380K679O270l488n462
1090d767L595N042m006m655M770M847n489m310N755M821p087k754P845J577q139
1105b955L87Q207j054p514J372P523k036o734K615O651l409p152M951O660n641
1120A871p270O475O185p627n196Q119L514r209k673R577J452r800j448R708M53
1135D131r668l35R994j014r632K360R932l378j0222M587J0309n002r004N407P982
1150F447n289o519O417N985o706n224P487O184q071o218Q066N752p196m604P432
1165C943K681q036j200Q523J22q397j146P897P07o434j342N139k23m827Q35N166
1181C408k694n736K752N595k282m878K409K094k009p54L198p18l751J412L851
$$ y = [-80, -3810, 3827, 6000, -2247, -3648, 4343, 4299, -4009, -2908, 4578, 2614, -4766, -2087, 4183, 695, -4767, -1172, 3870, -136, -4791, -21, 4826, -663, -4973, 782, 5603, -1484, -4238, 3607, 5184, -2955, -2568, 5639, 4585, -2929, -1557, 5966, 3930, -2804, -189, 6462, 3053, -4099, 852, 7512, 1871, -5399, 1076, 7261, -366, -5562, 2557, 6071, -3138, -5811, 3766, 5218, -4582, -6030, 3678, 4131, -5537, -5872, 4122, 3108, -6524, -4164, 5768, 2390, -7832, -3245, 7064, 2062, -6942, -1535, 6447, 1158, -5361, 1056, 7041, 335, -4889, 2598, 8782, 711, -5507, 2559, 8311, 1115, -3489, 3943, 6624, -1412, -2612, 5911, 6033, -2364, -3510, 4387, 5094, -1340, -2682, 2457, 2234, -2593, -1758, 3408, 714, -5022, -2270, 3325, 1043, -3835, -1426, 668, -1341, -2095, 1103, 385, -3366, -1954, 1897]
1196A897n53l262P78J778o11o62K619l67m186j6N673O16o426o83N722n35n136
1213c354K947M283n241n941O320O844o763q032M927P395m459o557N072M004p199
1228e754m171J0283M920j2400n922J2071P228j0637n363R587L685r199q70J1773
1242E231J067j3567j103J5928L575j4929l099J3728K890j1347Q64J1413l194j2144
1256d687N530J3581m302j4879K676J3988j454j2001J361R318m657q662O809Q671
1270A1292r085j1533P735J0861o286j0668K729O861l169m198L837K099o607l935
1284a0067P098O541o559q096L712P460p13l667J33J078q23J327M056O41l561l084
1300d524L578O382J518n738l213M299N494Rl319p35J413N56L78L147J431n648
$$ y = [1897, 1344, -1918, -1140, 638, 27, -635, 1984, 1617, -2569, -2585, 3088, 3704, -2722, -3405, 2317, 1782, -3354, -407, 3876, -1365, -7306, -986, 5858, -905, -8937, -4010, 3385, -1074, -7631, -2559, 1445, -5754, -9925, 358, 5278, -7122, -13044, -973, 6255, -4382, -9745, -158, 3527, -5672, -6542, 5231, 6298, -7269, -8372, 7556, 11131, -3798, -6897, 6831, 9721, -1626, -762, 10651, 7457, -4687, 843, 14424, 10122, -4757, -2081, 11907, 10453, -1548, -187, 9131, 4474, -4188, 2621, 11292, 2207, -9326, -1591, 9270, 2984, -7684, -4955, 1906, -1263, -5461, -1624, 475, -6132, -10067, -2969, 3572, -2987, -11083, -7371, 89, -624, -4291, -4158, -3080, -3903, -2576, 1480, 2121, -1440, -4524, -946, 5436, 6954, 1216, -1997, 2302, 7796, 7805, 4486, 3751, 5164, 5720, 6098, 9245, 10676, 5028]
1316E028m601O856Q171n888r798L096Q345k643n597K084L171o573m351R341O400
1331A3041j1265j1471R386J2193p892j1246N603O947p664m607J0858L451j5031
1344g697n472J5422Q543j3854j0224J1032Q689r125n115J0435K171j3859q23J7259
1358G382K716j8138m495J6113O003j2153m547R904J230r859K346J1950k801j5196
1372i545J499J6327J289j5256k598J1347J798q623J827O946m939q546N623J1687
1386H836m074j2781L20J1530K067p714j806M276j174k753M965M157n674o492L831
1401b486P965K37o334l477L157M185j80j827n53o50j183J487M213j85o019l423
1417e073M708O402k157p705r63N758J723m336J87K830l674m577N792O587o129
$$ y = [5028, 427, 7283, 15454, 9566, -232, 2864, 11209, 8566, 2969, 5053, 8224, 1651, -2700, 6641, 13041, 1776, -9695, -309, 11884, 3992, -7254, -1651, 5296, -2368, -6975, 3883, 7334, -7697, -13169, 2253, 10796, -3058, -13282, -2250, 6439, -2686, -7801, 2634, 4805, -9054, -9877, 7382, 10098, -8040, -12535, 3578, 9581, -2572, -7119, 2785, 4015, -5844, -3498, 8452, 5651, -9545, -8046, 8281, 9570, -5686, -8284, 3063, 4861, -3762, -1935, 5011, 72, -8474, -2851, 8836, 4762, -8019, -7699, 3831, 5898, -1816, -3622, 654, -520, -3273, 1692, 5849, 175, -6317, -2486, 5479, 5716, -618, -4095, -938, 3247, 3067, 1240, 687, 37, -1146, 341, 4554, 4369, -1650, -5073, -365, 6037, 3880, -3825, -4788, 970, 2693, -1643, -1456, 1374, -2300, -6877, -1085, 5502, -627]
1432f27r166M049R589j691q523J26O668j745n455N132O237q287q920R628J1300
1447H315p494j1693N124J0283l745p172N669N142q094n349J0883P945j1767r751
1461a1704J1142R938q773p880Q008N123q939k460J1099J546j2398l154J2488M710
1475H746j0748n217P961M249p072j814P558o11r261J555J0106o07j0337q92Q629
1490B245J532o302j127M322o46l851K022N228k310o712J574O943q0n830m94L450
1506c6K35j015P32N48k531o57K517K187j288k733o1J326K036l09j458j388M78
1523a417K414K80j920L06O79j200n95L655J017n337j373N987K252n250j785M059
1539A772J625m358K64M516l4o141K65P535j52p566K76P099k55o466J566N903k600
$$ y = [-627, -9793, -5744, 3845, 2154, -6369, -6243, 425, -1320, -6775, -1643, 4594, -3693, -12613, -2985, 8315, 821, -10872, -5748, 4535, 790, -6382, -713, 4429, -3665, -9014, 1869, 9814, -1953, -11704, -562, 9376, 603, -7277, 731, 5854, -3085, -5545, 5554, 7100, -5298, -8452, 4036, 8746, -2002, -7219, 742, 4991, -2081, -3895, 3663, 3052, -6209, -4654, 5452, 4845, -5492, -6384, 2245, 3777, -2525, -3652, 670, 24, -3827, -1805, 3423, 1113, -5599, -4025, 2918, 2838, -2992, -3486, -36, 199, -816, -84, 464, -2067, -2724, -207, 1980, 692, -2041, -2102, -776, 1260, 951, -507, -1895, -1417, 997, 1277, -643, -337, 342, -858, -1453, 2202, 3219, -2118, -3491, 2496, 4748, -502, -2287, 1772, 3397, -961, -697, 3819, 3785, -2356, -2091, 5444, 5292, -2274, -1998, 5101, 4846, -1620, -54, 5849, 3249]
1556C249n940L482N770l523o645L194O726k480o273J755N939l347m858L931N055
1571F035n495n395N537N130n154n054M389M017m336l224M447K725n519k426O065
1586A742K313o532k174O025J689o030o0M637l53m683J365M456j799l978K010L116
1602A744j087k980Q71L065j753k249K460J712l006j165L315R66k970n25K689l36
1618G51k004R99J488j149j323J096J599r41k267J458J832j826j301K070J047k793
1634a264q84L266L89l572M19K514l21l186R70L149j320l090J161L419j507l638
1650c495J800L948k756l424L313K828l618k384M087J897m110j268M498P33l732
1665a683p02M375M72l753m51M398J8m139J057M197j254m579K113M442k321l301
$$ y = [3249, -2691, 791, 6561, 3038, -3607, -413, 6313, 3833, -2440, -685, 5254, 1907, -2951, 980, 6035, 540, -4855, 682, 5812, 658, -4396, -7, 4010, -326, -3550, 897, 3622, -1897, -4323, 1742, 4055, -2477, -4651, 1374, 3063, -2967, -3027, 1610, 1257, -3426, -2061, 2395, 596, -3382, -1372, 1744, 657, -2323, -1452, 1613, -140, -2389, 71, 1783, -1223, -2388, 927, 1893, -1077, -1602, 1087, 751, -1253, -254, 1234, 85, -1238, -142, 1457, 516, -1751, -293, 1539, -287, -1588, 482, 1529, -1264, -2148, 1118, 1507, -2065, -1646, 868, 547, -2639, -1669, 1480, 160, -2930, -1769, 1650, 143, -3495, -1695, 2253, -503, -3927, -614, 2214, -1404, -3788, 299, 2196, -1914, -3182, 1316, 2049, -1683, -2385, 1990, 2462, -1291, -1742, 2656, 2674, -1465, -408, 3789, 2535, -2044, 69, 4511, 2190, -1111]
1681a111K605K629k497k619K599K215k836k246K497K154l060j709K675J525l817
1696i96j373L969J43l939k72L528r80l281R67K871j450k958J232K178r44k698
1712d003J277K716j997k238K638K369l180j635L557J098l157k87L369L63k908
1727b018K83L273o71k346Q15K651j156k599J590K683k082k111K356K235l273j100
1743a470L028N29l275j31K481l03k728J0K628o10k691L26K644j092l043Q96L078
1760B77j736l131K175K607k912k120L406J294k598j975L133J704l037j136L598
1775d51J324l559n71M108J003m578L6M932n0m463R16M419j040l736J927L819k033
1792B003l485K250M053k535l452K075L633k419l603L222K635l754k238M109J757
$$ y = [-1111, 1494, 4123, 1626, -993, 1606, 3821, 985, -1261, 1236, 3390, 330, -1379, 1296, 2821, -996, -2369, 1600, 1743, -2196, -2468, 1060, 80, -3201, -2234, 637, -813, -3771, -2539, -361, -1305, -4003, -2726, -10, -2007, -4245, -1607, 762, -2418, -4053, -496, 602, -2555, -2842, 527, 890, -2018, -1735, 1538, 867, -1479, -664, 1987, 831, -1768, -178, 2505, 423, -1688, 668, 2903, -370, -1470, 1558, 2087, -1188, -1319, 1162, 859, -1869, -1859, 769, 159, -2532, -2206, 438, -654, -3697, -2801, 277, -1459, -4590, -2415, 192, -2720, -4840, -1434, -140, -2738, -4713, -1580, 124, -2913, -4049, -451, 873, -2686, -3257, 851, 1854, -2724, -2688, 2244, 2194, -2269, -1353, 3066, 2026, -1710, 217, 4036, 2003, -1482, 768, 4821, 2286, -1166, 909, 4542, 2123, -1480, 1742, 4377, 623, -1615, 2494, 4251]
1807D251l987j994L463J746l250j176K565Q34k808p82K635N77l382k79K950N51
1823A914k996m75K390m13j314Q93R38j323j016Q95J457o23j402M2J316Lo68K63
1841a19k81m72L83J150m11j304N28K78q36R36J323j478k034J469K811j029k939
1858b025R71K859j303j219J420J555k416k369M006L184l911l693L686M127l891
1873I81k640L907J250m432m51N282N92o011j476O035K100n921k258N098J475n140
1889a609n19N573j272o656R74P284q07p408k02O011J96n235K44M649j806n048
1905e631K556O199l111o944K204P011j430n761J273M358j584l229L101L559l771
1920a200m487M049N393k508n499J710M652j157k692J960J645k871j633L627K038
$$ y = [4251, 264, -1730, 1733, 3479, 229, -947, 1618, 2452, -356, -1138, 1497, 2074, -1308, -1587, 1363, 1914, -1082, -1557, 833, 420, -894, -1, 937, -386, -1402, -507, 950, 327, -1075, -1033, 283, 286, -382, -119, -400, -872, -489, 661, 250, -1054, -526, -248, -1084, -148, 1175, -303, -2337, -868, 1943, 914, -2025, -1054, 1805, 502, -717, 703, 2258, -158, -2527, 1479, 4663, 752, -2941, 745, 4872, 981, -1659, 2248, 3498, -934, -1385, 3897, 4489, -1522, -2998, 3037, 5137, -784, -3042, 2056, 3531, -1609, -2128, 3445, 2173, -4483, -3509, 3775, 2968, -4440, -4642, 1369, 1565, -3670, -3426, 1223, -583, -5631, -3075, 3124, 13, -6931, -4727, 2284, 854, -4907, -3634, 724, -860, -4089, -988, 2571, -1200, -5687, -1638, 3755, 1247, -4252, -2542, 2110, 953, -1739, 221, 1866, -1005, -2638, 989, 3027]
1935C027k857l591J872L701j15k796j376J330R04n63N57M64j598j876J264K978
1951A325j26l312k351K611L224j305l066M43J866j084k87K794L34m597j290N199
1967C78L097m295m457L008M446j647l342K246K114m059j280N885K175o914l795
1982f440N985M973n200m431L474L258m483j513N567M53p438j603Q159L179q801
1997d861m230P115L790o053k093N513j11o347J190P675j89q970j180R263K517
2012C029p162k126O164O13m799K083N986k687o435K530Q092j40p150j202O188
2027B984J915l773k5L301j562l488K890N072k293o603J002O006N75m638q82J651
2043B132M92j673P35J689k237l760J128M519j99n209j489K730K090j413j806j74
$$ y = [3027, 170, -3421, -1549, 2152, 2037, -759, -2135, -805, 99, -464, 93, 557, -1041, -2917, -1653, 1325, 1199, -2113, -4464, -1853, 1371, 66, -3000, -2557, -691, -1775, -2062, 732, 1066, -3531, -4821, 378, 3475, -820, -5277, -2269, 2177, 530, -2812, -566, 1548, -2511, -3791, 2094, 4269, -2645, -6440, -455, 4518, -682, -5113, -1639, 1619, -2864, -4377, 1190, 1643, -5795, -7398, 761, 3940, -4861, -9091, -1976, 1814, -4239, -6332, -819, -930, -7277, -6087, 1588, 1399, -7571, -8751, 512, 3029, -4133, -6259, -95, 518, -4281, -2198, 3788, 1101, -5334, -2804, 5288, 5148, -2002, -3204, 2984, 4899, 1126, 1101, 4402, 2840, -648, 2242, 7314, 5021, -1582, -580, 5426, 6001, 1363, 481, 2132, 2624, 951, 1686, 3375, 1138, -2622, -1494, 3025, 2826, -2383, -3872, -1142, 948, -465, -2271, -2445]
2059b445L60n79k29K163M6k855k286M105L644k891m279J600L958o19j923J082
2075a148J641j947j789M429L389m348n046M216O289k483n563K504M052k755j757
2090c16L674J631n189k634N555M700n705m987M028M324l550l888L588K390n389
2105a768k142O436J780o709l691N986L862n103l765L898K383m207j258M733N23
2120I58o293r64O910J696o357k141N351J663l876n30L831r69l225R82M342j20
2136A258n061j59M758J232l664p49K566j57j199J075J651j560k267J290K842J11
2152A967k963p97J647J288q56j372P60l51l96L66J455l96j974p19J541J604q23
2169a9k404K1J907J05r93l45J150n79j404J334J810j043k562M59L277O6k986l06
$$ y = [-2445, -2085, -2664, -2893, -730, -684, -3539, -5825, -1720, 1924, -967, -5246, -3646, 312, -307, -2230, -1148, 493, -1454, -3243, 1186, 4575, 227, -4819, -603, 5686, 3203, -2360, 144, 4196, 1441, -316, 3358, 4989, -200, -2834, 2721, 7421, 1716, -3271, 757, 5081, 1531, -2357, 1231, 3621, -1768, -3910, 2526, 4306, -2403, -6094, -108, 3754, -1349, -5114, -1216, 1167, -3040, -4298, 435, 958, -5335, -6299, 611, 2307, -4050, -6191, -840, 823, -3053, -3583, 248, -721, -3946, -2964, 1378, 1258, -3803, -3962, 796, 2028, -1636, -2385, 181, 24, -1175, -100, 1551, -9, -2276, -986, 1856, 1967, -996, -1793, -146, 1142, 286, -1086, -326, -677, -1073, -707, 748, 352, -1622, -2341, -800, 804, -19, -2423, -2402, -495, -390, -1383, -1728, -578, -1157, -2561, -1227, 583, -460, -3022, -2563, 714, 780, -2206, -2512]
2187b512K850J03k277O46K795j431k995K124L559j502l965J553L136k93l459J440
2203b28K526j495k928K697K998l248l200L247K864k713l155K704K541k990j489
2218a869K218J775k935k085L195J874k842k391K504K033k760j436K674P58k975
2233b262o3K832L49l133k40K569P69k469m03K471lj997L51K379m57k260R97K117
2251A547r09j663J286J233j247j85R30J30q35k78R97N9n99k51M80N26j105L70
2269D86O50q71p84Q75Q02j430j80J098k55j225O27P28n17o95M08J209o78j140
2287h92O29J390o82j520J331Q46j060j139K080J130k203l25J967Q83j841l00J831
2304B125L87j571K3J411P03k342o9K305n2k040N6K546p42k125R09J794j091j805
$$ y = [-2512, 338, 441, -1836, -1190, 1605, 174, -2821, -697, 2862, 1360, -2605, -1052, 2084, 1791, -1668, -228, 2298, 803, -2125, 572, 3570, 322, -2878, 369, 3233, 520, -2635, 69, 2610, -380, -1869, 349, 2124, -811, -2896, 299, 2173, -669, -3060, -556, 1477, -1283, -2719, -45, 713, -2262, -2325, 507, 856, -2277, -2517, 52, 821, -1648, -2051, 420, 417, -1580, -1229, 1150, 693, -1567, -570, 1547, 638, -1025, 261, 1494, 247, 62, 992, 1122, 287, 9, 1006, 1065, 466, 215, 695, 1221, 116, 486, 1136, 265, -519, 356, 1158, -272, -452, 646, 391, -834, -207, 521, 4, -691, -283, 926, 248, -892, -263, 1127, 445, -1075, 256, 1102, 42, -1097, 983, 2113, -90, -415, 1552, 2435, 594, 294, 2125, 2512, 941, 964, 2375, 3078, 736, 667, 2972, 2920, 880, 936, 3482, 2740, 615, 1524, 3318, 2227, 422]
2322D22J024K040j822j535Q42J868j478j637J347J510j979j409J815Q06j605j136
2338i27K090J98j548j83J663r4j619J4J918j38j639M59J545l61j783R38J507q23
2356A217j127J229P03p40n82Q85R39j656j76O61N37k58n14Q19M61j310l49J356
2374B095l9j589J18J356o20q29N56K56p59r80J167M42j157n33J116k05r12l49
2392h66J316jj410k08J636j53j683P24J344r48j430J486J233j264j268J783M42
2409G33r50n07J654K8j676Q1J183Q90k081l24K322K60k500M99K093m23k229P97
2427a50J793r20j613L96J853p85j812P14J625n33j651R38J357j150j758J581J456
2444A341j533j336J490J351j547j308J634Q33j710o55J974L14j722o96J677J010
$$ y = [422, 1446, 3486, 1664, 129, 971, 2839, 1361, -276, 1071, 2581, 602, -807, 1008, 1814, 209, -927, 1163, 1361, -187, -370, 1293, 1199, -420, -406, 1512, 1374, -265, 194, 1739, 1378, -405, 533, 2040, 1217, 90, 1319, 2022, 1282, 700, 1585, 2524, 868, 692, 1353, 1890, 1632, 1118, 1937, 2398, 1088, 739, 2095, 2056, 467, 585, 1941, 1321, 492, 1048, 1304, 545, -435, 732, 1174, 17, -516, 600, 395, -517, -866, 450, 449, -961, -1169, 467, 314, -1369, -645, 699, -249, -1679, -193, 1040, -224, -1492, 291, 733, -217, -724, 930, 958, -718, -637, 546, 1436, -645, -969, 1353, 1613, -887, -388, 1705, 1282, -947, -150, 1643, 723, -890, -494, 1359, 574, -1238, -524, 1101, 568, -1083, -145, 1212, 62, -1696, -115, 1341, -192, -1528, -38, 1313, -234, -1542, 92, 925, -785, -1440, 534, 848, -874, -1570, 107, 1117]
2460A117j663j006J782J32j347J36J256l96j488M74J020J08q73k43N97K79q35
2477i50O21j40l67j54N04L13m33k25J55N7K92J67J90j216P90P40n48j67P9K42
2497e0k12J64L92O19j039q96J659Q34r16j564J185J558r61j129J870R0j794l01
2515d91K001R78k674j181K316J408k317q36J575L66k046j25L040q19l177Q9L574
2532A681N5l457m84L024j47k725O17K572r13k859O26L842r07l941M91L499n92
2549C82k488Q42K025j320j977K245K416k157k835J727L367r55k885Q02K263p99
2565F53j837J725J731k403j566K774J943j818k162J120J880n0j407L81J063q28
2581A199p85J064J496j896j441J446J745n55j395o48J133N10n73j42M04p26r12
$$ y = [1117, -546, -1552, 230, 362, -985, -849, 407, 11, -1477, -1003, 17, 125, -748, -991, -394, -115, -950, -329, -469, -836, -990, -486, -173, -606, -831, -676, -619, -327, -160, 30, -1186, -396, 344, -204, -371, -292, -50, -262, -98, 294, 913, -126, -1022, 637, 1471, 555, -1009, 176, 1734, 773, -356, 1514, 1604, -190, -491, 1510, 2488, -186, -1367, 949, 2357, 40, -796, 779, 1145, -901, -1026, 2014, 1195, -1982, -1893, 1681, 1736, -1721, -2205, 819, 672, -2053, -1436, 1136, 223, -2636, -2010, 1832, 925, -3016, -2525, 974, 382, -2106, -1264, 761, -559, -2536, -291, 2125, -32, -2867, -1140, 2227, 1272, -1613, -811, 1452, 653, -1184, 541, 2272, -131, -1697, 1077, 3020, 1202, -960, 160, 2040, 1990, 583, 964, 2027, 1199, 414, 1478, 2974, 1078, -363, 1083, 2828, 2273, 878, 230, 1363, 1873, 1300, 1158, 1562, 836, -76]
2598g6P48J629j72k509p70K229J047j420j669R49Q74q10k96R87P6k173p60L136
2616A020J009l217k070K801J999k016j458J495P29k466N35K932J97m099j037M575
2632I29J870l869j905L003J539k494J03K605q8l836N98M552j07m253j052M401
2648A996J331l420o35K947m69k972J211M025j533m566O76M843j83l957l23K855
2664A826l16k199R19J990j376l508J401M053j165m075J09L624m96k246J89J471
2680B01q04j459J330J826j221l055P46L160L24k804p37J930L63p57J03Q26r47
2697i75j050J024J927N9k405q08K258J436j660j187R69M04o34L83J348l55j957
2714a223m19K320J493k305j927J699J931j146j577J398N81j790n09K668R10l482
$$ y = [-76, 672, 2301, 2129, -380, -1150, 1079, 2126, 706, -963, -14, 860, 50, -246, 741, 817, -1356, -2116, 1020, 2029, -1188, -3258, -457, 1542, -474, -1932, -437, 292, -2174, -1639, 1293, 1490, -2609, -3646, 929, 2799, -1070, -2975, 28, 1567, -927, -824, 1781, 1693, -2143, -1545, 3007, 2900, -1353, -2405, 1996, 3327, -93, -728, 2219, 1750, -1222, -11, 4014, 2481, -2085, -1409, 3434, 3251, -706, -1029, 1826, 1510, -689, 230, 2220, 844, -2664, -1263, 2790, 1625, -2450, -2341, 1283, 787, -1459, -1270, 201, -603, -2062, -732, 1094, -127, -3182, -2436, 724, 1048, -1756, -2493, -563, -200, -957, -854, -28, -975, -2025, -1001, 926, 985, -1420, -2228, 30, 1466, -194, -1381, -412, -8, -642, -259, 1089, 734, -1223, -1642, 678, 2171, -134, -2061, -362, 1569, 423, -1154, 244, 825, -965, -1474, 1194, 2104, -1378]
2730a378j120K828K302k439k455J908J700j702j058K439J036l412p81L595J708
2745C171m080j571L327J779k441j128K270L96k452l05L481K40l944o46L734J706
2761C537l652j512L061M16j973O5K247o80l225P81L640k48l615m60L052P33k264
2778i7m88J806n75k084J315K355j074k502N47J991K21j685j64J186N06j112M2
2795A88J401m53j698R39J601j41j688l33J410N70n18o17J02M53j04q8O59O7j094
2814F56m37J395P83j474j011N75J269m31q88P0N47k48q29Q35Q34q11k361J282
2832b44J948j381j366J49J531p36j232P56J002r52j682J731J467j748k012J621
2848a148K137j331k059J800J149j531q62J670Q96j457j688K493J721k360j349
$$ y = [-1378, -2498, 330, 2632, 193, -2262, -354, 1346, -356, -1414, 1025, 2061, -1351, -2132, 1463, 3171, -909, -2480, 847, 2626, 185, -943, 1327, 1723, -729, -1034, 2447, 2687, -1257, -1903, 1831, 3537, -115, -1627, 1434, 1850, -123, -58, 2189, 1509, -1716, -935, 2705, 2457, -1158, -1618, 1434, 2167, -97, -585, 1221, 646, -1438, -123, 2232, 1158, -1344, -797, 1194, 1415, -270, -434, 752, 1258, 146, 188, 1589, 1136, -562, 377, 1978, 1837, 149, -184, 1226, 1796, 1278, 661, 763, 1216, 1112, 1024, 1683, 1750, 656, 219, 1614, 2397, 923, -88, 487, 1756, 1325, 437, 507, 1054, 806, -23, 812, 1646, 835, -1526, -244, 1704, 323, -1043, -894, 637, -99, -1331, -575, 427, -525, -2207, -476, 991, -757, -2769, -1148, 989, -342, -2401, -601, 548, -983, -1845, -175, 721, -736, -2424, 69, 1790, -570, -1919]
2863a919J550J419j425r11J868O39k253j31K243L11k175k33J751M05j239l80R77
2880D97%j450K33K055n69k161N51J287J52j637L35M81J20r69P61j02j72p47L30
2899a005Q71k35j115L35R30l90m08K36M01l16M7N18k9l88K36M93k86L78L43m02
2919B14k91M48L87j37L8k74P87j73o4K03O16o70m43P03O86j189l13Q13O37j251
2939G27j27R92k80r13L00N33l0j323J41J045l7j306J35J428p82j191M92R69p00
2958G3j047O17Q80o39n78L07Q24k19j103N68O00k15r72R45N16p06p45J121Q33
2977A060j235m18J109M76q91r0N00M33p00r7Q21N88j134l55J092j52q40M91Q98
2996A556q27p14Q32L25m96n94M65J14n30P4L07J92q29L15L11k09m77K58L49j89
$$ y = [-1919, -369, 1050, -375, -1286, 582, 1221, -1032, -1163, 1080, 1391, -784, -1017, 734, 1139, -100, -480, 497, 497, -953, -720, 1335, 766, -1395, -844, 443, 595, -1042, -707, -226, -106, -1075, -314, -416, -588, -1335, -1005, -134, -369, -1484, -1149, -219, -609, -1017, -781, -380, -696, -649, -131, -160, -548, -312, 181, -105, 273, 616, 214, -77, 371, 758, 621, 659, 385, 1172, 999, 935, 1138, 1754, 1084, 641, 1344, 2030, 841, 528, 1341, 1978, 727, 600, 1592, 1312, 399, 699, 1232, 1202, -121, 20, 1065, 1028, -278, -143, 1285, 503, -688, -196, 773, 73, -974, -357, 523, -116, -694, -387, 437, 218, -885, -317, 283, 68, -904, 41, 557, -149, -894, 227, 1060, -175, -593, 516, 992, 101, 11, 511, 944, 244, 147, 968, 1556, 422, 67, 1159, 1007, 167, 658, 1556, 729, 15, 847, 1172, 676, 82, 547, 661, 131, 205, 512, 704, -125, 190, 501, 292, -185, 73, 422, 233]
3016B33n28K57N61m78l43M00L25l87m3M98L4r1k09N73O5l62k85O79R1m16K06Q19
3038A599n33o28N60N36n46n60P27N40m19o24K22Q61o14o67Q56K96m78p64P57M03
3058A524p70k59R56K29j359J3J149n10q40K17J281k70r74K19Q06k50p95J61J109
3077A637q01q36N99J286p76j072R88O12r67m14J122J73o21m96Q22N65q75m20J059
3096A585K67r34l06R71m3p62k96J030j30j036m6N29j36m5m03M35J53o50l1P15
3116H67m71q63O05O08o4p82J17L41K23l44o1Q9k15J65J00K17k20j47J15rN65l86
3138D50o8j74L95M86P7m67q2M43n52m4P64r5p53k43J039R3j061o37J300L82r58
3159B95j59P13j06j346K99J272n4j643l05J777j29j405j73J249n22j260N52J458
$$ y = [233, -295, -38, 523, 45, -298, 102, 427, 40, -3, 495, 529, 438, 229, 802, 867, 505, 220, 899, 990, 574, 780, 1599, 1066, 438, 998, 1534, 988, 428, 1155, 1695, 1276, 652, 874, 1735, 1121, 454, 1310, 1606, 1128, 364, 1121, 1524, 754, 495, 1451, 1680, 321, 334, 1483, 973, 133, 350, 1631, 1361, 387, 606, 1412, 1162, 367, 528, 1637, 836, 0, 599, 1885, 1109, 37, 1025, 1637, 670, 256, 1378, 1551, 930, 434, 1256, 1821, 946, 526, 1585, 1852, 918, 612, 1583, 1540, 778, 482, 1512, 1382, 346, 300, 829, 693, 648, 245, 680, 833, 183, 152, 867, 396, -467, 138, 746, 682, -100, 17, 358, 581, 237, 176, 265, 50, 215, 315, 532, 312, 165, 280, 271, 836, 450, 382, 208, 603, 1089, 1166, 699, 617, 1060, 508, 464, 1228, 1133, 380, 137, 1176, 1269, 208, -429, 871, 1253, 295, 136, 849, 743, -603, -304, 968, 914, -729, -1034, 743, 614, -791, -964, 285, -237, -1497, -945, 513]
3177E13o78j543O33J927p05j911O11J583m12j610Q26J172r92j273J446J540q96
3194B31j898J197J647p26r97M21J338j100n38J380R19j237j252J456J351j023
3210A169j202O21J171r09l02R49K14j105n62J366O84q98q83M68J178o06j498O84
3228E39N58n31k34N92N8q27o05N32J089m89j251J12J051n7q65J41L29k35m01M76
3248a8O94l3j657M72J323M24j800m22J130Q24j199P2P92l21j104N09K043l90j927
3267e88k29J896O63j580k87J158M6j179K44K127j022k193P55K334l55k091n2J531
3285A178J88j392L15J419n19k262P15K739r82k815N80K326n8k259Q52P51l81j395
3303a000J179J278j186k080J107K264m25k253j32K261n83j368Q71P82q60j079
$$ y = [513, -165, -1708, -1075, 852, 147, -1764, -1153, 430, 18, -1592, -766, 406, -586, -1859, -413, 1127, 231, -1667, -470, 1177, 451, -546, -125, 1213, 113, -425, 955, 1874, 637, -615, 841, 2192, 1169, -33, 588, 1759, 850, 548, 1497, 1711, 606, 44, 1410, 2094, 1196, 313, 781, 1959, 1353, -145, 539, 1097, 566, 332, 924, 982, 155, -450, 82, 1171, 682, -569, -457, 594, 537, -328, -187, 142, -93, -494, -18, 676, 643, -1014, -542, 781, 1205, -595, -1017, 113, 937, -262, -190, 602, 281, -823, -314, 1729, 1339, -588, -817, 1079, 1742, 162, -125, 1033, 1079, -100, 144, 2271, 1249, -944, -189, 2145, 1790, -301, -353, 1178, 1366, -26, 289, 1708, 1189, -1073, -358, 2381, 1399, -1416, -836, 1490, 1432, -827, 25, 776, 395, -1000, 179, 1457, 271, -1809, -702, 1562, 1137, -1116, -1248, 1013, 430, -938, -67, 715, -145, -1224]
3319a224J208J439o96k285Q08J633M3j558K62K90j70m33R65N61j192j046R68J338
3337I11m89j397O3J195o7o58P7M49m47l88P93O49o62j226M19J448N09j343p36
3356i00R29N64o67k58J005m1j688N72J527K0j606n85J648P59j045n61O16M17q17
3375a11Q1J514J4j998j92K007P54k068p69J143J084j780Q1J463o28j619K41K093
3393A310r0k360k17K466L75k023n51J705k72j265K02K082m39k421O00K147j8k087
3411h56k95J675J65j360L64Q35n3j822J079J696n45j722L39J830o5j403R6J015
3429I73m49m96L87R62p88j545Q89J945k31j520m18J232k4m21j15J36j15n14M36
3448C24O57m90p70p2J066J94j018l36M43L86l61l63P19k06p54N8O06M64j123n89
$$ y = [-1224, -16, 1423, 727, -1558, -750, 883, 926, -632, -370, -80, -250, -683, 282, 843, -349, -1395, -427, 911, 422, -975, -912, 283, 216, -442, -365, 84, -363, -751, 42, 691, 29, -1197, -778, 670, 1179, -164, -900, 29, 593, -74, -332, 673, 632, -1056, -484, 1043, 1063, -543, -1128, 520, 1279, 234, -327, 289, 706, -111, -30, 1484, 1498, -500, -692, 1315, 2069, 1, -768, 375, 1459, -321, -240, 1223, 595, -1024, -783, 1310, 1220, -1140, -1357, 1109, 1484, -539, -1090, 615, 343, -922, -720, 1362, 923, -1498, -898, 1249, 1231, -856, -1151, 524, 689, -671, -307, 528, 475, -1347, -268, 1428, 883, -839, -500, 1330, 1265, -138, -42, 973, 524, 28, 415, 1377, 589, -956, -67, 1878, 1647, 127, -291, 941, 917, 496, 381, 517, 402, -112, 324, 981, 491, -279, -351, 715, 909, -109, -445, -2, 384, 23, -340, 379, 173, -581, -523, 83, 547, -576, -1165]
3468a165R51J187j198o09P67N51q35j42J032k5p12n52J056R90r81r12N37J106
3486A046q50j35M54M55r07m32J344L46j239l59R25O72q70p83J126J35o87k13J335
3505A363j41r46p54J888J38j301l70P39M00j028r5O69N57j532Q1R95L19j354j70
3524e42J078O8p56r7J272o03o72N25P42m46o71P8J027R3r32j6R51m1o81J10O19
3545A106l00l94P42K38m11k49j44N1Q49m21m54M72q0O5j23k6R3k43j37M81m34
3566F81J63j53k14L95j40k69j5J94k33n57M51L67p9l51j88K37K26m81M0M08k43
3587B39m7n17P67j81l53q7P46n23n73M18M73l67k63N86j29k43o17O07M17l21p32
3608g00O12O44p64n62O30P02j010l3M29K24n03nL01M18n25n32O47L18l41k06L85
$$ y = [-1165, -214, 973, -225, -834, -67, 484, -351, -493, 539, 514, -198, -750, 306, 1296, 315, -597, -60, 1046, 196, 61, 515, 970, 63, -369, 975, 1321, 82, -277, 648, 1320, 450, -333, 793, 928, 241, 28, 1363, 1222, 276, -478, 1410, 1548, 247, -123, 616, 1016, -12, -107, 562, 1119, -413, -332, 663, 982, -372, -542, 536, 604, -152, -249, 1023, 420, -252, 273, 1015, 569, -102, -24, 1003, 1096, 164, 148, 1099, 1058, 377, 487, 1106, 806, 412, 1154, 1392, 981, 732, 588, 639, 1488, 1067, 613, 1085, 1005, 1070, 947, 921, 1014, 771, 634, 1115, 681, 844, 691, 477, 872, 732, 463, 448, 642, 409, -148, 303, 670, 591, 240, 52, 289, 515, 34, 74, 482, 239, 192, -325, 442, 261, -92, -179, 567, 44, -529, -111, 362, -5, -268, 318, 189, -54, -671, -64, 353, 32, -700, -88, 556, -208, -770, -140, 562, -448, -481, -52, 172, -331, -336, -35, 383, -142, -674, -27, 291, -50, -256, 129]
3629A29r3l05j8L23J87p38l7P60P5o50L56j51J71Q7j11L86k16k23k14O09q0j94
3651E3qJ48j68n9J68M4j05J41K9m5m04N31q3J27j93p6K69r6k12j19M56m71J40
3674F7J45K89n89M4N79k74m07L45L94k45o04M74N5n9o1L19K47o08j81K65L24n17
3696Bk6M11J65n04K21M17q4m72k45Q10o2m84M07J7Pl14j77M55O8m93K8P27j32
3719G42q96O27%l99pL19N07o97m52P38K42m77n15M38K99m73q2L04L94r50l8O21
3741B45J0p01J1Q26np08j15N78j16k7j81j7M08n21R0M67J78l06j58L58P2p7K6
3764C37N1m23J73J16J50J93k30j96L82J75j31j24J0p9J42J24o3k71m5p7j05K33
3786C42J51k47k69L25J87o77L1M02j36l28M3K86J06p11k12J075k08o25k75N88
$$ y = [129, 36, -269, -287, 36, 223, -515, -552, 208, 283, -367, -11, -162, 9, 96, -15, 371, 155, -68, -282, 327, 247, 53, 45, 193, 25, -34, 134, 178, 73, 214, 243, 198, -206, 325, 242, 369, 176, 100, 369, 273, 61, -58, 398, -73, 67, 212, 501, -88, -44, 535, 261, -146, 199, 593, 348, -256, 218, 273, 214, 153, 472, 719, 111, -70, 195, 519, 2, -24, 387, 552, 48, 269, 686, 602, 130, -115, 695, 633, 149, 556, 573, 580, 266, 89, 544, 612, 119, 147, 874, 742, -154, 473, 473, 74, 67, 386, 893, 196, -256, 482, 724, 247, -268, 170, 469, -4, -86, 218, 612, -338, -376, 245, 255, -446, -435, 391, 386, -322, -437, 141, 25, -2, -183, -200, 208, -313, -223, 244, 422, 116, -42, 316, 388, 311, 337, 388, -35, 138, 254, 404, 597, 367, 171, 553, 728, 597, 473, 483, 404, 546, 670, 607, 336, 291, 214, 109, 342, 493, 246, -23, 302, 489, -188, -157, 245, 109, -219, -176, 110, 216, -495, -707, 368, 160, -465, -740, -152]
3806a52L78o23k0O26k26j140R41P18n00q90J83J233k88p59K42M82K35p33O00O66
3826I73q82m99O66R03o74p36M59O41k74r42N60O26m07n65O62O35o62o12M43O75
3846I90o72o62O63L06o59k64R33j04p29j43N27R10r52j073Q63N00p43M8M89o2
3866A66n47j71O77L11p58l68L68M07K99j058N3P93k38m06L54K46l49m10N10O59
3886E38o52m46LP93l05j90k07M88q4j12k49Q66m58q76N02P69j35j122M06M05K91
3907B25l98l0O12j20j151L39J264n08r30J62J158J25q95k42N92L29o36r2J314
3926A118r33q54N15J587p17j425M23J296l45o96K67O21k95r40O26R82q00j310
3944h80M45J338p5j193M70P37l20j172O54P63j042n81R97R71j015j126O36P63
$$ y = [-152, 226, -397, -417, 209, -17, -1157, -216, 502, 2, -888, -705, 528, 240, -519, -277, 205, 440, -293, 307, 973, 91, -408, 258, 1161, 487, -249, 210, 851, 577, -365, 195, 821, 414, -151, 511, 1146, 484, -128, 315, 990, 318, -344, 319, 625, -34, -298, 635, 531, -198, -341, 186, 1096, 144, -929, -66, 434, -309, -261, 228, 166, -381, -552, 125, 436, -322, -690, -322, 85, 384, -674, -621, 172, -66, -472, -118, 128, -221, -631, -121, 538, -114, -560, -557, 236, -69, -259, -466, 22, -62, -174, -423, 443, -15, -891, -389, 380, 245, -877, -471, -66, 225, -173, -203, 409, 289, -862, -523, 741, 233, -697, -535, 623, 748, -147, -389, 203, 532, -104, -196, 1118, 185, -669, -154, 1433, 716, -709, -286, 1010, 665, -31, 236, 857, 562, -378, 248, 1230, 430, -880, -435, 903, 828, -365, 105, 842, 522, -650, 4, 767, -275, -856, 141, 1112, 97, -1029, -393, 370]
3962C70J9o60O3N52n59q59J154N25m04j008Q32J016o70n69J98O59n56l75Q00O1
3982E89l99n61R17N60m90o41J60M86L34n28K6J07K78n34K12K09O4r09L55O60J53
4003A048p26o42Q63N30o65k93N10q9r90N44P72k65j098k68J441P8j086k12P44
4022A96j02m77k67J094j20j141J77J347k77j171k71J480K03j024K78M46k58r28
4040h15O17R99l3j462L00J450m17q51J2Q29O0o47LJ041o57o95N09R18m92j165
4060d96P45Q42p05n38K64Q11n87q88P10R28o50j318N40Q88l95q16O48J52qp69
4080f42Q11K71o63o97P58L59m05k16l63R69J66p50J43L05q1k23J64N06m46k43
4100b77P8M57J69l14l16L98M2j72r5L19M75j332P17J34M21j021n6P08L35o68l60
$$ y = [370, 389, -271, -208, 344, -215, -1074, 80, 605, 201, -807, 25, 1041, 371, -198, 0, 659, 103, -272, 528, 589, 190, -371, 546, 1106, 616, -25, 135, 621, 955, 427, 453, 560, 838, 304, 516, 725, 789, -120, 235, 895, 1048, 322, -320, 543, 1073, 408, 115, 625, 536, -454, 90, 862, 597, -501, -769, 672, 750, -336, -548, 196, 94, -383, -650, 444, 324, -817, -640, 707, 430, -741, -1012, 468, 671, -353, -75, 371, 113, -815, -198, 801, 768, -694, -394, 1056, 639, -212, -200, 629, 689, 42, 45, 1086, 429, -266, 243, 1161, 669, -496, 249, 1091, 386, -152, 112, 923, 336, -552, 158, 1086, 436, -882, -342, 546, 151, -665, -17, 135, 127, -642, 169, 440, -223, -920, -162, 197, -208, -424, -787, 182, 348, -402, -259, 46, -35, -258, -94, 412, -34, -277, -199, 258, 427, 113, -203, 195, 237, 65, -30, 289, 764, -568, 149, 283, 704, -317, -373, 335, 670, 2, -358]
4121c58O59L8n99o7Q36L2q73o7P36K24q46n06N50O69j001p0Q87N6j036K31M51
4142e4K86q74l28J177p0o78l09P83Q1o62J3Q88j59p41K01P10J02n78m67J135j89
4163B67o18J69L81J07n81K9N03P9o95N5P51k90o43j44J068j1n75q3M58m8m84L37
4185C2O31n41o04Q2O10n7k81K6N0L93n18K28M69n91l21L55L61K74n80j33L73l26
4207f8j50M05r4K55j68k31J88p4mr6M45J21n3m10j51L04J61o52M58J82m55j62
4229b49J91L14p3o90J65P15n71j13J27J21n0R2k56N36n48P4NM44k44l32L42P4
4251G4K01m86M13J25n97K15J26K82k21l71N25j31r7K17J0M79l66j59K6L52n94
4272B3N04K44K5n70j80M72P3l80K5M37J07n50K77J01k8k27j14K85l6j79L9J56
$$ y = [-358, 301, 339, -260, -327, 509, 541, -332, -399, 337, 561, -285, -791, -241, 428, -573, -643, 244, 300, -736, -505, -54, 232, -642, -970, 207, 137, -541, -850, -67, 14, -648, -635, 253, 94, -647, -446, 264, 366, -212, -679, 456, 267, -351, -182, 199, 306, -275, -246, 257, 336, -359, -304, 447, 157, -486, -630, 438, 427, -148, -231, 227, 179, -305, 32, 663, 122, -482, -400, 210, 153, -128, -102, -52, 341, -177, 51, 520, -71, -392, -37, 324, 598, 18, -115, 258, -68, -218, 187, 93, 348, 180, -51, 137, 63, 59, -37, 408, 529, 476, 66, -85, 219, 380, -272, 186, 368, -87, -249, -58, 256, 183, -507, -342, 373, -198, -311, -184, -63, -113, -21, -277, 259, -289, -215, -210, 234, -10, -342, 0, 74, 275, -211, 202, 327, -270, -55, 71, 353, 132, -239, 286, 155, 58, 275, 285, 764, 398, 239, 265, 617, 23, 527, 771, 796, 226, 46, 518, 591, 211, 236, 673, 780, 230, 507, 608, 580, 353, 239, 524, 488, 309, 348, 504]
4294E04k23k48J60J5J62j87l01M13l61P2L9J71m1r0K83l14M0m3K81j54l51M16
4316B43j83l01L37j26k44K42J66n4j28K26K27k42j02k43L24K50k63j26K49p4j84
4337fm7M30J02o57K30K60J10k24p2J64l04J47k70M57K27m27j07M69l65m57K06
4358a34L69l6l18K31L62m93k65K25J09k31k60K92r6l9k71M9K75l77j65M87L3j90
4380d43N7P7j3L4l58M45L77m07j04K36K07m48K54Rj1Q5l88K89M47j98j72M81l98
4403E8rR4J10n6j8j08K17M5j66L09m6j34k67J56K9l19J30N4j54j16J96m96P0N71
4427A50l61Nj65j1n7K32j84Q1k24k25J16K37L16n09o6M46J95m81L00L27k13l00
4449c91J69O20l98k32L71K42j02l66J09q2M80l36J39O19l38o12N02K90k13k43
$$ y = [504, 281, 33, 193, 208, 370, 183, -118, 295, -66, 6, 45, 216, 175, 85, 368, 54, 94, 51, 332, 178, -173, 243, 60, -241, 96, -30, -274, -32, 134, 80, -48, 178, 405, 163, 61, -182, 142, 392, 129, 3, 252, 178, -6, -53, 377, 479, -178, 52, 312, 422, 198, 126, 290, -14, 133, -137, 320, 547, 120, 13, 482, 117, -340, -134, 235, 199, -119, 112, 474, -19, -284, -59, 50, -181, -441, -149, -245, -284, -555, -506, -231, -608, -773, -286, -253, -443, -386, -309, -322, -288, -646, -201, 176, -231, -335, -99, 108, -340, -86, -77, -88, -3, -391, -102, 345, 147, -25, 456, 58, 49, 143, 253, 197, 179, 71, 288, 333, 167, 476, 430, 296, 29, 185, 214, -105, 25, 79, -75, -191, 5, -491, -421, 150, -211, -206, -371, -382, -439, -207, -391, -310, -534, -759, -643, -406, -90, -599, -665, -219, -24, -505, -205, 122, -91, -391, -222, 398, 0, -232, 139, 381, 279, -87, 22, -60, 420, 84, 223, 842, 504, -108, 394, 684, 471, 228]
4469B28j52P42o56k02O58j70l11n59O15O9j05m62L39Q4k03r9M42k69l71q2L60
4490a04J38n51J65K17M79l83l14M74J16k71OL07k62k36R7N05jl39j53K63L59k31
4512B81r5k1M1j05j0K5K50j83l57M17K98n53o1K63j47M75p69J71K29m94P2P0M21
4535B18l43l22K92L76J47o85k12Q18r2m41J08O40m64n36P0Q94j43p08J48P92j80
4556C77j78m0N00o52m23L98M14l35l54K6R51k89j138O30O13l08m69L92M6j94n50
4577e83Q25J70m27o85J94J109n16p58M72O4k68j41N12J71n16o95O47Q82l84o94
4597f21J91M74m20k85L82L79p91j77N62O40n70o47M27Q06m04m14K48J66j24l04
4617d82M22M21p36P8K51O42o09o00M65J47J59l71O6K95m13k08M88M96m87n29J79
$$ y = [228, 76, 818, 162, -40, 618, 448, 137, -422, 193, 262, 157, -305, 34, 118, -85, -184, 258, -11, -382, -464, -104, 34, -517, -352, -135, 344, -39, -353, 121, 237, -34, -28, 279, 17, -219, -122, 383, 382, 43, -110, 153, 512, 281, 186, 165, 206, 101, 91, 116, 366, 183, -174, 243, 541, -12, -73, 190, 43, 518, -251, -80, 149, -345, -273, -203, 218, -125, -447, -155, 221, 368, -317, -529, 289, 197, -244, -136, 504, 40, -496, -426, 468, 325, -383, -235, 557, 377, 199, 159, 659, 7, -416, -18, 396, 61, -293, -267, 684, 395, -743, -113, 500, 192, -277, 115, 161, -33, -583, 242, 412, -15, -700, -506, 603, 87, -671, -199, -135, -403, -544, -32, 139, -377, -1072, -425, 457, 73, -621, -430, 44, -376, -661, -279, 100, -691, -868, -306, 334, -236, -883, -456, 350, -54, -468, -220, -54, -178, -482, -60, 361, -375, -297, -46, 596, -13, -613, -148, -1, 158, -213, -147, 148, -265, -473, 15, 511, 24, -505, -326]
4638c26P36j26m78qK34l0j28N8K74l73m62K20O24j53m91j7L86n9j26k64O87n35
4660c57n3K03P37o04m35Q6L91K83p86J03M84j54l82J09O50n07k34M13P66o06o89
4681e82K28N49J46m96K55M38l48p22O20N44m31o39L81J024n62o31M1O01j80n23
4701b87K45O27n33o65O13N98m89o93K14O32j23p51K07N68j27n16M02M26o21o65
4721i38O47Q10j15p78J08M51Ok38j01O82o01m30K89M76j65k26J53J95K84n29M6
4742B6L47k73j12K26J51o7l81J23K34j9k74l3M97j04m56L7j06O90n03Q1K59j6
4764C27l67k65P40j11o16NK96M05n34J25K89J4m51K65m6K75j80l70L02M64p71
4785b04J86M61m59k54L36K86k36k74K5J86J30m56J52L99K3n43L58K63l12l74K50
$$ y = [-326, 410, 284, -194, -202, 32, 2, -126, -68, 206, -167, -629, -409, 215, 62, -429, -446, -60, -119, -245, -509, 178, -357, -410, -207, 530, -74, -509, -423, -32, 251, -535, -432, 52, -102, -484, -375, 275, -232, -466, -53, 713, 107, -582, -354, 195, 341, -155, 100, 538, 190, -532, 88, 632, 201, -438, -57, 967, 405, -226, -185, 416, 236, -287, -42, 585, 52, -613, 0, 598, 109, -584, -370, 262, 139, -612, -405, 163, 36, -480, -78, 348, -273, -938, -291, 519, 404, -374, -266, 185, 191, -47, -148, 534, -67, -497, -208, 268, 103, -123, 30, 225, 509, -20, 26, 373, 100, -12, 214, 365, 298, -83, 40, 274, 255, -19, -52, 445, 341, -115, -78, -184, 506, 3, 84, 343, 327, -40, -305, 435, 324, -292, -287, 9, 414, -120, 5, 294, 308, -143, 122, 76, 351, 171, -199, 103, 567, -204, -18, 443, -16, -270, 66, 352, 116, -158, -133, 53, 183, -273, -121, 278, 301, -242, 116, 379, 67, -307, -57]
4806e7M13k05o26K02O99k42o55K16M56K1k37j86M15J09k84K1L30p1m63L59J11
4827C26j97q0J23J96o8q8j99J86K7k36J34K35K92o25J75K64n12J8K38J6l6k24
4849c5j99L64p0j90j80L35J28n19N0L39m60K52j68k9J98l57k20P05l0l00j21L43
4871a64J91m11P9L82l34l12M23P9R2k42j79L64J13o9j53J49J77j80p8N98m14k7
4893H4n4R5K04k35k03K18J03k14J28j29J05l18j24L99R8l42o1J58J08k39k74N38
4915D5J58m56j28J81J29n70K63K07N0q1K12O1n87R4N31k69L0K6j74J97J1k17J00
4938a87K19k38R6k88J45j4J83J02K18k71mK53k18j50k09L06j08J13k06J80n3N8
4960g3K42k03q6K3J06l03L60j40Q7j30O0K2J51j92j90K57l1L3j77K95j06q1J78
$$ y = [-57, 356, 151, -475, -273, 426, 184, -471, -255, 201, 222, -15, -201, 214, 323, 39, 60, 390, 319, -144, 215, 326, 129, 49, 172, 368, 300, 212, 13, 199, 226, -10, 124, 359, 651, 26, 201, 465, -47, -29, 209, 225, 189, -35, -234, 130, 60, -130, -310, 25, 153, -366, -316, 23, -437, -185, -353, -382, -184, -541, -761, -56, -86, -386, -507, -164, 27, -384, -305, 77, -257, -569, -146, -67, 25, -217, -396, -32, 81, 12, -141, 8, 185, 5, -73, 525, 111, 84, 30, 125, 329, 94, -109, 109, 212, -2, 126, -3, 102, -216, -340, 59, 157, -185, -246, -88, 20, -219, -493, 45, 203, -253, -381, -200, -71, -641, -378, -171, -121, -202, 10, 71, -516, -422, 109, -160, -130, -104, -278, -81, -70, -287, -187, 32, -206, -110, -398, -253, -267, -84, 18, 236, -35, -39, 214, -4, -154, -363, -57, -165, -52, -258, -78, -131, -73, 169, -34, -120, -97, 9, -294, 66, -74, 13, -117, -57, -35, 116, -76, -266, -9, -40, -7, -184, 111, 5, -76, 102]
4983A02J02k67O0L66l51j6r6j17K35q6J3j3R1m28L04J88p8m5k07K20J34l84K1
5006b52K7L76j80l53K33L48k05j89J94M47p24K5M53P2l77K51j36J6Q5j14J80P6
5028B53m56L1R04m15l09J80M0J0k46K51J57l67L4l52M41L0k30N2L26l1k85j78
5050a60N8L15j64r6J45O3m14R4L1K16k50N1L43J59l63l49k02N03R4k54NL31M9
5073B05j69nj04K48o5L42M1l72N3o7N4o3%j01L28m02k47L46J7J04n34Q1J31r6
5097b75k02K05J84k27m29K04O86n33j5O4J50N9j31L79J18m88m33N78N0j37j70
5118c63J38L45k23l64L99L22q01L59N39o6l50j77O0L76l97l3M46k94K23m05M48
5139A82j12k70j04J53l0j3k25K76K26l47m7K48j06l9j18J78j80j92j50L67L0l53
$$ y = [102, 204, -63, -3, 363, 12, -4, -100, -217, 18, -68, -55, -68, 23, -405, -101, 87, 9, -36, -243, -23, 111, -273, -252, -225, 151, -29, -382, -149, 199, -6, -195, -1, 446, -278, -253, 200, 272, -105, 146, 10, 26, 111, -3, 177, 253, -203, -172, 732, 317, 8, 188, 228, 238, -8, 243, 400, 33, 67, -285, 156, 186, -44, 8, 334, 303, 18, -160, -102, 213, 49, -47, 98, 161, -253, -159, -128, 88, -162, -111, 232, 391, 28, -321, -523, -20, 74, -180, -175, 156, 205, 36, 31, -73, 175, 110, 452, 493, 121, 174, 107, 161, 98, 98, -3, 325, -77, -324, 22, 39, 143, -391, -310, -179, -275, -477, -272, -88, -315, -744, -540, 146, -387, -402, -338, -188, -129, -260, 119, 237, -251, -684, -106, -56, -193, -363, -225, 120, -103, -467, -68, 254, -547, -188, 351, 285, -65, -242, -182, 194, -203, -236, 210, -84, 139, -266, 182, 70, -200, -304, -151, -181, -194, -419, -143, 83, -264, -311, -63, -169, -208, -326, -148, -328, -520, -670, -303, -273, -626]
5161f26p9M54j04l79K73K72j17n04J86M53M17l78j42J85o9L73l47O9K66r4O4r9
5183G4K64j14J41j27K45j78l57K5K39k0m7Q5j37J36n28K1O00n49k1K64K87m74
5205a71j58O9P3L8m91M48K94j37m39J09M16Q2q03K67O93m40l68L56J47k60l71
5226f46N88O77q40j25L21M39j44l5nJ82m07jM92l74Q5j78L62K84k81n37M90J10
5248D57M3m98M70K17n22l63O73J07q09j72N16N15n21j47K73K25l34k03J28l0k96
5269b71K3J25K88l81k97j08O26j18K0J31j70Jj42K94K20k23l97O65M0p7n48P2
5291b27K90Nj58J72N97l79k44K53N23o55j42J85N81n36k04M5K26m26L3J26M42
5312E07j99l92L13J18j88k94J60J89J79q46L33p5O5k41m2Q89m48n65N8J43M66
$$ y = [-626, -705, -251, -355, -734, -461, -189, -306, -810, -624, -171, 246, -132, -274, -89, -158, 215, -132, -63, 203, 109, 173, 74, 338, 224, 365, 238, 483, 305, -52, -27, 212, 192, 145, 230, 93, 229, -299, -278, 322, -227, -248, 16, 303, -171, -329, -260, -187, -149, -640, -192, 102, -35, -474, -365, 51, 133, -670, -403, 290, -150, -518, -162, -15, -275, -646, -58, 619, -221, -346, -25, 414, 270, 235, 230, 412, 5, 4, 496, 122, 207, 29, 391, 675, 394, -143, 347, 457, 500, 2, 472, 689, 167, -196, 477, 584, -225, -397, 119, 634, 113, -34, 239, 464, 130, -73, 55, 25, -271, -248, -123, 165, -216, -513, -621, 5, -113, -93, 38, -132, -131, -273, 21, 241, 18, -379, 286, 326, 249, -299, -227, 63, 68, -90, 82, 679, 300, 56, 309, 832, 177, 35, 220, 801, 265, 61, 106, 332, -94, -61, 65, 507, 308, -84, 229, 347, 159, -135, 25, 214, 393, -453, -120, -195, -130, -371, -413, 476, 28, -537, -479, -336, 130]
5333A30q75K62O11k83o3N6M17m35k48L67P5K68m75P5K93ln17L68M18n14L3R3L01
5356C54m1o64O58K52m17j51j6K83l65J88o8J76m7l34L33N76o79n62M62n1K34o04
5378d83N26l03J25r5K40j15j5l49L22L17jo83K26NK32l53K77RP7r8o3L39J63o40
5402c40K25J87J57j42Oj0J42l85j83O39P5l04j23N57k36l66K10J65j78k76J10
5423g0M63k90o35K55K04J53p11M31O79n15j86P8K51l38j28p8L94k38j15N3J00
5444b43L82p30J99K33K0j2J10J45j65rJ24K21m6m09K80L00Q8m96K62J09k5j28
5466B10O0P9J32l51J86PJ81o58K82R9M3n00M38k4p7j70r7K06j16Q9l3j89J9P9
5490a05j1j50K95k06P2l4J4k89L20m0k84L59j54j64M23r8n8l0n9J46j13J94K81
$$ y = [130, -745, -483, 128, -155, -218, -162, 255, -180, -428, -61, 14, 282, -193, -118, 175, 172, -345, 23, 441, -73, -40, 53, 354, 313, -351, 307, 559, 142, -9, -25, 258, -107, 81, 13, 189, 142, -192, 141, 717, 38, -524, -62, -113, 121, -483, 43, -260, -135, -230, 10, -105, -120, -469, -147, 170, 169, -514, -288, -283, -51, -404, -127, -118, -41, -139, -202, 137, 300, -340, -115, 72, 229, 87, 93, 83, 225, -160, -343, 296, 371, 67, -56, 501, 265, -101, 109, 274, 96, -180, -70, 393, 103, -532, -277, -73, 80, -631, -200, 479, -36, -222, -144, 107, -231, -359, -437, -43, -281, -396, -343, -243, 139, -591, -392, -159, -139, -151, -41, 104, -61, -70, 54, 275, 229, -180, 100, 400, 488, -8, 254, 363, 338, 210, 270, 349, 481, 130, 316, 323, 504, -154, 128, 227, 270, -230, 208, 184, 107, -63, -160, 46, -70, 19, -14, -203, -184, -105, -116, -266, 29, -177, -105, -139, -125, -414, -94, -134, -418, -59, -213, -377, 46, -52, -110, -140, -199, -53, -166, 28, 309]
5513C09l33rL81Q0J8k96j11K64J4k12K11k9Lk07M13j23k77M9P9J25J59n11M37
5536D34J30j01j28k34K41j00l70J8M24k50j80L56k38K78m05K24K13n66L98RK37
5557C90l59j92M56m5j13j18K44P4k54r7J50k01k30M96l3k02j64L88K14l42j77
5578a15K94j50J02k90K15mJ13l48m1J58j24J37R5K90m87M35l03j72j8K68J34p2
5600A17R2k55J60k17M65k67j13L56l44J32N1k76K51j75j17L41J40Ko20K84j15
5621a08P3j51L3J22j44J50l4L1j85o0j0K60J09m80N29j03l82P5J03n6L9l15R6
5644d08L66k82Q3M4R4O9p6o6K3l31K90M46k11M5j71l4J31j71J95l2l7R3j24Q4
5668B0R5n9k83K49L29q06L27K56L3j92J07J05j55r5J8L03n26J89k02J26J75j42
$$ y = [309, -24, -33, 348, 428, 446, 150, 39, 303, 317, 105, 316, 287, 290, 83, 496, 373, 96, 145, 224, 349, 508, -3, 434, 564, 463, 335, 101, 342, 242, -128, -110, 314, 64, -116, 240, 2, 280, -125, 99, 312, -254, 144, 153, 390, 31, -161, 295, 250, 137, 19, 263, 337, 83, -14, 136, -65, -295, 201, 168, -34, -198, 190, 404, 62, -115, 179, 29, 131, -159, 56, 52, 165, -183, -224, -66, -190, -53, 42, 332, -155, 280, -23, -195, -213, 55, 189, 117, 209, -46, 114, -103, 362, 95, -18, 338, -6, 126, 177, -99, 152, -23, -140, 201, 341, 343, -277, 7, -108, -35, -186, -153, -31, -175, -25, -59, -28, -213, -273, -283, -23, 86, -394, 135, 32, -350, -275, -172, -228, -189, -504, -408, -42, -324, -241, -197, -103, -34, -110, -176, -153, -484, -194, 252, 41, 86, -85, -119, 12, -159, 36, 4, -33, 60, -64, 20, 115, 56, -227, 22, 351, -455, -128, 128, 161, -31, 76, 181, 26, -69, -51, 252, -274, -85, -287, -161, 14, -128]
5690a28k87M51R7j9o4j53p8%O0J45K30l52rL11l04R7J1l2m7n1KK27k21L24k77
5715f7pK38m34L28J84m2l28M0O5J33j59Q5j67M06l44L79l84J40L9k44K24K37k76
5738D6k75J61K03K05o72L16N0J38K00r7l3j39J3K14j85j82j54L88J27j75n8Q8
5760A79j69J26l27L00j43j64J06K24K4k11J35k01J50o1l62L83J2k0j49K55K11
5781B98k09j94N8K49o17M76l45Q10q42J44O20k99j09l25O22k29K00o8j51K36k36
5802H9p9K90J85m28j49N21K0m72K48K27L5k43p3j59N25l14k99R5J35r1k30K16
5824D9K77j64l02J43j21Q3j7J36j19r2O4l8J25j31j62J1K71Q0l82K2M71R9o12
5847c09L76N5j92Nm9K71j87R1m55M86m58L98N0k03J31j15Q8N02m79o2k91L37j83
$$ y = [-128, -415, 36, 133, 114, 50, -103, -181, -181, -121, 24, 254, -98, -107, 204, -100, -3, 8, -24, -71, -122, -120, 107, -114, 210, -67, -74, 164, -270, 58, 242, 200, -128, -88, -23, 110, -49, 36, -131, 275, -69, 310, -74, 66, 105, -139, 85, 322, 46, -229, -68, 135, 340, -332, -16, 34, 172, 372, 275, 242, 103, 116, 330, 145, -37, -191, 197, 324, 149, 91, 179, 10, 136, -191, 109, -34, -198, -92, 132, 156, -55, 80, -121, 29, -32, -394, -11, 1, -19, -168, 87, 298, 89, -105, -47, 202, -415, 61, -284, 526, -316, -172, 448, 149, 40, -285, 337, 108, 308, 240, 89, 325, 89, 10, 300, 485, 57, -92, 429, 449, -23, 225, 452, 487, 244, 171, 12, 537, 223, -76, 19, 154, 63, -167, 49, 326, 162, -140, 3, -118, -35, -52, 84, -35, -127, -63, -101, 24, -107, -269, -258, 13, 93, -289, -267, 204, 303, -309, 67, 122, -70, -65, -114, 157, -30, 61, -394, 92, -366, 32, 82, -121, 10, -105, -17, 485, 6, -56, -347, -10, -193]
5870a93n2K02K49l00m74O94J41l16l40K06K56j86l8N6J41k20j72K94j76N4m03
5891e77N38Q6m16j48O62j02J31k55K20k09qj00L26q7r6r7J89J36j84j42L03l1
5913A39j73J6m2K67l82j21M97O8k88k57O8K39k64J40j01K72k38k97L94J80m4l53
5935b80K19O46o87k21K48K40k33j94K29J24j77N4J61m14O57m40l7K64k92K23j41
5956e1M15Qp19N34J08k91k36K36L77J26m60j74N02l07j70L4M34j94k03L85j03
5977B51j07k28j8L91J39n88J79R9j08k96M33J77m05l2l3M46k71l22J26L11k8m53
5999c37M34J4l70M14j15K91l86j04J77PQ2k78j2M65k39j90M15Q0n38M05k9N27
6021G13l50K9j02l44K72j05L8N1mk68M53K4q4o22M15K44n00m2J96M1j96R0q4K4
$$ y = [-193, -245, -43, 206, -94, -568, 126, 267, -49, -389, -183, 73, -113, -151, -95, 46, -174, -346, -52, -228, -174, -577, -39, 47, -369, -517, 145, 43, 174, -81, 139, -70, -78, -178, 148, 61, -35, -132, 57, 193, 9, -133, 170, 139, -34, -18, -60, 207, -175, -296, 201, 269, -19, -276, -208, 31, -233, -93, -194, 78, -160, -457, -63, 117, 73, -280, -61, 585, -102, -323, -75, 165, -68, -262, -33, 91, -86, -32, 129, -285, 372, -68, -105, 159, -133, 90, -51, 364, 372, -347, 187, 295, 4, -232, 4, 381, 507, 47, -127, 375, 68, -102, -68, 366, 172, -31, 354, 251, 144, -84, -102, 289, 428, -160, 19, 118, 10, -286, 147, 324, -81, -113, -146, 300, 29, -293, -167, 144, 116, -337, 97, 111, -259, 155, 40, 331, -55, -159, 18, 25, 107, -171, -183, 282, 43, -147, 268, 348, -190, 215, 186, 713, 363, 392, 290, -54, 218, 113, 151, 202, 198, -70, 383, 407, 323, -299, 116, 360, -140, -182, 14, 55, -141, -51, -135, -111]
6045a11mj71K01M01n20k64J72L82k18l01J98J74l7j59K75k16Jk08L92l60L07K44
6067A78l43K60j14L39p0K08k57j38o3L95K71o64o7N03j14j9j68M46n1m62K64K91
6089F25l58l44M17N3q7l59MM35%l06l34N43l34l31L13N20l27k61N8j56K74k71
6111b26j17j56N52l39m9L41l9l86J64K16q1j32J92J49Q7k16N5J2M3l87L32M69
6133D84n29M1KM21j80N4l52K34M95m83o1j20L63k75Q3N8p3j62k16M44r1k41j34
6156b38J24L13l36J38J8N4l38j55J81L07m46K8L62J84k84j37J41J7P0P2L3k11
6178a03Q4j19L93K1p9k85K8J04o9j5K81k9j32J3k16J89J65l77M00k7j71l59L86
6201H3k11k50M17k63J07j04j0K47j98Q5j18R7kk48K87j33J0J8L8K42l44N2P9q1
$$ y = [-111, -115, -286, -85, 316, -204, -468, -296, 86, -132, -433, -235, -61, -98, -257, 18, -198, -197, -405, -13, -373, -66, 178, -165, 95, -19, 320, 250, 458, 201, 63, 0, 395, 666, 2, -65, 438, 324, 305, 137, 583, 532, 70, 334, 625, 267, -77, 340, 393, 306, -53, -49, 386, 386, 80, -254, 289, -45, -376, -63, 457, 130, -131, -73, -229, 45, -226, -343, -499, 53, -286, -335, 6, -33, -419, -255, -39, -120, -252, -60, 89, 176, -40, 15, 27, 70, -317, 15, 484, -45, -4, -2, 419, 239, 293, -59, 175, 670, 187, 126, 6, 369, 94, 177, 235, 162, 0, -216, 228, 137, -104, -238, -114, 199, -137, 1, 19, 73, -265, -420, -239, 68, -378, -350, 12, 196, -88, -225, -84, -67, 3, 75, 108, -103, -19, -138, 255, 276, 197, -88, -60, 44, -25, -40, 241, 212, 80, 93, -123, 66, 231, -146, 254, 227, 56, -303, 83, -128, -378, 39, -224, -117, -221, -231, 16, -182, -97, -215, -118, -120, -368, -81, -214, -204, -186, -148, 94, -250, -198, -119, -200]
6225b00K25k71K71Ok61O3P7K62j83M3K00j1J37l03k75O08m62j51K33j3J03K67
6247C65m62K40J32K7l54L43j48k15J64j28K78j80L4k7o2j22K18j44J21k42O7Q2
6269a3o8N6l44L83J13l70K73N4j14j55K8K35P1r1j99J39O9nj36J81K42l11J06
6292A44q6J99l4k7K78k34N1n94Q28m56J08j2J90l04j98J33J17K61k01m6j76K0
6314c9M7J8K08j85j81K91M9m4mn3q4K6k2K23j53J48k01j25J40n5R3k6j16J8Q2
6339E5K4Jn0n4k79R9J57k05l4J95N4L77k74j18J51p5j5j53r7J65k55K08L9J01
6363A7j85p5N94m55o8J19K92j51l07K85K00k61RkJ46j39k39L47j75k07L06r4K20
6386A77k21J14N3P4l27K50j21K48j93mJ11k96oj38O0K64k7k24j15o3K66l0K8L24
$$ y = [-200, 25, -246, 25, 31, -230, -167, -90, 172, -11, 32, 232, 221, 358, 55, -220, 388, -74, -225, 8, -5, 98, 365, -97, 143, 275, 302, -52, 291, 143, -72, 92, -36, 242, 62, 96, 69, 7, -115, 103, -41, 80, -162, -95, -13, -81, -25, -369, 14, 127, -243, 30, 84, -30, -185, -157, 78, 149, 58, -141, -2, 67, 62, -74, 107, 349, 38, 144, 58, 257, 223, 196, 474, 240, 291, -303, 525, 69, 177, 165, 355, 51, -147, -14, 103, 364, 163, 117, -59, -39, 8, 26, 234, 49, -132, 159, 208, 164, 160, 107, 23, 49, 27, 250, 97, 245, 44, -81, 59, 4, 97, 71, -45, -27, 55, 79, 80, 30, -24, -303, -204, -47, -252, -286, -91, -37, 340, 66, -52, 99, 24, 9, -144, -241, -76, -331, -123, -84, 17, -168, -243, 351, -104, -172, -53, 239, 88, -219, 66, 266, 5, 14, 12, 158, 19, -220, 127, -48, -255, 51, -43, 177, -44, 70, 123, 197, -130, 120, -1, 247, 54, 50, 161, -135, -141, -279, -219, 45, 18, -206, -321, -384, -118, -148, -120, 204]
6410B04l82j33J42L37m14m04M75J55l19L79o9J34j62K31j0o1K11n27O06j46o7
6431A80k4K83k58k66K27M2J22j20n9J00K4k17k65O27l89j20J56K99j48L4j99j12
6453h3M73o61K66J09j45Q4M5j58L50o24K45rK40o2k48K15j82J75j47j21K48K8
6475C8m45L89K9r2j04L17n1j6k31K59k9L1k2J03J8N0J22k39J0q3k29J55L0J08
6499A18k41k3N11l93p7J60K98k07J9J5m52J96J72J03Q4l42j46L25K13l43K97n58
6521b71L57j81J24l49P93l41m16M85k90J46j87K14l4o8J26nr4O6J3Pk10K51l6
6544A00j76J27J5j8k08K56j69j68P73l16j50j63K81Ln8J33N2j59N2k00J15J02
6566B24k24k89R9M69j0j58l6K05l49J32m8j4L36k44K33r3m05L6R3r5Q6J42j49
$$ y = [204, -178, -311, -169, 168, -246, -650, -175, -20, -339, 40, -29, 105, -57, 174, 164, 103, 314, -213, 393, 247, 180, 156, 439, 181, -85, 142, 184, 306, 186, 127, 227, 251, 34, -231, 396, 7, -113, 43, 342, 194, 228, 29, -83, 390, -271, -5, 104, -41, 43, 88, -70, 280, -344, -99, -108, 132, 70, -178, 37, -145, 30, -117, -238, 10, 38, -407, -18, 11, -81, -185, 132, 81, 65, -166, 93, 64, 95, 73, 176, 194, 244, 366, 127, 137, 54, -175, -20, 10, 118, -123, -146, 365, -28, -105, 55, 353, 146, 165, 180, -272, -76, 96, 199, 283, -59, -205, 120, 333, -10, 287, -271, 86, -95, 29, -320, 473, 132, -284, 201, -89, 57, -130, 84, 50, -18, 108, 103, 9, 75, 88, 95, -115, 136, 100, -76, 51, 66, 48, -160, 96, -73, -241, 532, 216, 66, -97, 184, 187, 129, 262, 314, 155, 207, 7, 122, 224, 0, -289, -190, 279, 269, 111, 75, 280, -69, 63, 15, 1, 337, 93, 326, 233, -172, -136, -43, -138, -52, 90, -59]
6589e9M9J03J3o5K49k40q1J77J07k4m13J92L66j60l99L9q5K97n1O0J76j61j57
6612f7J36J39j36k5M7j34j26J34rK04q1k06kK26k22j93J76L61l7kq2j48rl9R2
6637cJ47k68O7J8K01j6k96J81L76m85L7j2J79O4k32J0K27l11l1L60j4O6m64N1
6661a48N12m64J00K18m9q9j35k42M12k52j16K45K17m36K45l8j95J05l78N58k44
6682a74L20k20r9k9r7j0o6N50k23K02q9j3j93K46k59M1l7j09l6K81J57j92j13
6705a62L92p6l9J47k74qJ00j9J98j92k70K55J59l58N42Nj54j42k82N93k92J01
6727B24j73N2j8J37n56K59O4pK42k58O8N0k19o0K06k01K80l20J34Q5K42j04k22
6750i5J08M4j50L17r6j81k22N22l08p8M20o6l99l2L96m66K08p2L39l72O66m83
$$ y = [-59, -10, 93, 106, 41, 290, 50, -31, 146, 253, 229, -184, 8, 374, 214, -185, -146, -231, 66, 15, 75, 251, 90, -67, 69, 208, 72, 47, 94, -40, -166, -32, -41, 163, 82, -124, -126, 100, -122, -315, -139, 222, 185, 183, 101, -47, -56, -95, -3, 144, -124, -57, -39, 162, 146, -150, 31, 407, -78, -41, -53, 126, 190, -42, -32, 195, -116, -147, 213, 199, 265, -199, -148, 364, -100, 0, 218, 169, 80, -55, -297, 115, -137, -253, -8, 209, -227, 18, -20, -215, -110, -488, 70, -174, 146, -74, -173, -202, -299, -309, -375, 175, -48, 154, 65, 52, -141, 105, -154, -113, -150, -259, -295, -14, 143, -49, -162, 230, 154, 115, 262, -12, -20, 80, 61, 259, 67, -203, 52, 211, -147, 395, 400, 246, 104, -178, 415, 123, 224, 51, 103, 85, 222, -334, -75, -11, -18, 224, -34, 34, 84, -135, -195, 11, -190, 90, -230, -96, -11, 231, 127, -95, 13, 57, -93, 224, 128, -53, -275, 247, -61, -139, 281, 215, -184, -216, 180, -286, -78, -150, 189, -183, 483, 0]
6772@r3K38j9j71j86J02J76J25k43L05m18K39N5L41n43m3L46j06K07l72K99N1
6794B90j64j2k5j56J97l16L65Q3j36%j6L89l96j61j2L00Kj63n3L9K32p0k94J57
6818H0J59k39O8n0Kk30M1J25k18k15L77M0J32r1k54J01K83l69O3J43rj76J56M9
6842c2k4k7J81l03J20J2k52K28O4p6J03R5Q6k95O2M2j2k54N30k84m6o3M32j43
6866A44j33K34l17M74k07k80K51j07O9q2l62K47K25k97m7J42j10NJ52J44j90m15
6888d60K23K51j16Q7k83K01R0j18j3K01m76L31L17k4n33N82O2k73j1q6K31k70
6910h7O1N0J68k13j3k65K01K14j83P7M4l73L97n6L1M0l66K83k31L31O1l35L58
6933A94m68L19p1r9L01k53J41J66j87J45l77K06P1k63M89l50Q9K92l02j47K3J80
$$ y = [0, -93, 145, 126, -45, -231, -129, 47, 172, -71, 234, -184, 55, 110, 451, -92, -135, 211, 105, 312, -60, 239, 290, 126, 114, 89, -67, 130, -186, 179, 262, 126, 126, 110, 499, 103, -58, -70, 230, 232, 69, 16, 55, 287, 217, -77, 80, 239, 0, 68, 18, 20, -210, -169, -44, -262, -477, -100, -60, 72, -19, -273, -172, 111, -258, -195, -52, -61, -237, -81, -32, -56, -83, 98, -205, -85, -73, -325, -97, -33, -109, -6, 89, 175, -120, -58, -16, -28, -282, 248, -36, -82, -145, 287, 144, 11, 245, -72, 402, 195, -85, 166, 59, 128, 46, -316, -69, 156, -141, -188, -46, -156, -151, 1, 145, -45, -460, -237, 14, -102, -15, -298, -97, -7, -125, -138, 63, -413, -82, 235, 211, -322, 260, 322, 49, 38, -48, 183, -87, -26, 24, 192, -21, -34, -299, -98, 116, -67, 10, 54, -319, 78, 22, 53, 93, -273, 10, -221, 110, 171, -164, 194, -274, 45, -26, -125, 176, -77, 64, 230, 43, 188, -189, 17, 88, -175, 314, -36, 53, 345, 43, -104, -81, 99]
6955I9k58J80Q9l29K09M13l71K13k79m6o5O30l90m75L76o6J54q2N4j53J96o10
6977e11M81M6p5n6P1J39j75j68L52o2l41K61N5J78n18K25mL40l52L64k56K52j82
7000F4K1m8j01K21j27j40M36k73P1l30M79p0n19J14K52k1l61M65m4r3J55K39m52
7023f2K24m49NJ15M01k08m00N38k87J89k26N31k91p2J41J6j26j10J79J14j73m7
7045BJ74J12j81k07J43K60j03l0J06R3j7n05K28L06m57l7L97R6j78j10l05K55
7067D2L66m27J50n8j85J5LJ63l2o5L23n11J05K1Q5L34k64j10J36J92m33r2O1L54
7091A73j46J12j90J6K11l00J40O6J18m6M4j31j96K83J93l79o3J29N0P5j39j80
7113a60K68J91k45o8P4L9n6k78L59L25n59j01J13m3M9lp1L22l00l10M11r2q2P8
$$ y = [99, -159, 21, 110, -219, -10, 403, 32, 245, -34, -80, -145, 485, 95, -380, -4, -70, 84, 2, 56, -97, 99, -511, -30, 16, -59, -115, -44, 95, -80, -248, 104, 42, -299, -38, 17, 195, -323, -98, -102, 238, -114, 250, -6, 246, 64, 85, 37, -64, 157, 30, -110, 326, 53, 124, -206, 273, 203, -316, -202, 50, 29, -332, 133, 89, -4, 151, 390, -62, 162, -287, -282, -167, 234, 26, -374, 164, -123, 66, -160, 371, 80, 8, 149, 165, 39, -71, 108, 222, 49, 2, 176, 288, 107, -100, 43, 303, 200, 170, 276, 369, 352, -153, 75, 381, -76, -113, 284, 380, 202, 92, -213, 42, 408, -19, 131, 73, -112, -97, -94, 69, 37, -28, 295, -216, -111, -90, -5, 329, 65, -45, 91, 283, -150, -242, -181, 173, 27, 139, -51, -35, 176, -124, 16, 82, 200, 154, 198, 67, -129, 154, 347, -32, -95, 34, 84, 159, 20, -160, 108, 299, 54, -14, 60, 99, 43, -235, 124, 449, -110, -211, -98, -141, -92, -95, -166, 156, -144, -454, -43, -135, -217, -139]
7137a39K38j55k17Q0l2N9L63j73k15K2r1L63j95J06L02m45M2J05k60L85J83k34
7159I2l22K23l9M9J82j47N9j70L6N3k31J73%j78K93q3RJ63j47Q8k54K53m39N31
7183A94m48L88j1j89L65k53n68J79K24r3K90M2j37j03r0P0j31L62O8R3r9l24j65
7206c36K0K71P0J9K56k40Q5k6m1k86L30j55j97L26j11L9r7M9o3r1J39J26q3j19
7230a15J98M8k85L12o3k15l0R2J66j99j9k15K9J75k32K98l27M64l67M40k44k1
7252a10k53Q1L93m19m8L97O3j85j2k0J19l8K02J80l12Jj17K23k07J80j86O2j62
7275a68K67j7J20j28R4j60J79K13k11p4M3k63J97l40K04N08k87l05K20L8j94K6
7297c8L4l34K85J45j41kJ70l36K27k97Q6p7L4M29n78K08K9J71Q6k11R7K0O8mj42
$$ y = [-139, 99, -56, -273, -193, -225, -166, 197, 24, -191, -169, -260, 103, -92, 14, 316, -129, -87, 18, -242, 143, 326, 92, -230, -7, -46, 3, 185, 38, 97, -73, -37, 16, -215, -42, -42, -220, 73, -10, -1, 162, 15, 103, -151, 102, -337, 194, -254, 134, 123, -66, 299, 46, -522, -343, -119, -212, 78, 120, -17, -120, -210, -140, -271, 91, 159, 252, 153, -171, -336, -316, -45, 25, 44, 300, 60, 145, 119, 78, -208, 122, -33, -230, 96, -15, 24, -73, -24, -87, -178, -39, 87, 4, -115, 83, 131, -154, 158, 95, -120, -150, -58, 108, -91, -110, -325, -296, -121, -353, -55, -382, 82, -285, 155, -89, -110, -363, -282, 111, -308, -356, 41, 104, -81, -93, -113, 6, -32, 170, 350, 38, 39, -78, 145, -62, 118, -68, -6, -168, 99, 82, 202, 74, 168, 8, 187, 400, 189, 115, 158, -105, 92, -248, -44, 464, 177, -128, 92, 130, -64, -38, -4, -338, -53, 92, -49, -51, 119, -217, 10, -287, -201, -278, -244, 185, -393, -185, -156, 15, 101, -110, -13, 7, 75, 71, -71]
7322g1N79m41qO3N03q83L27R5M1k62j49L34J05j61j81P04n90J94j14Oj01K73j35
7345A28l0pK6k92K99j11k00j3j42J73R9l77L40L9m8J11J3o9L8l24L38K02j68k75
7369b50m1o7k2J88j57L69J38k90p2J12N00r1p55P24j15m50L15K80j40m32K65J92
7391B01J00j67J1j80R4k00O8J7n9j06L00j58J63j76K72j56j78K19k59l6K11L6
7413A7j08L6k90K53l5M2P3k30M0N28k29k56M75k13k25k34K76J02n1J11k14L09
7435A77p4k17Q9P2r7j09K05r9K52l43R2J48j29K87l0j92j9k89L74p8j34L58k49
7458ej43J73j26k00M72l71N8J03k14K81n2r8K28l12j7J36qJ74j95j46J03K63l9
7481F5j89K48Q9l01L34j10r0kJ7j49K06jk00K79j67J69K57k36l06J20Q3k9J82
$$ y = [-71, 508, 67, 59, 122, 625, -258, 69, 164, 205, -57, -206, 128, 233, 72, -109, 595, 5, 199, 85, 91, -10, 263, 128, 98, 91, 117, -175, 124, 13, -187, -200, -342, -169, -70, -447, -107, -68, -116, -5, 8, -61, -23, -347, -9, 193, 25, -250, -291, -358, -380, -192, -349, 20, 158, -132, -204, -92, 408, 317, -438, 286, 171, -279, 36, 316, 176, -256, 9, 201, 301, 134, 145, -35, 59, -141, -73, -56, -115, -221, 79, -79, 84, -92, 180, 24, -154, 65, -194, -230, -19, 17, -91, -55, -345, -92, -127, -85, -12, -242, -202, 326, 97, -159, 316, 103, -122, -356, -80, 22, -29, 82, -132, 177, 103, -114, -25, 47, -50, -159, 46, -53, 199, -144, -52, 96, -33, 254, 224, 32, 13, -276, 98, 20, -114, 244, -5, -148, 25, -101, -301, 171, -200, -142, -39, -253, 28, -24, -122, 106, -206, -223, -87, -95, 79, -116, -262, -159, 104, 65, -124, 124, 213, -88, 246, 136, 46, 44, 61, -88, 118, 117, -83, 196, 29, 198, 455, 219, -87, 33, 116, 87, 269]
7504B69k62l6m2K49m3k30J45q0L3J32M4Pj07k47J79n3L8o6J36j47j44J78L06j75
7528H4k28O1J95j55Q4j93K77q1j18j58M26Rj05l05K49L5k45l5M28k86J18O6k29
7551a06J62Nk29M53l31K07j45M15j70l29L52j99pJ23k29RO3j65M3K3l3J48N3p0
7575D3j09O3J02Q5j76J70j49J92j90J39l17o9j05O13l44k69N65m41L45l77JM19
7597A91l57J47o8J17Rk73K97l1k04J70j86L70k97K79j94M8k08R9K56J02m99M76
7619B44j68k40M76j79k07L62k86j99J86l41K12L5M72o23rM52p0K2j47o9p2L49
7641B00j00k27l2J45n9J42k77O1K6j02L51l06L08rJ18j90l99K58J88j47j44L18
7663A23o3J49l58m5L51k67J34Q6j56K4p0N4m1J27J24k97K26k07p2J02J7N8j51
$$ y = [269, 7, -29, -71, 178, 135, -95, 50, -30, 3, 135, 179, 186, 79, -168, 11, -42, -4, -70, 66, -81, -225, -47, 259, 84, -144, -83, 112, -43, 41, -152, 125, 44, -74, -232, 194, 203, 98, -207, 42, 77, -168, -203, 225, -61, 57, 123, -106, 56, 61, -168, 285, -46, 161, 16, 431, 261, -68, 284, 85, 78, 201, -28, -19, 44, -121, -78, -55, -88, 60, 113, 43, -66, -3, 99, 184, 8, 178, 29, 221, 31, 170, -147, -216, -321, 292, -52, -321, 244, -197, 148, -229, -228, 191, -166, -19, -87, 30, 39, -234, 63, 32, -172, -2, -188, 182, -115, 164, -30, 18, -190, -91, 165, 267, -232, 244, 76, -164, 312, 133, -74, 288, 2, -197, -11, -352, -140, -105, 367, -256, -265, 187, 117, 139, -8, -77, -149, 200, 100, -127, -159, -14, -73, 69, -208, -147, -121, -223, 128, -178, 130, 121, 239, 49, -350, -92, 96, -51, -195, 123, 60, 209, -149, -194, 157, -110, 24, 110, -46, -22, -92, -38, -79, 48, 172, -125, 101, -106, -178, -76, -59, -1, -152]
7686a52J1J11j68J69qm6j7L4J10l37nJ82P8L12l95j17K88j80R6lj6J41l9k0k39
7711b10M65j3l22L5J19jj26K30j09m6l77J83K81J2k17mL44m97J72J45j01J59j77
7734e5L10k69m6j23J07p2L71k64n1J15j65l2M6J71k65K67j27L34k88J73P3j70
7756D0Q2M2k40N7N7J20k57m9J44k6N5K08j53l11K75k70K07L0K41Qk32k5K37l90
7780a50j52L45l71M54k69q9M70l04J86r7j24J66m6K5k72J24J55l73K09K64k96
7801a45L18j20R9k30Q1Q4N9J17l71P4K3p9Lq1j02L59n6j55m7K30l1L04Q7o50K03
7826b6j4K51m21M9K56k71L97n21M93l1k61J19L2j90L07j09l4k21K31j43r9K56
7848E0J07k58J75n0j06K15J10r7k71J69l8qj25K41Q5j31k10p0K82r3j5j10J82
$$ y = [-152, -141, -30, -198, -29, -37, -83, -100, -66, 44, -293, -298, -116, -38, 274, -121, -238, 50, -130, -34, -37, -53, 88, 49, 29, -210, 255, 242, -80, -45, 74, 73, -53, 177, 68, 22, -355, -172, 109, 121, -96, -100, 244, -253, -81, 64, -37, 122, -55, 255, -14, -60, -183, -76, -148, 223, -41, -92, 23, -142, -174, -128, 43, -222, 45, -82, 252, -36, 137, 210, 40, 122, 164, -76, -19, 38, 158, -99, -148, -4, -30, 25, 233, 80, -231, 44, -226, -19, 11, 252, 260, 28, 3, 240, -150, -302, 43, -328, 126, -143, -232, 238, -66, 120, 23, -101, 65, 19, 44, -228, -104, 51, -322, -113, 151, -145, 173, 53, 152, -78, 3, 87, 146, 263, -108, -34, -11, -90, -87, -168, -270, 89, 33, -122, -169, 61, 30, 334, 421, -229, -26, -40, 211, -210, -161, 95, -176, 221, -300, 193, 162, -99, 20, 52, -138, 169, 60, 26, -195, 36, -107, -206, 50, 157, -101, 74, 24, -82, 133, 243, 146, -125, 44, 6, -2, -127, 114, 199, 68, -142, -212, 70, -23, -38, -148, 34]
7871C4j4L5J4j11J7J38j44o7m19L20p3L14pl12L58o7K66n0m42N4K16k99L56O8
7895A85q8l14L5M3L19J38o7k95Q6J03p0j43J72l32O9J72J24l14L82l74K76M2k74
7918a25L2r7K30J14j13k28P5j40K04O8pr8K49j56k48K71j61%KJ8L8j77K99r1q3
7943a24Q8J39o7j2k9K53p59N08K4O0j53J57j71L5J3J13j87K0J2j59K69K99n45
7966b16J87Q5l33M62k22J73K65n00p9K49o4N2N9j67K9l1M4J26j95q2J75j06k34
7989c23M34o1L3k11k06K40L76k83J06m00J72J37k77J43K55R9l70J59K20m9r0m54
8011c50K66J21j19j6J13p4k98P78l51J31l90Q0m5J00L01m21K83l36K44j70m0L66
8033A73j54l13P6r4M13j67j42L43q5o5L35k52j51J83j49K04m39L30J28k53oJ00
$$ y = [34, 20, 55, 69, -42, -25, 113, -31, -98, -517, -197, -270, 44, 37, -275, 83, 16, 282, 232, -210, -156, 60, -239, 117, 185, 97, -217, -182, -139, 180, 318, 251, -44, 42, 145, 75, -68, 104, -228, -159, 13, 137, -177, 205, -169, 107, 149, -125, -93, -190, 40, 154, 41, -187, -112, -252, -48, 20, 13, -85, 164, 8, -240, 31, -130, -130, -128, -110, -72, -249, 50, -41, -124, -36, 103, 36, 24, -5, 248, -511, -3, 21, 81, -72, 85, -86, -51, -38, 75, -112, -92, -80, -239, 30, 329, -216, -29, 56, -277, 185, -37, 136, 401, -99, -178, 71, 7, 59, 118, -49, -20, -51, -7, 119, -76, -158, 17, -89, -323, 111, 50, 83, -128, -334, -94, 282, -1, 105, -295, -123, 14, -263, -120, 135, 234, -136, 23, 243, 194, 104, -350, -84, 37, -82, -98, 15, -59, -357, 421, 70, 201, -189, -109, -154, -54, 247, -174, 109, -227, 17, -153, -193, 173, 19, -294, -218, -312, 101, -66, -208, 135, 50, -15, 320, 68, -83, 100, -49, 155, -284, 46, 174, -79, -85, 15]
8055A5N0K89m31N3Q3J62m84K33p4K18n9p7K68l49L80k73R5k74K83n3m7J39j84
8078c7j26j16k7J05K60o3j90J62j54K20n1q1L5K60J93n01J0kpj64K74O5o5j20
8102a20K0J91j87j68K83j42J69j34J85j34O1Q9j72J24m0J69j41M7o7L4j71n2K58
8125A02l40r8L76q9j72k1k24K87J72J11k44J10P6k73K94Lj16Q9O4P2j64k47L03
8148G1j70p5m2O01p08K77L71Q9l86mO0j04J08J05o6j46j1K65l51J04J93j95j11
8171a25J37J18k4l2L35m73q4K28j85M16m66J96pN5J09o7j42j48j43J50
$$ y = [15, 65, 354, -77, -24, 59, 221, -263, -30, -104, 114, 55, -22, 246, -103, 277, 4, 99, -175, 108, 55, 8, 147, -37, -163, -279, -306, -201, 59, -4, -194, -32, -186, 34, -17, -98, -63, 197, 390, -111, -101, -103, -110, -274, 0, 65, 0, -120, -100, 91, -96, -264, 19, -123, 46, -88, 97, -37, 24, 113, -59, 65, 25, 194, 53, 100, 33, 67, -104, -156, 102, -238, -336, 40, -49, -221, -242, -466, -179, -7, 104, -140, -30, 46, -227, 67, 70, -46, 43, 107, 179, 15, -232, 71, -99, -174, -216, 385, -323, -46, 325, 414, 28, 24, 84, -20, 88, 193, 127, -19, -30, 235, -116, -12, 181, -14, -125, 12, 130, 106, 74, 409, -64, -148, 80, -105, 311, -155, 41, 34, 89, 198, 131, -11, -159, -302, -152]
8191a52
$$ Imaginary data points
##PAGE= N=2
##DATA TABLE= (X++(I..I)), XYDATA
0@%%%%%%%JrJ6j6J6j7K5l2L8m6M9n7P2q8J03j18J35j53J74j98K25k56K88l23L63
32A92m08M57n09N67o31P00p76Q60r53J056j168J294j436J591j766J968k200K469
50A307k787L168l636M228n003O064p609J0082j4659K5889j01545j48091K37072
63D480R7240j65835p5758J56974K3793j40294R546J65929j8930j65447Q347J61078
75F1123L512j25841m13R8332k0189p4248M1402P0029o0615p6764N5899Q1772m5684
88H315q2898K1091O6534j5335n3384J0788L3819k9705l3356M1617L4540n6184
100e4158m8350M8947N0024l8223m3274K1435K0502j6751M176K8702j7478m4138
112h8586J6180N5582J143m0894n114J8729j229J2708L3980j7823n6498J6390O9671
$$ y = [0, 0, 0, 0, 0, 0, 0, 0, 1, -8, 8, -8, 8, -9, 16, -16, 22, -24, 25, -32, 40, -48, 55, -63, 72, -81, 93, -105, 120, -136, 152, -171, 192, -216, 241, -268, 299, -332, 368, -408, 452, -501, 555, -613, 681, -755, 836, -930, 1038, -1162, 1307, -1480, 1688, -1948, 2280, -2723, 3341, -4268, 5814, -8845, 17044, -84501, -232592, 4480, 101720, -64115, -139873, 17101, 40894, -99400, -89854, 76075, 57145, -108302, -99955, 61123, 64635, -61206, -61619, 36713, 16524, -57724, -16322, 53707, -6908, -83672, -27773, 53999, 8315, -74583, -53492, 13042, -2293, -55677, -44889, -11070, -40775, -74131, -32514, 2026, -54158, -102508, -53561, -3537, -41760, -85034, -63599, -43097, -59848, -55672, -26970, -44448, -88586, -72406, -16824, -15681, -56575, -61689, -42960, -44189, -31481, 2499, -15324, -71822, -55432, 14239]
125A4239q08n2421Q298L3962k3959j5517N4556K1560p0818l1559P4863M2070o3084
138h618l5847N3898K0446n3888Q45O3951j5415p8125K0412Q8043j7911q8702J2628
151c8283P9868j1398o5802J7040N5330k9282n4346M2975O2651m8076p2576M6148
163a5751P9368l7536p2409L4749N8420m0103m1809N6616L7779p1674m3179P9589
175B4060N4589p3588n6832O1538M6313n5694k7155O2029J0234p6541m939Q5987
187E0001O405q6075j0607P2985M674n9062O739M8396k1823m8998K8642N2087k9947
200A3417n4481K5033M8607k0751l9128K0833K7233k4356j7476L0182J1733l2824
212a1978r412L3417J0427k8501q193K2581M317j6002M666J5016j1495j8646J8806
$$ y = [14239, 13431, -38990, -30692, 3270, -20689, -36206, 18350, 39910, -30908, -62467, 12396, 54466, -8618, -44465, 9433, 29879, -24009, -23164, 40787, 25372, -52753, -32341, 55702, 37791, -50911, -38283, 41585, 30187, -35615, -18575, 36755, 7473, -46873, -3898, 58753, 10677, -61899, -15751, 63617, 26081, -46328, -11579, 46841, 6738, -35071, 21545, 59324, -12350, -55529, 24060, 78649, 5061, -51771, 9767, 56080, 386, -26769, 35260, 45494, -31047, -35986, 50001, 56406, -29669, -40276, 32709, 37383, -21679, -14940, 33456, 11633, -37365, -8723, 43364, 13417, -41064, -16031, 32576, 11825, -27303, -6470, 20763, -3593, -21069, 9113, 20846, -11978, -21390, 12027, 22454, -6047, -14240, 8341, 12658, -3344, 1322, 16338, 4843, -13803, 5003]
225E003K3571j8503k3642J7000J7794j6180p001K0314l103k8076Q901L4436q652
238B1862l6308O531L2290q653k6734J5334K4098k5485k6503L3099L0446l6924
250C053l1184L6498K7609l7422j9851M0403J2144m4347p057M7907M098m9174k798
263b0121M9293O44m8540K453M7083p045m6420J2929M5311k0317m4632K4730M3239
276C8607k8684m1382K9387L5918l0045l0999L0268K4360l3440k2345L7313K0136
288B9094m0158k0169L9989J7205l8681j1736L7252M335l7568K125L8651m959l7525
301b2145P151L4840p801l0467J1499K9390j5399k7001J9917K7202k1851k4836
313a9501K5188K0918k7244j4725L0026J0046l1567n966L1437J950k9947J317K8279
$$ y = [5003, 28574, 10071, -13571, 3429, 21223, 5043, -1958, 18356, 15253, -12823, -3922, 30514, 21862, -14446, -7915, 24375, 15722, -11012, 4322, 28420, 2935, -23568, 9531, 39977, 3053, -28131, 8367, 35976, -1446, -21297, 19106, 31250, -13097, -20154, 27753, 31851, -17323, -20121, 29172, 29816, -18724, -16271, 30812, 23767, -22653, -9724, 35587, 15270, -29362, -4632, 38607, 9923, -31459, -2072, 33846, 3801, -27198, 3070, 27430, -6010, -28355, 8958, 29094, -11064, -31233, 8756, 25961, -12720, -24456, 12796, 17131, -20437, -18312, 20339, 15380, -22145, -14994, 19846, 12045, -18422, -6923, 22467, 7068, -19933, -16, 27186, 5335, -19501, 5687, 26605, -639, -15364, 14662, 24708, -6859, -12825, 18612, 20562, -9385, -8068, 20211]
326B0211o175k8944Q707K8464j2189k9113J4275K5421j8820k3958K2585J9282
338A9746k7669j7635K8556J3532k9088j0266K6886N814k8146k340K9225o23l0794
351b2802J490L1448l282l0099P397K9191j2404k7503J7694K7065j9490k4105K1628
364c772K1431k1396j6967K4213J4245k4961j2346K6769J2322k6930r068K8068
376A1608M936k8860Q4L0828m268l1038O872K9196r010k6733J1366K2753j4850
389B884k2030J6880K1083j9701k1117J9750J8346k2996j5468K4890J0849k8662
401a5292q480K9667M411k9888j485K7305k548k6663N587K6256p913k6633R317
414a6359K5915j0358k3649J3345K2063j6864j9179K1034J8320k2075j5136K3747
$$ y = [20211, 14036, -14908, -6201, 22263, 10074, -19039, -4764, 20657, 1837, -22121, 464, 19746, -7923, -25558, 2998, 16530, -12558, -22824, 4062, 9876, -18270, -20610, 8615, 7992, -22802, -21312, 10136, 6854, -23245, -15848, 13343, 939, -26564, -8870, 18195, -1295, -25400, -3772, 17659, -3737, -20704, 3509, 17754, -7207, -19553, 7216, 19538, -7392, -16460, 11608, 16544, -12316, -12232, 18596, 14328, -16710, -9838, 19358, 10348, -16385, -5019, 17734, 2884, -19146, -2266, 18817, -884, -22001, -2251, 16095, -6901, -22369, 2521, 13370, -15292, -23772, 5895, 10306, -19582, -21067, 6238, 3690, -22973, -17386, 8870, 957, -25676, -16359, 9556, -802, -24451, -11106, 10957, -5907, -25086, -4052, 14268, -7807, -22943, 804]
426H04J2458k2177p335K3576M938k2808k374K4768K813k4257M9K3831k253k3057
440a1024P345K3100j0793k3171J3475K1198j5500j8165J5915J3401j8915j0878
452a4012J9594Q630k3128q787K2228N867k3710m070K3105j902k4930M260K4316
465G461q595k4918J1293K2047j3926k0604J6489J8967j7740j7388J9745J6352
477I183j9954j3202K3790J1576k5059p975L0020Q095k9247l998L0173K527k7011
490a1082L537K8275o470k7348R664K9782r261k8759R437K6399j0626k4221J3824
503C151K1283j9145k1689K1083J9867k3678k0869K0945J5750k2041j3881J9299
515G5Q553k3368q840K2651O677k5839p809K4141M986k3862l858K1563l68k0003
$$ y = [804, 13262, -8915, -16250, 7326, 12264, -10544, -12918, 11850, 14663, -9594, -9545, 14286, 12033, -11024, -3679, 19421, 8628, -14543, -1068, 20130, 4630, -13535, 2380, 15781, -3134, -14012, 5582, 14212, -8916, -17703, 4525, 10392, -13318, -17388, 5717, 3815, -21115, -16855, 7461, -1134, -26052, -14759, 7288, -6638, -27242, -10753, 8214, -9526, -26914, -7169, 9183, -10771, -23973, -183, 11393, -13666, -21641, 8379, 16474, -12773, -16771, 13402, 15929, -11082, -7545, 20730, 14260, -13088, -3424, 26358, 17097, -11662, -2225, 24174, 13548, -10673, 3151, 24434, 5289, -16400, 4683, 24550, 872, -19997, 948, 16698, -5343, -19224, 75, 8628, -14740, -23580, -929, 5748, -20091, -27900, -3759, 1227, -22635, -26493, -4930, -5298, -25301]
529b5301M597J8611p630j7226J0410J7681q556j5235Q799J4133o065p747R220
542d309N554j0927j024J5992L008j5458j196J3603R25p924N214M689j0912l736
556f501J5410N187j6426p617J2759N401j1302k183J0383n137j6358O974J9485
569A0075r390k5100O393K2712q189k1004R266J5238j6267j4436K0560J5020k5097
582b0219j9436K5058K1600k3280k1059K2109J7233k2876j1163K8159P405l3546
594c0015n628L9448Q353l8975r083L5954R426l0204l141K8777l429k9838Q444
607a9911L7102r441m0733O408M0137k711l4035L791K6145r772k1492J6961K2294
620A4743k1767k6540K0287K9830j4985k8113R289K2361q389j4928J3098J0938
$$ y = [-25301, -20704, -2093, -9723, -26949, -16539, 1142, -7414, -22649, -13850, 283, -5782, -13529, -4309, 1245, -9682, -10706, 5286, 8294, -7164, -8360, 5243, 6168, -1756, 3458, 8147, -2765, -6501, 8909, 14096, -2330, -9947, 2812, 8213, -3089, -5272, 5111, -26, -16384, -9410, 10075, 685, -24415, -18022, 4690, -3499, -24503, -15237, 1, -16266, -30702, -10142, 4878, -20219, -39655, -14597, 7003, -16277, -37336, -15227, 2006, -20870, -32033, -3874, 3531, -30015, -35643, 3805, 12158, -26817, -35900, 54, 9480, -20724, -23865, 4912, 1483, -28355, -19911, 17191, 7750, -32983, -26575, 13562, 10851, -23184, -19393, 6752, -3020, -24512, -7551, 14743, -7024, -33564, -13277, 16553, 1568, -26545, -17256, 5105, -3284, -18212, -5114, 5824]
632E824j9297j0981K3795J4701k0941j6969J5337J6245p699r694M477L082n478
645g598J788J1387j145j4784l206J4151P229p757p051j014K002O522M754q035
659b757r048L283O648k11n09Q28q247q432J1250J6456q453k3207J416K2656K566
674D239j7696o07J2049p891j1772J7896J7767k2851k5013K2062K9170j4927k6201
687b3775J1251J9815j1957j2004J9839J1518k7604j5330L3612K3598l0945k7155
699b9137K6655K5236k0757j7151K1704R488k6996n399L4394Q158l8455j4196L7429
712A0973J8582l2181j7072K7637Q716k6218O22L0597n721l7072N463L9727L24
725B4377l6890m770K9566L616k1051K756J8323j0376k0819J5181K6777j3842k9594
$$ y = [5824, -13473, -24454, -659, 14042, -6899, -23868, -8531, 7714, 15, -9679, -5202, -2120, -7598, -5810, 5577, 4432, -10352, -13558, 593, 7822, 65, -6986, -8000, -5998, 524, 5278, -2757, -11805, -8522, -1874, -2085, -2594, -1766, -10013, -18445, -7195, 9261, 808, -22399, -20983, 1673, 4239, -13457, -14064, -2015, -9906, -21678, -3782, 13985, -8866, -33879, -11817, 17353, 2426, -23775, -12524, 7291, -4666, -16670, 3169, 14687, -12917, -28247, 5365, 28963, -1982, -29137, -2482, 22754, 1997, -15154, 6550, 16038, -10958, -16357, 18037, 26195, -12260, -26456, 10973, 29555, -2626, -19698, 7939, 16655, -9563, -8941, 21656, 15935, -21137, -15674, 24053, 24377, -12513, -17283, 12283, 15899, -5152, -2396, 15927, 5551, -15268, -87, 26690, 12848, -16746]
738a6746Q031K6498k690j7923K296Q711o155n390J1754P169j4470j3206J0662
751a459J6155m453j5418k706Q408L519j136j103l754m837K091O789K846m780p766
766g604k684Q324R541l917j2220j968J0489O147m840m071L019k22l880O361J1606
781A4081o608j8281M125K4637J305k2239l178J8581J029j3985O514J4127j1989
794H119j9093J4081K4898j2749k7946P816K5244p912k1594R641J5354j7674j5931
807a7746K1869J6422k6625k1094K2106K0321j9758j9635J4999J2409j6806r623
819b3161J9689O506k5140r161K6353J1587k5542j1940K0972J0013j6827m849J7210
832d290P53j8263J986K2998O08k3337k059K3279N475j7773k091J5088q01j2918
$$ y = [-16746, -8715, 17783, 15093, -2830, -534, 8177, 2022, -3368, 8386, 15555, 1085, -12121, -1459, 14696, 10243, -5175, -7881, 527, 4046, 2910, 1807, -1947, -6784, -4693, 2096, 4942, 162, -7604, -10288, -1964, 7577, 3660, -8560, -10528, -39, 6108, 1268, -2803, 216, -6, -3886, 2475, 14081, 7473, -10808, -6683, 17954, 19259, -2980, -6158, 12423, 13452, -533, 5981, 20108, 8119, -10974, 3107, 28005, 15256, -12690, -4874, 20370, 12458, -9136, 505, 15859, -1815, -17746, 4123, 20545, -6080, -27174, -5068, 15253, -4505, -24140, -9141, 3268, -13538, -23161, -3472, 3034, -22106, -31267, -4914, 6673, -18869, -30809, -9837, 176, -16651, -21500, -4290, -3537, -21800, -19814, 3184, 3792, -19545, -21604, 1675, 7150, -10623, -12714, 2374, 1573, -11345]
846a1345P266J4540q799j5141Q306J6252n305j3161L239Q321l344m293N452K077
860D065q877l287R218L804q356m300M448N61k259K428K0o682n50P702Q28o948
876h185j153M491r78k636M005L426o545m795P975P655p496p384P147P709o735
891c499m240Q557L473j0480j246J3822K427j3392l395J3826M230j1708l090J1126
905F411J808j2285P85J4880k163j7081K175J7822k760j6852L035J4986n481j3476
919h196P099J2972r622j3868J0123J3852j0631j4017J0550J2281j1537j0381J2994
932A619P585j4080o101J4695M673j3975l551J3538K443j2345p63J1197K54j0601
946e412J362J0939k258j1233L597J0865l626r618M410Q128n034o415O226N201
$$ y = [-11345, -4079, 10461, 1662, -13479, -5173, 11079, 5774, -7387, -4148, 4173, 829, -3464, 1988, 4065, -4812, -8099, 1119, 4923, -3433, -7733, -3285, -2724, -4983, -2555, -2535, -9217, -9767, -2065, -1237, -8185, -9338, -4847, -5825, -8461, -4456, -1030, -7575, -12370, -4395, 3260, -4236, -11620, -4473, 3236, -3499, -7739, 818, 4291, -6189, -7435, 6387, 8814, -4578, -7973, 5853, 10083, -1625, -4715, 6411, 8219, -4066, -3281, 11599, 9436, -7645, -5470, 12352, 9592, -7260, -4225, 10761, 5280, -8196, -1097, 11875, 2253, -11615, -1492, 12360, 1729, -12288, -1738, 10543, -994, -11375, 1619, 9204, -4876, -10977, 3718, 8391, -5584, -9135, 4403, 6846, -5499, -6262, 4935, 5189, -5412, -4050, 6889, 4631, -6602, -3005, 7860, 4234, -5384, -974, 7154, 2120, -4295, 1931, 7132]
960G132o956m181O194M371o834l640O386K747p069j869P514K12q561Q73R317k728
976B908r003L690P589n022o287N547N288o566m814P105M105p462m161Q796L046
991D759r487j596R586P35j0556J498J0204l150r375M587Q924n370p967N878P380
1006F050o064o156N936O433p069n720Q188M826q658m145R165K945r338j993R533
1021C933J24r006N54R182j314q408R95Q207j893q186K352Q224l508q470M670Q306
1037E762n894p622O540O578p603m817Q097L718q183l066Q592K470q198k185R069
1052C258R78q757m98R984q27r910K751R216l625q260N255P292n777o490O303N338
1068F231o284m772O202L894o630l354O985K522q271j992Q131Q40q597K64Q032
$$ y = [7132, 176, -4005, 2189, 6560, -274, -3914, 2472, 5219, -1850, -3719, 3795, 4007, -4554, -3681, 5636, 2908, -6095, -2405, 5184, 162, -6125, -578, 4710, -1856, -6670, 435, 4540, -2922, -7083, 1713, 4759, -4728, -6324, 3262, 3997, -6559, -5061, 5143, 1993, -7382, -2795, 6129, 759, -7208, -1330, 6050, -14, -6170, -234, 6199, -870, -6590, 1598, 6424, -2234, -6379, 2786, 5731, -3607, -5600, 3933, 4057, -4949, -4395, 4787, 3473, -4935, -3940, 4267, 2374, -5812, -3460, 4764, 1256, -7214, -2544, 5762, -132, -7754, -1214, 5364, -2239, -7056, 1041, 4759, -3424, -6490, 2102, 4572, -3626, -5811, 3258, 4236, -4521, -5019, 4965, 4138, -5772, -3021, 6195, 2570, -5690, -435, 6857, 1080, -5410, 893, 6231, -53, -4825, 1377, 5271, -1359, -4713, 2272, 4794, -3477, -5469, 2662, 3502, -5095, -4831, 3201]
1083C201j800p488J681O938l202o204L732N042m001m671M228M718m977m802N809
1098a796M871o251l317P176K083p287j47Q152m28p486J352P823j410o941K652
1113i54O837l054o413M172P161n228p072O107O692p151n994P782M381r450l033
1128e217R345J561r993j786R280R30j0372n95R318j006r589J081R733k685j0688
1143a0683L599J0392m966j0124N539Q784n362p118N860O849o502n676P592O120
1157D304p282o103P986O823p106m654P499L677p138j951Q656J133q240p21Q095
1172D978J385p200j322N629N52n192N09M884k596n675K646N612l177n749K304
1187b412L288k809j565K467r34l220R56L299j004l241L04J878k05q52J830j87
$$ y = [3201, 1401, -6087, -4406, 2532, -670, -6874, -3142, 1900, -2101, -6772, -2544, 2174, -2803, -7605, -1796, 3075, -3176, -6493, 683, 2766, -4521, -4668, 3484, 3056, -4430, -3078, 4745, 3335, -3606, -954, 5883, 2829, -3584, 588, 7749, 2521, -4551, 1556, 8248, 1097, -4897, 2885, 7266, -2184, -5217, 4128, 5689, -4304, -6090, 3190, 4120, -6252, -6847, 2471, 1465, -8124, -7043, 2690, 5, -10683, -7084, 3308, -1658, -11782, -6243, 2541, -2821, -9939, -4079, 2770, -3732, -9408, -1816, 4304, -2978, -9081, -1095, 5728, -1378, -6032, 1467, 5144, -1994, -3945, 4711, 5844, -2396, -3117, 4978, 6363, -837, -2159, 3470, 4022, -1170, -661, 4223, 1627, -4048, -1402, 4210, 1033, -4716, -2412, 876, -1933, -3498, -1031, -1965, -5185, -4229, -930, -1934, -5175, -4871, -2993, -3198, -4050, -2220, -2407]
1203b407l129P53N597J66n724j48O125P18m866J852M734l632m282O079O332o406
1219A762p142N628P951m152p314M368N299n992m683Q771M091j1774n572J1659
1233B900O185j1624o971R652M448j0111k156R788Q25j3297r44J4726K116j5370
1247i833l453J4231L426j2199r76J1638j342j1407M858J3676m500j4078M518J5425
1261I984j777j1942J704J1354k275p954N836Q872p524r960R058J2099p125j1523
1275a173M434R200k656n914K730K451n354l518O862M309q303p515M085P292k647
1290D283o623p05J812j049r5J386j256m430k327L369M285j735o223k289M804M672
1306b121k573l943j48K292J423n2J625Q60l984k283O905P498o131r178M969J0552
$$ y = [-2407, -5536, -4783, 814, 980, -4744, -4892, 1233, 1951, -2915, -1063, 3671, 39, -4243, 1836, 8168, 1762, -5380, 248, 8199, 4047, -3267, 1101, 6400, 408, -4275, 4496, 8587, -3187, -8759, 2900, 9085, -2539, -9510, 142, 4590, -5521, -7677, 2111, 2936, -10361, -11305, 3421, 5537, -9833, -13286, 945, 4371, -7828, -8804, 2834, 1492, -9915, -5057, 8619, 4119, -9959, -5441, 9984, 8207, -3735, -2031, 9323, 7048, -906, 4930, 13802, 6278, -3682, 5376, 17475, 10350, -1173, 3261, 12461, 9805, 3891, 6621, 9072, 3718, 200, 7062, 11371, 3068, -4447, -362, 6930, 4283, -2340, -3045, -1233, -2282, -2377, -991, -2247, -6677, -9004, -5635, -1350, -3085, -9308, -11597, -6793, -2121, -4694, -8637, -8785, -6493, -5070, -5122, -3497, -2637, -6621, -8904, -1999, 5499, -632, -9810, -4841, 5711]
1322E711j921o723K753M459l890l086Q429N616j0560q481J0464J1857q257j2191
1336e820N918R488o576n758Q906K784j3188m367J4749O842j5562r901J1943Q960
1350H418r953p253R251K571j2160j325J5216J228j8044l948J7162N677j4043n823
1364a3026J0421K980q806O46J0091k479j3166K439J5964M66j5972k313J3592K814
1378C651r503K32P448l424o969N479J0119m722j2424K470J2336J571r889k172
1392e797N971P24l147L377L173n793n311N014P294j671p303j860M601L877j247
1407A902l150o40R09o89J506L152j030n397j483N806M743l331p431M96P119J265
1423C747m953o56K925j927l486N150N488o580q377N280J0148k719r811P43P503
$$ y = [5711, 3790, -2933, -180, 4279, 389, -2697, 5732, 11348, 788, -7693, 2771, 14628, 6371, -5820, 98, 9586, 3010, -2748, 6158, 8942, -4246, -8613, 6136, 12978, -2584, -12485, -542, 8418, -1535, -8788, 463, 3034, -9126, -10451, 4765, 5993, -12051, -15999, 1163, 6840, -7203, -13026, -2605, 375, -8431, -7785, 2306, -173, -13339, -10900, 5064, 5530, -10442, -12755, 837, 3651, -5852, -5620, 1828, -1596, -8565, -3086, 7033, 2311, -10113, -7643, 4693, 6264, -3625, -5797, 174, 898, -2249, 1128, 4301, -1492, -6803, -1789, 5505, 3834, -3469, -5329, -728, 3149, 1902, -1248, -1888, -979, -1668, -162, 2990, 1960, -3437, -4920, 886, 5629, 2298, -5133, -4637, 2482, 3747, -1206, -1862, 1063, -864, -4350, 800, 6288, -292, -8669, -3389, 6759, 4040, -5771, -5028, 2475]
1438B475j002n698L554N270o672p086Q771R625q188j1558O253J1013m531q531
1452f305M364N992o670m743R270O281j1428q547J1410R914r687r179P833O604
1466E109p784l408R295J917j1385k483J2680L915j1560n739J0011N133p985k887
1480e171P432M35q253J491R940j593j0299K25R635J354p097j476M758J146l682
1495a155J233M787k265n774K332O983m80o618o10M714R31j848N04L71j830m67
1511H08K585J562k192k520J16K164J170j034j925j411R86K118q8k446o34J334
1527E93q05j146K513N26n247j288N677J629n289k189M395J783m300o83M238j04
1543C03n329M70O810l17p134K6P612L5o773J085O401k059n301L714N686l714o260
$$ y = [2475, 1473, -4225, -671, 4599, -2073, -9159, -388, 9237, 1049, -10509, -4256, 6757, 2226, -6305, -1941, 4051, -2619, -7362, 1908, 8189, -3239, -11786, -376, 9538, -149, -9328, -1495, 5109, -2675, -6083, 3212, 5129, -6256, -8739, 3941, 7856, -3704, -9443, 568, 5701, -2284, -5171, 2261, 2696, -5557, -4066, 5874, 4281, -6018, -5793, 3842, 5196, -1901, -3377, 1381, 2527, -1155, 78, 4865, 2600, -3174, -842, 6141, 5661, -957, -1567, 3147, 4078, 2230, 2734, 3105, 1275, 808, 3393, 4955, 2763, 243, 359, 2523, 3693, 2659, 734, -677, 309, 2427, 2339, -107, -741, 593, -212, -1358, 1155, 1681, -3566, -4854, 823, 2452, -2837, -5026, -631, 1152, -3148, -3831, 407, 303, -5026, -4556, 2254, 1937, -5197, -5171, 2441, 2476, -4297, -3212, 3189, 1130, -4171, -457, 5229, 1515, -4745]
1560d745L297P151k441o276J890N919k171n672L754N044m902n554N157N522n715
1575B58n605N180M329m555l740M203K276n099k488N452K395o393k532N919J574
1590A174o073p82N085k34m749J157M325j781m159J883L708r34l443J368L309j342
1606a488k577K254K094k384j370L623J228k962o94K831O41k305O44K020j114q95
1622d54J415J470j128j799J335J417q85j488J189J462k486r33K783N94l406k17
1638a131K970l19k924N15K572j364l003J161L133j526l674J816K959j788m027
1653d630K676L566l595k637L928J801l939j653M220J536m523n42M277O13m009
1668b911k74M741j67m420Q02M603j058m347K044M098j742m057K864L070k790k046
$$ y = [-4745, -1448, 5703, 3262, -3014, -1124, 4795, 2624, -3048, 706, 5750, 848, -4706, 451, 5973, 258, -5347, -167, 4162, -393, -4133, 70, 2346, -2753, -5241, 211, 2606, -3787, -6319, -400, 1174, -4899, -5681, -596, -830, -5579, -4422, -97, -1878, -6037, -4154, -446, -1380, -4823, -3455, -146, -1488, -4065, -1811, 283, -2101, -3471, 152, 1380, -1582, -2276, 555, 1196, -1109, -465, 1555, 441, -454, 961, 2431, 1303, -496, 839, 2256, 1371, -117, 1072, 2534, 48, -885, 1898, 2492, -914, -1131, 1839, 1520, -1404, -889, 1683, 319, -2684, -1523, 1610, 84, -3590, -1774, 1185, -603, -4630, -1954, 1612, -1983, -4620, -692, 1109, -2830, -4483, -263, 1273, -3250, -3792, 485, 1098, -2911, -3185, 1556, 1389, -3031, -2229, 2374, 1316, -3031, -987, 3111, 1369, -2688, 176, 3246, 456, -1590]
1684a590K576K006k531k150L000K019l297j875L120J618l540j580L783O60m151
1699a932Q7L351n77l715N31L254j308k939P97K711j113l048J124K628j886k523
1715d558K287K486l107k215L633J085k719p55K756O93k731M11L004n69k272O47
1731a924L262n73k785J415K920j558k338K636K548k896j315K757J194k809j46
1746C88K822L8k532j71K626p0k739M56K563n74l396J035K559j152l178J525K611
1763B811k781k094K639J482l124j500L043J326l235j132K843J273l484n77L740
1778A230N09m049k37M728M05m898O96M427n57l741J485L549j415l833K531L672
1794D502j831m038K393L777k126l579K657L381l756k551M186K002m263k282L826
$$ y = [-1590, 986, 2992, 461, -1689, 1311, 3330, 33, -1842, 1278, 2896, -644, -2224, 1559, 2219, -1932, -1845, 1506, 929, -2786, -2255, 999, -309, -3248, -2451, 260, -853, -3901, -2777, -149, -2035, -4558, -2271, 215, -2892, -5107, -1474, -389, -3108, -3863, -1107, -414, -3145, -2734, 270, -299, -2571, -1924, 1338, 765, -2020, -605, 2315, 757, -1581, 1055, 3603, 707, -608, 2149, 3343, 534, 388, 3210, 3248, 716, 545, 3171, 3101, 362, 818, 3381, 2807, -589, 446, 3005, 1853, -1325, 200, 2811, 30, -2064, 575, 2057, -1067, -2567, 476, 1802, -1433, -2565, 278, 1551, -1933, -2510, 1230, 1739, -2310, -2547, 2181, 2586, -2312, -1616, 2811, 2254, -1487, -2, 3547, 2132, -1701, 830, 4502, 2671, -1367, 1026, 4803, 2677, -902, 1755, 5136, 1380, -1171, 3015, 5017, 754, -1528, 2298]
1809B298J769l750j459K676P52k494o97K476M28l213m43L075N82l363p20K768
1825F85n5j600L86J186o55j270J364J454j133j371J82J515K70o60l5L51o73O32
1843E73N52k44j160K12Q55p05K54Q04j308j821J527K377j379k921O29K404p30
1860h1k269J184J603k198k043K764K279l668l316L967L612l736k823L461K067
1875H03l976n11M699R30n611j088O409K147n666k415N919K080m888l37N284l30
1891C449o240J772O736n13p503L18O333O46n167l07M246j029m348J875N260k494
1907C034p124J998P295j727o882P03M795j789l430K119K853l859l870L843N046
1922C005l350n699J441N216j087l859J431K085k303j337L784J799l575k671K428
$$ y = [2298, 4067, 317, -1142, 1534, 2286, -208, -905, 1571, 1999, -1214, -1657, 1418, 2000, -1363, -2083, 685, 630, -970, -584, 602, -53, -1323, 41, 1495, 362, -1009, -827, 688, 958, 298, 263, 614, -59, 573, 1125, 881, -279, -67, 788, 83, 337, 1141, -167, -1988, -461, 1916, 537, -2384, -1755, 649, -81, -2350, -1166, 437, -1761, -3804, -1040, 1239, -2429, -5745, -1778, 1834, -1902, -4725, -1264, 803, -3173, -3684, 1015, 1945, -3666, -4754, 1655, 3802, -1864, -4279, 1640, 3720, -1168, -1505, 3779, 3449, -2791, -1019, 5717, 5204, -2299, -1981, 4352, 4998, -169, -476, 3770, 2741, -1607, 268, 5528, 3034, -4090, -2092, 5203, 3476, -3406, -2703, 2092, 303, -3127, -1008, 1845, -2014, -5884, -2041, 3005, -345, -6044, -4603, 613, -474, -4333, -2902, -817, -3120, -4457, -673, 1126, -2449, -5120, -2692]
1937b692L765o90k964n16K268J075q14K75M56r06j008K007K418j128k873q61L328
1954A140K428k059l178Q86K429m98j424K160Q6l628q68M723K312m728l586L104
1970g01M783k100m050J776K533k912j616N205J797o723l158P299M496n589n195
1985d155M432L987l589k380M483J522o463j241Q264K227q531m038Q068M054o564
$$ y = [-2692, 1073, 383, -2581, -3097, -829, 246, -568, -293, 163, -743, -1751, 256, 2674, 1546, -1327, -2188, 1140, 3568, 1509, -1669, -783, 1646, 1148, -276, 1884, 1970, -1658, -2526, 2197, 4509, -219, -3805, -701, 4082, 1982, -2068, -292, 2241, -671, -2287, 2918, 4715, -2008, -5166, 2133, 6629, 1040, -4155, 277, 4264, 675, -1705, 2778, 4300, -2163, -3404, 4860, 7087, -1444, -5482, 2586, 6640, 76]
$$ [...]
8191a50
##END NTUPLES=NMR FID
##END=
